{"text_format":"1","workbook":"xlsx","n_sheets":16,"sheets":["All Climbers","SHERPAS","HEAD SHERPA","TRACK LEAD","MARKETING TEAM LEADS","MARKETING CLIMBER REPORT","FINANCE TEAM LEADS","FINANCE CLIMBER REPORT","OBHR TEAM LEADS","OBHR CLIMBER REPORT","SUPPLY CHAIN TEAM LEADS","SUPPLY CHAIN CLIMBER REPORT","ENTREPRENEURSHIP TEAM LEADS","ENTREPRENEURSHIP CLIMBER REPORT","COMMENTS TRACKER","Sheet1"],"not_rendered":{"charts":0,"images":0,"macros":1,"external_links":0,"defined_names":4,"comments":0,"pivot_tables":0},"unopened":[],"bounds":{"document_bytes":16777216,"sheet_cells":100000,"rows_first":2000,"rows_last":500,"rows_between":2000,"halvings":0,"cell_chars":16384,"cell_head_chars":4096},"cells_cut":0,"cells_raw":0,"read":"whole","date_system":"1900"}

{"sheet":"All Climbers","index":0,"n_rows":1,"n_cols":11,"rows_kept":1,"cut":false,"hidden":false,"merged":[]}
["Climbers:","Track","Interest","Sherpa","International","Hours worked this week on internship hunt: (Open response)","Number of Job Applications completed this week: (Open response)","Number of Informational Interviews held this week: (Open response)","Number of \"Mock\" practice interviews held this week: (Open response)","Number of Real Interviews held this week: (Open response)","Number of Job Offers received this week: (Open response)"]

{"sheet":"SHERPAS","index":1,"n_rows":1,"n_cols":5,"rows_kept":1,"cut":false,"hidden":false,"merged":[]}
["Sherpa Name","Track","Phone Number","Email Address","Phone Number Extension"]

{"sheet":"HEAD SHERPA","index":2,"n_rows":45,"n_cols":11,"rows_kept":45,"cut":false,"hidden":false,"merged":[]}
[null,"SHERPA PROGRAM TOTALS"]
[]
[null,"WEEK X"]
[null,null,"TRACK LEAD","# CLIMBERS","# INT'l","HRS WORKED","# JOB APPS","# INFO INTERVIEWS","# MOCK INTERVIEWS","# REAL INTERVIEWS","# OFFERS"]
[null,"FINANCE",null,{"$f":"COUNTIF('FINANCE CLIMBER REPORT'!D24:D71,\"Yes\")","v":0},{"$f":"COUNTIF('FINANCE CLIMBER REPORT'!E24:E71,\"Yes\")","v":0},{"$f":"'FINANCE CLIMBER REPORT'!R$71","v":""},{"$f":"'FINANCE CLIMBER REPORT'!S$71","v":""},{"$f":"'FINANCE CLIMBER REPORT'!T$71","v":""},{"$f":"'FINANCE CLIMBER REPORT'!U$71","v":""},{"$f":"'FINANCE CLIMBER REPORT'!V$71","v":""},{"$f":"'FINANCE CLIMBER REPORT'!W$71","v":""}]
[null,"MARKETING",null,{"$f":"COUNTIF('MARKETING CLIMBER REPORT'!D10:D82,\"Yes\")","v":0},{"$f":"COUNTIF('MARKETING CLIMBER REPORT'!E10:E70,\"Yes\")","v":0},{"$f":"'MARKETING CLIMBER REPORT'!F$71","v":""},{"$f":"'MARKETING CLIMBER REPORT'!G$71","v":""},{"$f":"'MARKETING CLIMBER REPORT'!H$71","v":""},{"$f":"'MARKETING CLIMBER REPORT'!I$71","v":""},{"$f":"'MARKETING CLIMBER REPORT'!J$71","v":""},{"$f":"'MARKETING CLIMBER REPORT'!K$71","v":""}]
[null,"OB/HR",null,{"$f":"COUNTIF('OBHR CLIMBER REPORT'!D10:D82,\"Yes\")","v":0},{"$f":"COUNTIF('OBHR CLIMBER REPORT'!E10:E82,\"Yes\")","v":0},{"$f":"'OBHR CLIMBER REPORT'!F$71","v":""},{"$f":"'OBHR CLIMBER REPORT'!G$71","v":""},{"$f":"'OBHR CLIMBER REPORT'!H$71","v":""},{"$f":"'OBHR CLIMBER REPORT'!I$71","v":""},{"$f":"'OBHR CLIMBER REPORT'!J$71","v":""},{"$f":"'OBHR CLIMBER REPORT'!K$71","v":""}]
[null,"SUPPLY CHAIN",null,{"$f":"COUNTIF('SUPPLY CHAIN CLIMBER REPORT'!D10:D80,\"Yes\")","v":0},{"$f":"COUNTIF('SUPPLY CHAIN CLIMBER REPORT'!E10:E80,\"Yes\")","v":0},{"$f":"'SUPPLY CHAIN CLIMBER REPORT'!F71","v":""},{"$f":"'SUPPLY CHAIN CLIMBER REPORT'!G71","v":""},{"$f":"'SUPPLY CHAIN CLIMBER REPORT'!H71","v":""},{"$f":"'SUPPLY CHAIN CLIMBER REPORT'!I71","v":""},{"$f":"'SUPPLY CHAIN CLIMBER REPORT'!J71","v":""},{"$f":"'SUPPLY CHAIN CLIMBER REPORT'!K71","v":""}]
[null,"ENTREPRENEURSHIP",null,{"$f":"COUNTIF('ENTREPRENEURSHIP CLIMBER REPORT'!D10:D82,\"Yes\")","v":0},{"$f":"COUNTIF('ENTREPRENEURSHIP CLIMBER REPORT'!E10:E82,\"Yes\")","v":0},{"$f":"'ENTREPRENEURSHIP CLIMBER REPORT'!F$71","v":""},{"$f":"'ENTREPRENEURSHIP CLIMBER REPORT'!G$71","v":""},{"$f":"'ENTREPRENEURSHIP CLIMBER REPORT'!H$71","v":""},{"$f":"'ENTREPRENEURSHIP CLIMBER REPORT'!I$71","v":""},{"$f":"'ENTREPRENEURSHIP CLIMBER REPORT'!J$71","v":""},{"$f":"'ENTREPRENEURSHIP CLIMBER REPORT'!K$71","v":""}]
[null,"PROGRAM AVE",null,{"$f":"COUNT(MarketingClimber)","v":0},{"$f":"AVERAGE(E5:E9)","v":0},{"$f":"IFERROR(AVERAGE(F5:F9), \"\")","v":""},{"$f":"IFERROR(AVERAGE(G5:G9), \"\")","v":""},{"$f":"IFERROR(AVERAGE(H5:H9), \"\")","v":""},{"$f":"IFERROR(AVERAGE(I5:I9), \"\")","v":""},{"$f":"IFERROR(AVERAGE(J5:J9), \"\")","v":""},{"$f":"IFERROR(AVERAGE(K5:K9), \"\")","v":""}]
{"$rows_left_out":36}
{"sheet":"TRACK LEAD","index":3,"n_rows":62,"n_cols":24,"rows_kept":62,"cut":false,"hidden":true,"merged":[]}
[]
[]
[null,"NOTES:","NEED THIS FOR EACH TRACK - COULD BE A SEPARATE TAB IN THE MASTER WORKBOOK"]
[null,"GRADE:","GREEN, YELLOW, RED"]
[]
[]
[null,"FINANCE TRACK",null,null,null,null,null,null,null,null,null,null,null,"FINANCE TRACK"]
[null,"WEEK X",null,null,null,null,null,null,null,null,null,null,null,"CUMULATIVE"]
[null,null,"TEAM #","TEAM LEAD","INT'L","HRS WORKED","# JOB APPS","# INFO INTERVIEWS","# MOCK INTERVIEWS","# REAL INTERVIEWS","# OFFERS","GRADE",null,null,"TEAM #","TEAM LEAD","INT'L","HRS WORKED","# JOB APPS","# INFO INTERVIEWS","# MOCK INTERVIEWS","# REAL INTERVIEWS","# OFFERS","GRADE"]
[null,"Justin Haslem",null,null,null,null,null,null,null,null,null,null,null,"John S."]
{"$rows_left_out":53}
{"sheet":"MARKETING TEAM LEADS","index":4,"n_rows":94,"n_cols":16,"rows_kept":94,"cut":false,"hidden":false,"merged":[]}
[]
[]
[]
[null,"MARKETING CLIMBER KPI"]
[]
[null,"TEAM 1",null,null,null,null,null,null,null,"TEAM 1"]
[null,{"$f":"TODAY()","v":"2016-04-12"},null,null,null,null,null,null,null,"CUMULATIVE"]
[null,"Team Lead Name","HRS WORKED","# JOB APPS","# INFO INTERVIEWS","# MOCK INTERVIEWS","# REAL INTERVIEWS","# OFFERS",null,{"$f":"B8","v":"Team Lead Name"},"HRS WORKED","# JOB APPS","# INFO INTERVIEWS","# MOCK INTERVIEWS","# REAL INTERVIEWS","# OFFERS"]
[null,null,{"$f":"IFERROR(VLOOKUP($B9,'MARKETING CLIMBER REPORT'!$B$10:$L$70,5),\"\")","v":""},{"$f":"IFERROR(VLOOKUP($B9,'MARKETING CLIMBER REPORT'!$B$10:$L$70,6),\"\")","v":""},{"$f":"IFERROR(VLOOKUP($B9,'MARKETING CLIMBER REPORT'!$B$10:$L$70,7),\"\")","v":""},{"$f":"IFERROR(VLOOKUP($B9,'MARKETING CLIMBER REPORT'!$B$10:$L$70,8),\"\")","v":""},{"$f":"IFERROR(VLOOKUP($B9,'MARKETING CLIMBER REPORT'!$B$10:$L$70,9),\"\")","v":""},{"$f":"IFERROR(VLOOKUP($B9,'MARKETING CLIMBER REPORT'!$B$10:$L$70,10),\"\")","v":""},null,{"$f":"IF(B9=\"\",\"\",B9)","v":""},null,{"$f":"IFERROR(VLOOKUP($J9,'MARKETING CLIMBER REPORT'!$N$10:$X$70,6),\"\")","v":""},{"$f":"IFERROR(VLOOKUP($J9,'MARKETING CLIMBER REPORT'!$N$10:$X$70,7),\"\")","v":""},{"$f":"IFERROR(VLOOKUP($J9,'MARKETING CLIMBER REPORT'!$N$10:$X$70,8),\"\")","v":""},{"$f":"IFERROR(VLOOKUP($J9,'MARKETING CLIMBER REPORT'!$N$10:$X$70,9),\"\")","v":""},{"$f":"IFERROR(VLOOKUP($J9,'MARKETING CLIMBER REPORT'!$N$10:$X$70,10),\"\")","v":""}]
[null,null,{"$f":"IFERROR(VLOOKUP($B10,'MARKETING CLIMBER REPORT'!$B$10:$L$70,5),\"\")","v":""},{"$f":"IFERROR(VLOOKUP($B10,'MARKETING CLIMBER REPORT'!$B$10:$L$70,6),\"\")","v":""},{"$f":"IFERROR(VLOOKUP($B10,'MARKETING CLIMBER REPORT'!$B$10:$L$70,7),\"\")","v":""},{"$f":"IFERROR(VLOOKUP($B10,'MARKETING CLIMBER REPORT'!$B$10:$L$70,8),\"\")","v":""},{"$f":"IFERROR(VLOOKUP($B10,'MARKETING CLIMBER REPORT'!$B$10:$L$70,9),\"\")","v":""},{"$f":"IFERROR(VLOOKUP($B10,'MARKETING CLIMBER REPORT'!$B$10:$L$70,10),\"\")","v":""},null,"",null,{"$f":"IFERROR(VLOOKUP($J10,'MARKETING CLIMBER REPORT'!$N$10:$X$70,6),\"\")","v":""},{"$f":"IFERROR(VLOOKUP($J10,'MARKETING CLIMBER REPORT'!$N$10:$X$70,7),\"\")","v":""},{"$f":"IFERROR(VLOOKUP($J10,'MARKETING CLIMBER REPORT'!$N$10:$X$70,8),\"\")","v":""},{"$f":"IFERROR(VLOOKUP($J10,'MARKETING CLIMBER REPORT'!$N$10:$X$70,9),\"\")","v":""},{"$f":"IFERROR(VLOOKUP($J10,'MARKETING CLIMBER REPORT'!$N$10:$X$70,10),\"\")","v":""}]
{"$rows_left_out":85}
{"sheet":"MARKETING CLIMBER REPORT","index":5,"n_rows":85,"n_cols":24,"rows_kept":85,"cut":false,"hidden":false,"merged":[]}
[]
[]
[null,"NOTES:","NEED THIS FOR EACH TRACK - COULD BE A SEPARATE TAB IN THE MASTER WORKBOOK"]
[null,"GRADE:","GREEN, YELLOW, RED"]
[]
[]
[null,"MARKETING TRACK",null,null,null,null,null,null,null,null,null,null,null,{"$f":"$B$7","v":"MARKETING TRACK"}]
[null,"WEEK X",null,null,null,null,null,null,null,null,null,null,null,"CUMULATIVE"]
[null,"Climbers","TEAM #","TEAM LEAD","INT'L","HRS WORKED","# JOB APPS","# INFO INTERVIEWS","# MOCK INTERVIEWS","# REAL INTERVIEWS","# OFFERS","GRADE",null,null,"TEAM #","TEAM LEAD","INT'L","HRS WORKED","# JOB APPS","# INFO INTERVIEWS","# MOCK INTERVIEWS","# REAL INTERVIEWS","# OFFERS","GRADE"]
[]
{"$rows_left_out":76}
{"sheet":"FINANCE TEAM LEADS","index":6,"n_rows":94,"n_cols":16,"rows_kept":94,"cut":false,"hidden":false,"merged":[]}
[]
[]
[]
[null,"FINANCE CLIMBER KPI"]
[]
[null,"TEAM 1",null,null,null,null,null,null,null,"TEAM 1"]
[null,{"$f":"TODAY()","v":"2016-04-12"},null,null,null,null,null,null,null,"CUMULATIVE"]
[null,"Team Lead Name","HRS WORKED","# JOB APPS","# INFO INTERVIEWS","# MOCK INTERVIEWS","# REAL INTERVIEWS","# OFFERS",null,{"$f":"B8","v":"Team Lead Name"},"HRS WORKED","# JOB APPS","# INFO INTERVIEWS","# MOCK INTERVIEWS","# REAL INTERVIEWS","# OFFERS"]
[null,null,{"$f":"IFERROR(VLOOKUP($B9,'FINANCE CLIMBER REPORT'!$B$24:$L$69,5,FALSE),\"\")","v":""},{"$f":"IFERROR(VLOOKUP($B9,'FINANCE CLIMBER REPORT'!$B$24:$L$69,6,),\"\")","v":""},{"$f":"IFERROR(VLOOKUP($B9,'FINANCE CLIMBER REPORT'!$B$24:$L$69,7,FALSE),\"\")","v":""},{"$f":"IFERROR(VLOOKUP($B9,'FINANCE CLIMBER REPORT'!$B$24:$L$69,8,FALSE),\"\")","v":""},{"$f":"IFERROR(VLOOKUP($B9,'FINANCE CLIMBER REPORT'!$B$24:$L$69,9,FALSE),\"\")","v":""},{"$f":"IFERROR(VLOOKUP($B9,'FINANCE CLIMBER REPORT'!$B$24:$L$69,10,FALSE),\"\")","v":""},null,{"$f":"IF(B9=\"\",\"\",B9)","v":""},null,{"$f":"IFERROR(VLOOKUP($J9,'FINANCE CLIMBER REPORT'!$N$24:$X$69,6,FALSE),\"\")","v":""},{"$f":"IFERROR(VLOOKUP($J9,'FINANCE CLIMBER REPORT'!$N$24:$X$69,7,FALSE),\"\")","v":""},{"$f":"IFERROR(VLOOKUP($J9,'FINANCE CLIMBER REPORT'!$N$24:$X$69,8,FALSE),\"\")","v":""},{"$f":"IFERROR(VLOOKUP($J9,'FINANCE CLIMBER REPORT'!$N$24:$X$69,9,FALSE),\"\")","v":""},{"$f":"IFERROR(VLOOKUP($J9,'FINANCE CLIMBER REPORT'!$N$24:$X$69,10,FALSE),\"\")","v":""}]
[null,null,{"$f":"IFERROR(VLOOKUP($B10,'FINANCE CLIMBER REPORT'!$B$24:$L$69,5,FALSE),\"\")","v":""},{"$f":"IFERROR(VLOOKUP($B10,'FINANCE CLIMBER REPORT'!$B$24:$L$69,6,),\"\")","v":""},{"$f":"IFERROR(VLOOKUP($B10,'FINANCE CLIMBER REPORT'!$B$24:$L$69,7,FALSE),\"\")","v":""},{"$f":"IFERROR(VLOOKUP($B10,'FINANCE CLIMBER REPORT'!$B$24:$L$69,8,FALSE),\"\")","v":""},{"$f":"IFERROR(VLOOKUP($B10,'FINANCE CLIMBER REPORT'!$B$24:$L$69,9,FALSE),\"\")","v":""},{"$f":"IFERROR(VLOOKUP($B10,'FINANCE CLIMBER REPORT'!$B$24:$L$69,10,FALSE),\"\")","v":""},null,"",null,{"$f":"IFERROR(VLOOKUP($J10,'FINANCE CLIMBER REPORT'!$N$24:$X$69,6,FALSE),\"\")","v":""},{"$f":"IFERROR(VLOOKUP($J10,'FINANCE CLIMBER REPORT'!$N$24:$X$69,7,FALSE),\"\")","v":""},{"$f":"IFERROR(VLOOKUP($J10,'FINANCE CLIMBER REPORT'!$N$24:$X$69,8,FALSE),\"\")","v":""},{"$f":"IFERROR(VLOOKUP($J10,'FINANCE CLIMBER REPORT'!$N$24:$X$69,9,FALSE),\"\")","v":""},{"$f":"IFERROR(VLOOKUP($J10,'FINANCE CLIMBER REPORT'!$N$24:$X$69,10,FALSE),\"\")","v":""}]
{"$rows_left_out":85}
{"sheet":"FINANCE CLIMBER REPORT","index":7,"n_rows":85,"n_cols":24,"rows_kept":85,"cut":false,"hidden":false,"merged":[]}
[]
[]
[null,"NOTES:","NEED THIS FOR EACH TRACK - COULD BE A SEPARATE TAB IN THE MASTER WORKBOOK"]
[null,"GRADE:","GREEN, YELLOW, RED"]
[]
[]
[null,"FINANCE TRACK",null,null,null,null,null,null,null,null,null,null,null,"FINANCE TRACK"]
[null,"WEEK 1",null,null,null,null,null,null,null,null,null,null,null,"CUMULATIVE"]
[null,"Climbers","TEAM #","TEAM LEAD","INT'L","HRS WORKED","# JOB APPS","# INFO INTERVIEWS","# MOCK INTERVIEWS","# REAL INTERVIEWS","# OFFERS","GRADE",null,null,"TEAM #","TEAM LEAD","INT'L","HRS WORKED","# JOB APPS","# INFO INTERVIEWS","# MOCK INTERVIEWS","# REAL INTERVIEWS","# OFFERS","GRADE"]
[]
{"$rows_left_out":76}
{"sheet":"OBHR TEAM LEADS","index":8,"n_rows":94,"n_cols":16,"rows_kept":94,"cut":false,"hidden":false,"merged":[]}
[]
[]
[]
[null,"OBHR CLIMBER KPI"]
[]
[null,"TEAM 1",null,null,null,null,null,null,null,"TEAM 1"]
[null,{"$f":"TODAY()","v":"2016-04-12"},null,null,null,null,null,null,null,"CUMULATIVE"]
[null,"Team Lead Name","HRS WORKED","# JOB APPS","# INFO INTERVIEWS","# MOCK INTERVIEWS","# REAL INTERVIEWS","# OFFERS",null,{"$f":"B8","v":"Team Lead Name"},"HRS WORKED","# JOB APPS","# INFO INTERVIEWS","# MOCK INTERVIEWS","# REAL INTERVIEWS","# OFFERS"]
[null,null,{"$f":"IFERROR(VLOOKUP($B9,'OBHR CLIMBER REPORT'!$B$10:$L$70,COLUMN()+2,FALSE),\"\")","v":""},{"$f":"IFERROR(VLOOKUP($B9,'OBHR CLIMBER REPORT'!$B$10:$L$70,COLUMN()+2,FALSE),\"\")","v":""},{"$f":"IFERROR(VLOOKUP($B9,'OBHR CLIMBER REPORT'!$B$10:$L$70,COLUMN()+2,FALSE),\"\")","v":""},{"$f":"IFERROR(VLOOKUP($B9,'OBHR CLIMBER REPORT'!$B$10:$L$70,COLUMN()+2,FALSE),\"\")","v":""},{"$f":"IFERROR(VLOOKUP($B9,'OBHR CLIMBER REPORT'!$B$10:$L$70,COLUMN()+2,FALSE),\"\")","v":""},{"$f":"IFERROR(VLOOKUP($B9,'OBHR CLIMBER REPORT'!$B$10:$L$70,COLUMN()+2,FALSE),\"\")","v":""},null,{"$f":"IF(B9=\"\",\"\",B9)","v":""},null,{"$f":"IFERROR(VLOOKUP($J9,'OBHR CLIMBER REPORT'!$N$10:$X$70,6),\"\")","v":""},{"$f":"IFERROR(VLOOKUP($J9,'OBHR CLIMBER REPORT'!$N$10:$X$70,7),\"\")","v":""},{"$f":"IFERROR(VLOOKUP($J9,'OBHR CLIMBER REPORT'!$N$10:$X$70,8),\"\")","v":""},{"$f":"IFERROR(VLOOKUP($J9,'OBHR CLIMBER REPORT'!$N$10:$X$70,9),\"\")","v":""},{"$f":"IFERROR(VLOOKUP($J9,'OBHR CLIMBER REPORT'!$N$10:$X$70,10),\"\")","v":""}]
[null,null,{"$f":"IFERROR(VLOOKUP($B10,'OBHR CLIMBER REPORT'!$B$10:$L$70,COLUMN()+2,FALSE),\"\")","v":""},{"$f":"IFERROR(VLOOKUP($B10,'OBHR CLIMBER REPORT'!$B$10:$L$70,COLUMN()+2,FALSE),\"\")","v":""},{"$f":"IFERROR(VLOOKUP($B10,'OBHR CLIMBER REPORT'!$B$10:$L$70,COLUMN()+2,FALSE),\"\")","v":""},{"$f":"IFERROR(VLOOKUP($B10,'OBHR CLIMBER REPORT'!$B$10:$L$70,COLUMN()+2,FALSE),\"\")","v":""},{"$f":"IFERROR(VLOOKUP($B10,'OBHR CLIMBER REPORT'!$B$10:$L$70,COLUMN()+2,FALSE),\"\")","v":""},{"$f":"IFERROR(VLOOKUP($B10,'OBHR CLIMBER REPORT'!$B$10:$L$70,COLUMN()+2,FALSE),\"\")","v":""},null,"",null,{"$f":"IFERROR(VLOOKUP($J10,'OBHR CLIMBER REPORT'!$N$10:$X$70,6),\"\")","v":""},{"$f":"IFERROR(VLOOKUP($J10,'OBHR CLIMBER REPORT'!$N$10:$X$70,7),\"\")","v":""},{"$f":"IFERROR(VLOOKUP($J10,'OBHR CLIMBER REPORT'!$N$10:$X$70,8),\"\")","v":""},{"$f":"IFERROR(VLOOKUP($J10,'OBHR CLIMBER REPORT'!$N$10:$X$70,9),\"\")","v":""},{"$f":"IFERROR(VLOOKUP($J10,'OBHR CLIMBER REPORT'!$N$10:$X$70,10),\"\")","v":""}]
{"$rows_left_out":85}
{"sheet":"OBHR CLIMBER REPORT","index":9,"n_rows":85,"n_cols":24,"rows_kept":85,"cut":false,"hidden":false,"merged":[]}
[]
[]
[null,"NOTES:","NEED THIS FOR EACH TRACK - COULD BE A SEPARATE TAB IN THE MASTER WORKBOOK"]
[null,"GRADE:","GREEN, YELLOW, RED"]
[]
[]
[null,"OBHR TRACK",null,null,null,null,null,null,null,null,null,null,null,{"$f":"B7","v":"OBHR TRACK"}]
[null,"WEEK X",null,null,null,null,null,null,null,null,null,null,null,"CUMULATIVE"]
[null,"Climbers","TEAM #","TEAM LEAD","INT'L","HRS WORKED","# JOB APPS","# INFO INTERVIEWS","# MOCK INTERVIEWS","# REAL INTERVIEWS","# OFFERS","GRADE",null,null,"TEAM #","TEAM LEAD","INT'L","HRS WORKED","# JOB APPS","# INFO INTERVIEWS","# MOCK INTERVIEWS","# REAL INTERVIEWS","# OFFERS","GRADE"]
[]
{"$rows_left_out":76}
{"sheet":"SUPPLY CHAIN TEAM LEADS","index":10,"n_rows":94,"n_cols":16,"rows_kept":94,"cut":false,"hidden":false,"merged":[]}
[]
[]
[]
[null,"SC CLIMBER KPI"]
[]
[null,"TEAM 1",null,null,null,null,null,null,null,"TEAM 1"]
[null,"WEEK X",null,null,null,null,null,null,null,"CUMULATIVE"]
[null,"Team Lead Name","HRS WORKED","# JOB APPS","# INFO INTERVIEWS","# MOCK INTERVIEWS","# REAL INTERVIEWS","# OFFERS",null,{"$f":"B8","v":"Team Lead Name"},"HRS WORKED","# JOB APPS","# INFO INTERVIEWS","# MOCK INTERVIEWS","# REAL INTERVIEWS","# OFFERS"]
[null,null,{"$f":"IFERROR(VLOOKUP($J9,'SUPPLY CHAIN CLIMBER REPORT'!$N$10:$X$70,5),\"\")","v":""},{"$f":"IFERROR(VLOOKUP($J9,'SUPPLY CHAIN CLIMBER REPORT'!$N$10:$X$70,6),\"\")","v":""},{"$f":"IFERROR(VLOOKUP($J9,'SUPPLY CHAIN CLIMBER REPORT'!$N$10:$X$70,7),\"\")","v":""},{"$f":"IFERROR(VLOOKUP($J9,'SUPPLY CHAIN CLIMBER REPORT'!$N$10:$X$70,8),\"\")","v":""},{"$f":"IFERROR(VLOOKUP($J9,'SUPPLY CHAIN CLIMBER REPORT'!$N$10:$X$70,9),\"\")","v":""},{"$f":"IFERROR(VLOOKUP($J9,'SUPPLY CHAIN CLIMBER REPORT'!$N$10:$X$70,10),\"\")","v":""},null,{"$f":"IF(B9=\"\",\"\",B9)","v":""},null,{"$f":"IFERROR(VLOOKUP($J9,'SUPPLY CHAIN CLIMBER REPORT'!$N$10:$X$70,6),\"\")","v":""},{"$f":"IFERROR(VLOOKUP($J9,'SUPPLY CHAIN CLIMBER REPORT'!$N$10:$X$70,7),\"\")","v":""},{"$f":"IFERROR(VLOOKUP($J9,'SUPPLY CHAIN CLIMBER REPORT'!$N$10:$X$70,8),\"\")","v":""},{"$f":"IFERROR(VLOOKUP($J9,'SUPPLY CHAIN CLIMBER REPORT'!$N$10:$X$70,9),\"\")","v":""},{"$f":"IFERROR(VLOOKUP($J9,'SUPPLY CHAIN CLIMBER REPORT'!$N$10:$X$70,10),\"\")","v":""}]
[null,null,{"$f":"IFERROR(VLOOKUP($J10,'SUPPLY CHAIN CLIMBER REPORT'!$N$10:$X$70,5),\"\")","v":""},{"$f":"IFERROR(VLOOKUP($J10,'SUPPLY CHAIN CLIMBER REPORT'!$N$10:$X$70,6),\"\")","v":""},{"$f":"IFERROR(VLOOKUP($J10,'SUPPLY CHAIN CLIMBER REPORT'!$N$10:$X$70,7),\"\")","v":""},{"$f":"IFERROR(VLOOKUP($J10,'SUPPLY CHAIN CLIMBER REPORT'!$N$10:$X$70,8),\"\")","v":""},{"$f":"IFERROR(VLOOKUP($J10,'SUPPLY CHAIN CLIMBER REPORT'!$N$10:$X$70,9),\"\")","v":""},{"$f":"IFERROR(VLOOKUP($J10,'SUPPLY CHAIN CLIMBER REPORT'!$N$10:$X$70,10),\"\")","v":""},null,"",null,{"$f":"IFERROR(VLOOKUP($J10,'SUPPLY CHAIN CLIMBER REPORT'!$N$10:$X$70,6),\"\")","v":""},{"$f":"IFERROR(VLOOKUP($J10,'SUPPLY CHAIN CLIMBER REPORT'!$N$10:$X$70,7),\"\")","v":""},{"$f":"IFERROR(VLOOKUP($J10,'SUPPLY CHAIN CLIMBER REPORT'!$N$10:$X$70,8),\"\")","v":""},{"$f":"IFERROR(VLOOKUP($J10,'SUPPLY CHAIN CLIMBER REPORT'!$N$10:$X$70,9),\"\")","v":""},{"$f":"IFERROR(VLOOKUP($J10,'SUPPLY CHAIN CLIMBER REPORT'!$N$10:$X$70,10),\"\")","v":""}]
{"$rows_left_out":85}
{"sheet":"SUPPLY CHAIN CLIMBER REPORT","index":11,"n_rows":85,"n_cols":24,"rows_kept":85,"cut":false,"hidden":false,"merged":[]}
[]
[]
[null,"NOTES:","NEED THIS FOR EACH TRACK - COULD BE A SEPARATE TAB IN THE MASTER WORKBOOK"]
[null,"GRADE:","GREEN, YELLOW, RED"]
[]
[]
[null,"SUPPLY CHAIN TRACK",null,null,null,null,null,null,null,null,null,null,null,{"$f":"B7","v":"SUPPLY CHAIN TRACK"}]
[null,"WEEK X",null,null,null,null,null,null,null,null,null,null,null,"CUMULATIVE"]
[null,"Climbers","TEAM #","TEAM LEAD","INT'L","HRS WORKED","# JOB APPS","# INFO INTERVIEWS","# MOCK INTERVIEWS","# REAL INTERVIEWS","# OFFERS","GRADE",null,null,"TEAM #","TEAM LEAD","INT'L","HRS WORKED","# JOB APPS","# INFO INTERVIEWS","# MOCK INTERVIEWS","# REAL INTERVIEWS","# OFFERS","GRADE"]
[]
{"$rows_left_out":76}
{"sheet":"ENTREPRENEURSHIP TEAM LEADS","index":12,"n_rows":94,"n_cols":16,"rows_kept":94,"cut":false,"hidden":false,"merged":[]}
[]
[]
[]
[null,"ENTREPRENEURSHIP CLIMBER KPI"]
[]
[null,"TEAM 1",null,null,null,null,null,null,null,"TEAM 1"]
[null,{"$f":"TODAY()","v":"2016-04-12"},null,null,null,null,null,null,null,"CUMULATIVE"]
[null,"Team Lead Name","HRS WORKED","# JOB APPS","# INFO INTERVIEWS","# MOCK INTERVIEWS","# REAL INTERVIEWS","# OFFERS",null,{"$f":"B8","v":"Team Lead Name"},"HRS WORKED","# JOB APPS","# INFO INTERVIEWS","# MOCK INTERVIEWS","# REAL INTERVIEWS","# OFFERS"]
[null,null,{"$f":"IFERROR(VLOOKUP($J9,'ENTREPRENEURSHIP CLIMBER REPORT'!$N$10:$X$70,5),\"\")","v":""},{"$f":"IFERROR(VLOOKUP($J9,'ENTREPRENEURSHIP CLIMBER REPORT'!$N$10:$X$70,6),\"\")","v":""},{"$f":"IFERROR(VLOOKUP($J9,'ENTREPRENEURSHIP CLIMBER REPORT'!$N$10:$X$70,7),\"\")","v":""},{"$f":"IFERROR(VLOOKUP($J9,'ENTREPRENEURSHIP CLIMBER REPORT'!$N$10:$X$70,8),\"\")","v":""},{"$f":"IFERROR(VLOOKUP($J9,'ENTREPRENEURSHIP CLIMBER REPORT'!$N$10:$X$70,9),\"\")","v":""},{"$f":"IFERROR(VLOOKUP($J9,'ENTREPRENEURSHIP CLIMBER REPORT'!$N$10:$X$70,10),\"\")","v":""},null,{"$f":"IF(B9=\"\",\"\",B9)","v":""},null,{"$f":"IFERROR(VLOOKUP($J9,'ENTREPRENEURSHIP CLIMBER REPORT'!$N$10:$X$70,6),\"\")","v":""},{"$f":"IFERROR(VLOOKUP($J9,'ENTREPRENEURSHIP CLIMBER REPORT'!$N$10:$X$70,7),\"\")","v":""},{"$f":"IFERROR(VLOOKUP($J9,'ENTREPRENEURSHIP CLIMBER REPORT'!$N$10:$X$70,8),\"\")","v":""},{"$f":"IFERROR(VLOOKUP($J9,'ENTREPRENEURSHIP CLIMBER REPORT'!$N$10:$X$70,9),\"\")","v":""},{"$f":"IFERROR(VLOOKUP($J9,'ENTREPRENEURSHIP CLIMBER REPORT'!$N$10:$X$70,10),\"\")","v":""}]
[null,null,{"$f":"IFERROR(VLOOKUP($J10,'ENTREPRENEURSHIP CLIMBER REPORT'!$N$10:$X$70,5),\"\")","v":""},{"$f":"IFERROR(VLOOKUP($J10,'ENTREPRENEURSHIP CLIMBER REPORT'!$N$10:$X$70,6),\"\")","v":""},{"$f":"IFERROR(VLOOKUP($J10,'ENTREPRENEURSHIP CLIMBER REPORT'!$N$10:$X$70,7),\"\")","v":""},{"$f":"IFERROR(VLOOKUP($J10,'ENTREPRENEURSHIP CLIMBER REPORT'!$N$10:$X$70,8),\"\")","v":""},{"$f":"IFERROR(VLOOKUP($J10,'ENTREPRENEURSHIP CLIMBER REPORT'!$N$10:$X$70,9),\"\")","v":""},{"$f":"IFERROR(VLOOKUP($J10,'ENTREPRENEURSHIP CLIMBER REPORT'!$N$10:$X$70,10),\"\")","v":""},null,"",null,{"$f":"IFERROR(VLOOKUP($J10,'ENTREPRENEURSHIP CLIMBER REPORT'!$N$10:$X$70,6),\"\")","v":""},{"$f":"IFERROR(VLOOKUP($J10,'ENTREPRENEURSHIP CLIMBER REPORT'!$N$10:$X$70,7),\"\")","v":""},{"$f":"IFERROR(VLOOKUP($J10,'ENTREPRENEURSHIP CLIMBER REPORT'!$N$10:$X$70,8),\"\")","v":""},{"$f":"IFERROR(VLOOKUP($J10,'ENTREPRENEURSHIP CLIMBER REPORT'!$N$10:$X$70,9),\"\")","v":""},{"$f":"IFERROR(VLOOKUP($J10,'ENTREPRENEURSHIP CLIMBER REPORT'!$N$10:$X$70,10),\"\")","v":""}]
{"$rows_left_out":85}
{"sheet":"ENTREPRENEURSHIP CLIMBER REPORT","index":13,"n_rows":85,"n_cols":24,"rows_kept":85,"cut":false,"hidden":false,"merged":[]}
[]
[]
[null,"NOTES:","NEED THIS FOR EACH TRACK - COULD BE A SEPARATE TAB IN THE MASTER WORKBOOK"]
[null,"GRADE:","GREEN, YELLOW, RED"]
[]
[]
[null,"ENTREPRENEURSHIP TRACK",null,null,null,null,null,null,null,null,null,null,null,{"$f":"B7","v":"ENTREPRENEURSHIP TRACK"}]
[null,"WEEK X",null,null,null,null,null,null,null,null,null,null,null,"CUMULATIVE"]
[null,"Climbers","TEAM #","TEAM LEAD","INT'L","HRS WORKED","# JOB APPS","# INFO INTERVIEWS","# MOCK INTERVIEWS","# REAL INTERVIEWS","# OFFERS","GRADE",null,null,"TEAM #","TEAM LEAD","INT'L","HRS WORKED","# JOB APPS","# INFO INTERVIEWS","# MOCK INTERVIEWS","# REAL INTERVIEWS","# OFFERS","GRADE"]
[]
{"$rows_left_out":76}
{"sheet":"COMMENTS TRACKER","index":14,"n_rows":2,"n_cols":2,"rows_kept":2,"cut":false,"hidden":true,"merged":[]}
[null,"Date"]
["Climber"]

{"sheet":"Sheet1","index":15,"n_rows":8,"n_cols":3,"rows_kept":8,"cut":false,"hidden":true,"merged":[]}
[]
[]
[]
[null,null,"Sheet with comments"]
[null,null,"Autopopulation"]
[null,null,"Manual vs Automatic"]
[null,null,"Pain Points - where are tests"]
[null,null,"Text message reminders about KPI's"]