{"text_format":"1","workbook":"xlsx","n_sheets":18,"sheets":["Model Controls","Graphs","Balances","Budget","Income","Expenses","December","November","October","September","August","July","June","May","April","March","February","January"],"not_rendered":{"charts":5,"images":1,"macros":1,"external_links":0,"defined_names":16,"comments":1,"pivot_tables":0},"unopened":[],"bounds":{"document_bytes":16777216,"sheet_cells":100000,"rows_first":2000,"rows_last":500,"rows_between":2000,"halvings":0,"cell_chars":16384,"cell_head_chars":4096},"cells_cut":0,"cells_raw":0,"read":"whole","date_system":"1900"}

{"sheet":"Model Controls","index":0,"n_rows":23,"n_cols":11,"rows_kept":23,"cut":false,"hidden":false,"merged":[[7,9,7,10],[11,9,11,10],[15,9,15,10]]}
[null,"Expense Categories",null,"Income Categories",null,"Payment Types",null,"Savings Percent",null,"Credit Cards"]
[null,"Church",null,"TRH",null,{"$f":"J2","v":"Discover"},null,0.2,null,"Discover"]
[null,"Clothes",null,"BYU",null,{"$f":"J3","v":"Gesa"},null,null,null,"Gesa"]
[null,"Cosmetics",null,"MGF",null,"Cash or Debit",null,"Other Automatic Expense"]
[null,"Eat Out",null,"FAMILY",null,null,null,0.1]
[null,"Entertainment",null,"MISC"]
{"$rows_left_out":18}
{"sheet":"Graphs","index":1,"n_rows":46,"n_cols":2,"rows_kept":46,"cut":false,"hidden":false,"merged":[[45,1,45,6],[24,1,24,11]]}
[]
[null,"Account Balances"]
[]
[]
[]
[]
{"$rows_left_out":41}
{"sheet":"Balances","index":2,"n_rows":11,"n_cols":15,"rows_kept":11,"cut":false,"hidden":false,"merged":[]}
[]
[null,"Ending Account Balances"]
[null,null,{"$f":"'Model Controls'!J17","v":"Dec. '15"},"January","February","March","April","May","June","July","August","September","October","November","December"]
[null,"Spending",{"$f":"'Model Controls'!K13","v":2254.06},{"$f":"INDEX(January!$L$5:$L$151,COUNTA(January!$L$5:$L$151))","v":1535.1979999999992},{"$f":"INDEX(February!$L$5:$L$150,COUNTA(February!$L$5:$L$150))","v":1697.2179999999992},{"$f":"INDEX(March!$L$5:$L$151,COUNTA(March!$L$5:$L$151))","v":3026.3380000000002},{"$f":"INDEX(April!$L$5:$L$151,COUNTA(April!$L$5:$L$151))","v":3433.2880000000005},{"$f":"INDEX(May!$L$5:$L$151,COUNTA(May!$L$5:$L$151))","v":3433.2880000000005},{"$f":"INDEX(June!$L$5:$L$151,COUNTA(June!$L$5:$L$151))","v":3433.2880000000005},{"$f":"INDEX(July!$L$5:$L$150,COUNTA(July!$L$5:$L$150))","v":3433.2880000000005},{"$f":"INDEX(August!$L$5:$L$149,COUNTA(August!$L$5:$L$149))","v":3433.2880000000005},{"$f":"INDEX(September!$L$5:$L$153,COUNTA(September!$L$5:$L$153))","v":3433.2880000000005},{"$f":"INDEX(October!$L$5:$L$153,COUNTA(October!$L$5:$L$153))","v":3433.2880000000005},{"$f":"INDEX(November!$L$5:$L$149,COUNTA(November!$L$5:$L$149))","v":3433.2880000000005},{"$f":"INDEX(December!$L$5:$L$151,COUNTA(December!$L$5:$L$151))","v":3433.2880000000005}]
[null,"Savings",{"$f":"'Model Controls'!K14","v":4120},{"$f":"INDEX(January!$M$5:$M$151,COUNTA(January!$M$5:$M$151))","v":6332},{"$f":"INDEX(February!$M$5:$M$150,COUNTA(February!$M$5:$M$150))","v":7628},{"$f":"INDEX(March!$M$5:$M$151,COUNTA(March!$M$5:$M$151))","v":8981},{"$f":"INDEX(April!$M$5:$M$151,COUNTA(April!$M$5:$M$151))","v":9434},{"$f":"INDEX(May!$M$5:$M$151,COUNTA(May!$M$5:$M$151))","v":9434},{"$f":"INDEX(June!$M$5:$M$151,COUNTA(June!$M$5:$M$151))","v":9434},{"$f":"INDEX(July!$M$5:$M$150,COUNTA(July!$M$5:$M$150))","v":9434},{"$f":"INDEX(August!$M$5:$M$149,COUNTA(August!$M$5:$M$149))","v":9434},{"$f":"INDEX(September!$M$5:$M$153,COUNTA(September!$M$5:$M$153))","v":9434},{"$f":"INDEX(October!$M$5:$M$153,COUNTA(October!$M$5:$M$153))","v":9434},{"$f":"INDEX(November!$M$5:$M$149,COUNTA(November!$M$5:$M$149))","v":9434},{"$f":"INDEX(December!$M$5:$M$151,COUNTA(December!$M$5:$M$151))","v":9434}]
[null,"Total",{"$f":"SUM(C4:C5)","v":6374.0599999999995},{"$f":"SUM(D4:D5)","v":7867.1979999999994},{"$f":"SUM(E4:E5)","v":9325.2179999999989},12007.338,12867.288,12867.288,12867.288,12867.288,12867.288,12867.288,12867.288,12867.288,12867.288]
{"$rows_left_out":6}
{"sheet":"Budget","index":3,"n_rows":23,"n_cols":28,"rows_kept":23,"cut":false,"hidden":false,"merged":[[2,2,2,3],[2,4,2,5],[2,6,2,7],[2,8,2,9],[2,10,2,11],[2,24,2,25],[2,26,2,27],[2,12,2,13],[2,14,2,15],[2,16,2,17],[2,18,2,19],[2,20,2,21],[2,22,2,23]]}
[]
[null,"Budget"]
[null,null,"January",null,"February",null,"March",null,"April",null,"May",null,"June",null,"July",null,"August",null,"September",null,"October",null,"November",null,"December",null,"YTD Total"]
[null,null,"Budget","Remaining","Budget","Remaining","Budget","Remaining","Budget","Remaining","Budget","Remaining","Budget","Remaining","Budget","Remaining","Budget","Remaining","Budget","Remaining","Budget","Remaining","Budget","Remaining","Budget","Remaining","Budget","Left Over"]
[null,{"$f":"IF('Model Controls'!B2=0,\"\",'Model Controls'!B2)","v":"Church"},0,{"$f":"C5-Expenses!C20","v":-348.95199999999994},0,{"$f":"E5-Expenses!D20","v":-434.9500000000001},0,{"$f":"G5-Expenses!E20","v":-498.45000000000005},0,{"$f":"I5-Expenses!F20","v":-226.95999999999998},{"$f":"(SUMIF(May!$C$5:'May'!$C$151,$B5,May!$D$5:'May'!$D$151)+SUMIF(May!$C$5:'May'!$C$151,$B5,May!$G$5:'May'!$G$151)+SUMIF(May!$C$5:'May'!$C$151,$B5,May!$H$5:'May'!$H$151))","v":0},{"$f":"K5-Expenses!G20","v":0},{"$f":"(SUMIF(June!$C$5:'June'!$C$151,$B5,June!$D$5:'June'!$D$151)+SUMIF(June!$C$5:'June'!$C$151,$B5,June!$G$5:'June'!$G$151)+SUMIF(June!$C$5:'June'!$C$151,$B5,June!$H$5:'June'!$H$151))","v":0},{"$f":"M5-Expenses!H20","v":0},{"$f":"(SUMIF(July!$C$5:'July'!$C$150,$B5,July!$D$5:'July'!$D$150)+SUMIF(July!$C$5:'July'!$C$150,$B5,July!$G$5:'July'!$G$150)+SUMIF(July!$C$5:'July'!$C$150,$B5,July!$H$5:'July'!$H$150))","v":0},{"$f":"O5-Expenses!I20","v":0},{"$f":"(SUMIF(August!$C$5:'August'!$C$149,$B5,August!$D$5:'August'!$D$149)+SUMIF(August!$C$5:'August'!$C$149,$B5,August!$G$5:'August'!$G$149)+SUMIF(August!$C$5:'August'!$C$149,$B5,August!$H$5:'August'!$H$149))","v":0},{"$f":"Q5-Expenses!J20","v":0},{"$f":"(SUMIF(September!$C$5:'September'!$C$153,$B5,September!$D$5:'September'!$D$153)+SUMIF(September!$C$5:'September'!$C$153,$B5,September!$G$5:'September'!$G$153)+SUMIF(September!$C$5:'September'!$C$153,$B5,September!$H$5:'September'!$H$153))","v":0},{"$f":"S5-Expenses!K20","v":0},{"$f":"(SUMIF(October!$C$5:'October'!$C$153,$B5,October!$D$5:'October'!$D$153)+SUMIF(October!$C$5:'October'!$C$153,$B5,October!$G$5:'October'!$G$153)+SUMIF(October!$C$5:'October'!$C$153,$B5,October!$H$5:'October'!$H$153))","v":0},{"$f":"U5-Expenses!L20","v":0},{"$f":"(SUMIF(November!$C$5:'November'!$C$149,$B5,November!$D$5:'November'!$D$149)+SUMIF(November!$C$5:'November'!$C$149,$B5,November!$G$5:'November'!$G$149)+SUMIF(November!$C$5:'November'!$C$149,$B5,November!$H$5:'November'!$H$149))","v":0},{"$f":"W5-Expenses!M20","v":0},{"$f":"(SUMIF(December!$C$5:'December'!$C$151,$B5,December!$D$5:'December'!$D$151)+SUMIF(December!$C$5:'December'!$C$151,$B5,December!$G$5:'December'!$G$151)+SUMIF(December!$C$5:'December'!$C$151,$B5,December!$H$5:'December'!$H$151))","v":0},{"$f":"Y5-Expenses!N20","v":0},{"$f":"SUM(C5,E5,G5,I5,K5,M5,O5,Q5,S5,U5,W5,Y5)","v":0},{"$f":"SUM(D5,F5,H5,J5,L5,N5,P5,R5,T5,V5,X5,Z5)","v":-1509.3120000000001}]
[null,{"$f":"IF('Model Controls'!B3=0,\"\",'Model Controls'!B3)","v":"Clothes"},50,{"$f":"C6-Expenses!C21","v":50},50,{"$f":"E6-Expenses!D21","v":-19.329999999999998},100,{"$f":"G6-Expenses!E21","v":-57.139999999999986},25,{"$f":"I6-Expenses!F21","v":-3},{"$f":"(SUMIF(May!$C$5:'May'!$C$151,$B6,May!$D$5:'May'!$D$151)+SUMIF(May!$C$5:'May'!$C$151,$B6,May!$G$5:'May'!$G$151)+SUMIF(May!$C$5:'May'!$C$151,$B6,May!$H$5:'May'!$H$151))","v":0},{"$f":"K6-Expenses!G21","v":0},{"$f":"(SUMIF(June!$C$5:'June'!$C$151,$B6,June!$D$5:'June'!$D$151)+SUMIF(June!$C$5:'June'!$C$151,$B6,June!$G$5:'June'!$G$151)+SUMIF(June!$C$5:'June'!$C$151,$B6,June!$H$5:'June'!$H$151))","v":0},{"$f":"M6-Expenses!H21","v":0},{"$f":"(SUMIF(July!$C$5:'July'!$C$150,$B6,July!$D$5:'July'!$D$150)+SUMIF(July!$C$5:'July'!$C$150,$B6,July!$G$5:'July'!$G$150)+SUMIF(July!$C$5:'July'!$C$150,$B6,July!$H$5:'July'!$H$150))","v":0},{"$f":"O6-Expenses!I21","v":0},{"$f":"(SUMIF(August!$C$5:'August'!$C$149,$B6,August!$D$5:'August'!$D$149)+SUMIF(August!$C$5:'August'!$C$149,$B6,August!$G$5:'August'!$G$149)+SUMIF(August!$C$5:'August'!$C$149,$B6,August!$H$5:'August'!$H$149))","v":0},{"$f":"Q6-Expenses!J21","v":0},{"$f":"(SUMIF(September!$C$5:'September'!$C$153,$B6,September!$D$5:'September'!$D$153)+SUMIF(September!$C$5:'September'!$C$153,$B6,September!$G$5:'September'!$G$153)+SUMIF(September!$C$5:'September'!$C$153,$B6,September!$H$5:'September'!$H$153))","v":0},{"$f":"S6-Expenses!K21","v":0},{"$f":"(SUMIF(October!$C$5:'October'!$C$153,$B6,October!$D$5:'October'!$D$153)+SUMIF(October!$C$5:'October'!$C$153,$B6,October!$G$5:'October'!$G$153)+SUMIF(October!$C$5:'October'!$C$153,$B6,October!$H$5:'October'!$H$153))","v":0},{"$f":"U6-Expenses!L21","v":0},{"$f":"(SUMIF(November!$C$5:'November'!$C$149,$B6,November!$D$5:'November'!$D$149)+SUMIF(November!$C$5:'November'!$C$149,$B6,November!$G$5:'November'!$G$149)+SUMIF(November!$C$5:'November'!$C$149,$B6,November!$H$5:'November'!$H$149))","v":0},{"$f":"W6-Expenses!M21","v":0},{"$f":"(SUMIF(December!$C$5:'December'!$C$151,$B6,December!$D$5:'December'!$D$151)+SUMIF(December!$C$5:'December'!$C$151,$B6,December!$G$5:'December'!$G$151)+SUMIF(December!$C$5:'December'!$C$151,$B6,December!$H$5:'December'!$H$151))","v":0},{"$f":"Y6-Expenses!N21","v":0},225,-29.469999999999985]
{"$rows_left_out":18}
{"sheet":"Income","index":4,"n_rows":56,"n_cols":17,"rows_kept":56,"cut":false,"hidden":false,"merged":[[1,1,1,4]]}
[]
[null,"Income Trends"]
[]
[]
[]
[]
{"$rows_left_out":51}
{"sheet":"Expenses","index":5,"n_rows":39,"n_cols":16,"rows_kept":39,"cut":false,"hidden":false,"merged":[[1,1,1,4]]}
[]
[null,"Expense Trends"]
[]
[]
[]
[]
{"$rows_left_out":34}
{"sheet":"December","index":6,"n_rows":151,"n_cols":16,"rows_kept":151,"cut":false,"hidden":true,"merged":[[3,0,3,12],[0,0,0,12],[0,14,0,15],[1,0,1,2],[1,3,1,5],[1,6,1,7],[1,8,1,10],[1,11,1,12]]}
[{"$f":"January!A1","v":2016},null,null,null,null,null,null,null,null,null,null,null,null,null,"Current Balance"]
["INFORMATION",null,null,"CASH",null,null,"DEBT",null,"SAVINGS",null,null,"TOTAL",null,null,{"$f":"'Model Controls'!J2","v":"Discover"},{"$f":"SUM(G5:G253)+November!P2","v":291.56999999999994}]
["Date","Description","Category","Expense","Income","Available ",{"$f":"'Model Controls'!J2","v":"Discover"},{"$f":"'Model Controls'!J3","v":"Gesa"},"Deposit","Withdral","IN BANK?","Spending","Savings",null,{"$f":"'Model Controls'!J3","v":"Gesa"},{"$f":"SUM(H5:H253)+September!P3","v":0}]
["December"]
[null,null,null,null,null,{"$f":"INDEX(November!$F$5:$F$151,COUNTA(November!$F$5:$F$151))-D5+E5","v":3724.8579999999988},null,null,null,null,null,{"$f":"INDEX(November!$L$5:$L$151,COUNTA(November!$L$5:$L$151))-G5-H5-D5+E5","v":3433.2880000000005},{"$f":"INDEX(November!$M$5:$M$151,COUNTA(November!$M$5:$M$151))-J5+I5","v":9434}]
[null,null,null,null,null,{"$f":"F5-D6+E6","v":3724.8579999999988},null,null,null,null,null,{"$f":"L5-G6-H6-D6+E6","v":3433.2880000000005},{"$f":"M5-J6+I6","v":9434}]
{"$rows_left_out":146}
{"sheet":"November","index":7,"n_rows":149,"n_cols":16,"rows_kept":149,"cut":false,"hidden":true,"merged":[[3,0,3,12],[0,0,0,12],[0,14,0,15],[1,0,1,2],[1,3,1,5],[1,6,1,7],[1,8,1,10],[1,11,1,12]]}
[{"$f":"January!A1","v":2016},null,null,null,null,null,null,null,null,null,null,null,null,null,"Current Balance"]
["INFORMATION",null,null,"CASH",null,null,"DEBT",null,"SAVINGS",null,null,"TOTAL",null,null,{"$f":"'Model Controls'!J2","v":"Discover"},{"$f":"SUM(G5:G251)+October!P2","v":291.56999999999994}]
["Date","Description","Category","Expense","Income","Available ",{"$f":"'Model Controls'!J2","v":"Discover"},{"$f":"'Model Controls'!J3","v":"Gesa"},"Deposit","Withdral","IN BANK?","Spending","Savings",null,{"$f":"'Model Controls'!J3","v":"Gesa"},{"$f":"SUM(H5:H251)+September!P3","v":0}]
["November"]
[null,null,null,null,null,{"$f":"INDEX(October!$F$5:$F$151,COUNTA(October!$F$5:$F$151))-D5+E5","v":3724.8579999999988},null,null,null,null,null,{"$f":"INDEX(October!$L$5:$L$151,COUNTA(October!$L$5:$L$151))-G5-H5-D5+E5","v":3433.2880000000005},{"$f":"INDEX(October!$M$5:$M$151,COUNTA(October!$M$5:$M$151))-J5+I5","v":9434}]
[null,null,null,null,null,{"$f":"F5-D6+E6","v":3724.8579999999988},null,null,null,null,null,{"$f":"L5-G6-H6-D6+E6","v":3433.2880000000005},{"$f":"M5-J6+I6","v":9434}]
{"$rows_left_out":144}
{"sheet":"October","index":8,"n_rows":153,"n_cols":16,"rows_kept":153,"cut":false,"hidden":true,"merged":[[3,0,3,12],[0,0,0,12],[0,14,0,15],[1,0,1,2],[1,3,1,5],[1,6,1,7],[1,8,1,10],[1,11,1,12]]}
[{"$f":"January!A1","v":2016},null,null,null,null,null,null,null,null,null,null,null,null,null,"Current Balance"]
["INFORMATION",null,null,"CASH",null,null,"DEBT",null,"SAVINGS",null,null,"TOTAL",null,null,{"$f":"'Model Controls'!J2","v":"Discover"},{"$f":"SUM(G5:G255)+September!P2","v":291.56999999999994}]
["Date","Description","Category","Expense","Income","Available ",{"$f":"'Model Controls'!J2","v":"Discover"},{"$f":"'Model Controls'!J3","v":"Gesa"},"Deposit","Withdral","IN BANK?","Spending","Savings",null,{"$f":"'Model Controls'!J3","v":"Gesa"},{"$f":"SUM(H5:H255)+September!P3","v":0}]
["October"]
[null,null,null,null,null,{"$f":"INDEX(September!$F$5:$F$151,COUNTA(September!$F$5:$F$151))-D5+E5","v":3724.8579999999988},null,null,null,null,null,{"$f":"INDEX(September!$L$5:$L$151,COUNTA(September!$L$5:$L$151))-G5-H5-D5+E5","v":3433.2880000000005},{"$f":"INDEX(September!$M$5:$M$151,COUNTA(September!$M$5:$M$151))-J5+I5","v":9434}]
[null,null,null,null,null,{"$f":"F5-D6+E6","v":3724.8579999999988},null,null,null,null,null,{"$f":"L5-G6-H6-D6+E6","v":3433.2880000000005},{"$f":"M5-J6+I6","v":9434}]
{"$rows_left_out":148}
{"sheet":"September","index":9,"n_rows":153,"n_cols":16,"rows_kept":153,"cut":false,"hidden":true,"merged":[[3,0,3,12],[0,0,0,12],[0,14,0,15],[1,0,1,2],[1,3,1,5],[1,6,1,7],[1,8,1,10],[1,11,1,12]]}
[{"$f":"January!A1","v":2016},null,null,null,null,null,null,null,null,null,null,null,null,null,"Current Balance"]
["INFORMATION",null,null,"CASH",null,null,"DEBT",null,"SAVINGS",null,null,"TOTAL",null,null,{"$f":"'Model Controls'!J2","v":"Discover"},{"$f":"SUM(G5:G255)+August!$P$2","v":291.56999999999994}]
["Date","Description","Category","Expense","Income","Available ",{"$f":"'Model Controls'!J2","v":"Discover"},{"$f":"'Model Controls'!J3","v":"Gesa"},"Deposit","Withdral","IN BANK?","Spending","Savings",null,{"$f":"'Model Controls'!J3","v":"Gesa"},{"$f":"SUM(H5:H255)+August!P3","v":0}]
["September"]
[null,null,null,null,null,{"$f":"INDEX(August!$F$5:$F$151,COUNTA(August!$F$5:$F$151))-D5+E5","v":3724.8579999999988},null,null,null,null,null,{"$f":"INDEX(August!$L$5:$L$151,COUNTA(August!$L$5:$L$151))-G5-H5-D5+E5","v":3433.2880000000005},{"$f":"INDEX(August!$M$5:$M$151,COUNTA(August!$M$5:$M$151))-J5+I5","v":9434}]
[null,null,null,null,null,{"$f":"F5-D6+E6","v":3724.8579999999988},null,null,null,null,null,{"$f":"L5-G6-H6-D6+E6","v":3433.2880000000005},{"$f":"M5-J6+I6","v":9434}]
{"$rows_left_out":148}
{"sheet":"August","index":10,"n_rows":149,"n_cols":16,"rows_kept":149,"cut":false,"hidden":true,"merged":[[3,0,3,12],[0,0,0,12],[0,14,0,15],[1,0,1,2],[1,3,1,5],[1,6,1,7],[1,8,1,10],[1,11,1,12]]}
[{"$f":"January!A1","v":2016},null,null,null,null,null,null,null,null,null,null,null,null,null,"Current Balance"]
["INFORMATION",null,null,"CASH",null,null,"DEBT",null,"SAVINGS",null,null,"TOTAL",null,null,{"$f":"'Model Controls'!J2","v":"Discover"},{"$f":"SUM(G5:G251)+July!P2","v":291.56999999999994}]
["Date","Description","Category","Expense","Income","Available ",{"$f":"'Model Controls'!J2","v":"Discover"},{"$f":"'Model Controls'!J3","v":"Gesa"},"Deposit","Withdral","IN BANK?","Spending","Savings",null,{"$f":"'Model Controls'!J3","v":"Gesa"},{"$f":"SUM(H5:H251)","v":0}]
["August"]
[null,null,null,null,null,{"$f":"INDEX(July!$F$5:$F$151,COUNTA(July!$F$5:$F$151))-D5+E5","v":3724.8579999999988},null,null,null,null,null,{"$f":"INDEX(July!$L$5:$L$151,COUNTA(July!$L$5:$L$151))-G5-H5-D5+E5","v":3433.2880000000005},{"$f":"INDEX(July!$M$5:$M$151,COUNTA(July!$M$5:$M$151))-J5+I5","v":9434}]
[null,null,null,null,null,{"$f":"F5-D6+E6","v":3724.8579999999988},null,null,null,null,null,{"$f":"L5-G6-H6-D6+E6","v":3433.2880000000005},{"$f":"M5-J6+I6","v":9434}]
{"$rows_left_out":144}
{"sheet":"July","index":11,"n_rows":150,"n_cols":16,"rows_kept":150,"cut":false,"hidden":true,"merged":[[3,0,3,12],[0,0,0,12],[0,14,0,15],[1,0,1,2],[1,3,1,5],[1,6,1,7],[1,8,1,10],[1,11,1,12]]}
[{"$f":"January!A1","v":2016},null,null,null,null,null,null,null,null,null,null,null,null,null,"Current Balance"]
["INFORMATION",null,null,"CASH",null,null,"DEBT",null,"SAVINGS",null,null,"TOTAL",null,null,{"$f":"'Model Controls'!J2","v":"Discover"},{"$f":"SUM(G5:G252)+June!P2","v":291.56999999999994}]
["Date","Description","Category","Expense","Income","Available ",{"$f":"'Model Controls'!J2","v":"Discover"},{"$f":"'Model Controls'!J3","v":"Gesa"},"Deposit","Withdral","IN BANK?","Spending","Savings",null,{"$f":"'Model Controls'!J3","v":"Gesa"},{"$f":"SUM(H5:H252)+June!P3","v":0}]
["July"]
[null,null,null,null,null,{"$f":"INDEX(June!$F$5:$F$151,COUNTA(June!$F$5:$F$151))-D5+E5","v":3724.8579999999988},null,null,null,null,null,{"$f":"INDEX(June!$L$5:$L$151,COUNTA(June!$L$5:$L$151))-G5-H5-D5+E5","v":3433.2880000000005},{"$f":"INDEX(June!$M$5:$M$151,COUNTA(June!$M$5:$M$151))-J5+I5","v":9434}]
[null,null,null,null,null,{"$f":"F5-D6+E6","v":3724.8579999999988},null,null,null,null,null,{"$f":"L5-G6-H6-D6+E6","v":3433.2880000000005},{"$f":"M5-J6+I6","v":9434}]
{"$rows_left_out":145}
{"sheet":"June","index":12,"n_rows":151,"n_cols":16,"rows_kept":151,"cut":false,"hidden":true,"merged":[[3,0,3,12],[0,0,0,12],[0,14,0,15],[1,0,1,2],[1,3,1,5],[1,6,1,7],[1,8,1,10],[1,11,1,12]]}
[{"$f":"January!A1","v":2016},null,null,null,null,null,null,null,null,null,null,null,null,null,"Current Balance"]
["INFORMATION",null,null,"CASH",null,null,"DEBT",null,"SAVINGS",null,null,"TOTAL",null,null,{"$f":"'Model Controls'!J2","v":"Discover"},{"$f":"SUM(G5:G253)+May!P2","v":291.56999999999994}]
["Date","Description","Category","Expense","Income","Available ",{"$f":"'Model Controls'!J2","v":"Discover"},{"$f":"'Model Controls'!J3","v":"Gesa"},"Deposit","Withdral","IN BANK?","Spending","Savings",null,{"$f":"'Model Controls'!J3","v":"Gesa"},{"$f":"SUM(H5:H253)+May!P3","v":0}]
["June"]
[null,null,null,null,null,{"$f":"INDEX(May!$F$5:$F$151,COUNTA(May!$F$5:$F$151))-D5+E5","v":3724.8579999999988},null,null,null,null,null,{"$f":"INDEX(May!$L$5:$L$151,COUNTA(May!$L$5:$L$151))-G5-H5-D5+E5","v":3433.2880000000005},{"$f":"INDEX(May!$M$5:$M$151,COUNTA(May!$M$5:$M$151))-J5+I5","v":9434}]
[null,null,null,null,null,{"$f":"F5-D6+E6","v":3724.8579999999988},null,null,null,null,null,{"$f":"L5-G6-H6-D6+E6","v":3433.2880000000005},{"$f":"M5-J6+I6","v":9434}]
{"$rows_left_out":146}
{"sheet":"May","index":13,"n_rows":151,"n_cols":16,"rows_kept":151,"cut":false,"hidden":true,"merged":[[3,0,3,12],[0,0,0,12],[0,14,0,15],[1,0,1,2],[1,3,1,5],[1,6,1,7],[1,8,1,10],[1,11,1,12]]}
[{"$f":"January!A1","v":2016},null,null,null,null,null,null,null,null,null,null,null,null,null,"Current Balance"]
["INFORMATION",null,null,"CASH",null,null,"DEBT",null,"SAVINGS",null,null,"TOTAL",null,null,{"$f":"'Model Controls'!J2","v":"Discover"},{"$f":"SUM(G5:G253)+April!P2","v":291.56999999999994}]
["Date","Description","Category","Expense","Income","Available ",{"$f":"'Model Controls'!J2","v":"Discover"},{"$f":"'Model Controls'!J3","v":"Gesa"},"Deposit","Withdral","IN BANK?","Spending","Savings",null,{"$f":"'Model Controls'!J3","v":"Gesa"},{"$f":"SUM(H5:H253)+April!P3","v":0}]
["May"]
[null,null,null,null,null,{"$f":"INDEX(April!$F$5:$F$151,COUNTA(April!$F$5:$F$151))-D5+E5","v":3724.8579999999988},null,null,null,null,null,{"$f":"INDEX(April!$L$5:$L$151,COUNTA(April!$L$5:$L$151))-G5-H5-D5+E5","v":3433.2880000000005},{"$f":"INDEX(April!$M$5:$M$151,COUNTA(April!$M$5:$M$151))-J5+I5","v":9434}]
[null,null,null,null,null,{"$f":"F5-D6+E6","v":3724.8579999999988},null,null,null,null,null,{"$f":"L5-G6-H6-D6+E6","v":3433.2880000000005},{"$f":"M5-J6+I6","v":9434}]
{"$rows_left_out":146}
{"sheet":"April","index":14,"n_rows":151,"n_cols":16,"rows_kept":151,"cut":false,"hidden":false,"merged":[[3,0,3,12],[0,0,0,12],[0,14,0,15],[1,0,1,2],[1,3,1,5],[1,6,1,7],[1,8,1,10],[1,11,1,12]]}
[{"$f":"January!A1","v":2016},null,null,null,null,null,null,null,null,null,null,null,null,null,"Current Balance"]
["INFORMATION",null,null,"CASH",null,null,"DEBT",null,"SAVINGS",null,null,"TOTAL",null,null,{"$f":"'Model Controls'!J2","v":"Discover"},{"$f":"SUM(G5:G253)+March!P2","v":291.56999999999994}]
["Date","Description","Category","Expense","Income","Available ",{"$f":"'Model Controls'!J2","v":"Discover"},{"$f":"'Model Controls'!J3","v":"Gesa"},"Deposit","Withdral","IN BANK?","Spending","Savings",null,{"$f":"'Model Controls'!J3","v":"Gesa"},{"$f":"SUM(H5:H253)+March!P3","v":0}]
["April"]
["2016-04-01","April Wyview","Rent",null,null,{"$f":"INDEX(March!$F$5:$F$151,COUNTA(March!$F$5:$F$151))-D5+E5","v":3144.0679999999984},745,null,null,null,null,{"$f":"INDEX(March!$L$5:$L$151,COUNTA(March!$L$5:$L$151))-G5-H5-D5+E5","v":2281.3380000000002},{"$f":"INDEX(March!$M$5:$M$151,COUNTA(March!$M$5:$M$151))-J5+I5","v":8981}]
["2016-04-01","Income","MGF",null,448.63,{"$f":"F5-D6+E6","v":3592.6979999999985},null,null,112,null,null,{"$f":"L5-G6-H6-D6+E6","v":2729.9680000000003},{"$f":"M5-J6+I6","v":9093}]
{"$rows_left_out":146}
{"sheet":"March","index":15,"n_rows":151,"n_cols":16,"rows_kept":151,"cut":false,"hidden":false,"merged":[[3,0,3,12],[0,0,0,12],[0,14,0,15],[1,0,1,2],[1,3,1,5],[1,6,1,7],[1,8,1,10],[1,11,1,12]]}
[{"$f":"January!A1","v":2016},null,null,null,null,null,null,null,null,null,null,null,null,null,"Current Balance"]
["INFORMATION",null,null,"CASH",null,null,"DEBT",null,"SAVINGS",null,null,"TOTAL",null,null,{"$f":"'Model Controls'!J2","v":"Discover"},{"$f":"SUM(G5:G253)+February!P2","v":117.73000000000005}]
["Date","Description","Category","Expense","Income","Available ",{"$f":"'Model Controls'!J2","v":"Discover"},{"$f":"'Model Controls'!J3","v":"Gesa"},"Deposit","Withdral","IN BANK?","Spending","Savings",null,{"$f":"'Model Controls'!J3","v":"Gesa"},{"$f":"SUM(H5:H253)+February!P3","v":0}]
["March"]
["2016-03-01","Discover","Credit Card",183.2,null,{"$f":"INDEX(February!$F$5:$F$151,COUNTA(February!$F$5:$F$151))-D5+E5","v":1864.4579999999987},-183.2,null,null,null,null,{"$f":"INDEX(February!$L$5:$L$151,COUNTA(February!$L$5:$L$151))-G5-H5-D5+E5","v":1697.2179999999992},{"$f":"INDEX(February!$M$5:$M$151,COUNTA(February!$M$5:$M$151))-J5+I5","v":7628}]
["2016-03-01","Rent","Rent",null,null,{"$f":"F5-D6+E6","v":1864.4579999999987},745,null,null,null,null,{"$f":"L5-D6-G6-H6+E6","v":952.21799999999917},{"$f":"M5+I6-J6","v":7628}]
{"$rows_left_out":146}
{"sheet":"February","index":16,"n_rows":150,"n_cols":16,"rows_kept":150,"cut":false,"hidden":true,"merged":[[3,0,3,12],[0,0,0,12],[0,14,0,15],[1,0,1,2],[1,3,1,5],[1,6,1,7],[1,8,1,10],[1,11,1,12]]}
[{"$f":"January!A1","v":2016},null,null,null,null,null,null,null,null,null,null,null,null,null,"Current Balance"]
["INFORMATION",null,null,"CASH",null,null,"DEBT",null,"SAVINGS",null,null,"TOTAL",null,null,{"$f":"'Model Controls'!J2","v":"Discover"},{"$f":"SUM(G5:G252)+January!P2","v":350.44000000000017}]
["Date","Description","Category","Expense","Income","Available ",{"$f":"'Model Controls'!J2","v":"Discover"},{"$f":"'Model Controls'!J3","v":"Gesa"},"Deposit","Withdral","IN BANK?","Spending","Savings",null,{"$f":"'Model Controls'!J3","v":"Gesa"},{"$f":"SUM(H5:H252)+January!P3","v":0}]
["February "]
["2016-02-01","Discover Payment","Credit Card",303.31,null,{"$f":"INDEX(January!$F$5:$F$151,COUNTA(January!$F$5:$F$151))-D5+E5","v":1799.4579999999987},-303.31,null,null,null,null,{"$f":"INDEX(January!$L$5:$L$151,COUNTA(January!$L$5:$L$151))-G5-H5-D5+E5","v":1535.1979999999992},{"$f":"INDEX(January!$M$5:$M$151,COUNTA(January!$M$5:$M$151))-J5+I5","v":6332}]
["2016-02-01","Walmart","School",null,null,{"$f":"F5-D6+E6","v":1799.4579999999987},3.97,null,null,null,null,{"$f":"L5+E6-D6-G6-H6","v":1531.2279999999992},{"$f":"M5+I6-J6","v":6332}]
{"$rows_left_out":145}
{"sheet":"January","index":17,"n_rows":151,"n_cols":16,"rows_kept":151,"cut":false,"hidden":true,"merged":[[3,0,3,12],[0,0,0,12],[0,14,0,15],[1,0,1,2],[1,3,1,5],[1,6,1,7],[1,8,1,10],[1,11,1,12]]}
[2016,null,null,null,null,null,null,null,null,null,null,null,null,null,"Current Balance"]
["INFORMATION",null,null,"CASH",null,null,"DEBT",null,"SAVINGS",null,null,"TOTAL",null,null,{"$f":"'Model Controls'!J2","v":"Discover"},{"$f":"SUM(G5:G253)+'Model Controls'!K9","v":567.57000000000016}]
["Date","Description","Category","Expense","Income","Available ",{"$f":"'Model Controls'!J2","v":"Discover"},{"$f":"'Model Controls'!J3","v":"Gesa"},"Deposit","Withdral","IN BANK?","Spending","Savings",null,{"$f":"'Model Controls'!J3","v":"Gesa"},{"$f":"SUM(H5:H253)+'Model Controls'!K10","v":0}]
["January"]
["1.1.2016","Discover","Credit Card",775.41,null,2434.66,-775.41,null,null,null,null,2254.06,4120]
["1.1.2016","Income","TRH",null,138,{"$f":"F5-D6+E6","v":2572.66},null,null,35,null,null,{"$f":"L5+E6-D6-G6-H6","v":2392.06},{"$f":"M5+I6-J6","v":4155}]
{"$rows_left_out":145}