{"text_format":"1","workbook":"xlsx","n_sheets":28,"sheets":["Factories","Build Quote","Estimate","PO to Vendor","PO to Decorator","Customers","Blank Products","info","Lines","TREVFileNames","TREVJobToZoho","TREVPermanent","Line 1","Line 2","Line 3","Pacific Price List","Line 4","Line 5","Line 6","Line 7","Line 8","Line 9","Line 10","Line 11","Line 12","Line 13","Line 14","Line 15"],"not_rendered":{"charts":0,"images":1,"macros":1,"external_links":0,"defined_names":4,"comments":1,"pivot_tables":0},"unopened":[],"bounds":{"document_bytes":16777216,"sheet_cells":100000,"rows_first":2000,"rows_last":500,"rows_between":2000,"halvings":0,"cell_chars":16384,"cell_head_chars":4096},"cells_cut":0,"cells_raw":0,"read":"whole","date_system":"1900"}

{"sheet":"Factories","index":0,"n_rows":128,"n_cols":5,"rows_kept":128,"cut":false,"hidden":true,"merged":[]}
["Company","Address 1","Address 2","Email","Phone"]
["Not Yet Assigned","123 not a real street","irvine, ca 92671","fakeemail@gmail.com",9495551234]
["None","123 not a real street","irvine, ca 92671","fakeemail@gmail.com",9495551234]
["Screen Printers, Inc","123 not a real street","irvine, ca 92671","fakeemail@gmail.com",9495551234]
["Vendors Unite","123 not a real street","irvine, ca 92671","fakeemail@gmail.com",9495551234]
["Acme, inc.","123 not a real street","irvine, ca 92671","fakeemail@gmail.com",9495551234]
["Widget Corp","123 not a real street","irvine, ca 92671","fakeemail@gmail.com",9495551234]
["123 Warehousing","123 not a real street","irvine, ca 92671","fakeemail@gmail.com",9495551234]
["Demo Company","123 not a real street","irvine, ca 92671","fakeemail@gmail.com",9495551234]
["Smith and Co.","123 not a real street","irvine, ca 92671","fakeemail@gmail.com",9495551234]
{"$rows_left_out":119}
{"sheet":"Build Quote","index":1,"n_rows":137,"n_cols":41,"rows_kept":137,"cut":false,"hidden":false,"merged":[[113,11,113,14],[114,11,114,14],[111,20,111,21],[115,20,115,21],[115,7,115,10],[112,20,112,21],[113,20,113,21],[112,7,114,10],[114,20,114,21],[111,7,111,10],[111,11,111,14],[120,1,121,1],[120,24,121,24],[120,19,121,19],[120,20,121,20],[120,21,121,21],[120,22,121,22],[120,23,121,23],[112,40,113,41],[120,2,121,2],[120,3,121,3],[117,20,117,26],[120,5,120,13],[120,14,121,14],[120,15,121,15],[120,16,121,16],[120,4,121,4],[114,1,114,5],[115,1,115,5],[117,7,117,10],[116,7,116,10],[115,11,115,14],[120,25,121,25],[112,11,112,14]]}
[]
[]
[]
[]
[]
[]
[]
[]
[null,null,null,null,null,null,null,null,null,null,null,null,null,null,null,"95 Markets"]
[null,null,null,null,null,null,null,null,null,null,null,null,null,null,null,"A Road Bike 4 U"]
{"$rows_left_out":128}
{"sheet":"Estimate","index":2,"n_rows":165,"n_cols":9,"rows_kept":165,"cut":false,"hidden":false,"merged":[[29,1,29,5],[31,1,31,5],[32,0,32,5],[32,6,32,7],[27,1,27,5],[28,1,28,5],[30,1,30,5],[16,1,16,5],[13,2,13,3],[14,2,14,3],[15,1,15,5],[23,1,23,5],[13,5,13,8],[14,5,14,8],[25,1,25,5],[26,1,26,5],[17,1,17,5],[18,1,18,5],[19,1,19,5],[20,1,20,5],[21,1,21,5],[22,1,22,5],[24,1,24,5],[10,0,10,3],[10,5,10,8],[11,0,11,3],[11,5,11,8],[12,0,12,3],[12,5,12,8],[0,6,2,8],[4,0,4,3],[5,0,5,3],[8,6,8,8],[9,0,9,3],[9,5,9,8],[8,0,8,3],[42,0,42,3],[42,5,42,8],[43,0,43,3],[43,5,43,8],[44,0,44,3],[44,5,44,8],[33,6,35,8],[37,0,37,3],[38,0,38,3],[41,0,41,3],[41,6,41,8],[48,1,48,5],[49,1,49,5],[50,1,50,5],[51,1,51,5],[52,1,52,5],[45,0,45,3],[45,5,45,8],[46,2,46,3],[46,5,46,8],[47,2,47,3],[47,5,47,8],[64,1,64,5],[65,0,65,5],[65,6,65,7],[58,1,58,5],[59,1,59,5],[60,1,60,5],[61,1,61,5],[62,1,62,5],[53,1,53,5],[54,1,54,5],[55,1,55,5],[56,1,56,5],[57,1,57,5],[75,0,75,3],[75,5,75,8],[76,0,76,3],[76,5,76,8],[77,0,77,3],[77,5,77,8],[66,6,68,8],[70,0,70,3],[71,0,71,3],[74,0,74,3],[74,6,74,8],[81,1,81,5],[82,1,82,5],[83,1,83,5],[84,1,84,5],[85,1,85,5],[78,0,78,3],[78,5,78,8],[79,2,79,3],[79,5,79,8],[80,2,80,3],[80,5,80,8],[91,1,91,5],[92,1,92,5],[93,1,93,5],[94,1,94,5],[95,1,95,5],[86,1,86,5],[87,1,87,5],[88,1,88,5],[89,1,89,5],[90,1,90,5],[104,0,104,3],[107,0,107,3],[107,6,107,8],[108,0,108,3],[108,5,108,8],[97,1,97,5],[98,0,98,5],[98,6,98,7],[99,6,101,8],[103,0,103,3],[112,2,112,3],[112,5,112,8],[113,2,113,3],[113,5,113,8],[114,1,114,5],[109,0,109,3],[109,5,109,8],[110,0,110,3],[110,5,110,8],[111,0,111,3],[111,5,111,8],[120,1,120,5],[121,1,121,5],[122,1,122,5],[123,1,123,5],[124,1,124,5],[115,1,115,5],[116,1,116,5],[117,1,117,5],[118,1,118,5],[119,1,119,5],[131,0,131,5],[131,6,131,7],[132,6,134,8],[136,0,136,3],[137,0,137,3],[125,1,125,5],[126,1,126,5],[127,1,127,5],[128,1,128,5],[130,1,130,5],[143,0,143,3],[143,5,143,8],[144,0,144,3],[144,5,144,8],[145,2,145,3],[145,5,145,8],[140,0,140,3],[140,6,140,8],[141,0,141,3],[141,5,141,8],[142,0,142,3],[142,5,142,8],[150,1,150,5],[151,1,151,5],[152,1,152,5],[153,1,153,5],[154,1,154,5],[146,2,146,3],[146,5,146,8],[147,1,147,5],[148,1,148,5],[149,1,149,5],[160,1,160,5],[161,1,161,5],[163,1,163,5],[164,0,164,5],[164,6,164,7],[155,1,155,5],[156,1,156,5],[157,1,157,5],[158,1,158,5],[159,1,159,5]]}
[null,null,null,null,null,null,"Estimate"]
[]
[]
[null,null,null,null,null,null,null,"Page:",1]
["26080 Towne Ctr"]
["Foothill Ranch, CA 92688"]
[]
[]
["Name/Ship-To Address"]
[{"$f":"IF('Build Quote'!L112=0,\"\",'Build Quote'!L112)","v":""}]
{"$rows_left_out":156}
{"sheet":"PO to Vendor","index":3,"n_rows":243,"n_cols":9,"rows_kept":243,"cut":false,"hidden":false,"merged":[[242,8,243,8],[241,1,241,5],[95,0,96,5],[95,6,96,7],[144,0,145,5],[144,6,145,7],[193,0,194,5],[193,6,194,7],[242,0,243,5],[242,6,243,7],[236,1,236,5],[237,1,237,5],[238,1,238,5],[239,1,239,5],[240,1,240,5],[231,1,231,5],[232,1,232,5],[233,1,233,5],[234,1,234,5],[235,1,235,5],[226,1,226,5],[227,1,227,5],[228,1,228,5],[229,1,229,5],[230,1,230,5],[221,1,221,5],[222,1,222,5],[223,1,223,5],[224,1,224,5],[225,1,225,5],[216,1,216,5],[217,1,217,5],[218,1,218,5],[219,1,219,5],[220,1,220,5],[211,1,211,5],[212,1,212,5],[213,1,213,5],[214,1,214,5],[215,1,215,5],[208,2,208,3],[208,4,208,6],[209,2,209,3],[209,4,209,6],[210,1,210,5],[205,0,205,3],[205,5,205,8],[206,0,206,3],[206,5,206,8],[207,0,207,3],[207,5,207,8],[201,6,201,8],[203,1,203,3],[203,6,203,8],[204,0,204,3],[204,5,204,8],[201,0,201,3],[192,1,192,5],[195,6,197,8],[199,0,199,3],[199,6,200,8],[200,0,200,3],[193,8,194,8],[187,1,187,5],[188,1,188,5],[189,1,189,5],[190,1,190,5],[191,1,191,5],[182,1,182,5],[183,1,183,5],[184,1,184,5],[185,1,185,5],[186,1,186,5],[177,1,177,5],[178,1,178,5],[179,1,179,5],[180,1,180,5],[181,1,181,5],[172,1,172,5],[173,1,173,5],[174,1,174,5],[175,1,175,5],[176,1,176,5],[167,1,167,5],[168,1,168,5],[169,1,169,5],[170,1,170,5],[171,1,171,5],[162,1,162,5],[163,1,163,5],[164,1,164,5],[165,1,165,5],[166,1,166,5],[159,2,159,3],[159,4,159,6],[160,2,160,3],[160,4,160,6],[161,1,161,5],[156,0,156,3],[156,5,156,8],[157,0,157,3],[157,5,157,8],[158,0,158,3],[158,5,158,8],[152,6,152,8],[154,1,154,3],[154,6,154,8],[155,0,155,3],[155,5,155,8],[152,0,152,3],[143,1,143,5],[146,6,148,8],[150,0,150,3],[150,6,151,8],[151,0,151,3],[144,8,145,8],[138,1,138,5],[139,1,139,5],[140,1,140,5],[141,1,141,5],[142,1,142,5],[133,1,133,5],[134,1,134,5],[135,1,135,5],[136,1,136,5],[137,1,137,5],[128,1,128,5],[129,1,129,5],[130,1,130,5],[131,1,131,5],[132,1,132,5],[123,1,123,5],[124,1,124,5],[125,1,125,5],[126,1,126,5],[127,1,127,5],[118,1,118,5],[119,1,119,5],[120,1,120,5],[121,1,121,5],[122,1,122,5],[113,1,113,5],[114,1,114,5],[115,1,115,5],[116,1,116,5],[117,1,117,5],[110,2,110,3],[110,4,110,6],[111,2,111,3],[111,4,111,6],[112,1,112,5],[107,0,107,3],[107,5,107,8],[108,0,108,3],[108,5,108,8],[109,0,109,3],[109,5,109,8],[103,6,103,8],[105,1,105,3],[105,6,105,8],[106,0,106,3],[106,5,106,8],[103,0,103,3],[97,6,99,8],[101,0,101,3],[101,6,102,8],[102,0,102,3],[95,8,96,8],[91,1,91,5],[92,1,92,5],[93,1,93,5],[94,1,94,5],[86,1,86,5],[87,1,87,5],[88,1,88,5],[89,1,89,5],[90,1,90,5],[81,1,81,5],[82,1,82,5],[83,1,83,5],[84,1,84,5],[85,1,85,5],[76,1,76,5],[77,1,77,5],[78,1,78,5],[79,1,79,5],[80,1,80,5],[71,1,71,5],[72,1,72,5],[73,1,73,5],[74,1,74,5],[75,1,75,5],[66,1,66,5],[67,1,67,5],[68,1,68,5],[69,1,69,5],[70,1,70,5],[62,2,62,3],[62,4,62,6],[63,1,63,5],[64,1,64,5],[65,1,65,5],[59,0,59,3],[59,5,59,8],[60,0,60,3],[60,5,60,8],[61,2,61,3],[61,4,61,6],[56,1,56,3],[56,6,56,8],[57,0,57,3],[57,5,57,8],[58,0,58,3],[58,5,58,8],[35,1,35,5],[36,1,36,5],[37,1,37,5],[38,1,38,5],[39,1,39,5],[40,1,40,5],[46,1,46,5],[41,1,41,5],[42,1,42,5],[43,1,43,5],[44,1,44,5],[45,1,45,5],[6,0,6,3],[4,0,4,3],[54,0,54,3],[23,1,23,5],[24,1,24,5],[25,1,25,5],[11,0,11,3],[12,0,12,3],[48,6,50,8],[52,0,52,3],[52,6,53,8],[53,0,53,3],[17,1,17,5],[18,1,18,5],[19,1,19,5],[20,1,20,5],[21,1,21,5],[54,6,54,8],[47,0,47,5],[29,1,29,5],[30,1,30,5],[47,6,47,7],[33,1,33,5],[34,1,34,5],[0,6,2,8],[5,0,5,3],[8,1,8,3],[8,6,8,8],[4,6,5,8],[6,6,6,8],[31,1,31,5],[32,1,32,5],[26,1,26,5],[27,1,27,5],[28,1,28,5],[22,1,22,5],[13,2,13,3],[13,4,13,6],[14,2,14,3],[14,4,14,6],[15,1,15,5],[16,1,16,5],[9,5,9,8],[10,5,10,8],[11,5,11,8],[12,5,12,8],[9,0,9,3],[10,0,10,3]]}
[null,null,null,null,null,null,"Purchase Order"]
[]
[]
[null,null,null,null,null,null,null,"Page:",1]
[null,null,null,null,null,null,"In Hands Date"]
["26080 Towne Ctr"]
["Foothill Ranch, CA 92688",null,null,null,null,null,{"$f":"TODAY()+1","v":"2015-12-12"}]
[]
["Vendor:",null,null,null,null,"Ship To:"]
[{"$f":"IF('Build Quote'!P$120=\"\",\"\",'Build Quote'!P$120)","v":""},null,null,null,null,{"$f":"IF('Build Quote'!Q$120=\"\",\"\",'Build Quote'!Q$120)","v":""}]
{"$rows_left_out":234}
{"sheet":"PO to Decorator","index":4,"n_rows":165,"n_cols":9,"rows_kept":165,"cut":false,"hidden":false,"merged":[[160,1,160,5],[161,1,161,5],[163,1,163,5],[164,0,164,5],[164,6,164,7],[155,1,155,5],[156,1,156,5],[157,1,157,5],[158,1,158,5],[159,1,159,5],[150,1,150,5],[151,1,151,5],[152,1,152,5],[153,1,153,5],[154,1,154,5],[146,2,146,3],[146,4,146,6],[147,1,147,5],[148,1,148,5],[149,1,149,5],[143,0,143,3],[143,5,143,8],[144,0,144,3],[144,5,144,8],[145,2,145,3],[145,4,145,6],[140,1,140,3],[140,6,140,8],[141,0,141,3],[141,5,141,8],[142,0,142,3],[142,5,142,8],[132,6,134,8],[136,0,136,3],[136,6,137,8],[137,0,137,3],[138,6,138,8],[127,1,127,5],[128,1,128,5],[130,1,130,5],[131,0,131,5],[131,6,131,7],[122,1,122,5],[123,1,123,5],[124,1,124,5],[125,1,125,5],[126,1,126,5],[117,1,117,5],[118,1,118,5],[119,1,119,5],[120,1,120,5],[121,1,121,5],[113,2,113,3],[113,4,113,6],[114,1,114,5],[115,1,115,5],[116,1,116,5],[110,0,110,3],[110,5,110,8],[111,0,111,3],[111,5,111,8],[112,2,112,3],[112,4,112,6],[107,1,107,3],[107,6,107,8],[108,0,108,3],[108,5,108,8],[109,0,109,3],[109,5,109,8],[99,6,101,8],[103,0,103,3],[103,6,104,8],[104,0,104,3],[105,6,105,8],[94,1,94,5],[95,1,95,5],[97,1,97,5],[98,0,98,5],[98,6,98,7],[89,1,89,5],[90,1,90,5],[91,1,91,5],[92,1,92,5],[93,1,93,5],[84,1,84,5],[85,1,85,5],[86,1,86,5],[87,1,87,5],[88,1,88,5],[80,2,80,3],[80,4,80,6],[81,1,81,5],[82,1,82,5],[83,1,83,5],[77,0,77,3],[77,5,77,8],[78,0,78,3],[78,5,78,8],[79,2,79,3],[79,4,79,6],[74,1,74,3],[74,6,74,8],[75,0,75,3],[75,5,75,8],[76,0,76,3],[76,5,76,8],[66,6,68,8],[70,0,70,3],[70,6,71,8],[71,0,71,3],[72,6,72,8],[61,1,61,5],[62,1,62,5],[64,1,64,5],[65,0,65,5],[65,6,65,7],[56,1,56,5],[57,1,57,5],[58,1,58,5],[59,1,59,5],[60,1,60,5],[51,1,51,5],[52,1,52,5],[53,1,53,5],[54,1,54,5],[55,1,55,5],[47,2,47,3],[47,4,47,6],[48,1,48,5],[49,1,49,5],[50,1,50,5],[44,0,44,3],[44,5,44,8],[45,0,45,3],[45,5,45,8],[46,2,46,3],[46,4,46,6],[41,1,41,3],[41,6,41,8],[42,0,42,3],[42,5,42,8],[43,0,43,3],[43,5,43,8],[33,6,35,8],[37,0,37,3],[37,6,38,8],[38,0,38,3],[39,6,39,8],[32,0,32,5],[29,1,29,5],[31,1,31,5],[32,6,32,7],[9,5,9,8],[10,5,10,8],[11,5,11,8],[12,5,12,8],[9,0,9,3],[10,0,10,3],[23,1,23,5],[24,1,24,5],[25,1,25,5],[26,1,26,5],[27,1,27,5],[28,1,28,5],[22,1,22,5],[13,2,13,3],[13,4,13,6],[14,2,14,3],[14,4,14,6],[15,1,15,5],[16,1,16,5],[17,1,17,5],[18,1,18,5],[19,1,19,5],[20,1,20,5],[21,1,21,5],[11,0,11,3],[12,0,12,3],[0,6,2,8],[4,0,4,3],[5,0,5,3],[8,1,8,3],[8,6,8,8],[4,6,5,8],[6,6,6,8]]}
[null,null,null,null,null,null,"Purchase Order"]
[]
[]
[null,null,null,null,null,null,null,"Page:",1]
["26080 Towne Ctr",null,null,null,null,null,"In Hands Date"]
["Foothill Ranch, CA 92688"]
[null,null,null,null,null,null,{"$f":"'Build Quote'!Q113","v":"00:00:00"}]
[]
["Decorator:",null,null,null,null,"Ship To:"]
[{"$f":"IF('Build Quote'!Q120=\"\",\"\",'Build Quote'!Q120)","v":""},null,null,null,null,{"$f":"IF('Build Quote'!L112=0,\"\",'Build Quote'!L112)","v":""}]
{"$rows_left_out":156}
{"sheet":"Customers","index":5,"n_rows":127,"n_cols":8,"rows_kept":127,"cut":false,"hidden":true,"merged":[]}
["Company","Address","Address 2","City","State","Zip","Phone","Email"]
["Pedal Industries","1234 address",null,"foothill ranch","ca",92688,9495551234,"pedalindustries.email@gmail.com"]
["Super Customer","111 success lane",null,"irvine","ca",92653,9495554321,"thisisnotarealemail@gmail.com"]
["Customer Three","41 big spender ave",null,"santa barbara","ca",92850,7135556321,"anotherfakeemail@gmail.com"]
["Acme, inc.","123 not a real street",null,"irvine","ca",92671,9495551234,"anotherfakeemail@gmail.com"]
["Widget Corp","123 not a real street",null,"irvine","ca",92671,9495551234,"anotherfakeemail@gmail.com"]
["123 Warehousing","123 not a real street",null,"irvine","ca",92671,9495551234,"anotherfakeemail@gmail.com"]
["Demo Company","123 not a real street",null,"irvine","ca",92671,9495551234,"anotherfakeemail@gmail.com"]
["Smith and Co.","123 not a real street",null,"irvine","ca",92671,9495551234,"anotherfakeemail@gmail.com"]
["Foo Bars","123 not a real street",null,"irvine","ca",92671,9495551234,"anotherfakeemail@gmail.com"]
{"$rows_left_out":118}
{"sheet":"Blank Products","index":6,"n_rows":14,"n_cols":5,"rows_kept":14,"cut":false,"hidden":true,"merged":[]}
["Item Number","Cost","Blank Color Options","Customer Item","Customer Description"]
[3301,4,null,"Apparel","Premium Crew Neck"]
[3401,4.5,null,"Apparel","Ladies V Neck"]
[3501,4.3,null,"Apparel","Crew Neck"]
[3601,4,null,"Apparel","Premium Crew Neck"]
[4101,4.5,null,"Apparel","Ladies V Neck"]
[4102,4.3,null,"Apparel","Crew Neck"]
[4201,4,null,"Apparel","Premium Crew Neck"]
[4202,4.5,null,"Apparel","Ladies V Neck"]
[4301,4.3,null,"Apparel","Crew Neck"]
{"$rows_left_out":5}
{"sheet":"info","index":7,"n_rows":17,"n_cols":2,"rows_kept":17,"cut":false,"hidden":true,"merged":[]}
[]
[null,"Item Types:"]
[null,"Apparel"]
[null,"Apparel:Apparel Set up"]
[null,"Other"]
[null,"Other:Set up"]
[null,"Hats!"]
[null,"Hats!:Set up Hats"]
[null,"DHD"]
[null,"DHD:Bag and Fold"]
{"$rows_left_out":8}
{"sheet":"Lines","index":8,"n_rows":109,"n_cols":32,"rows_kept":109,"cut":false,"hidden":true,"merged":[]}
[]
[]
[]
[]
[]
[]
[null,"Number of Locations","Current Location #","Blank Item #","Blank Cost","Bag+Fold","Run Charge","Style Name","Style QTY","Line Type","Margin","Blank Color","XXS","XS","S","M","L","XL","2XL","3XL","4XL","2XL +","3XL +","4XL +","Blank Description"]
[null,0,1,2,3,4,5,6,7,8,9,10,11,12,13,14,15,16,17,18,19,20,21,22,23,24,25,26,27,28,29,30]
[0,null,1,null,null,false,null,null,null,null,0.4]
[1,null,1,null,null,false,null,null,null,null,0.4,null,null,null,null,null,null,null,null,null,null,1,2,3]
{"$rows_left_out":100}
{"sheet":"TREVFileNames","index":9,"n_rows":8,"n_cols":2,"rows_kept":8,"cut":false,"hidden":true,"merged":[]}
["Estimate FileName:",{"$f":"B2&\" Estimate\"","v":"25006 Estimate"}]
["Job Number:",25006]
["Customer:",{"$f":"'Build Quote'!L112","v":0}]
["Customer Email:",{"$f":"IFERROR(VLOOKUP(B3,Customers!A:H,8,FALSE),\"no email\")","v":"no email"}]
["Vendor:",{"$f":"IF('Build Quote'!P120=\"\",\"\",'Build Quote'!P120)","v":""}]
["Vendor Email:",{"$f":"IFERROR(VLOOKUP(B5,Factories!A:E,4,FALSE),\"no email\")","v":"no email"}]
["Decorator:",{"$f":"IF('Build Quote'!Q120=\"\",\"\",'Build Quote'!Q120)","v":""}]
["Decorator Email:",{"$f":"IFERROR(VLOOKUP(B7,Factories!A:E,4,FALSE),\"no email\")","v":"no email"}]

{"sheet":"TREVJobToZoho","index":10,"n_rows":19,"n_cols":2,"rows_kept":19,"cut":false,"hidden":true,"merged":[]}
["Job # : ",{"$f":"TREVFileNames!B2","v":25006}]
["Job Name : ",{"$f":"IF('Build Quote'!Q118=\"\",\"\",'Build Quote'!Q118)","v":""}]
["Customers : ",{"$f":"IF('Build Quote'!L112=\"\",\"\",'Build Quote'!L112)","v":""}]
["Status : ","New Order"]
["Steps : ","Check in-hands Date"]
["Date Initiated : ",{"$f":"TODAY()","v":"2015-12-11"}]
["Date In Hands : ",{"$f":"IF('Build Quote'!Q113=\"\",\"\",'Build Quote'!Q113)","v":""}]
["Ship Time : ",{"$f":"'Build Quote'!L118","v":2}]
["Purchase Orders : "]
["Excel Sheet : "]
{"$rows_left_out":10}
{"sheet":"TREVPermanent","index":11,"n_rows":15,"n_cols":2,"rows_kept":15,"cut":false,"hidden":true,"merged":[]}
["Sent to Zoho?",false]
["Got PO Number",false]
["Print Estimate",false]
["Print PO to Vendor",false]
["Print PO to Decorator",false]
["Sent Estimate",false]
["Sent PO to Vendor",false]
["Sent PO to Decorator",false]
["Build Estimate",false]
["Build PO Vendor",false]
{"$rows_left_out":6}
{"sheet":"Line 1","index":12,"n_rows":13,"n_cols":4,"rows_kept":13,"cut":false,"hidden":true,"merged":[]}
[null,"location name","colors","flash"]
[null,0,1,2]
[0,null,null,false]
[1,null,null,false]
[2,null,null,false]
[3,null,null,false]
[4,null,null,false]
[5,null,null,false]
[6,null,null,false]
[7,null,null,false]
{"$rows_left_out":4}
{"sheet":"Line 2","index":13,"n_rows":13,"n_cols":4,"rows_kept":13,"cut":false,"hidden":true,"merged":[]}
[null,"location name","colors","flash"]
[null,0,1,2]
[0,null,null,false]
[1,null,null,false]
[2,null,null,false]
[3,null,null,false]
[4,null,null,false]
[5,null,null,false]
[6,null,null,false]
[7,null,null,false]
{"$rows_left_out":4}
{"sheet":"Line 3","index":14,"n_rows":13,"n_cols":4,"rows_kept":13,"cut":false,"hidden":true,"merged":[]}
[null,"location name","colors","flash"]
[null,0,1,2]
[0,null,null,false]
[1,null,null,false]
[2,null,null,false]
[3,null,null,false]
[4,null,null,false]
[5,null,null,false]
[6,null,null,false]
[7,null,null,false]
{"$rows_left_out":4}
{"sheet":"Pacific Price List","index":15,"n_rows":14,"n_cols":19,"rows_kept":14,"cut":false,"hidden":true,"merged":[[0,3,0,17],[2,0,12,0]]}
[null,null,null,"Number of Colors"]
[null,null,null,"Process",1,2,3,4,5,6,7,8,9,10,11,12,13,14,"Flash"]
["Quantity Level",1,0,120,25,40,55,70,85,100,115,130,145,160,175,190,205,220,1]
[null,24,1,10,2,3,4,5,6,7,8,9,10,11,12,13,14,15,1]
[null,48,2,9,1.9,2,2.1,2.2000000000000002,2.2999999999999998,2.4,2.5,2.6,2.7,2.8,2.9,3,3.1,3.2,1]
[null,72,3,8,1.8,1.9,2,2.1,2.2000000000000002,2.2999999999999998,2.4,2.5,2.6,2.7,2.8,2.9,3,3.1,1]
[null,144,4,7,1.7,1.8,1.9,2,2.1,2.2000000000000002,2.2999999999999998,2.4,2.5,2.6,2.7,2.8,2.9,3,0.9]
[null,{"$f":"B7*2","v":288},5,6,1.6,1.55,1.5,1.45,1.4,1.35,1.3,1.25,1.2,1.1499999999999999,1.1000000000000001,1.05,0.999999999999999,0.94999999999999896,0.9]
[null,600,6,5,1.5,1.48,1.46,1.44,1.42,1.4,1.38,1.36,1.34,1.32,1.3,1.28,1.26,1.24,0.9]
[null,1200,7,4,1.4,1.39,1.38,1.37,1.36,1.35,1.34,1.33,1.32,1.31,1.3,1.29,1.28,1.27,0.9]
{"$rows_left_out":5}
{"sheet":"Line 4","index":16,"n_rows":13,"n_cols":4,"rows_kept":13,"cut":false,"hidden":true,"merged":[]}
[null,"location name","colors","flash"]
[null,0,1,2]
[0,null,null,false]
[1,null,null,false]
[2,null,null,false]
[3,null,null,false]
[4,null,null,false]
[5,null,null,false]
[6,null,null,false]
[7,null,null,false]
{"$rows_left_out":4}
{"sheet":"Line 5","index":17,"n_rows":13,"n_cols":4,"rows_kept":13,"cut":false,"hidden":true,"merged":[]}
[null,"location name","colors","flash"]
[null,0,1,2]
[0,null,null,false]
[1,null,null,false]
[2,null,null,false]
[3,null,null,false]
[4,null,null,false]
[5,null,null,false]
[6,null,null,false]
[7,null,null,false]
{"$rows_left_out":4}
{"sheet":"Line 6","index":18,"n_rows":13,"n_cols":4,"rows_kept":13,"cut":false,"hidden":true,"merged":[]}
[null,"location name","colors","flash"]
[null,0,1,2]
[0,null,null,false]
[1,null,null,false]
[2,null,null,false]
[3,null,null,false]
[4,null,null,false]
[5,null,null,false]
[6,null,null,false]
[7,null,null,false]
{"$rows_left_out":4}
{"sheet":"Line 7","index":19,"n_rows":13,"n_cols":4,"rows_kept":13,"cut":false,"hidden":true,"merged":[]}
[null,"location name","colors","flash"]
[null,0,1,2]
[0,null,null,false]
[1,null,null,false]
[2,null,null,false]
[3,null,null,false]
[4,null,null,false]
[5,null,null,false]
[6,null,null,false]
[7,null,null,false]
{"$rows_left_out":4}
{"sheet":"Line 8","index":20,"n_rows":13,"n_cols":4,"rows_kept":13,"cut":false,"hidden":true,"merged":[]}
[null,"location name","colors","flash"]
[null,0,1,2]
[0,null,null,false]
[1,null,null,false]
[2,null,null,false]
[3,null,null,false]
[4,null,null,false]
[5,null,null,false]
[6,null,null,false]
[7,null,null,false]
{"$rows_left_out":4}
{"sheet":"Line 9","index":21,"n_rows":13,"n_cols":4,"rows_kept":13,"cut":false,"hidden":true,"merged":[]}
[null,"location name","colors","flash"]
[null,0,1,2]
[0,null,null,false]
[1,null,null,false]
[2,null,null,false]
[3,null,null,false]
[4,null,null,false]
[5,null,null,false]
[6,null,null,false]
[7,null,null,false]
{"$rows_left_out":4}
{"sheet":"Line 10","index":22,"n_rows":13,"n_cols":4,"rows_kept":13,"cut":false,"hidden":true,"merged":[]}
[null,"location name","colors","flash"]
[null,0,1,2]
[0,null,null,false]
[1,null,null,false]
[2,null,null,false]
[3,null,null,false]
[4,null,null,false]
[5,null,null,false]
[6,null,null,false]
[7,null,null,false]
{"$rows_left_out":4}
{"sheet":"Line 11","index":23,"n_rows":13,"n_cols":4,"rows_kept":13,"cut":false,"hidden":true,"merged":[]}
[null,"location name","colors","flash"]
[null,0,1,2]
[0,null,null,false]
[1,null,null,false]
[2,null,null,false]
[3,null,null,false]
[4,null,null,false]
[5,null,null,false]
[6,null,null,false]
[7,null,null,false]
{"$rows_left_out":4}
{"sheet":"Line 12","index":24,"n_rows":13,"n_cols":4,"rows_kept":13,"cut":false,"hidden":true,"merged":[]}
[null,"location name","colors","flash"]
[null,0,1,2]
[0,null,null,false]
[1,null,null,false]
[2,null,null,false]
[3,null,null,false]
[4,null,null,false]
[5,null,null,false]
[6,null,null,false]
[7,null,null,false]
{"$rows_left_out":4}
{"sheet":"Line 13","index":25,"n_rows":13,"n_cols":4,"rows_kept":13,"cut":false,"hidden":true,"merged":[]}
[null,"location name","colors","flash"]
[null,0,1,2]
[0,null,null,false]
[1,null,null,false]
[2,null,null,false]
[3,null,null,false]
[4,null,null,false]
[5,null,null,false]
[6,null,null,false]
[7,null,null,false]
{"$rows_left_out":4}
{"sheet":"Line 14","index":26,"n_rows":13,"n_cols":4,"rows_kept":13,"cut":false,"hidden":true,"merged":[]}
[null,"location name","colors","flash"]
[null,0,1,2]
[0,null,null,false]
[1,null,null,false]
[2,null,null,false]
[3,null,null,false]
[4,null,null,false]
[5,null,null,false]
[6,null,null,false]
[7,null,null,false]
{"$rows_left_out":4}
{"sheet":"Line 15","index":27,"n_rows":13,"n_cols":4,"rows_kept":13,"cut":false,"hidden":true,"merged":[]}
[null,"location name","colors","flash"]
[null,0,1,2]
[0,null,null,false]
[1,null,null,false]
[2,null,null,false]
[3,null,null,false]
[4,null,null,false]
[5,null,null,false]
[6,null,null,false]
[7,null,null,false]
{"$rows_left_out":3}