{"text_format":"1","workbook":"xlsx","n_sheets":3,"sheets":["Oct Comparison P&L","Budget 1","Budget 2"],"not_rendered":{"charts":0,"images":0,"macros":0,"external_links":1,"defined_names":0,"comments":0,"pivot_tables":0},"unopened":[],"bounds":{"document_bytes":16777216,"sheet_cells":100000,"rows_first":2000,"rows_last":500,"rows_between":2000,"halvings":0,"cell_chars":16384,"cell_head_chars":4096},"cells_cut":0,"cells_raw":0,"read":"whole","date_system":"1900"}

{"sheet":"Oct Comparison P&L","index":0,"n_rows":88,"n_cols":21,"rows_kept":88,"cut":false,"hidden":false,"merged":[[2,0,2,9],[1,0,1,9],[0,0,0,9]]}
["Marc A. Austin, P.C."]
["Profit and Loss Budget Report"]
[{"$f":"B5","v":"2015-10-01"}]
[]
[null,"2015-10-01","2014-10-01","Variance","Memo",null,"YTD 2015","YTD 2014","Variance","Memo"]
["INCOME"]
["   404 Professional Income-P",50849.166666666664,88302.546666666676,-37453.380000000012,null,null,128153.83333333334,150200.85333333333,-22047.01999999999]
["   404.1 Professional Income-PC Credit",0,0,0,null,null,0,0,0]
["   Unapplied Cash Payment Income",-1440,1320,-2760,null,null,2290,-4346.666666666667,6636.666666666667]
["Total Income",49409.166666666664,89622.546666666676,-40213.380000000012,null,null,130443.83333333334,145854.18666666668,-15410.353333333333]
[]
["EXPENSES"]
["   515 Bank Fees",13.333333333333334,29.313333333333333,15.979999999999999,null,null,13.333333333333334,57.64,44.306666666666665]
["   520 Office Supplies",1216.8399999999999,434.25333333333333,-782.58666666666659,null,null,1642.1733333333332,1554.5333333333333,-87.639999999999873]
["   521 Auto Expenses - Fuel",32.020000000000003,51.933333333333337,19.913333333333334,null,null,116.66,125.11333333333333,8.4533333333333331]
["   521.1 Auto Expenses - Other",80.873333333333335,106.04,25.166666666666671,null,null,80.873333333333335,177.32,96.446666666666658]
["   521.2 Auto Expenses - Insurance",0,0,0,null,null,0,0,0]
["   521.5 Auto Expense Reimbursement",2.686666666666667,8.0266666666666655,5.3399999999999981,null,null,41.02,31.733333333333334,-9.2866666666666688]
["   522 Rent Expense",2842.02,2842.02,0,null,null,5684.04,5684.04,0]
["   525 Client Expenses",507.66666666666669,1122.3266666666666,614.65999999999985,null,null,12567.533333333333,2071.54,-10495.993333333332]
{"$rows_left_out":69}
{"sheet":"Budget 1","index":1,"n_rows":80,"n_cols":37,"rows_kept":80,"cut":false,"hidden":false,"merged":[]}
["Marc A. Austin, P.C."]
["Budget #1 Report",null,null,null,null,null,null,null,null,null,null,null,null,null,null,null,null,null,null,null,null,null,{"$f":"'Oct Comparison P&L'!B5","v":"2015-10-01"},"Budget #1","Variance",null,"YTD 2015","YTD Budget #1","Variance",null,{"$f":"'Oct Comparison P&L'!B5","v":"2015-10-01"},"Budget #2","Variance",null,"YTD 2015","YTD Budget #2","Variance"]
[{"$f":"B5","v":"2015-10-01"}]
[null,null,null,null,null,null,null,null,null,null,null,null,null,null,null,null,null,null,null,null,null,null,{"$f":"'Oct Comparison P&L'!B7","v":50849.166666666664},{"$f":"IF(ISNA(VLOOKUP('Oct Comparison P&L'!A7,'[1]Budget 1'!$A$1:$O$100,'Oct Comparison P&L'!$K$1,FALSE)),0,(VLOOKUP('Oct Comparison P&L'!A7,'[1]Budget 1'!$A$1:$O$100,'Oct Comparison P&L'!$K$1,FALSE)))","v":{"$error":"#VALUE!"}},{"$f":"W4-X4","v":{"$error":"#VALUE!"}},null,{"$f":"'Oct Comparison P&L'!G7","v":128153.83333333334},{"$f":"IF(ISNA(VLOOKUP('Oct Comparison P&L'!$A7,'[1]Budget 1'!$A$1:$Z$100,'Oct Comparison P&L'!$K$2,FALSE)),0,(VLOOKUP('Oct Comparison P&L'!$A7,'[1]Budget 1'!$A$1:$Z$100,'Oct Comparison P&L'!$K$2,FALSE)))","v":{"$error":"#VALUE!"}},{"$f":"AA4-AB4","v":{"$error":"#VALUE!"}},null,{"$f":"'Oct Comparison P&L'!B7","v":50849.166666666664},{"$f":"IF(ISNA(VLOOKUP('Oct Comparison P&L'!A7,'[1]Budget 2'!$A$1:$O$100,'Oct Comparison P&L'!$K$1,FALSE)),0,(VLOOKUP('Oct Comparison P&L'!A7,'[1]Budget 2'!$A$1:$O$100,'Oct Comparison P&L'!$K$1,FALSE)))","v":{"$error":"#VALUE!"}},{"$f":"AE4-AF4","v":{"$error":"#VALUE!"}},null,{"$f":"AA4","v":128153.83333333334},{"$f":"IF(ISNA(VLOOKUP('Oct Comparison P&L'!$A7,'[1]Budget 2'!$A$1:$Z$100,'Oct Comparison P&L'!$K$2,FALSE)),0,(VLOOKUP('Oct Comparison P&L'!$A7,'[1]Budget 2'!$A$1:$Z$100,'Oct Comparison P&L'!$K$2,FALSE)))","v":{"$error":"#VALUE!"}},{"$f":"AI4-AJ4","v":{"$error":"#VALUE!"}}]
[null,"2015-10-01","Budget #1","Variance",null,"YTD 2015","YTD Budget #1","Variance","Memo",null,null,null,null,null,null,null,null,null,null,null,null,null,{"$f":"'Oct Comparison P&L'!B8","v":0},{"$f":"IF(ISNA(VLOOKUP('Oct Comparison P&L'!A8,'[1]Budget 1'!$A$1:$O$100,'Oct Comparison P&L'!$K$1,FALSE)),0,(VLOOKUP('Oct Comparison P&L'!A8,'[1]Budget 1'!$A$1:$O$100,'Oct Comparison P&L'!$K$1,FALSE)))","v":0},{"$f":"W5-X5","v":0},null,{"$f":"'Oct Comparison P&L'!G8","v":0},{"$f":"IF(ISNA(VLOOKUP('Oct Comparison P&L'!$A8,'[1]Budget 1'!$A$1:$Z$100,'Oct Comparison P&L'!$K$2,FALSE)),0,(VLOOKUP('Oct Comparison P&L'!$A8,'[1]Budget 1'!$A$1:$Z$100,'Oct Comparison P&L'!$K$2,FALSE)))","v":0},{"$f":"AA5-AB5","v":0},null,{"$f":"'Oct Comparison P&L'!B8","v":0},{"$f":"IF(ISNA(VLOOKUP('Oct Comparison P&L'!A8,'[1]Budget 2'!$A$1:$O$100,'Oct Comparison P&L'!$K$1,FALSE)),0,(VLOOKUP('Oct Comparison P&L'!A8,'[1]Budget 2'!$A$1:$O$100,'Oct Comparison P&L'!$K$1,FALSE)))","v":0},{"$f":"AE5-AF5","v":0},null,{"$f":"AA5","v":0},{"$f":"IF(ISNA(VLOOKUP('Oct Comparison P&L'!$A8,'[1]Budget 2'!$A$1:$Z$100,'Oct Comparison P&L'!$K$2,FALSE)),0,(VLOOKUP('Oct Comparison P&L'!$A8,'[1]Budget 2'!$A$1:$Z$100,'Oct Comparison P&L'!$K$2,FALSE)))","v":0},{"$f":"AI5-AJ5","v":0}]
["INCOME",null,null,null,null,null,null,null,null,null,null,null,null,null,null,null,null,null,null,null,null,null,{"$f":"'Oct Comparison P&L'!B9","v":-1440},{"$f":"IF(ISNA(VLOOKUP('Oct Comparison P&L'!A9,'[1]Budget 1'!$A$1:$O$100,'Oct Comparison P&L'!$K$1,FALSE)),0,(VLOOKUP('Oct Comparison P&L'!A9,'[1]Budget 1'!$A$1:$O$100,'Oct Comparison P&L'!$K$1,FALSE)))","v":{"$error":"#VALUE!"}},{"$f":"W6-X6","v":{"$error":"#VALUE!"}},null,{"$f":"'Oct Comparison P&L'!G9","v":2290},{"$f":"IF(ISNA(VLOOKUP('Oct Comparison P&L'!$A9,'[1]Budget 1'!$A$1:$Z$100,'Oct Comparison P&L'!$K$2,FALSE)),0,(VLOOKUP('Oct Comparison P&L'!$A9,'[1]Budget 1'!$A$1:$Z$100,'Oct Comparison P&L'!$K$2,FALSE)))","v":{"$error":"#VALUE!"}},{"$f":"AA6-AB6","v":{"$error":"#VALUE!"}},null,{"$f":"'Oct Comparison P&L'!B9","v":-1440},{"$f":"IF(ISNA(VLOOKUP('Oct Comparison P&L'!A9,'[1]Budget 2'!$A$1:$O$100,'Oct Comparison P&L'!$K$1,FALSE)),0,(VLOOKUP('Oct Comparison P&L'!A9,'[1]Budget 2'!$A$1:$O$100,'Oct Comparison P&L'!$K$1,FALSE)))","v":{"$error":"#VALUE!"}},{"$f":"AE6-AF6","v":{"$error":"#VALUE!"}},null,{"$f":"AA6","v":2290},{"$f":"IF(ISNA(VLOOKUP('Oct Comparison P&L'!$A9,'[1]Budget 2'!$A$1:$Z$100,'Oct Comparison P&L'!$K$2,FALSE)),0,(VLOOKUP('Oct Comparison P&L'!$A9,'[1]Budget 2'!$A$1:$Z$100,'Oct Comparison P&L'!$K$2,FALSE)))","v":{"$error":"#VALUE!"}},{"$f":"AI6-AJ6","v":{"$error":"#VALUE!"}}]
["   404 Professional Income-P",50849.166666666664,66666.666666666672,-15817.500000000007,null,128153.83333333334,666666.66666666663,-538512.83333333326,null,null,null,null,null,null,null,null,null,null,null,null,null,null,{"$f":"'Oct Comparison P&L'!B10","v":49409.166666666664},{"$f":"IF(ISNA(VLOOKUP('Oct Comparison P&L'!A10,'[1]Budget 1'!$A$1:$O$100,'Oct Comparison P&L'!$K$1,FALSE)),0,(VLOOKUP('Oct Comparison P&L'!A10,'[1]Budget 1'!$A$1:$O$100,'Oct Comparison P&L'!$K$1,FALSE)))","v":{"$error":"#VALUE!"}},{"$f":"W7-X7","v":{"$error":"#VALUE!"}},null,{"$f":"'Oct Comparison P&L'!G10","v":130443.83333333334},{"$f":"IF(ISNA(VLOOKUP('Oct Comparison P&L'!$A10,'[1]Budget 1'!$A$1:$Z$100,'Oct Comparison P&L'!$K$2,FALSE)),0,(VLOOKUP('Oct Comparison P&L'!$A10,'[1]Budget 1'!$A$1:$Z$100,'Oct Comparison P&L'!$K$2,FALSE)))","v":{"$error":"#VALUE!"}},{"$f":"AA7-AB7","v":{"$error":"#VALUE!"}},null,{"$f":"'Oct Comparison P&L'!B10","v":49409.166666666664},{"$f":"IF(ISNA(VLOOKUP('Oct Comparison P&L'!A10,'[1]Budget 2'!$A$1:$O$100,'Oct Comparison P&L'!$K$1,FALSE)),0,(VLOOKUP('Oct Comparison P&L'!A10,'[1]Budget 2'!$A$1:$O$100,'Oct Comparison P&L'!$K$1,FALSE)))","v":{"$error":"#VALUE!"}},{"$f":"AE7-AF7","v":{"$error":"#VALUE!"}},null,{"$f":"AA7","v":130443.83333333334},{"$f":"IF(ISNA(VLOOKUP('Oct Comparison P&L'!$A10,'[1]Budget 2'!$A$1:$Z$100,'Oct Comparison P&L'!$K$2,FALSE)),0,(VLOOKUP('Oct Comparison P&L'!$A10,'[1]Budget 2'!$A$1:$Z$100,'Oct Comparison P&L'!$K$2,FALSE)))","v":{"$error":"#VALUE!"}},{"$f":"AI7-AJ7","v":{"$error":"#VALUE!"}}]
["   404.1 Professional Income-PC Credit",0,0,0,null,0,0,0]
["   Unapplied Cash Payment Income",-1440,0,-1440,null,2290,0,2290]
["Total Income",49409.166666666664,66666.666666666672,-17257.500000000007,null,130443.83333333334,666666.66666666663,-536222.83333333326,null,null,null,null,null,null,null,null,null,null,null,null,null,null,{"$f":"'Oct Comparison P&L'!B13","v":13.333333333333334},{"$f":"IF(ISNA(VLOOKUP('Oct Comparison P&L'!A13,'[1]Budget 1'!$A$1:$O$100,'Oct Comparison P&L'!$K$1,FALSE)),0,(VLOOKUP('Oct Comparison P&L'!A13,'[1]Budget 1'!$A$1:$O$100,'Oct Comparison P&L'!$K$1,FALSE)))","v":{"$error":"#VALUE!"}},{"$f":"X10-W10","v":{"$error":"#VALUE!"}},null,{"$f":"'Oct Comparison P&L'!G13","v":13.333333333333334},{"$f":"IF(ISNA(VLOOKUP('Oct Comparison P&L'!$A13,'[1]Budget 1'!$A$1:$Z$100,'Oct Comparison P&L'!$K$2,FALSE)),0,(VLOOKUP('Oct Comparison P&L'!$A13,'[1]Budget 1'!$A$1:$Z$100,'Oct Comparison P&L'!$K$2,FALSE)))","v":{"$error":"#VALUE!"}},{"$f":"AB10-AA10","v":{"$error":"#VALUE!"}},null,{"$f":"'Oct Comparison P&L'!B13","v":13.333333333333334},{"$f":"IF(ISNA(VLOOKUP('Oct Comparison P&L'!A13,'[1]Budget 2'!$A$1:$O$100,'Oct Comparison P&L'!$K$1,FALSE)),0,(VLOOKUP('Oct Comparison P&L'!A13,'[1]Budget 2'!$A$1:$O$100,'Oct Comparison P&L'!$K$1,FALSE)))","v":{"$error":"#VALUE!"}},{"$f":"AF10-AE10","v":{"$error":"#VALUE!"}},null,{"$f":"AA10","v":13.333333333333334},{"$f":"IF(ISNA(VLOOKUP('Oct Comparison P&L'!$A13,'[1]Budget 2'!$A$1:$Z$100,'Oct Comparison P&L'!$K$2,FALSE)),0,(VLOOKUP('Oct Comparison P&L'!$A13,'[1]Budget 2'!$A$1:$Z$100,'Oct Comparison P&L'!$K$2,FALSE)))","v":{"$error":"#VALUE!"}},{"$f":"AJ10-AI10","v":{"$error":"#VALUE!"}}]
[null,null,null,null,null,null,null,null,null,null,null,null,null,null,null,null,null,null,null,null,null,null,{"$f":"'Oct Comparison P&L'!B14","v":1216.8399999999999},{"$f":"IF(ISNA(VLOOKUP('Oct Comparison P&L'!A14,'[1]Budget 1'!$A$1:$O$100,'Oct Comparison P&L'!$K$1,FALSE)),0,(VLOOKUP('Oct Comparison P&L'!A14,'[1]Budget 1'!$A$1:$O$100,'Oct Comparison P&L'!$K$1,FALSE)))","v":{"$error":"#VALUE!"}},{"$error":"#VALUE!"},null,{"$f":"'Oct Comparison P&L'!G14","v":1642.1733333333332},{"$f":"IF(ISNA(VLOOKUP('Oct Comparison P&L'!$A14,'[1]Budget 1'!$A$1:$Z$100,'Oct Comparison P&L'!$K$2,FALSE)),0,(VLOOKUP('Oct Comparison P&L'!$A14,'[1]Budget 1'!$A$1:$Z$100,'Oct Comparison P&L'!$K$2,FALSE)))","v":{"$error":"#VALUE!"}},{"$error":"#VALUE!"},null,{"$f":"'Oct Comparison P&L'!B14","v":1216.8399999999999},{"$f":"IF(ISNA(VLOOKUP('Oct Comparison P&L'!A14,'[1]Budget 2'!$A$1:$O$100,'Oct Comparison P&L'!$K$1,FALSE)),0,(VLOOKUP('Oct Comparison P&L'!A14,'[1]Budget 2'!$A$1:$O$100,'Oct Comparison P&L'!$K$1,FALSE)))","v":{"$error":"#VALUE!"}},{"$error":"#VALUE!"},null,1642.1733333333332,{"$f":"IF(ISNA(VLOOKUP('Oct Comparison P&L'!$A14,'[1]Budget 2'!$A$1:$Z$100,'Oct Comparison P&L'!$K$2,FALSE)),0,(VLOOKUP('Oct Comparison P&L'!$A14,'[1]Budget 2'!$A$1:$Z$100,'Oct Comparison P&L'!$K$2,FALSE)))","v":{"$error":"#VALUE!"}},{"$error":"#VALUE!"}]
["EXPENSES",null,null,null,null,null,null,null,null,null,null,null,null,null,null,null,null,null,null,null,null,null,{"$f":"'Oct Comparison P&L'!B15","v":32.020000000000003},{"$f":"IF(ISNA(VLOOKUP('Oct Comparison P&L'!A15,'[1]Budget 1'!$A$1:$O$100,'Oct Comparison P&L'!$K$1,FALSE)),0,(VLOOKUP('Oct Comparison P&L'!A15,'[1]Budget 1'!$A$1:$O$100,'Oct Comparison P&L'!$K$1,FALSE)))","v":{"$error":"#VALUE!"}},{"$error":"#VALUE!"},null,{"$f":"'Oct Comparison P&L'!G15","v":116.66},{"$f":"IF(ISNA(VLOOKUP('Oct Comparison P&L'!$A15,'[1]Budget 1'!$A$1:$Z$100,'Oct Comparison P&L'!$K$2,FALSE)),0,(VLOOKUP('Oct Comparison P&L'!$A15,'[1]Budget 1'!$A$1:$Z$100,'Oct Comparison P&L'!$K$2,FALSE)))","v":{"$error":"#VALUE!"}},{"$error":"#VALUE!"},null,{"$f":"'Oct Comparison P&L'!B15","v":32.020000000000003},{"$f":"IF(ISNA(VLOOKUP('Oct Comparison P&L'!A15,'[1]Budget 2'!$A$1:$O$100,'Oct Comparison P&L'!$K$1,FALSE)),0,(VLOOKUP('Oct Comparison P&L'!A15,'[1]Budget 2'!$A$1:$O$100,'Oct Comparison P&L'!$K$1,FALSE)))","v":{"$error":"#VALUE!"}},{"$error":"#VALUE!"},null,116.66,{"$f":"IF(ISNA(VLOOKUP('Oct Comparison P&L'!$A15,'[1]Budget 2'!$A$1:$Z$100,'Oct Comparison P&L'!$K$2,FALSE)),0,(VLOOKUP('Oct Comparison P&L'!$A15,'[1]Budget 2'!$A$1:$Z$100,'Oct Comparison P&L'!$K$2,FALSE)))","v":{"$error":"#VALUE!"}},{"$error":"#VALUE!"}]
["   515 Bank Fees",13.333333333333334,41.666666666666664,28.333333333333329,null,13.333333333333334,416.66666666666669,403.33333333333337,null,null,null,null,null,null,null,null,null,null,null,null,null,null,{"$f":"'Oct Comparison P&L'!B16","v":80.873333333333335},{"$f":"IF(ISNA(VLOOKUP('Oct Comparison P&L'!A16,'[1]Budget 1'!$A$1:$O$100,'Oct Comparison P&L'!$K$1,FALSE)),0,(VLOOKUP('Oct Comparison P&L'!A16,'[1]Budget 1'!$A$1:$O$100,'Oct Comparison P&L'!$K$1,FALSE)))","v":{"$error":"#VALUE!"}},{"$error":"#VALUE!"},null,{"$f":"'Oct Comparison P&L'!G16","v":80.873333333333335},{"$f":"IF(ISNA(VLOOKUP('Oct Comparison P&L'!$A16,'[1]Budget 1'!$A$1:$Z$100,'Oct Comparison P&L'!$K$2,FALSE)),0,(VLOOKUP('Oct Comparison P&L'!$A16,'[1]Budget 1'!$A$1:$Z$100,'Oct Comparison P&L'!$K$2,FALSE)))","v":{"$error":"#VALUE!"}},{"$error":"#VALUE!"},null,{"$f":"'Oct Comparison P&L'!B16","v":80.873333333333335},{"$f":"IF(ISNA(VLOOKUP('Oct Comparison P&L'!A16,'[1]Budget 2'!$A$1:$O$100,'Oct Comparison P&L'!$K$1,FALSE)),0,(VLOOKUP('Oct Comparison P&L'!A16,'[1]Budget 2'!$A$1:$O$100,'Oct Comparison P&L'!$K$1,FALSE)))","v":{"$error":"#VALUE!"}},{"$error":"#VALUE!"},null,80.873333333333335,{"$f":"IF(ISNA(VLOOKUP('Oct Comparison P&L'!$A16,'[1]Budget 2'!$A$1:$Z$100,'Oct Comparison P&L'!$K$2,FALSE)),0,(VLOOKUP('Oct Comparison P&L'!$A16,'[1]Budget 2'!$A$1:$Z$100,'Oct Comparison P&L'!$K$2,FALSE)))","v":{"$error":"#VALUE!"}},{"$error":"#VALUE!"}]
["   520 Office Supplies",1216.8399999999999,1666.6666666666667,449.82666666666682,null,1642.1733333333332,16666.666666666664,15024.493333333332,null,null,null,null,null,null,null,null,null,null,null,null,null,null,{"$f":"'Oct Comparison P&L'!B17","v":0},{"$f":"IF(ISNA(VLOOKUP('Oct Comparison P&L'!A17,'[1]Budget 1'!$A$1:$O$100,'Oct Comparison P&L'!$K$1,FALSE)),0,(VLOOKUP('Oct Comparison P&L'!A17,'[1]Budget 1'!$A$1:$O$100,'Oct Comparison P&L'!$K$1,FALSE)))","v":{"$error":"#VALUE!"}},{"$error":"#VALUE!"},null,{"$f":"'Oct Comparison P&L'!G17","v":0},{"$f":"IF(ISNA(VLOOKUP('Oct Comparison P&L'!$A17,'[1]Budget 1'!$A$1:$Z$100,'Oct Comparison P&L'!$K$2,FALSE)),0,(VLOOKUP('Oct Comparison P&L'!$A17,'[1]Budget 1'!$A$1:$Z$100,'Oct Comparison P&L'!$K$2,FALSE)))","v":{"$error":"#VALUE!"}},{"$error":"#VALUE!"},null,{"$f":"'Oct Comparison P&L'!B17","v":0},{"$f":"IF(ISNA(VLOOKUP('Oct Comparison P&L'!A17,'[1]Budget 2'!$A$1:$O$100,'Oct Comparison P&L'!$K$1,FALSE)),0,(VLOOKUP('Oct Comparison P&L'!A17,'[1]Budget 2'!$A$1:$O$100,'Oct Comparison P&L'!$K$1,FALSE)))","v":{"$error":"#VALUE!"}},{"$error":"#VALUE!"},null,0,{"$f":"IF(ISNA(VLOOKUP('Oct Comparison P&L'!$A17,'[1]Budget 2'!$A$1:$Z$100,'Oct Comparison P&L'!$K$2,FALSE)),0,(VLOOKUP('Oct Comparison P&L'!$A17,'[1]Budget 2'!$A$1:$Z$100,'Oct Comparison P&L'!$K$2,FALSE)))","v":{"$error":"#VALUE!"}},{"$error":"#VALUE!"}]
["   521 Auto Expenses - Fuel",32.020000000000003,125,92.97999999999999,null,116.66,1250,1133.3399999999999,null,null,null,null,null,null,null,null,null,null,null,null,null,null,{"$f":"'Oct Comparison P&L'!B18","v":2.686666666666667},{"$f":"IF(ISNA(VLOOKUP('Oct Comparison P&L'!A18,'[1]Budget 1'!$A$1:$O$100,'Oct Comparison P&L'!$K$1,FALSE)),0,(VLOOKUP('Oct Comparison P&L'!A18,'[1]Budget 1'!$A$1:$O$100,'Oct Comparison P&L'!$K$1,FALSE)))","v":{"$error":"#VALUE!"}},{"$error":"#VALUE!"},null,{"$f":"'Oct Comparison P&L'!G18","v":41.02},{"$f":"IF(ISNA(VLOOKUP('Oct Comparison P&L'!$A18,'[1]Budget 1'!$A$1:$Z$100,'Oct Comparison P&L'!$K$2,FALSE)),0,(VLOOKUP('Oct Comparison P&L'!$A18,'[1]Budget 1'!$A$1:$Z$100,'Oct Comparison P&L'!$K$2,FALSE)))","v":{"$error":"#VALUE!"}},{"$error":"#VALUE!"},null,{"$f":"'Oct Comparison P&L'!B18","v":2.686666666666667},{"$f":"IF(ISNA(VLOOKUP('Oct Comparison P&L'!A18,'[1]Budget 2'!$A$1:$O$100,'Oct Comparison P&L'!$K$1,FALSE)),0,(VLOOKUP('Oct Comparison P&L'!A18,'[1]Budget 2'!$A$1:$O$100,'Oct Comparison P&L'!$K$1,FALSE)))","v":{"$error":"#VALUE!"}},{"$error":"#VALUE!"},null,41.02,{"$f":"IF(ISNA(VLOOKUP('Oct Comparison P&L'!$A18,'[1]Budget 2'!$A$1:$Z$100,'Oct Comparison P&L'!$K$2,FALSE)),0,(VLOOKUP('Oct Comparison P&L'!$A18,'[1]Budget 2'!$A$1:$Z$100,'Oct Comparison P&L'!$K$2,FALSE)))","v":{"$error":"#VALUE!"}},{"$error":"#VALUE!"}]
["   521.1 Auto Expenses - Other",80.873333333333335,83.333333333333329,2.4599999999999937,null,80.873333333333335,833.33333333333337,752.46,null,null,null,null,null,null,null,null,null,null,null,null,null,null,{"$f":"'Oct Comparison P&L'!B19","v":2842.02},{"$f":"IF(ISNA(VLOOKUP('Oct Comparison P&L'!A19,'[1]Budget 1'!$A$1:$O$100,'Oct Comparison P&L'!$K$1,FALSE)),0,(VLOOKUP('Oct Comparison P&L'!A19,'[1]Budget 1'!$A$1:$O$100,'Oct Comparison P&L'!$K$1,FALSE)))","v":{"$error":"#VALUE!"}},{"$error":"#VALUE!"},null,{"$f":"'Oct Comparison P&L'!G19","v":5684.04},{"$f":"IF(ISNA(VLOOKUP('Oct Comparison P&L'!$A19,'[1]Budget 1'!$A$1:$Z$100,'Oct Comparison P&L'!$K$2,FALSE)),0,(VLOOKUP('Oct Comparison P&L'!$A19,'[1]Budget 1'!$A$1:$Z$100,'Oct Comparison P&L'!$K$2,FALSE)))","v":{"$error":"#VALUE!"}},{"$error":"#VALUE!"},null,{"$f":"'Oct Comparison P&L'!B19","v":2842.02},{"$f":"IF(ISNA(VLOOKUP('Oct Comparison P&L'!A19,'[1]Budget 2'!$A$1:$O$100,'Oct Comparison P&L'!$K$1,FALSE)),0,(VLOOKUP('Oct Comparison P&L'!A19,'[1]Budget 2'!$A$1:$O$100,'Oct Comparison P&L'!$K$1,FALSE)))","v":{"$error":"#VALUE!"}},{"$error":"#VALUE!"},null,5684.04,{"$f":"IF(ISNA(VLOOKUP('Oct Comparison P&L'!$A19,'[1]Budget 2'!$A$1:$Z$100,'Oct Comparison P&L'!$K$2,FALSE)),0,(VLOOKUP('Oct Comparison P&L'!$A19,'[1]Budget 2'!$A$1:$Z$100,'Oct Comparison P&L'!$K$2,FALSE)))","v":{"$error":"#VALUE!"}},{"$error":"#VALUE!"}]
["   521.2 Auto Expenses - Insurance",0,0,0,null,0,0,0,null,null,null,null,null,null,null,null,null,null,null,null,null,null,{"$f":"'Oct Comparison P&L'!B20","v":507.66666666666669},{"$f":"IF(ISNA(VLOOKUP('Oct Comparison P&L'!A20,'[1]Budget 1'!$A$1:$O$100,'Oct Comparison P&L'!$K$1,FALSE)),0,(VLOOKUP('Oct Comparison P&L'!A20,'[1]Budget 1'!$A$1:$O$100,'Oct Comparison P&L'!$K$1,FALSE)))","v":{"$error":"#VALUE!"}},{"$error":"#VALUE!"},null,{"$f":"'Oct Comparison P&L'!G20","v":12567.533333333333},{"$f":"IF(ISNA(VLOOKUP('Oct Comparison P&L'!$A20,'[1]Budget 1'!$A$1:$Z$100,'Oct Comparison P&L'!$K$2,FALSE)),0,(VLOOKUP('Oct Comparison P&L'!$A20,'[1]Budget 1'!$A$1:$Z$100,'Oct Comparison P&L'!$K$2,FALSE)))","v":{"$error":"#VALUE!"}},{"$error":"#VALUE!"},null,{"$f":"'Oct Comparison P&L'!B20","v":507.66666666666669},{"$f":"IF(ISNA(VLOOKUP('Oct Comparison P&L'!A20,'[1]Budget 2'!$A$1:$O$100,'Oct Comparison P&L'!$K$1,FALSE)),0,(VLOOKUP('Oct Comparison P&L'!A20,'[1]Budget 2'!$A$1:$O$100,'Oct Comparison P&L'!$K$1,FALSE)))","v":{"$error":"#VALUE!"}},{"$error":"#VALUE!"},null,12567.533333333333,{"$f":"IF(ISNA(VLOOKUP('Oct Comparison P&L'!$A20,'[1]Budget 2'!$A$1:$Z$100,'Oct Comparison P&L'!$K$2,FALSE)),0,(VLOOKUP('Oct Comparison P&L'!$A20,'[1]Budget 2'!$A$1:$Z$100,'Oct Comparison P&L'!$K$2,FALSE)))","v":{"$error":"#VALUE!"}},{"$error":"#VALUE!"}]
["   521.5 Auto Expense Reimbursement",2.686666666666667,41.666666666666664,38.979999999999997,null,41.02,416.66666666666669,375.6466666666667,null,null,null,null,null,null,null,null,null,null,null,null,null,null,{"$f":"'Oct Comparison P&L'!B21","v":0},{"$f":"IF(ISNA(VLOOKUP('Oct Comparison P&L'!A21,'[1]Budget 1'!$A$1:$O$100,'Oct Comparison P&L'!$K$1,FALSE)),0,(VLOOKUP('Oct Comparison P&L'!A21,'[1]Budget 1'!$A$1:$O$100,'Oct Comparison P&L'!$K$1,FALSE)))","v":{"$error":"#VALUE!"}},{"$error":"#VALUE!"},null,{"$f":"'Oct Comparison P&L'!G21","v":0},{"$f":"IF(ISNA(VLOOKUP('Oct Comparison P&L'!$A21,'[1]Budget 1'!$A$1:$Z$100,'Oct Comparison P&L'!$K$2,FALSE)),0,(VLOOKUP('Oct Comparison P&L'!$A21,'[1]Budget 1'!$A$1:$Z$100,'Oct Comparison P&L'!$K$2,FALSE)))","v":{"$error":"#VALUE!"}},{"$error":"#VALUE!"},null,{"$f":"'Oct Comparison P&L'!B21","v":0},{"$f":"IF(ISNA(VLOOKUP('Oct Comparison P&L'!A21,'[1]Budget 2'!$A$1:$O$100,'Oct Comparison P&L'!$K$1,FALSE)),0,(VLOOKUP('Oct Comparison P&L'!A21,'[1]Budget 2'!$A$1:$O$100,'Oct Comparison P&L'!$K$1,FALSE)))","v":{"$error":"#VALUE!"}},{"$error":"#VALUE!"},null,0,{"$f":"IF(ISNA(VLOOKUP('Oct Comparison P&L'!$A21,'[1]Budget 2'!$A$1:$Z$100,'Oct Comparison P&L'!$K$2,FALSE)),0,(VLOOKUP('Oct Comparison P&L'!$A21,'[1]Budget 2'!$A$1:$Z$100,'Oct Comparison P&L'!$K$2,FALSE)))","v":{"$error":"#VALUE!"}},{"$error":"#VALUE!"}]
["   522 Rent Expense",2842.02,3333.3333333333335,491.3133333333335,null,5684.04,33333.333333333328,27649.293333333328,null,null,null,null,null,null,null,null,null,null,null,null,null,null,{"$f":"'Oct Comparison P&L'!B22","v":131.71333333333334},{"$f":"IF(ISNA(VLOOKUP('Oct Comparison P&L'!A22,'[1]Budget 1'!$A$1:$O$100,'Oct Comparison P&L'!$K$1,FALSE)),0,(VLOOKUP('Oct Comparison P&L'!A22,'[1]Budget 1'!$A$1:$O$100,'Oct Comparison P&L'!$K$1,FALSE)))","v":{"$error":"#VALUE!"}},{"$error":"#VALUE!"},null,{"$f":"'Oct Comparison P&L'!G22","v":131.71333333333334},{"$f":"IF(ISNA(VLOOKUP('Oct Comparison P&L'!$A22,'[1]Budget 1'!$A$1:$Z$100,'Oct Comparison P&L'!$K$2,FALSE)),0,(VLOOKUP('Oct Comparison P&L'!$A22,'[1]Budget 1'!$A$1:$Z$100,'Oct Comparison P&L'!$K$2,FALSE)))","v":{"$error":"#VALUE!"}},{"$error":"#VALUE!"},null,{"$f":"'Oct Comparison P&L'!B22","v":131.71333333333334},{"$f":"IF(ISNA(VLOOKUP('Oct Comparison P&L'!A22,'[1]Budget 2'!$A$1:$O$100,'Oct Comparison P&L'!$K$1,FALSE)),0,(VLOOKUP('Oct Comparison P&L'!A22,'[1]Budget 2'!$A$1:$O$100,'Oct Comparison P&L'!$K$1,FALSE)))","v":{"$error":"#VALUE!"}},{"$error":"#VALUE!"},null,131.71333333333334,{"$f":"IF(ISNA(VLOOKUP('Oct Comparison P&L'!$A22,'[1]Budget 2'!$A$1:$Z$100,'Oct Comparison P&L'!$K$2,FALSE)),0,(VLOOKUP('Oct Comparison P&L'!$A22,'[1]Budget 2'!$A$1:$Z$100,'Oct Comparison P&L'!$K$2,FALSE)))","v":{"$error":"#VALUE!"}},{"$error":"#VALUE!"}]
["   525 Client Expenses",507.66666666666669,0,-507.66666666666669,null,12567.533333333333,0,-12567.533333333333,null,null,null,null,null,null,null,null,null,null,null,null,null,null,{"$f":"'Oct Comparison P&L'!B23","v":180.73333333333335},{"$f":"IF(ISNA(VLOOKUP('Oct Comparison P&L'!A23,'[1]Budget 1'!$A$1:$O$100,'Oct Comparison P&L'!$K$1,FALSE)),0,(VLOOKUP('Oct Comparison P&L'!A23,'[1]Budget 1'!$A$1:$O$100,'Oct Comparison P&L'!$K$1,FALSE)))","v":{"$error":"#VALUE!"}},{"$error":"#VALUE!"},null,{"$f":"'Oct Comparison P&L'!G23","v":279.0866666666667},{"$f":"IF(ISNA(VLOOKUP('Oct Comparison P&L'!$A23,'[1]Budget 1'!$A$1:$Z$100,'Oct Comparison P&L'!$K$2,FALSE)),0,(VLOOKUP('Oct Comparison P&L'!$A23,'[1]Budget 1'!$A$1:$Z$100,'Oct Comparison P&L'!$K$2,FALSE)))","v":{"$error":"#VALUE!"}},{"$error":"#VALUE!"},null,{"$f":"'Oct Comparison P&L'!B23","v":180.73333333333335},{"$f":"IF(ISNA(VLOOKUP('Oct Comparison P&L'!A23,'[1]Budget 2'!$A$1:$O$100,'Oct Comparison P&L'!$K$1,FALSE)),0,(VLOOKUP('Oct Comparison P&L'!A23,'[1]Budget 2'!$A$1:$O$100,'Oct Comparison P&L'!$K$1,FALSE)))","v":{"$error":"#VALUE!"}},{"$error":"#VALUE!"},null,279.0866666666667,{"$f":"IF(ISNA(VLOOKUP('Oct Comparison P&L'!$A23,'[1]Budget 2'!$A$1:$Z$100,'Oct Comparison P&L'!$K$2,FALSE)),0,(VLOOKUP('Oct Comparison P&L'!$A23,'[1]Budget 2'!$A$1:$Z$100,'Oct Comparison P&L'!$K$2,FALSE)))","v":{"$error":"#VALUE!"}},{"$error":"#VALUE!"}]
{"$rows_left_out":61}
{"sheet":"Budget 2","index":2,"n_rows":80,"n_cols":8,"rows_kept":80,"cut":false,"hidden":false,"merged":[]}
[{"$f":"'Oct Comparison P&L'!A1","v":"Marc A. Austin, P.C."}]
["Budget #2 Report"]
[{"$f":"'Budget 1'!A3","v":"2015-10-01"}]
[]
[null,"2015-10-01","Budget #2","Variance",null,"YTD 2015","YTD Budget #2","Variance"]
["INCOME"]
["   404 Professional Income-P",50849.166666666664,58333.333333333336,-7484.1666666666715,null,128153.83333333334,583333.33333333337,-455179.5]
["   404.1 Professional Income-PC Credit",0,0,0,null,0,0,0]
["   Unapplied Cash Payment Income",-1440,0,-1440,null,2290,0,2290]
["Total Income",49409.166666666664,58333.333333333336,-8924.1666666666715,null,130443.83333333334,583333.33333333337,-452889.5]
[]
["EXPENSES"]
["   515 Bank Fees",13.333333333333334,41.666666666666664,28.333333333333329,null,13.333333333333334,416.66666666666669,403.33333333333337]
["   520 Office Supplies",1216.8399999999999,1000,-216.83999999999992,null,1642.1733333333332,10000,8357.8266666666677]
["   521 Auto Expenses - Fuel",32.020000000000003,125,92.97999999999999,null,116.66,1250,1133.3399999999999]
["   521.1 Auto Expenses - Other",80.873333333333335,83.333333333333329,2.4599999999999937,null,80.873333333333335,833.33333333333337,752.46]
["   521.2 Auto Expenses - Insurance",0,0,0,null,0,0,0]
["   521.5 Auto Expense Reimbursement",2.686666666666667,41.666666666666664,38.979999999999997,null,41.02,416.66666666666669,375.6466666666667]
["   522 Rent Expense",2842.02,3333.3333333333335,491.3133333333335,null,5684.04,33333.333333333328,27649.293333333328]
["   525 Client Expenses",507.66666666666669,0,-507.66666666666669,null,12567.533333333333,0,-12567.533333333333]
{"$rows_left_out":60}