{"text_format":"1","workbook":"xlsx","n_sheets":6,"sheets":["Title","Transaction Details","Vendor List","(QR Sheet Example)","Quality Review","Upload To Certiflex"],"not_rendered":{"charts":0,"images":1,"macros":1,"external_links":0,"defined_names":7,"comments":0,"pivot_tables":0},"unopened":[],"bounds":{"document_bytes":16777216,"sheet_cells":100000,"rows_first":2000,"rows_last":500,"rows_between":2000,"halvings":0,"cell_chars":16384,"cell_head_chars":4096},"cells_cut":0,"cells_raw":0,"read":"whole","date_system":"1900"}

{"sheet":"Title","index":0,"n_rows":15,"n_cols":2,"rows_kept":15,"cut":false,"hidden":false,"merged":[]}
[]
["Account User Name:","username"]
["Account Password:","password"]
[]
["Date Range Beginnig Month:","08/01/2013"]
["Date Range Ending Month:","12/31/2013"]
[]
[]
[]
[]
[]
[]
[]
[]
[null,"."]

{"sheet":"Transaction Details","index":1,"n_rows":665,"n_cols":5,"rows_kept":665,"cut":false,"hidden":false,"merged":[]}
[null,"Transaction Details","Delta Reserve / August 1, 2013 to December 31, 2013"]
[null,"Prepared for",""]
[null,"SOME RANDOM DUDE"]
[null,"Account Number"]
[null,"XXXX-XXXXXX-XXXXX"]
[]
["Date","Description","Cardmember","Account #","Amount"]
["08/01/2013","CHEVRON K & H ENTERPSALT LAKE CITY UT","RANDOM CHICK","XXXX-XXXXXX-XXXXX",50.68]
["08/01/2013","LOWE'S OF SALT LAKE SALT LAKE CITY UT","RANDOM DUDE","XXXX-XXXXXX-XXXXX",240.19]
["08/01/2013","OLYMPUS HILLS SERVICSALT LAKE CITY UT","RANDOM CHICK","XXXX-XXXXXX-XXXXX",15.02]
["08/02/2013","7-ELEVEN 26999 00072SALT LAKE CITY UT","RANDOM DUDE","XXXX-XXXXXX-XXXXX",4.83]
["08/02/2013","GLEN'S LOCK & KEY SALT LAKE CIT UT","RANDOM DUDE","XXXX-XXXXXX-XXXXX",35]
["08/02/2013","MCDONALD'S F6396 000SALT LAKE CI UT","RANDOM DUDE","XXXX-XXXXXX-XXXXX",18.04]
["08/02/2013","PAYMENT RECEIVED - THANK YOU","RANDOM DUDE","XXXX-XXXXXX-XXXXX",-5000]
["08/02/2013","PAYMENT RECEIVED ACH - THANK YOU","RANDOM DUDE","XXXX-XXXXXX-XXXXX",-119]
["08/03/2013","GLEN'S LOCK & KEY SALT LAKE CIT UT","RANDOM DUDE","XXXX-XXXXXX-XXXXX",79]
["08/03/2013","OLYMPUS HILLS SERVICSALT LAKE CITY UT","RANDOM CHICK","XXXX-XXXXXX-XXXXX",15]
["08/03/2013","PHONE PAYMENT - THANK YOU","RANDOM DUDE","XXXX-XXXXXX-XXXXX",-3200]
["08/04/2013","7-ELEVEN 12927 00071SALT LAKE CITY UT","RANDOM CHICK","XXXX-XXXXXX-XXXXX",12.82]
["08/04/2013","MCDONALD'S F4010 000SALT LAKE CI UT","RANDOM CHICK","XXXX-XXXXXX-XXXXX",16.260000000000002]
["08/05/2013","7-ELEVEN 26999 00072SALT LAKE CITY UT","RANDOM DUDE","XXXX-XXXXXX-XXXXX",11.98]
["08/05/2013","7-ELEVEN 26999 00072SALT LAKE CITY UT","RANDOM DUDE","XXXX-XXXXXX-XXXXX",20.04]
["08/05/2013","CHEVRON HOLIDAY OIL SALT LAKE CITY UT","RANDOM DUDE","XXXX-XXXXXX-XXXXX",10.01]
["08/05/2013","DAN'S OLYMPUS 000000SALT LAKE CITY UT","RANDOM CHICK","XXXX-XXXXXX-XXXXX",12.36]
["08/05/2013","MY SONIC CARD 0012 EL RENO OK","RANDOM CHICK","XXXX-XXXXXX-XXXXX",151]
["08/05/2013","NEXSTAR BROADCASTINGIRVING TX","RANDOM DUDE","XXXX-XXXXXX-XXXXX",3271]
["08/05/2013","OLYMPUS HILLS SERVICSALT LAKE CITY UT","RANDOM CHICK","XXXX-XXXXXX-XXXXX",15.03]
["08/06/2013","7-ELEVEN 26999 00072SALT LAKE CITY UT","RANDOM DUDE","XXXX-XXXXXX-XXXXX",10.1]
["08/06/2013","7-ELEVEN 26999 00072SALT LAKE CITY UT","RANDOM DUDE","XXXX-XXXXXX-XXXXX",15.09]
["08/06/2013","GLEN'S LOCK & KEY SALT LAKE CIT UT","RANDOM DUDE","XXXX-XXXXXX-XXXXX",35]
["08/06/2013","PAYPAL *ALLKEYLESSL 4029357733 CA","RANDOM DUDE","XXXX-XXXXXX-XXXXX",47.48]
["08/06/2013","SUPERIOR PAINT SUPPLSALT LAKE CITY UT","RANDOM DUDE","XXXX-XXXXXX-XXXXX",6.22]
["08/06/2013","VICTORS TIRES INC VISALT LAKE CITY UT","RANDOM DUDE","XXXX-XXXXXX-XXXXX",80]
["08/07/2013","7-ELEVEN 26282 00072SALT LAKE CITY UT","RANDOM DUDE","XXXX-XXXXXX-XXXXX",19.739999999999998]
["08/07/2013","OLYMPUS HILLS SERVICSALT LAKE CITY UT","RANDOM CHICK","XXXX-XXXXXX-XXXXX",15.02]
["08/08/2013","PROSTOP CONV STORE #SANDY UT","RANDOM CHICK","XXXX-XXXXXX-XXXXX",50.56]
["08/09/2013","7-ELEVEN 26999 00072SALT LAKE CITY UT","RANDOM DUDE","XXXX-XXXXXX-XXXXX",4.83]
["08/09/2013","7-ELEVEN 26999 00072SALT LAKE CITY UT","RANDOM DUDE","XXXX-XXXXXX-XXXXX",10]
["08/09/2013","7-ELEVEN 26999 00072SALT LAKE CITY UT","RANDOM DUDE","XXXX-XXXXXX-XXXXX",12.05]
["08/09/2013","ANNUAL MEMBERSHIP FEE","RANDOM DUDE","XXXX-XXXXXX-XXXXX",395]
{"$rows_left_out":626}
{"sheet":"Vendor List","index":2,"n_rows":318,"n_cols":2,"rows_kept":318,"cut":false,"hidden":false,"merged":[]}
["Vendors","Account #"]
["4Imprint","70700.FCF"]
["7-Eleven","40500.FCF"]
["AAA Postal","70500.FCF"]
["Aamco Transmissions","12105.FCF"]
["Ace Hardware","70000.FCF"]
["Advanced Vet","17000.FCF"]
["AFM*AM Insurance","65100.FCF"]
["AJ's Interior","12105.FCF"]
["All Computer","60350.FCF"]
["All for One Auto Parts","12105.FCF"]
["All Year Store","12105.FCF"]
["AM Auto Parts","12105.FCF"]
["AM Family Insurance","65100.FCF"]
["Amazon.com","72300.FCF"]
["Amer. Fence","71000.FCF"]
["Amex 48004 Payable","24059.FCF"]
["Annual Membership Fee","60700.FCF"]
["Antennax.com","12105.FCF"]
["Arby's","60800.FCF"]
["AU Naturale","60800.FCF"]
["Austin Impor","12105.FCF"]
["Auto and Art","12105.FCF"]
["Auto Light","12105.FCF"]
["Auto Parts","12105.FCF"]
["Auto Zone","72300.FCF"]
["Autoandart","12105.FCF"]
["Autosdepo","12105.FCF"]
["Banbury Cross Donuts","60800.FCF"]
["Bank of America","24110.FCF"]
["Basin Market","60800.FCF"]
["Baskin Robbins","60800.FCF"]
["BBB Member Services","70700.FCF"]
["Betos","60800.FCF"]
["BJs Restaurant","60800.FCF"]
["Blu Stations","40500.FCF"]
["Bolt and Nut",{"$f":"B36","v":"40500.FCF"}]
["Books","17000.FCF"]
["Bose Corp","12105.FCF"]
["Bridgewood parts","12105.FCF"]
{"$rows_left_out":279}
{"sheet":"(QR Sheet Example)","index":3,"n_rows":648,"n_cols":8,"rows_kept":648,"cut":false,"hidden":false,"merged":[]}
["Quality Review – AMEX XXXX-XXXXXX-XXXXX"]
[]
[null,null,null,null,"Account Number"]
[null,null,null,null,"XXXX-XXXXXX-XXXXX"]
[]
["Personal","Type","Date","Ref","Description","Amount","Vendor Matched","Account #"]
[null,1,"08/01/2013","XXXXX08001","CHEVRON K & H ENTERPSALT LAKE CITY UT",50.68,"CHEVRON",{"$f":"VLOOKUP(IF(A7=\"Yes\",\"Personal\",G7),'Vendor List'!$A:$B,2,FALSE)","v":"40500.FCF"}]
[null,1,"08/01/2013","XXXXX08002","LOWE'S OF SALT LAKE SALT LAKE CITY UT",240.19,"LOWE'S",{"$f":"VLOOKUP(IF(A8=\"Yes\",\"Personal\",G8),'Vendor List'!$A:$B,2,FALSE)","v":"70000.FCF"}]
[null,1,"08/01/2013","XXXXX08003","OLYMPUS HILLS SERVICSALT LAKE CITY UT",15.02,"P-Amazon",{"$f":"VLOOKUP(IF(A9=\"Yes\",\"Personal\",G9),'Vendor List'!$A:$B,2,FALSE)","v":"17000.FCF"}]
[null,1,"08/02/2013","XXXXX08004","7-ELEVEN 26999 00072SALT LAKE CITY UT",4.83,"7-ELEVEN",{"$f":"VLOOKUP(IF(A10=\"Yes\",\"Personal\",G10),'Vendor List'!$A:$B,2,FALSE)","v":"40500.FCF"}]
[null,1,"08/02/2013","XXXXX08005","GLEN'S LOCK & KEY SALT LAKE CIT UT",35,"Glen's Lock & Key",{"$f":"VLOOKUP(IF(A11=\"Yes\",\"Personal\",G11),'Vendor List'!$A:$B,2,FALSE)","v":"12105.FCF"}]
[null,1,"08/02/2013","XXXXX08006","MCDONALD'S F6396 000SALT LAKE CI UT",18.04,"MCDONALD'S",{"$f":"VLOOKUP(IF(A12=\"Yes\",\"Personal\",G12),'Vendor List'!$A:$B,2,FALSE)","v":"60800.FCF"}]
[null,1,"08/03/2013","XXXXX08007","GLEN'S LOCK & KEY SALT LAKE CIT UT",79,"Glen's Lock & Key",{"$f":"VLOOKUP(IF(A13=\"Yes\",\"Personal\",G13),'Vendor List'!$A:$B,2,FALSE)","v":"12105.FCF"}]
[null,1,"08/03/2013","XXXXX08008","OLYMPUS HILLS SERVICSALT LAKE CITY UT",15,"OLYMPUS HILLS SERVICE",{"$f":"VLOOKUP(IF(A14=\"Yes\",\"Personal\",G14),'Vendor List'!$A:$B,2,FALSE)","v":"40500.FCF"}]
[null,1,"08/04/2013","XXXXX08009","7-ELEVEN 12927 00071SALT LAKE CITY UT",12.82,"7-ELEVEN",{"$f":"VLOOKUP(IF(A15=\"Yes\",\"Personal\",G15),'Vendor List'!$A:$B,2,FALSE)","v":"40500.FCF"}]
[null,1,"08/04/2013","XXXXX08010","MCDONALD'S F4010 000SALT LAKE CI UT",16.260000000000002,"MCDONALD'S",{"$f":"VLOOKUP(IF(A16=\"Yes\",\"Personal\",G16),'Vendor List'!$A:$B,2,FALSE)","v":"60800.FCF"}]
[null,1,"08/05/2013","XXXXX08011","7-ELEVEN 26999 00072SALT LAKE CITY UT",11.98,"7-ELEVEN",{"$f":"VLOOKUP(IF(A17=\"Yes\",\"Personal\",G17),'Vendor List'!$A:$B,2,FALSE)","v":"40500.FCF"}]
[null,1,"08/05/2013","XXXXX08012","7-ELEVEN 26999 00072SALT LAKE CITY UT",20.04,"7-ELEVEN",{"$f":"VLOOKUP(IF(A18=\"Yes\",\"Personal\",G18),'Vendor List'!$A:$B,2,FALSE)","v":"40500.FCF"}]
[null,1,"08/05/2013","XXXXX08013","CHEVRON HOLIDAY OIL SALT LAKE CITY UT",10.01,"CHEVRON",{"$f":"VLOOKUP(IF(A19=\"Yes\",\"Personal\",G19),'Vendor List'!$A:$B,2,FALSE)","v":"40500.FCF"}]
[null,1,"08/05/2013","XXXXX08014","DAN'S OLYMPUS 000000SALT LAKE CITY UT",12.36,"DAN'S FOOD",{"$f":"VLOOKUP(IF(A20=\"Yes\",\"Personal\",G20),'Vendor List'!$A:$B,2,FALSE)","v":"60800.FCF"}]
["Yes",1,"08/05/2013","XXXXX08015","MY SONIC CARD 0012 EL RENO OK",151,"SONIC",{"$f":"VLOOKUP(IF(A21=\"Yes\",\"Personal\",G21),'Vendor List'!$A:$B,2,FALSE)","v":"17000.FCF"}]
[null,1,"08/05/2013","XXXXX08016","NEXSTAR BROADCASTINGIRVING TX",3271,"NEXSTAR BROADCASTING",{"$f":"VLOOKUP(IF(A22=\"Yes\",\"Personal\",G22),'Vendor List'!$A:$B,2,FALSE)","v":"50200.FCF"}]
[null,1,"08/05/2013","XXXXX08017","OLYMPUS HILLS SERVICSALT LAKE CITY UT",15.03,"OLYMPUS HILLS SERVICE",{"$f":"VLOOKUP(IF(A23=\"Yes\",\"Personal\",G23),'Vendor List'!$A:$B,2,FALSE)","v":"40500.FCF"}]
[null,1,"08/06/2013","XXXXX08018","7-ELEVEN 26999 00072SALT LAKE CITY UT",10.1,"7-ELEVEN",{"$f":"VLOOKUP(IF(A24=\"Yes\",\"Personal\",G24),'Vendor List'!$A:$B,2,FALSE)","v":"40500.FCF"}]
[null,1,"08/06/2013","XXXXX08019","7-ELEVEN 26999 00072SALT LAKE CITY UT",15.09,"7-ELEVEN",{"$f":"VLOOKUP(IF(A25=\"Yes\",\"Personal\",G25),'Vendor List'!$A:$B,2,FALSE)","v":"40500.FCF"}]
[null,1,"08/06/2013","XXXXX08020","GLEN'S LOCK & KEY SALT LAKE CIT UT",35,"Glen's Lock & Key",{"$f":"VLOOKUP(IF(A26=\"Yes\",\"Personal\",G26),'Vendor List'!$A:$B,2,FALSE)","v":"12105.FCF"}]
["Yes",1,"08/06/2013","XXXXX08021","PAYPAL *ALLKEYLESSL 4029357733 CA",47.48,"Personal",{"$f":"VLOOKUP(IF(A27=\"Yes\",\"Personal\",G27),'Vendor List'!$A:$B,2,FALSE)","v":"17000.FCF"}]
[null,1,"08/06/2013","XXXXX08022","SUPERIOR PAINT SUPPLSALT LAKE CITY UT",6.22,"SUPERIOR PAINT",{"$f":"VLOOKUP(IF(A28=\"Yes\",\"Personal\",G28),'Vendor List'!$A:$B,2,FALSE)","v":"72300.FCF"}]
[null,1,"08/06/2013","XXXXX08023","VICTORS TIRES INC VISALT LAKE CITY UT",80,"VICTORS TIRES",{"$f":"VLOOKUP(IF(A29=\"Yes\",\"Personal\",G29),'Vendor List'!$A:$B,2,FALSE)","v":"12105.FCF"}]
[null,1,"08/07/2013","XXXXX08024","7-ELEVEN 26282 00072SALT LAKE CITY UT",19.739999999999998,"7-ELEVEN",{"$f":"VLOOKUP(IF(A30=\"Yes\",\"Personal\",G30),'Vendor List'!$A:$B,2,FALSE)","v":"40500.FCF"}]
[null,1,"08/07/2013","XXXXX08025","OLYMPUS HILLS SERVICSALT LAKE CITY UT",15.02,"OLYMPUS HILLS SERVICE",{"$f":"VLOOKUP(IF(A31=\"Yes\",\"Personal\",G31),'Vendor List'!$A:$B,2,FALSE)","v":"40500.FCF"}]
[null,1,"08/08/2013","XXXXX08026","PROSTOP CONV STORE #SANDY UT",50.56,"7-ELEVEN",{"$f":"VLOOKUP(IF(A32=\"Yes\",\"Personal\",G32),'Vendor List'!$A:$B,2,FALSE)","v":"40500.FCF"}]
[null,1,"08/09/2013","XXXXX08027","7-ELEVEN 26999 00072SALT LAKE CITY UT",4.83,"7-ELEVEN",{"$f":"VLOOKUP(IF(A33=\"Yes\",\"Personal\",G33),'Vendor List'!$A:$B,2,FALSE)","v":"40500.FCF"}]
[null,1,"08/09/2013","XXXXX08028","7-ELEVEN 26999 00072SALT LAKE CITY UT",10,"7-ELEVEN",{"$f":"VLOOKUP(IF(A34=\"Yes\",\"Personal\",G34),'Vendor List'!$A:$B,2,FALSE)","v":"40500.FCF"}]
[null,1,"08/09/2013","XXXXX08029","7-ELEVEN 26999 00072SALT LAKE CITY UT",12.05,"7-ELEVEN",{"$f":"VLOOKUP(IF(A35=\"Yes\",\"Personal\",G35),'Vendor List'!$A:$B,2,FALSE)","v":"40500.FCF"}]
[null,1,"08/09/2013","XXXXX08030","ANNUAL MEMBERSHIP FEE",395,"MEMBERSHIP FEE",{"$f":"VLOOKUP(IF(A36=\"Yes\",\"Personal\",G36),'Vendor List'!$A:$B,2,FALSE)","v":"60700.FCF"}]
[null,1,"08/09/2013","XXXXX08031","DAN'S OLYMPUS 000000SALT LAKE CITY UT",47.19,"DAN'S FOOD",{"$f":"VLOOKUP(IF(A37=\"Yes\",\"Personal\",G37),'Vendor List'!$A:$B,2,FALSE)","v":"60800.FCF"}]
[null,1,"08/09/2013","XXXXX08032","Interest Charge on Purchases",243.2,"Interest Charged",{"$f":"VLOOKUP(IF(A38=\"Yes\",\"Personal\",G38),'Vendor List'!$A:$B,2,FALSE)","v":"65300.FCF"}]
[null,1,"08/09/2013","XXXXX08033","MCDONALD'S F6396 000SALT LAKE CI UT",10.78,"MCDONALD'S",{"$f":"VLOOKUP(IF(A39=\"Yes\",\"Personal\",G39),'Vendor List'!$A:$B,2,FALSE)","v":"60800.FCF"}]
[null,1,"08/10/2013","XXXXX08034","7-ELEVEN 26999 00072SALT LAKE CITY UT",8.2200000000000006,"7-ELEVEN",{"$f":"VLOOKUP(IF(A40=\"Yes\",\"Personal\",G40),'Vendor List'!$A:$B,2,FALSE)","v":"40500.FCF"}]
{"$rows_left_out":609}
{"sheet":"Quality Review","index":4,"n_rows":648,"n_cols":8,"rows_kept":648,"cut":false,"hidden":false,"merged":[]}
["Quality Review – AMEX XXXX-XXXXXX-XXXXX"]
[]
[null,null,null,null,"Account Number"]
[null,null,null,null,"XXXX-XXXXXX-XXXXX"]
[]
["Personal","Type","Date","Ref","Description","Amount","Vendor Matched","Account #"]
["-",1,"08/01/2013","XXXXX08001","CHEVRON K & H ENTERPSALT LAKE CITY UT",50.68,"CHEVRON",{"$f":"VLOOKUP(IF(A7=\"Yes\",\"Personal\",G7),'Vendor List'!$A:$B,2,FALSE)","v":"40500.FCF"}]
["-",1,"08/01/2013","XXXXX08002","LOWE'S OF SALT LAKE SALT LAKE CITY UT",240.19,"Lowe's",{"$f":"VLOOKUP(IF(A8=\"Yes\",\"Personal\",G8),'Vendor List'!$A:$B,2,FALSE)","v":"70000.FCF"}]
["-",1,"08/01/2013","XXXXX08003","OLYMPUS HILLS SERVICSALT LAKE CITY UT",15.02,"P-Amazon",{"$f":"VLOOKUP(IF(A9=\"Yes\",\"Personal\",G9),'Vendor List'!$A:$B,2,FALSE)","v":"17000.FCF"}]
["-",1,"08/02/2013","XXXXX08004","7-ELEVEN 26999 00072SALT LAKE CITY UT",4.83,"7-ELEVEN",{"$f":"VLOOKUP(IF(A10=\"Yes\",\"Personal\",G10),'Vendor List'!$A:$B,2,FALSE)","v":"40500.FCF"}]
["-",1,"08/02/2013","XXXXX08005","GLEN'S LOCK & KEY SALT LAKE CIT UT",35,"Glen's Lock & Key",{"$f":"VLOOKUP(IF(A11=\"Yes\",\"Personal\",G11),'Vendor List'!$A:$B,2,FALSE)","v":"12105.FCF"}]
["-",1,"08/02/2013","XXXXX08006","MCDONALD'S F6396 000SALT LAKE CI UT",18.04,"MCDONALD'S",{"$f":"VLOOKUP(IF(A12=\"Yes\",\"Personal\",G12),'Vendor List'!$A:$B,2,FALSE)","v":"60800.FCF"}]
["-",1,"08/03/2013","XXXXX08007","GLEN'S LOCK & KEY SALT LAKE CIT UT",79,"Glen's Lock & Key",{"$f":"VLOOKUP(IF(A13=\"Yes\",\"Personal\",G13),'Vendor List'!$A:$B,2,FALSE)","v":"12105.FCF"}]
["-",1,"08/03/2013","XXXXX08008","OLYMPUS HILLS SERVICSALT LAKE CITY UT",15,"OLYMPUS HILLS SERVICE",{"$f":"VLOOKUP(IF(A14=\"Yes\",\"Personal\",G14),'Vendor List'!$A:$B,2,FALSE)","v":"40500.FCF"}]
["-",1,"08/04/2013","XXXXX08009","7-ELEVEN 12927 00071SALT LAKE CITY UT",12.82,"7-ELEVEN",{"$f":"VLOOKUP(IF(A15=\"Yes\",\"Personal\",G15),'Vendor List'!$A:$B,2,FALSE)","v":"40500.FCF"}]
["-",1,"08/04/2013","XXXXX08010","MCDONALD'S F4010 000SALT LAKE CI UT",16.260000000000002,"MCDONALD'S",{"$f":"VLOOKUP(IF(A16=\"Yes\",\"Personal\",G16),'Vendor List'!$A:$B,2,FALSE)","v":"60800.FCF"}]
["-",1,"08/05/2013","XXXXX08011","7-ELEVEN 26999 00072SALT LAKE CITY UT",11.98,"7-ELEVEN",{"$f":"VLOOKUP(IF(A17=\"Yes\",\"Personal\",G17),'Vendor List'!$A:$B,2,FALSE)","v":"40500.FCF"}]
["-",1,"08/05/2013","XXXXX08012","7-ELEVEN 26999 00072SALT LAKE CITY UT",20.04,"7-ELEVEN",{"$f":"VLOOKUP(IF(A18=\"Yes\",\"Personal\",G18),'Vendor List'!$A:$B,2,FALSE)","v":"40500.FCF"}]
["-",1,"08/05/2013","XXXXX08013","CHEVRON HOLIDAY OIL SALT LAKE CITY UT",10.01,"CHEVRON",{"$f":"VLOOKUP(IF(A19=\"Yes\",\"Personal\",G19),'Vendor List'!$A:$B,2,FALSE)","v":"40500.FCF"}]
["-",1,"08/05/2013","XXXXX08014","DAN'S OLYMPUS 000000SALT LAKE CITY UT",12.36,"DAN'S FOOD",{"$f":"VLOOKUP(IF(A20=\"Yes\",\"Personal\",G20),'Vendor List'!$A:$B,2,FALSE)","v":"60800.FCF"}]
["-",1,"08/05/2013","XXXXX08015","MY SONIC CARD 0012 EL RENO OK",151,"SONIC",{"$f":"VLOOKUP(IF(A21=\"Yes\",\"Personal\",G21),'Vendor List'!$A:$B,2,FALSE)","v":"60800.FCF"}]
["-",1,"08/05/2013","XXXXX08016","NEXSTAR BROADCASTINGIRVING TX",3271,"NEXSTAR BROADCASTING",{"$f":"VLOOKUP(IF(A22=\"Yes\",\"Personal\",G22),'Vendor List'!$A:$B,2,FALSE)","v":"50200.FCF"}]
["-",1,"08/05/2013","XXXXX08017","OLYMPUS HILLS SERVICSALT LAKE CITY UT",15.03,"OLYMPUS HILLS SERVICE",{"$f":"VLOOKUP(IF(A23=\"Yes\",\"Personal\",G23),'Vendor List'!$A:$B,2,FALSE)","v":"40500.FCF"}]
["-",1,"08/06/2013","XXXXX08018","7-ELEVEN 26999 00072SALT LAKE CITY UT",10.1,"7-ELEVEN",{"$f":"VLOOKUP(IF(A24=\"Yes\",\"Personal\",G24),'Vendor List'!$A:$B,2,FALSE)","v":"40500.FCF"}]
["-",1,"08/06/2013","XXXXX08019","7-ELEVEN 26999 00072SALT LAKE CITY UT",15.09,"7-ELEVEN",{"$f":"VLOOKUP(IF(A25=\"Yes\",\"Personal\",G25),'Vendor List'!$A:$B,2,FALSE)","v":"40500.FCF"}]
["-",1,"08/06/2013","XXXXX08020","GLEN'S LOCK & KEY SALT LAKE CIT UT",35,"Glen's Lock & Key",{"$f":"VLOOKUP(IF(A26=\"Yes\",\"Personal\",G26),'Vendor List'!$A:$B,2,FALSE)","v":"12105.FCF"}]
["-",1,"08/06/2013","XXXXX08021","PAYPAL *ALLKEYLESSL 4029357733 CA",47.48,"Personal",{"$f":"VLOOKUP(IF(A27=\"Yes\",\"Personal\",G27),'Vendor List'!$A:$B,2,FALSE)","v":"17000.FCF"}]
["-",1,"08/06/2013","XXXXX08022","SUPERIOR PAINT SUPPLSALT LAKE CITY UT",6.22,"SUPERIOR PAINT",{"$f":"VLOOKUP(IF(A28=\"Yes\",\"Personal\",G28),'Vendor List'!$A:$B,2,FALSE)","v":"72300.FCF"}]
["-",1,"08/06/2013","XXXXX08023","VICTORS TIRES INC VISALT LAKE CITY UT",80,"VICTORS TIRES",{"$f":"VLOOKUP(IF(A29=\"Yes\",\"Personal\",G29),'Vendor List'!$A:$B,2,FALSE)","v":"12105.FCF"}]
["-",1,"08/07/2013","XXXXX08024","7-ELEVEN 26282 00072SALT LAKE CITY UT",19.739999999999998,"7-ELEVEN",{"$f":"VLOOKUP(IF(A30=\"Yes\",\"Personal\",G30),'Vendor List'!$A:$B,2,FALSE)","v":"40500.FCF"}]
["-",1,"08/07/2013","XXXXX08025","OLYMPUS HILLS SERVICSALT LAKE CITY UT",15.02,"OLYMPUS HILLS SERVICE",{"$f":"VLOOKUP(IF(A31=\"Yes\",\"Personal\",G31),'Vendor List'!$A:$B,2,FALSE)","v":"40500.FCF"}]
["-",1,"08/08/2013","XXXXX08026","PROSTOP CONV STORE #SANDY UT",50.56,"7-ELEVEN",{"$f":"VLOOKUP(IF(A32=\"Yes\",\"Personal\",G32),'Vendor List'!$A:$B,2,FALSE)","v":"40500.FCF"}]
["-",1,"08/09/2013","XXXXX08027","7-ELEVEN 26999 00072SALT LAKE CITY UT",4.83,"7-ELEVEN",{"$f":"VLOOKUP(IF(A33=\"Yes\",\"Personal\",G33),'Vendor List'!$A:$B,2,FALSE)","v":"40500.FCF"}]
["-",1,"08/09/2013","XXXXX08028","7-ELEVEN 26999 00072SALT LAKE CITY UT",10,"7-ELEVEN",{"$f":"VLOOKUP(IF(A34=\"Yes\",\"Personal\",G34),'Vendor List'!$A:$B,2,FALSE)","v":"40500.FCF"}]
["-",1,"08/09/2013","XXXXX08029","7-ELEVEN 26999 00072SALT LAKE CITY UT",12.05,"7-ELEVEN",{"$f":"VLOOKUP(IF(A35=\"Yes\",\"Personal\",G35),'Vendor List'!$A:$B,2,FALSE)","v":"40500.FCF"}]
["-",1,"08/09/2013","XXXXX08030","ANNUAL MEMBERSHIP FEE",395,"MEMBERSHIP FEE",{"$f":"VLOOKUP(IF(A36=\"Yes\",\"Personal\",G36),'Vendor List'!$A:$B,2,FALSE)","v":"60700.FCF"}]
["-",1,"08/09/2013","XXXXX08031","DAN'S OLYMPUS 000000SALT LAKE CITY UT",47.19,"DAN'S FOOD",{"$f":"VLOOKUP(IF(A37=\"Yes\",\"Personal\",G37),'Vendor List'!$A:$B,2,FALSE)","v":"60800.FCF"}]
["-",1,"08/09/2013","XXXXX08032","Interest Charge on Purchases",243.2,"Interest Charged",{"$f":"VLOOKUP(IF(A38=\"Yes\",\"Personal\",G38),'Vendor List'!$A:$B,2,FALSE)","v":"65300.FCF"}]
["-",1,"08/09/2013","XXXXX08033","MCDONALD'S F6396 000SALT LAKE CI UT",10.78,"MCDONALD'S",{"$f":"VLOOKUP(IF(A39=\"Yes\",\"Personal\",G39),'Vendor List'!$A:$B,2,FALSE)","v":"60800.FCF"}]
["-",1,"08/10/2013","XXXXX08034","7-ELEVEN 26999 00072SALT LAKE CITY UT",8.2200000000000006,"7-ELEVEN",{"$f":"VLOOKUP(IF(A40=\"Yes\",\"Personal\",G40),'Vendor List'!$A:$B,2,FALSE)","v":"40500.FCF"}]
{"$rows_left_out":609}
{"sheet":"Upload To Certiflex","index":5,"n_rows":643,"n_cols":6,"rows_kept":643,"cut":false,"hidden":false,"merged":[]}
["Type","Date","Ref","Description","Account #","Amount"]
[1,"08/01/2013","XXXXX08001","CHEVRON","40500.FCF",50.68]
[1,"08/01/2013","XXXXX08002","Lowe's","70000.FCF",240.19]
[1,"08/01/2013","XXXXX08003","P-Amazon","17000.FCF",15.02]
[1,"08/02/2013","XXXXX08004","7-ELEVEN","40500.FCF",4.83]
[1,"08/02/2013","XXXXX08005","Glen's Lock & Key","12105.FCF",35]
[1,"08/02/2013","XXXXX08006","MCDONALD'S","60800.FCF",18.04]
[1,"08/03/2013","XXXXX08007","Glen's Lock & Key","12105.FCF",79]
[1,"08/03/2013","XXXXX08008","OLYMPUS HILLS SERVICE","40500.FCF",15]
[1,"08/04/2013","XXXXX08009","7-ELEVEN","40500.FCF",12.82]
[1,"08/04/2013","XXXXX08010","MCDONALD'S","60800.FCF",16.260000000000002]
[1,"08/05/2013","XXXXX08011","7-ELEVEN","40500.FCF",11.98]
[1,"08/05/2013","XXXXX08012","7-ELEVEN","40500.FCF",20.04]
[1,"08/05/2013","XXXXX08013","CHEVRON","40500.FCF",10.01]
[1,"08/05/2013","XXXXX08014","DAN'S FOOD","60800.FCF",12.36]
[1,"08/05/2013","XXXXX08015","SONIC","60800.FCF",151]
[1,"08/05/2013","XXXXX08016","NEXSTAR BROADCASTING","50200.FCF",3271]
[1,"08/05/2013","XXXXX08017","OLYMPUS HILLS SERVICE","40500.FCF",15.03]
[1,"08/06/2013","XXXXX08018","7-ELEVEN","40500.FCF",10.1]
[1,"08/06/2013","XXXXX08019","7-ELEVEN","40500.FCF",15.09]
[1,"08/06/2013","XXXXX08020","Glen's Lock & Key","12105.FCF",35]
[1,"08/06/2013","XXXXX08021","Personal","17000.FCF",47.48]
[1,"08/06/2013","XXXXX08022","SUPERIOR PAINT","72300.FCF",6.22]
[1,"08/06/2013","XXXXX08023","VICTORS TIRES","12105.FCF",80]
[1,"08/07/2013","XXXXX08024","7-ELEVEN","40500.FCF",19.739999999999998]
[1,"08/07/2013","XXXXX08025","OLYMPUS HILLS SERVICE","40500.FCF",15.02]
[1,"08/08/2013","XXXXX08026","7-ELEVEN","40500.FCF",50.56]
[1,"08/09/2013","XXXXX08027","7-ELEVEN","40500.FCF",4.83]
[1,"08/09/2013","XXXXX08028","7-ELEVEN","40500.FCF",10]
[1,"08/09/2013","XXXXX08029","7-ELEVEN","40500.FCF",12.05]
[1,"08/09/2013","XXXXX08030","MEMBERSHIP FEE","60700.FCF",395]
[1,"08/09/2013","XXXXX08031","DAN'S FOOD","60800.FCF",47.19]
[1,"08/09/2013","XXXXX08032","Interest Charged","65300.FCF",243.2]
[1,"08/09/2013","XXXXX08033","MCDONALD'S","60800.FCF",10.78]
[1,"08/10/2013","XXXXX08034","7-ELEVEN","40500.FCF",8.2200000000000006]
[1,"08/10/2013","XXXXX08035","7-ELEVEN","40500.FCF",9.1199999999999992]
[1,"08/10/2013","XXXXX08036","7-ELEVEN","40500.FCF",9.1300000000000008]
[1,"08/10/2013","XXXXX08037","Glen's Lock & Key","12105.FCF",84.41]
[1,"08/10/2013","XXXXX08038","OLYMPUS HILLS SERVICE","40500.FCF",15.03]
[1,"08/11/2013","XXXXX08039","COMCAST","17000.FCF",121.35]
{"$rows_left_out":603}