{"text_format":"1","workbook":"xlsx","n_sheets":4,"sheets":["Schedule","Employee Info","Carriers","Formulas"],"not_rendered":{"charts":0,"images":6,"macros":1,"external_links":0,"defined_names":26,"comments":0,"pivot_tables":0},"unopened":[],"bounds":{"document_bytes":16777216,"sheet_cells":100000,"rows_first":2000,"rows_last":500,"rows_between":2000,"halvings":0,"cell_chars":16384,"cell_head_chars":4096},"cells_cut":0,"cells_raw":0,"read":"whole","date_system":"1900"}

{"sheet":"Schedule","index":0,"n_rows":86,"n_cols":25,"rows_kept":86,"cut":false,"hidden":false,"merged":[[17,7,17,8],[17,9,17,10],[21,0,22,2],[12,5,12,6],[12,7,12,8],[12,9,12,10],[17,5,17,6],[21,5,21,6],[21,7,21,8],[19,5,19,6],[13,7,13,8],[13,9,13,10],[19,3,19,4],[17,3,17,4],[1,13,1,15],[13,0,14,2],[15,0,16,2],[17,0,18,2],[19,0,20,2],[12,3,12,4],[23,13,23,14],[33,13,33,14],[17,11,17,12],[25,13,25,14],[21,11,21,12],[31,0,32,2],[21,13,21,14],[23,3,23,4],[23,5,23,6],[23,7,23,8],[23,9,23,10],[12,11,12,12],[12,13,12,14],[17,13,17,14],[19,7,19,8],[19,9,19,10],[19,11,19,12],[19,13,19,14],[23,0,24,2],[25,0,26,2],[27,0,28,2],[29,0,30,2],[49,0,50,2],[51,0,52,2],[53,0,54,2],[21,9,21,10],[27,3,27,4],[33,0,34,2],[43,9,43,10],[37,3,37,4],[37,5,37,6],[37,7,37,8],[37,9,37,10],[45,3,45,4],[45,5,45,6],[45,7,45,8],[45,9,45,10],[49,5,49,6],[49,7,49,8],[49,9,49,10],[47,3,47,4],[47,5,47,6],[57,0,58,2],[41,0,42,2],[43,0,44,2],[45,0,46,2],[47,0,48,2],[55,0,56,2],[33,11,33,12],[33,3,33,4],[33,5,33,6],[33,7,33,8],[33,9,33,10],[41,3,41,4],[41,5,41,6],[37,0,38,2],[39,0,40,2],[57,3,57,4],[57,5,57,6],[51,3,51,4],[51,5,51,6],[51,7,51,8],[51,9,51,10],[57,9,57,10],[53,9,53,10],[55,11,55,12],[13,17,14,17],[15,17,16,17],[57,11,57,12],[57,13,57,14],[57,7,57,8],[47,13,47,14],[41,13,41,14],[27,13,27,14],[39,11,39,12],[39,13,39,14],[43,13,43,14],[45,11,45,12],[45,13,45,14],[49,11,49,12],[49,13,49,14],[47,9,47,10],[47,11,47,12],[41,7,41,8],[41,9,41,10],[41,11,41,12],[27,9,27,10],[27,11,27,12],[17,17,18,17],[43,11,43,12],[55,13,55,14],[37,13,37,14],[53,3,53,4],[53,5,53,6],[53,7,53,8],[53,11,53,12],[53,13,53,14],[51,11,51,12],[51,13,51,14],[49,3,49,4],[39,5,39,6],[39,7,39,8],[39,9,39,10],[47,7,47,8],[23,11,23,12],[21,3,21,4],[25,3,25,4],[25,5,25,6],[25,7,25,8],[25,9,25,10],[25,11,25,12],[27,5,27,6],[27,7,27,8],[13,11,13,12],[13,13,13,14],[15,3,15,4],[15,5,15,6],[15,7,15,8],[15,9,15,10],[15,11,15,12],[15,13,15,14],[13,3,13,4],[13,5,13,6],[56,17,57,17],[42,17,43,17],[44,17,45,17],[46,17,47,17],[48,17,49,17],[50,17,51,17],[52,17,53,17],[19,17,20,17],[21,17,22,17],[23,17,24,17],[25,17,26,17],[27,17,28,17],[29,17,30,17],[31,17,32,17],[33,17,34,17],[36,17,37,17],[29,3,29,4],[29,5,29,6],[29,7,29,8],[29,9,29,10],[29,11,29,12],[29,13,29,14],[38,17,39,17],[40,17,41,17],[54,17,55,17],[39,3,39,4],[43,3,43,4],[43,5,43,6],[43,7,43,8],[37,11,37,12],[31,3,31,4],[31,5,31,6],[31,7,31,8],[31,9,31,10],[31,11,31,12],[31,13,31,14],[55,3,55,4],[55,5,55,6],[55,7,55,8],[55,9,55,10]]}
[null,null,null,"Cowboy Donuts Work Schedule",null,null,null,null,null,null,null,null,null,null,null,null,null,null,4.1666666666666671E-2]
[]
[null,null,null,{"$f":"\"Year: \"&year","v":"Year: 2014"},null,null,null,null,null,"Week:",null,{"$f":"week","v":4},null,null,null,null,"[42]"]
[]
[null,null,null,"Month:",null,{"$f":"monthName","v":"July"}]
[null,null,null,null,null,null,null,null,null,null,null,null,null,null,null,"Week"]
["2-Week Work Schedule"]
[{"$f":"TEXT(INDEX(Formulas!B$21:B$26,week),\"Mmmm d, yyyy\")&\" - \"","v":"July 20, 2014 - "}]
[{"$f":"TEXT(INDEX(Formulas!H$21:H$27,week+1),\"Mmmm d, yyyy\")","v":"August 2, 2014"}]
[]
{"$rows_left_out":77}
{"sheet":"Employee Info","index":1,"n_rows":74,"n_cols":44,"rows_kept":74,"cut":false,"hidden":false,"merged":[]}
["Employee Information",null,null,null,null,null,null,null,null,null,null,4.1666666666666699E-2]
[null,null,null,null,null,null,null,null,null,null,null,{"$f":"L16","v":"Jay"},"start","end",{"$f":"O16","v":"Penny"},"start","end",{"$f":"R16","v":"Nissa"},"start","end",{"$f":"U16","v":"Tracie"},"start","end",{"$f":"X16","v":"Kristi"},"start","end",{"$f":"AA16","v":"Will"},"start","end",{"$f":"AD16","v":"Tiffany"},"start","end",{"$f":"AG16","v":"Emily"},"start","end",{"$f":"AJ16","v":"Danielle"},"start","end",{"$f":"AM16","v":"Haley"},"start","end",{"$f":"AP16","v":"Pauline"},"start","end"]
["Emp. #","Name","Position","Rate/Hr.","2 Wk Hrs","2 week pay","Phone #","Carrier","Carrier code","Email",null,{"$f":"Schedule!$D$13","v":"Mon - 21"},{"$f":"IFERROR(IF(VLOOKUP(M17,$J$16:$K$74,2,FALSE)=0,\"\",VLOOKUP(M17,$J$16:$K$74,2,FALSE)),\"\")","v":""},{"$f":"IFERROR(IF(VLOOKUP(N17,$J$16:$K$74,2,FALSE)=0,\"\",VLOOKUP(N17,$J$16:$K$74,2,FALSE)),\"\")","v":""},{"$f":"Schedule!$D$13","v":"Mon - 21"},{"$f":"IFERROR(IF(VLOOKUP(P17,$J$16:$K$74,2,FALSE)=0,\"\",VLOOKUP(P17,$J$16:$K$74,2,FALSE)),\"\")","v":""},{"$f":"IFERROR(IF(VLOOKUP(Q17,$J$16:$K$74,2,FALSE)=0,\"\",VLOOKUP(Q17,$J$16:$K$74,2,FALSE)),\"\")","v":""},{"$f":"Schedule!$D$13","v":"Mon - 21"},{"$f":"IFERROR(IF(VLOOKUP(S17,$J$16:$K$74,2,FALSE)=0,\"\",VLOOKUP(S17,$J$16:$K$74,2,FALSE)),\"\")","v":"OFF"},{"$f":"IFERROR(IF(VLOOKUP(T17,$J$16:$K$74,2,FALSE)=0,\"\",VLOOKUP(T17,$J$16:$K$74,2,FALSE)),\"\")","v":"OFF"},{"$f":"Schedule!$D$13","v":"Mon - 21"},{"$f":"IFERROR(IF(VLOOKUP(V17,$J$16:$K$74,2,FALSE)=0,\"\",VLOOKUP(V17,$J$16:$K$74,2,FALSE)),\"\")","v":"6 a.m."},{"$f":"IFERROR(IF(VLOOKUP(W17,$J$16:$K$74,2,FALSE)=0,\"\",VLOOKUP(W17,$J$16:$K$74,2,FALSE)),\"\")","v":"1 p.m."},{"$f":"Schedule!$D$13","v":"Mon - 21"},{"$f":"IFERROR(IF(VLOOKUP(Y17,$J$16:$K$74,2,FALSE)=0,\"\",VLOOKUP(Y17,$J$16:$K$74,2,FALSE)),\"\")","v":"2 a.m."},{"$f":"IFERROR(IF(VLOOKUP(Z17,$J$16:$K$74,2,FALSE)=0,\"\",VLOOKUP(Z17,$J$16:$K$74,2,FALSE)),\"\")","v":"8 a.m."},{"$f":"Schedule!$D$13","v":"Mon - 21"},{"$f":"IFERROR(IF(VLOOKUP(AB17,$J$16:$K$74,2,FALSE)=0,\"\",VLOOKUP(AB17,$J$16:$K$74,2,FALSE)),\"\")","v":"2:45 a.m."},{"$f":"IFERROR(IF(VLOOKUP(AC17,$J$16:$K$74,2,FALSE)=0,\"\",VLOOKUP(AC17,$J$16:$K$74,2,FALSE)),\"\")","v":"7 a.m."},{"$f":"Schedule!$D$13","v":"Mon - 21"},{"$f":"IFERROR(IF(VLOOKUP(AE17,$J$16:$K$74,2,FALSE)=0,\"\",VLOOKUP(AE17,$J$16:$K$74,2,FALSE)),\"\")","v":"4 a.m."},{"$f":"IFERROR(IF(VLOOKUP(AF17,$J$16:$K$74,2,FALSE)=0,\"\",VLOOKUP(AF17,$J$16:$K$74,2,FALSE)),\"\")","v":"4 a.m."},{"$f":"Schedule!$D$13","v":"Mon - 21"},{"$f":"IFERROR(IF(VLOOKUP(AH17,$J$16:$K$74,2,FALSE)=0,\"\",VLOOKUP(AH17,$J$16:$K$74,2,FALSE)),\"\")","v":"4 a.m."},{"$f":"IFERROR(IF(VLOOKUP(AI17,$J$16:$K$74,2,FALSE)=0,\"\",VLOOKUP(AI17,$J$16:$K$74,2,FALSE)),\"\")","v":"4 a.m."},{"$f":"Schedule!$D$13","v":"Mon - 21"},{"$f":"IFERROR(IF(VLOOKUP(AK17,$J$16:$K$74,2,FALSE)=0,\"\",VLOOKUP(AK17,$J$16:$K$74,2,FALSE)),\"\")","v":"8 a.m."},{"$f":"IFERROR(IF(VLOOKUP(AL17,$J$16:$K$74,2,FALSE)=0,\"\",VLOOKUP(AL17,$J$16:$K$74,2,FALSE)),\"\")","v":"8 a.m."},{"$f":"Schedule!$D$13","v":"Mon - 21"},{"$f":"IFERROR(IF(VLOOKUP(AN17,$J$16:$K$74,2,FALSE)=0,\"\",VLOOKUP(AN17,$J$16:$K$74,2,FALSE)),\"\")","v":"8 a.m."},{"$f":"IFERROR(IF(VLOOKUP(AO17,$J$16:$K$74,2,FALSE)=0,\"\",VLOOKUP(AO17,$J$16:$K$74,2,FALSE)),\"\")","v":"8 a.m."},{"$f":"Schedule!$D$13","v":"Mon - 21"},{"$f":"IFERROR(IF(VLOOKUP(AQ17,$J$16:$K$74,2,FALSE)=0,\"\",VLOOKUP(AQ17,$J$16:$K$74,2,FALSE)),\"\")","v":"8 a.m."},{"$f":"IFERROR(IF(VLOOKUP(AR17,$J$16:$K$74,2,FALSE)=0,\"\",VLOOKUP(AR17,$J$16:$K$74,2,FALSE)),\"\")","v":"8 a.m."}]
[1,"Jay","M","-",{"$f":"(VLOOKUP('Employee Info'!B4,Schedule!$P$14:$Q$35,2,FALSE)+VLOOKUP('Employee Info'!B4,Schedule!$P$38:$Q$59,2,FALSE))","v":0},{"$f":"IFERROR(E4*D4,\"\")","v":""},3078710570,"Verizon",{"$f":"VLOOKUP(H4,Carriers!$A$2:$B$10,2,FALSE)","v":"vtext.com"},"derekjohnson112@gmail.com",null,{"$f":"Schedule!$F$13","v":"Tue - 22"},{"$f":"IFERROR(IF(VLOOKUP(M18,$J$16:$K$74,2,FALSE)=0,\"\",VLOOKUP(M18,$J$16:$K$74,2,FALSE)),\"\")","v":""},"",{"$f":"Schedule!$F$13","v":"Tue - 22"},{"$f":"IFERROR(IF(VLOOKUP(P18,$J$16:$K$74,2,FALSE)=0,\"\",VLOOKUP(P18,$J$16:$K$74,2,FALSE)),\"\")","v":""},"",{"$f":"Schedule!$F$13","v":"Tue - 22"},{"$f":"IFERROR(IF(VLOOKUP(S18,$J$16:$K$74,2,FALSE)=0,\"\",VLOOKUP(S18,$J$16:$K$74,2,FALSE)),\"\")","v":"2 a.m."},{"$f":"IFERROR(IF(VLOOKUP(T18,$J$16:$K$74,2,FALSE)=0,\"\",VLOOKUP(T18,$J$16:$K$74,2,FALSE)),\"\")","v":"7 a.m."},{"$f":"Schedule!$F$13","v":"Tue - 22"},{"$f":"IFERROR(IF(VLOOKUP(V18,$J$16:$K$74,2,FALSE)=0,\"\",VLOOKUP(V18,$J$16:$K$74,2,FALSE)),\"\")","v":"6 a.m."},"2 p.m.",{"$f":"Schedule!$F$13","v":"Tue - 22"},{"$f":"IFERROR(IF(VLOOKUP(Y18,$J$16:$K$74,2,FALSE)=0,\"\",VLOOKUP(Y18,$J$16:$K$74,2,FALSE)),\"\")","v":"2 a.m."},"8 a.m.",{"$f":"Schedule!$F$13","v":"Tue - 22"},{"$f":"IFERROR(IF(VLOOKUP(AB18,$J$16:$K$74,2,FALSE)=0,\"\",VLOOKUP(AB18,$J$16:$K$74,2,FALSE)),\"\")","v":"OFF"},"OFF",{"$f":"Schedule!$F$13","v":"Tue - 22"},{"$f":"IFERROR(IF(VLOOKUP(AE18,$J$16:$K$74,2,FALSE)=0,\"\",VLOOKUP(AE18,$J$16:$K$74,2,FALSE)),\"\")","v":"6 a.m."},"10 a.m.",{"$f":"Schedule!$F$13","v":"Tue - 22"},{"$f":"IFERROR(IF(VLOOKUP(AH18,$J$16:$K$74,2,FALSE)=0,\"\",VLOOKUP(AH18,$J$16:$K$74,2,FALSE)),\"\")","v":"4 a.m."},"8 a.m.",{"$f":"Schedule!$F$13","v":"Tue - 22"},{"$f":"IFERROR(IF(VLOOKUP(AK18,$J$16:$K$74,2,FALSE)=0,\"\",VLOOKUP(AK18,$J$16:$K$74,2,FALSE)),\"\")","v":"8 a.m."},"2 p.m.",{"$f":"Schedule!$F$13","v":"Tue - 22"},{"$f":"IFERROR(IF(VLOOKUP(AN18,$J$16:$K$74,2,FALSE)=0,\"\",VLOOKUP(AN18,$J$16:$K$74,2,FALSE)),\"\")","v":"8 a.m."},"2 p.m.",{"$f":"Schedule!$F$13","v":"Tue - 22"},{"$f":"IFERROR(IF(VLOOKUP(AQ18,$J$16:$K$74,2,FALSE)=0,\"\",VLOOKUP(AQ18,$J$16:$K$74,2,FALSE)),\"\")","v":"8 a.m."},"2 p.m."]
[2,"Penny","M","-",{"$f":"(VLOOKUP('Employee Info'!B5,Schedule!$P$14:$Q$35,2,FALSE)+VLOOKUP('Employee Info'!B5,Schedule!$P$38:$Q$59,2,FALSE))","v":0},{"$f":"IFERROR(E5*D5,\"\")","v":""},3078710571,"Verizon",{"$f":"VLOOKUP(H5,Carriers!$A$2:$B$10,2,FALSE)","v":"vtext.com"},"derekjohnson113@gmail.com",null,{"$f":"Schedule!$H$13","v":"Wed - 23"},{"$f":"IFERROR(IF(VLOOKUP(M19,$J$16:$K$74,2,FALSE)=0,\"\",VLOOKUP(M19,$J$16:$K$74,2,FALSE)),\"\")","v":""},"",{"$f":"Schedule!$H$13","v":"Wed - 23"},{"$f":"IFERROR(IF(VLOOKUP(P19,$J$16:$K$74,2,FALSE)=0,\"\",VLOOKUP(P19,$J$16:$K$74,2,FALSE)),\"\")","v":""},"",{"$f":"Schedule!$H$13","v":"Wed - 23"},"2 a.m.","7:30 a.m.",{"$f":"Schedule!$H$13","v":"Wed - 23"},{"$f":"IFERROR(IF(VLOOKUP(V19,$J$16:$K$74,2,FALSE)=0,\"\",VLOOKUP(V19,$J$16:$K$74,2,FALSE)),\"\")","v":"6 a.m."},"2 p.m.",{"$f":"Schedule!$H$13","v":"Wed - 23"},{"$f":"IFERROR(IF(VLOOKUP(Y19,$J$16:$K$74,2,FALSE)=0,\"\",VLOOKUP(Y19,$J$16:$K$74,2,FALSE)),\"\")","v":"2 a.m."},"8 a.m.",{"$f":"Schedule!$H$13","v":"Wed - 23"},{"$f":"IFERROR(IF(VLOOKUP(AB19,$J$16:$K$74,2,FALSE)=0,\"\",VLOOKUP(AB19,$J$16:$K$74,2,FALSE)),\"\")","v":"2:45 a.m."},"7:30 a.m.",{"$f":"Schedule!$H$13","v":"Wed - 23"},{"$f":"IFERROR(IF(VLOOKUP(AE19,$J$16:$K$74,2,FALSE)=0,\"\",VLOOKUP(AE19,$J$16:$K$74,2,FALSE)),\"\")","v":"6 a.m."},"10 a.m.",{"$f":"Schedule!$H$13","v":"Wed - 23"},{"$f":"IFERROR(IF(VLOOKUP(AH19,$J$16:$K$74,2,FALSE)=0,\"\",VLOOKUP(AH19,$J$16:$K$74,2,FALSE)),\"\")","v":"4 a.m."},"8 a.m.",{"$f":"Schedule!$H$13","v":"Wed - 23"},{"$f":"IFERROR(IF(VLOOKUP(AK19,$J$16:$K$74,2,FALSE)=0,\"\",VLOOKUP(AK19,$J$16:$K$74,2,FALSE)),\"\")","v":"8 a.m."},"2 p.m.",{"$f":"Schedule!$H$13","v":"Wed - 23"},{"$f":"IFERROR(IF(VLOOKUP(AN19,$J$16:$K$74,2,FALSE)=0,\"\",VLOOKUP(AN19,$J$16:$K$74,2,FALSE)),\"\")","v":"8 a.m."},"2 p.m.",{"$f":"Schedule!$H$13","v":"Wed - 23"},{"$f":"IFERROR(IF(VLOOKUP(AQ19,$J$16:$K$74,2,FALSE)=0,\"\",VLOOKUP(AQ19,$J$16:$K$74,2,FALSE)),\"\")","v":"8 a.m."},"2 p.m."]
[3,"Nissa","E",10,{"$f":"(VLOOKUP('Employee Info'!B6,Schedule!$P$14:$Q$35,2,FALSE)+VLOOKUP('Employee Info'!B6,Schedule!$P$38:$Q$59,2,FALSE))","v":61.500000000000007},615.00000000000011,3078710572,"Verizon",{"$f":"VLOOKUP(H6,Carriers!$A$2:$B$10,2,FALSE)","v":"vtext.com"},"derekjohnson112@gmail.com",null,{"$f":"Schedule!$J$13","v":"Thu - 24"},{"$f":"IFERROR(IF(VLOOKUP(M20,$J$16:$K$74,2,FALSE)=0,\"\",VLOOKUP(M20,$J$16:$K$74,2,FALSE)),\"\")","v":""},"",{"$f":"Schedule!$J$13","v":"Thu - 24"},{"$f":"IFERROR(IF(VLOOKUP(P20,$J$16:$K$74,2,FALSE)=0,\"\",VLOOKUP(P20,$J$16:$K$74,2,FALSE)),\"\")","v":""},"",{"$f":"Schedule!$J$13","v":"Thu - 24"},{"$f":"IFERROR(IF(VLOOKUP(S20,$J$16:$K$74,2,FALSE)=0,\"\",VLOOKUP(S20,$J$16:$K$74,2,FALSE)),\"\")","v":"2 a.m."},"7:30 a.m.",{"$f":"Schedule!$J$13","v":"Thu - 24"},{"$f":"IFERROR(IF(VLOOKUP(V20,$J$16:$K$74,2,FALSE)=0,\"\",VLOOKUP(V20,$J$16:$K$74,2,FALSE)),\"\")","v":"6 a.m."},"10:45 a.m.",{"$f":"Schedule!$J$13","v":"Thu - 24"},{"$f":"IFERROR(IF(VLOOKUP(Y20,$J$16:$K$74,2,FALSE)=0,\"\",VLOOKUP(Y20,$J$16:$K$74,2,FALSE)),\"\")","v":"2 a.m."},"8 a.m.",{"$f":"Schedule!$J$13","v":"Thu - 24"},{"$f":"IFERROR(IF(VLOOKUP(AB20,$J$16:$K$74,2,FALSE)=0,\"\",VLOOKUP(AB20,$J$16:$K$74,2,FALSE)),\"\")","v":"2:45 a.m."},"7:30 a.m.",{"$f":"Schedule!$J$13","v":"Thu - 24"},{"$f":"IFERROR(IF(VLOOKUP(AE20,$J$16:$K$74,2,FALSE)=0,\"\",VLOOKUP(AE20,$J$16:$K$74,2,FALSE)),\"\")","v":"6 a.m."},"10 a.m.",{"$f":"Schedule!$J$13","v":"Thu - 24"},{"$f":"IFERROR(IF(VLOOKUP(AH20,$J$16:$K$74,2,FALSE)=0,\"\",VLOOKUP(AH20,$J$16:$K$74,2,FALSE)),\"\")","v":"4 a.m."},"8 a.m.",{"$f":"Schedule!$J$13","v":"Thu - 24"},{"$f":"IFERROR(IF(VLOOKUP(AK20,$J$16:$K$74,2,FALSE)=0,\"\",VLOOKUP(AK20,$J$16:$K$74,2,FALSE)),\"\")","v":"8 a.m."},"2 p.m.",{"$f":"Schedule!$J$13","v":"Thu - 24"},{"$f":"IFERROR(IF(VLOOKUP(AN20,$J$16:$K$74,2,FALSE)=0,\"\",VLOOKUP(AN20,$J$16:$K$74,2,FALSE)),\"\")","v":"8 a.m."},"2 p.m.",{"$f":"Schedule!$J$13","v":"Thu - 24"},{"$f":"IFERROR(IF(VLOOKUP(AQ20,$J$16:$K$74,2,FALSE)=0,\"\",VLOOKUP(AQ20,$J$16:$K$74,2,FALSE)),\"\")","v":"8 a.m."},"2 p.m."]
[4,"Tracie","E",10.5,{"$f":"(VLOOKUP('Employee Info'!B7,Schedule!$P$14:$Q$35,2,FALSE)+VLOOKUP('Employee Info'!B7,Schedule!$P$38:$Q$59,2,FALSE))","v":66.000000000000114},693.00000000000114,3078710573,"Verizon",{"$f":"VLOOKUP(H7,Carriers!$A$2:$B$10,2,FALSE)","v":"vtext.com"},"derekjohnson113@gmail.com",null,{"$f":"Schedule!$L$13","v":"Fri - 25"},{"$f":"IFERROR(IF(VLOOKUP(M21,$J$16:$K$74,2,FALSE)=0,\"\",VLOOKUP(M21,$J$16:$K$74,2,FALSE)),\"\")","v":""},"",{"$f":"Schedule!$L$13","v":"Fri - 25"},{"$f":"IFERROR(IF(VLOOKUP(P21,$J$16:$K$74,2,FALSE)=0,\"\",VLOOKUP(P21,$J$16:$K$74,2,FALSE)),\"\")","v":""},"",{"$f":"Schedule!$L$13","v":"Fri - 25"},{"$f":"IFERROR(IF(VLOOKUP(S21,$J$16:$K$74,2,FALSE)=0,\"\",VLOOKUP(S21,$J$16:$K$74,2,FALSE)),\"\")","v":"2 a.m."},"7:30 a.m.",{"$f":"Schedule!$L$13","v":"Fri - 25"},{"$f":"IFERROR(IF(VLOOKUP(V21,$J$16:$K$74,2,FALSE)=0,\"\",VLOOKUP(V21,$J$16:$K$74,2,FALSE)),\"\")","v":"6 a.m."},"10:45 a.m.",{"$f":"Schedule!$L$13","v":"Fri - 25"},{"$f":"IFERROR(IF(VLOOKUP(Y21,$J$16:$K$74,2,FALSE)=0,\"\",VLOOKUP(Y21,$J$16:$K$74,2,FALSE)),\"\")","v":"2 a.m."},"8 a.m.",{"$f":"Schedule!$L$13","v":"Fri - 25"},{"$f":"IFERROR(IF(VLOOKUP(AB21,$J$16:$K$74,2,FALSE)=0,\"\",VLOOKUP(AB21,$J$16:$K$74,2,FALSE)),\"\")","v":"2:45 a.m."},"7:30 a.m.",{"$f":"Schedule!$L$13","v":"Fri - 25"},{"$f":"IFERROR(IF(VLOOKUP(AE21,$J$16:$K$74,2,FALSE)=0,\"\",VLOOKUP(AE21,$J$16:$K$74,2,FALSE)),\"\")","v":"6 a.m."},"10 a.m.",{"$f":"Schedule!$L$13","v":"Fri - 25"},{"$f":"IFERROR(IF(VLOOKUP(AH21,$J$16:$K$74,2,FALSE)=0,\"\",VLOOKUP(AH21,$J$16:$K$74,2,FALSE)),\"\")","v":"4 a.m."},"8 a.m.",{"$f":"Schedule!$L$13","v":"Fri - 25"},{"$f":"IFERROR(IF(VLOOKUP(AK21,$J$16:$K$74,2,FALSE)=0,\"\",VLOOKUP(AK21,$J$16:$K$74,2,FALSE)),\"\")","v":"8 a.m."},"2 p.m.",{"$f":"Schedule!$L$13","v":"Fri - 25"},{"$f":"IFERROR(IF(VLOOKUP(AN21,$J$16:$K$74,2,FALSE)=0,\"\",VLOOKUP(AN21,$J$16:$K$74,2,FALSE)),\"\")","v":"8 a.m."},"2 p.m.",{"$f":"Schedule!$L$13","v":"Fri - 25"},{"$f":"IFERROR(IF(VLOOKUP(AQ21,$J$16:$K$74,2,FALSE)=0,\"\",VLOOKUP(AQ21,$J$16:$K$74,2,FALSE)),\"\")","v":"8 a.m."},"2 p.m."]
[5,"Kristi","E",9,{"$f":"(VLOOKUP('Employee Info'!B8,Schedule!$P$14:$Q$35,2,FALSE)+VLOOKUP('Employee Info'!B8,Schedule!$P$38:$Q$59,2,FALSE))","v":72.000000000000185},648.00000000000171,3078710574,"Verizon",{"$f":"VLOOKUP(H8,Carriers!$A$2:$B$10,2,FALSE)","v":"vtext.com"},"derekjohnson112@gmail.com",null,{"$f":"Schedule!$N$13","v":"Sat - 26"},{"$f":"IFERROR(IF(VLOOKUP(M22,$J$16:$K$74,2,FALSE)=0,\"\",VLOOKUP(M22,$J$16:$K$74,2,FALSE)),\"\")","v":""},"",{"$f":"Schedule!$N$13","v":"Sat - 26"},{"$f":"IFERROR(IF(VLOOKUP(P22,$J$16:$K$74,2,FALSE)=0,\"\",VLOOKUP(P22,$J$16:$K$74,2,FALSE)),\"\")","v":""},"",{"$f":"Schedule!$N$13","v":"Sat - 26"},{"$f":"IFERROR(IF(VLOOKUP(S22,$J$16:$K$74,2,FALSE)=0,\"\",VLOOKUP(S22,$J$16:$K$74,2,FALSE)),\"\")","v":"2 a.m."},"7:30 a.m.",{"$f":"Schedule!$N$13","v":"Sat - 26"},{"$f":"IFERROR(IF(VLOOKUP(V22,$J$16:$K$74,2,FALSE)=0,\"\",VLOOKUP(V22,$J$16:$K$74,2,FALSE)),\"\")","v":"OFF"},"OFF",{"$f":"Schedule!$N$13","v":"Sat - 26"},{"$f":"IFERROR(IF(VLOOKUP(Y22,$J$16:$K$74,2,FALSE)=0,\"\",VLOOKUP(Y22,$J$16:$K$74,2,FALSE)),\"\")","v":"2 a.m."},"8 a.m.",{"$f":"Schedule!$N$13","v":"Sat - 26"},{"$f":"IFERROR(IF(VLOOKUP(AB22,$J$16:$K$74,2,FALSE)=0,\"\",VLOOKUP(AB22,$J$16:$K$74,2,FALSE)),\"\")","v":"2:45 a.m."},"7:30 a.m.",{"$f":"Schedule!$N$13","v":"Sat - 26"},{"$f":"IFERROR(IF(VLOOKUP(AE22,$J$16:$K$74,2,FALSE)=0,\"\",VLOOKUP(AE22,$J$16:$K$74,2,FALSE)),\"\")","v":"4 a.m."},"10 a.m.",{"$f":"Schedule!$N$13","v":"Sat - 26"},{"$f":"IFERROR(IF(VLOOKUP(AH22,$J$16:$K$74,2,FALSE)=0,\"\",VLOOKUP(AH22,$J$16:$K$74,2,FALSE)),\"\")","v":"4 a.m."},"8 a.m.",{"$f":"Schedule!$N$13","v":"Sat - 26"},{"$f":"IFERROR(IF(VLOOKUP(AK22,$J$16:$K$74,2,FALSE)=0,\"\",VLOOKUP(AK22,$J$16:$K$74,2,FALSE)),\"\")","v":"8 a.m."},"2 p.m.",{"$f":"Schedule!$N$13","v":"Sat - 26"},{"$f":"IFERROR(IF(VLOOKUP(AN22,$J$16:$K$74,2,FALSE)=0,\"\",VLOOKUP(AN22,$J$16:$K$74,2,FALSE)),\"\")","v":"8 a.m."},"2 p.m.",{"$f":"Schedule!$N$13","v":"Sat - 26"},{"$f":"IFERROR(IF(VLOOKUP(AQ22,$J$16:$K$74,2,FALSE)=0,\"\",VLOOKUP(AQ22,$J$16:$K$74,2,FALSE)),\"\")","v":"8 a.m."},"2 p.m."]
[6,"Will","E",9,{"$f":"(VLOOKUP('Employee Info'!B9,Schedule!$P$14:$Q$35,2,FALSE)+VLOOKUP('Employee Info'!B9,Schedule!$P$38:$Q$59,2,FALSE))","v":51.750000000000007},465.75000000000006,3078710575,"Verizon",{"$f":"VLOOKUP(H9,Carriers!$A$2:$B$10,2,FALSE)","v":"vtext.com"},"derekjohnson113@gmail.com",null,{"$f":"Schedule!$D$37","v":"Mon - 28"},{"$f":"IFERROR(IF(VLOOKUP(M23,$J$16:$K$74,2,FALSE)=0,\"\",VLOOKUP(M23,$J$16:$K$74,2,FALSE)),\"\")","v":""},"",{"$f":"Schedule!$D$37","v":"Mon - 28"},{"$f":"IFERROR(IF(VLOOKUP(P23,$J$16:$K$74,2,FALSE)=0,\"\",VLOOKUP(P23,$J$16:$K$74,2,FALSE)),\"\")","v":""},"",{"$f":"Schedule!$D$37","v":"Mon - 28"},{"$f":"IFERROR(IF(VLOOKUP(S23,$J$16:$K$74,2,FALSE)=0,\"\",VLOOKUP(S23,$J$16:$K$74,2,FALSE)),\"\")","v":"2 a.m."},"7:30 a.m.",{"$f":"Schedule!$D$37","v":"Mon - 28"},{"$f":"IFERROR(IF(VLOOKUP(V23,$J$16:$K$74,2,FALSE)=0,\"\",VLOOKUP(V23,$J$16:$K$74,2,FALSE)),\"\")","v":"6 a.m."},"2 p.m.",{"$f":"Schedule!$D$37","v":"Mon - 28"},{"$f":"IFERROR(IF(VLOOKUP(Y23,$J$16:$K$74,2,FALSE)=0,\"\",VLOOKUP(Y23,$J$16:$K$74,2,FALSE)),\"\")","v":"2 a.m."},"8 a.m.",{"$f":"Schedule!$D$37","v":"Mon - 28"},{"$f":"IFERROR(IF(VLOOKUP(AB23,$J$16:$K$74,2,FALSE)=0,\"\",VLOOKUP(AB23,$J$16:$K$74,2,FALSE)),\"\")","v":"2:45 a.m."},"7:30 a.m.",{"$f":"Schedule!$D$37","v":"Mon - 28"},{"$f":"IFERROR(IF(VLOOKUP(AE23,$J$16:$K$74,2,FALSE)=0,\"\",VLOOKUP(AE23,$J$16:$K$74,2,FALSE)),\"\")","v":"4 a.m."},"10 a.m.",{"$f":"Schedule!$D$37","v":"Mon - 28"},{"$f":"IFERROR(IF(VLOOKUP(AH23,$J$16:$K$74,2,FALSE)=0,\"\",VLOOKUP(AH23,$J$16:$K$74,2,FALSE)),\"\")","v":"4 a.m."},"8 a.m.",{"$f":"Schedule!$D$37","v":"Mon - 28"},{"$f":"IFERROR(IF(VLOOKUP(AK23,$J$16:$K$74,2,FALSE)=0,\"\",VLOOKUP(AK23,$J$16:$K$74,2,FALSE)),\"\")","v":"8 a.m."},"2 p.m.",{"$f":"Schedule!$D$37","v":"Mon - 28"},{"$f":"IFERROR(IF(VLOOKUP(AN23,$J$16:$K$74,2,FALSE)=0,\"\",VLOOKUP(AN23,$J$16:$K$74,2,FALSE)),\"\")","v":"8 a.m."},"2 p.m.",{"$f":"Schedule!$D$37","v":"Mon - 28"},{"$f":"IFERROR(IF(VLOOKUP(AQ23,$J$16:$K$74,2,FALSE)=0,\"\",VLOOKUP(AQ23,$J$16:$K$74,2,FALSE)),\"\")","v":"8 a.m."},"2 p.m."]
[7,"Tiffany","E",9.5,{"$f":"(VLOOKUP('Employee Info'!B10,Schedule!$P$14:$Q$35,2,FALSE)+VLOOKUP('Employee Info'!B10,Schedule!$P$38:$Q$59,2,FALSE))","v":56.000000000000057},532.00000000000057,3078710576,"Verizon",{"$f":"VLOOKUP(H10,Carriers!$A$2:$B$10,2,FALSE)","v":"vtext.com"},"derekjohnson112@gmail.com",null,{"$f":"Schedule!$F$37","v":"Tue - 29"},{"$f":"IFERROR(IF(VLOOKUP(M24,$J$16:$K$74,2,FALSE)=0,\"\",VLOOKUP(M24,$J$16:$K$74,2,FALSE)),\"\")","v":""},"",{"$f":"Schedule!$F$37","v":"Tue - 29"},{"$f":"IFERROR(IF(VLOOKUP(P24,$J$16:$K$74,2,FALSE)=0,\"\",VLOOKUP(P24,$J$16:$K$74,2,FALSE)),\"\")","v":""},"",{"$f":"Schedule!$F$37","v":"Tue - 29"},{"$f":"IFERROR(IF(VLOOKUP(S24,$J$16:$K$74,2,FALSE)=0,\"\",VLOOKUP(S24,$J$16:$K$74,2,FALSE)),\"\")","v":"2 a.m."},"7:30 a.m.",{"$f":"Schedule!$F$37","v":"Tue - 29"},{"$f":"IFERROR(IF(VLOOKUP(V24,$J$16:$K$74,2,FALSE)=0,\"\",VLOOKUP(V24,$J$16:$K$74,2,FALSE)),\"\")","v":"6 a.m."},"2 p.m.",{"$f":"Schedule!$F$37","v":"Tue - 29"},{"$f":"IFERROR(IF(VLOOKUP(Y24,$J$16:$K$74,2,FALSE)=0,\"\",VLOOKUP(Y24,$J$16:$K$74,2,FALSE)),\"\")","v":"2 a.m."},"8 a.m.",{"$f":"Schedule!$F$37","v":"Tue - 29"},{"$f":"IFERROR(IF(VLOOKUP(AB24,$J$16:$K$74,2,FALSE)=0,\"\",VLOOKUP(AB24,$J$16:$K$74,2,FALSE)),\"\")","v":"2:45 a.m."},"7:30 a.m.",{"$f":"Schedule!$F$37","v":"Tue - 29"},{"$f":"IFERROR(IF(VLOOKUP(AE24,$J$16:$K$74,2,FALSE)=0,\"\",VLOOKUP(AE24,$J$16:$K$74,2,FALSE)),\"\")","v":"6 a.m."},"10 a.m.",{"$f":"Schedule!$F$37","v":"Tue - 29"},{"$f":"IFERROR(IF(VLOOKUP(AH24,$J$16:$K$74,2,FALSE)=0,\"\",VLOOKUP(AH24,$J$16:$K$74,2,FALSE)),\"\")","v":"4 a.m."},"8 a.m.",{"$f":"Schedule!$F$37","v":"Tue - 29"},{"$f":"IFERROR(IF(VLOOKUP(AK24,$J$16:$K$74,2,FALSE)=0,\"\",VLOOKUP(AK24,$J$16:$K$74,2,FALSE)),\"\")","v":"8 a.m."},"2 p.m.",{"$f":"Schedule!$F$37","v":"Tue - 29"},{"$f":"IFERROR(IF(VLOOKUP(AN24,$J$16:$K$74,2,FALSE)=0,\"\",VLOOKUP(AN24,$J$16:$K$74,2,FALSE)),\"\")","v":"8 a.m."},"2 p.m.",{"$f":"Schedule!$F$37","v":"Tue - 29"},{"$f":"IFERROR(IF(VLOOKUP(AQ24,$J$16:$K$74,2,FALSE)=0,\"\",VLOOKUP(AQ24,$J$16:$K$74,2,FALSE)),\"\")","v":"8 a.m."},"2 p.m."]
{"$rows_left_out":65}
{"sheet":"Carriers","index":2,"n_rows":10,"n_cols":2,"rows_kept":10,"cut":false,"hidden":false,"merged":[]}
["Provider","Gateway"]
["AllTel","text.wireless.alltel.com"]
["AT&T","txt.att.net"]
["Boost Mobile","myboostmobile.com"]
["Cricket","sms.mycricket.com"]
["Sprint","messaging.sprintpcs.com"]
["T-Mobile","tmomail.net"]
["US Cellular","email.uscc.net"]
["Verizon","vtext.com"]
["Virgin Mobile","vmobl.com"]
{"$rows_left_out":1}
{"sheet":"Formulas","index":3,"n_rows":61,"n_cols":16,"rows_kept":61,"cut":false,"hidden":false,"merged":[]}
["Date and Time Formulas"]
[null,null,null,null,null,null,null,null,null,{"$f":"prevMonthName&\" \"&YEAR(H10)","v":"June 2014"}]
[null,"Today's Date",null,"Month Names",null,null,"time",11,null,"S","M","T","W","Th","F","Sa"]
[null,{"$f":"TODAY()","v":"2014-04-11"},null,"January",null,null,"week",4,null,{"$f":"IF(MONTH(prevMonth)<>MONTH(prevMonth-WEEKDAY(prevMonth)+(WeekNo-1)*7+WeekDay),\"\",DAY(prevMonth-WEEKDAY(prevMonth)+(WeekNo-1)*7+WeekDay))","v":1},2,3,4,5,6,7]
[null,{"$f":"MONTH(TODAY())","v":4},null,"February",null,null,"month",7,null,8,9,10,11,12,13,14]
[null,{"$f":"INDEX(monthNames,B5)","v":"April"},null,"March",null,null,"year",2014,null,15,16,17,18,19,20,21]
[null,{"$f":"YEAR(TODAY())","v":2014},null,"April",null,null,"monthName",{"$f":"INDEX(monthNames,month)","v":"July"},null,22,23,24,25,26,27,28]
[null,null,null,"May",null,null,"startDate",{"$f":"DATE(year,month,1)","v":"2014-07-01"},null,29,30,"","","","",""]
[null,null,null,"June",null,null,"startDayOfWeek",{"$f":"WEEKDAY(startDate)","v":3},null,"","","","","","",""]
[null,null,null,"July",null,null,"prevMonth",{"$f":"DATE(YEAR(startDate-1),MONTH(startDate-1),1)","v":"2014-06-01"}]
{"$rows_left_out":51}