{"text_format":"1","workbook":"xlsx","n_sheets":7,"sheets":["Assumptions","Income Statement","Cashflow Statement","Balance Sheet","Graphs","Data","Inputs"],"not_rendered":{"charts":3,"images":0,"macros":1,"external_links":0,"defined_names":26,"comments":0,"pivot_tables":0},"unopened":[],"bounds":{"document_bytes":16777216,"sheet_cells":100000,"rows_first":2000,"rows_last":500,"rows_between":2000,"halvings":0,"cell_chars":16384,"cell_head_chars":4096},"cells_cut":0,"cells_raw":0,"read":"whole","date_system":"1900"}

{"sheet":"Assumptions","index":0,"n_rows":47,"n_cols":12,"rows_kept":47,"cut":false,"hidden":false,"merged":[]}
["Initial Operation Year:",2014,null,null,null,null,"Type of Business/Marketing:","Saasware/Email"]
[]
["Unit Assumptions",null,null,"Financial Assumptions",null,null,"Market Assumptions"]
[]
["Initial Scale (Year 1)",null,null,"Taxes",null,null,"Marketing Ratios",null,null,"Saasware/Email","Mfg./Wholesale","Product/Direct"]
["Sale Price:",100,null,"Income Tax Rate:",0.4,null,"Reception/Open Rate:",{"$f":"IF($H$1=$J$5,J6,IF($H$1=$K$5,K6,IF($H$1=$L$5,L6,0)))","v":0.04},null,0.04,{"$f":"0.5","v":0.5},0.95]
["Transaction Cost:",10,null,null,null,null,"Action/Click Rate:",{"$f":"IF($H$1=$J$5,J7,IF($H$1=$K$5,K7,IF($H$1=$L$5,L7,0)))","v":0.25},null,0.25,1,0.8]
["Logistics Cost:",0,null,"Overhead",null,null,"Conversion Rate:",{"$f":"IF($H$1=$J$5,J8,IF($H$1=$K$5,K8,IF($H$1=$L$5,L8,0)))","v":0.1},null,0.1,0.05,0.1]
["Component 1:",0,null,"SG&A Rate:",0.2]
["Component 2:",0,null,null,null,null,"Marketing Costs"]
["Component 3:",0,null,null,null,null,"Cost per contact lead:",{"$f":"IF($H$1=$J$5,J11,IF($H$1=$K$5,K11,IF($H$1=$L$5,L11,0)))","v":0.04},null,0.04,22,0.8]
["Other components:",0,null,null,null,null,"Cost per contact made:",1.5E-3,null,1.5E-3,35,0]
["Manufacturing:",0,null,null,null,null,"Cost per action required:",0.02,null,0.02,300,0]
["Processing:",0,null,null,null,null,"Cost per sale/conversion:",0.27,null,0.27,1200,2.25]
[]
[]
["Gross Margin:",{"$f":"B6-SUM(B7:B16)","v":90},null,null,null,null,"Awareness Factors"]
[null,null,null,null,null,null,"Referral coefficient (K):",0.2,null,0.2,0.05,0.35]
[null,null,null,null,null,null,"Contact overlap:",{"$f":"IF($H$1=$J$5,J19,IF($H$1=$K$5,K19,IF($H$1=$L$5,L19,0)))","v":0.25},null,0.25,0.05,0.3]
["Expansion Scale (Year 3)",null,null,null,null,null,"Contact decay:",0.05,null,0.05,0.01,0.02]
["Sale Price:",{"$f":"B6","v":100},null,null,null,null,"Recurring coefficient:",0.55000000000000004,null,0.55000000000000004,0.8,0.6]
["Transaction Cost:",{"$f":"B7","v":10}]
["Logistics Cost:",0,null,null,null,null,"Marketing Efforts"]
["Component 1:",0,null,null,null,null,"Contacts Made Year 1:",1000000]
["Component 2:",0,null,null,null,null,"Contacts Made Year 2:",2000000]
["Component 3:",0,null,null,null,null,"Contacts Made Year 3:",4000000]
["Other components:",0,null,null,null,null,"Contacts Made Year 4:",5000000]
["Manufacturing:",0,null,null,null,null,"Contacts Made Year 5:",6000000]
["Processing:",0]
[]
[]
["Gross Margin:",{"$f":"B21-SUM(B22:B31)","v":90}]
[]
[]
["Full Scale (Year 5)"]
["Sale Price:",{"$f":"B21","v":100}]
["Transaction Cost:",{"$f":"B22","v":10}]
["Logistics Cost:",0]
["Component 1:",0]
["Component 2:",0]
{"$rows_left_out":8}
{"sheet":"Income Statement","index":1,"n_rows":34,"n_cols":6,"rows_kept":34,"cut":false,"hidden":false,"merged":[]}
["Total Products Sold:",{"$f":"Contacts1*OpenRate*ClickRate*ConversionRate","v":1000},{"$f":"(Contacts2*OpenRate*ClickRate*ConversionRate*(1-ContactDecay)*(1-Overlap)*(1+K))+(Recurring*B1)","v":2260},{"$f":"(Contacts3*OpenRate*ClickRate*ConversionRate*(1-ContactDecay)*(1-Overlap)*(1+K))+(Recurring*C1)","v":4663},{"$f":"(Contacts4*OpenRate*ClickRate*ConversionRate*(1-ContactDecay)*(1-Overlap)*(1+K))+(Recurring*D1)","v":6839.65},{"$f":"(Contacts5*OpenRate*ClickRate*ConversionRate*(1-ContactDecay)*(1-Overlap)*(1+K))+(Recurring*E1)","v":8891.807499999999}]
[]
[null,{"$f":"Assumptions!B1","v":2014},{"$f":"B3+1","v":2015},{"$f":"C3+1","v":2016},2017,2018]
["Revenues:"]
["sales",{"$f":"Assumptions!$B$6*B1","v":100000},{"$f":"Assumptions!$B$6*C1","v":226000},{"$f":"Assumptions!$B$21*D1","v":466300},{"$f":"Assumptions!$B$21*E1","v":683965},{"$f":"Assumptions!$B$36*F1","v":889180.74999999988}]
["other revenue"]
[]
[]
[]
["Total Revenue:",{"$f":"SUM(B5:B9)","v":100000},{"$f":"SUM(C5:C9)","v":226000},466300,683965,889180.74999999988]
[]
["Expenses:"]
["COGS",{"$f":"SUM(Assumptions!$B$7:$B$14)*B1","v":10000},{"$f":"SUM(Assumptions!$B$7:$B$14)*C1","v":22600},{"$f":"SUM(Assumptions!$B$22:$B$29)*D1","v":46630},{"$f":"SUM(Assumptions!$B$22:$B$29)*E1","v":68396.5},{"$f":"SUM(Assumptions!$B$37:$B$44)*F1","v":88918.074999999983}]
["General R&D"]
["Marketing",{"$f":"(Contacts1*LeadCost)+(Contacts1*ContactCost)+(Contacts1*OpenRate*ClickRate*ActionCost)+(Contacts1*OpenRate*ClickRate*ConversionRate*ConversionCost)","v":41970},{"$f":"(Contacts2*LeadCost)+(Contacts2*ContactCost)+(Contacts2*OpenRate*ClickRate*ActionCost)+(Contacts2*OpenRate*ClickRate*ConversionRate*ConversionCost)","v":83940},{"$f":"(Contacts3*LeadCost)+(Contacts3*ContactCost)+(Contacts3*OpenRate*ClickRate*ActionCost)+(Contacts3*OpenRate*ClickRate*ConversionRate*ConversionCost)","v":167880},{"$f":"(Contacts4*LeadCost)+(Contacts4*ContactCost)+(Contacts4*OpenRate*ClickRate*ActionCost)+(Contacts4*OpenRate*ClickRate*ConversionRate*ConversionCost)","v":209850},{"$f":"(Contacts5*LeadCost)+(Contacts5*ContactCost)+(Contacts5*OpenRate*ClickRate*ActionCost)+(Contacts5*OpenRate*ClickRate*ConversionRate*ConversionCost)","v":251820}]
["Salary 1"]
["Salary 2"]
["Salary 3"]
["Salary 4"]
["Other SG&A",{"$f":"Assumptions!$E$9*B5","v":20000},{"$f":"Assumptions!$E$9*C5","v":45200},{"$f":"Assumptions!$E$9*D5","v":93260},{"$f":"Assumptions!$E$9*E5","v":136793},{"$f":"Assumptions!$E$9*F5","v":177836.15}]
["Principal payments"]
[]
[]
["Total operating expenses",{"$f":"SUM(B13:B23)","v":71970},{"$f":"SUM(C13:C23)","v":151740},307770,415039.5,518574.22499999998]
["EBITDA",{"$f":"B10-B24","v":28030},{"$f":"C10-C24","v":74260},158530,268925.5,370606.52499999991]
["Interest expense"]
["Depreciation"]
[]
["Taxable income",{"$f":"B25-SUM(B26:B28)","v":28030},{"$f":"C25-SUM(C26:C28)","v":74260},158530,268925.5,370606.52499999991]
["income tax expense",{"$f":"IF(B29>0,B29*Assumptions!$E$6,0)","v":11212},{"$f":"IF(C29>0,C29*Assumptions!$E$6,0)","v":29704},{"$f":"IF(D29>0,D29*Assumptions!$E$6,0)","v":63412},{"$f":"IF(E29>0,E29*Assumptions!$E$6,0)","v":107570.20000000001},{"$f":"IF(F29>0,F29*Assumptions!$E$6,0)","v":148242.60999999996}]
[]
[]
["Total Expenses:",{"$f":"B24+SUM(B26:B28)+SUM(B30:B32)","v":83182},{"$f":"C24+SUM(C26:C28)+SUM(C30:C32)","v":181444},371182,522609.7,666816.83499999996]
["Net income (loss):",{"$f":"B10-B33","v":16818},{"$f":"C10-C33","v":44556},95118,161355.29999999999,222363.91499999992]

{"sheet":"Cashflow Statement","index":2,"n_rows":46,"n_cols":6,"rows_kept":46,"cut":false,"hidden":false,"merged":[]}
[]
[null,{"$f":"Assumptions!B1","v":2014},{"$f":"B2+1","v":2015},{"$f":"C2+1","v":2016},2017,2018]
["Operations Cash Flow:"]
["Sales",{"$f":"'Income Statement'!B5","v":100000},{"$f":"'Income Statement'!C5","v":226000},{"$f":"'Income Statement'!D5","v":466300},{"$f":"'Income Statement'!E5","v":683965},{"$f":"'Income Statement'!F5","v":889180.74999999988}]
["Other",{"$f":"'Income Statement'!B6","v":0},{"$f":"'Income Statement'!C6","v":0},{"$f":"'Income Statement'!D6","v":0},{"$f":"'Income Statement'!E6","v":0},{"$f":"'Income Statement'!F6","v":0}]
[]
["Costs you have to cover during regular business operation are called Operating Expense (or Opex)"]
["Cash paid for:"]
["inventory purchases",{"$f":"-'Income Statement'!B13","v":-10000},{"$f":"-'Income Statement'!C13","v":-22600},{"$f":"-'Income Statement'!D13","v":-46630},{"$f":"-'Income Statement'!E13","v":-68396.5},{"$f":"-'Income Statement'!F13","v":-88918.074999999983}]
["General R&D",{"$f":"-'Income Statement'!B14","v":0},{"$f":"-'Income Statement'!C14","v":0},{"$f":"-'Income Statement'!D14","v":0},{"$f":"-'Income Statement'!E14","v":0},{"$f":"-'Income Statement'!F14","v":0}]
["Marketing",{"$f":"-'Income Statement'!B15","v":-41970},{"$f":"-'Income Statement'!C15","v":-83940},{"$f":"-'Income Statement'!D15","v":-167880},{"$f":"-'Income Statement'!E15","v":-209850},{"$f":"-'Income Statement'!F15","v":-251820}]
["Salary 1",{"$f":"-'Income Statement'!B16","v":0},{"$f":"-'Income Statement'!C16","v":0},{"$f":"-'Income Statement'!D16","v":0},{"$f":"-'Income Statement'!E16","v":0},{"$f":"-'Income Statement'!F16","v":0}]
["Salary 2",{"$f":"-'Income Statement'!B17","v":0},{"$f":"-'Income Statement'!C17","v":0},{"$f":"-'Income Statement'!D17","v":0},{"$f":"-'Income Statement'!E17","v":0},{"$f":"-'Income Statement'!F17","v":0}]
["Salary 3",{"$f":"-'Income Statement'!B18","v":0},{"$f":"-'Income Statement'!C18","v":0},{"$f":"-'Income Statement'!D18","v":0},{"$f":"-'Income Statement'!E18","v":0},{"$f":"-'Income Statement'!F18","v":0}]
["Salary 4",{"$f":"-'Income Statement'!B19","v":0},{"$f":"-'Income Statement'!C19","v":0},{"$f":"-'Income Statement'!D19","v":0},{"$f":"-'Income Statement'!E19","v":0},{"$f":"-'Income Statement'!F19","v":0}]
["Other SG&A",{"$f":"-'Income Statement'!B20","v":-20000},{"$f":"-'Income Statement'!C20","v":-45200},{"$f":"-'Income Statement'!D20","v":-93260},{"$f":"-'Income Statement'!E20","v":-136793},{"$f":"-'Income Statement'!F20","v":-177836.15}]
["Interest  expense",{"$f":"-'Income Statement'!B26","v":0},{"$f":"-'Income Statement'!C26","v":0},{"$f":"-'Income Statement'!D26","v":0},{"$f":"-'Income Statement'!E26","v":0},{"$f":"-'Income Statement'!F26","v":0}]
["Principal payments",{"$f":"-'Income Statement'!B21","v":0},{"$f":"-'Income Statement'!C21","v":0},{"$f":"-'Income Statement'!D21","v":0},{"$f":"-'Income Statement'!E21","v":0},{"$f":"-'Income Statement'!F21","v":0}]
[]
["income taxes paid for last year",0,{"$f":"-'Income Statement'!B30","v":-11212},{"$f":"-'Income Statement'!C30","v":-29704},{"$f":"-'Income Statement'!D30","v":-63412},{"$f":"-'Income Statement'!E30","v":-107570.20000000001}]
[]
["Net cash flow from operations:",{"$f":"SUM(B4:B21)","v":28030},{"$f":"SUM(C4:C21)","v":63048},128826,205513.5,263036.3249999999]
[]
["Investing Cash Flow - this is cash for equipment (or Capital Expense, also known as Capex)"]
["cash (paid) for property additions"]
["cash proceeds from property sales"]
["other"]
[]
["Net cash flow for investing:",{"$f":"SUM(B25:B28)","v":0},{"$f":"SUM(C25:C28)","v":0},{"$f":"SUM(D25:D28)","v":0},{"$f":"SUM(E25:E28)","v":0},{"$f":"SUM(F25:F28)","v":0}]
[]
["Financing Cash Flow - this is what investors give you or what you borrow to run your company"]
["cash from investors",1000000]
["additions to short-term borrowing"]
["payments on short-term borrowing"]
["additions to long-term borrowing"]
["payments on long-term borrowing"]
["treasury stock purchase"]
["net warrant and option proceeds"]
["other"]
[]
{"$rows_left_out":7}
{"sheet":"Balance Sheet","index":3,"n_rows":63,"n_cols":12,"rows_kept":63,"cut":false,"hidden":false,"merged":[]}
[]
[null,{"$f":"Assumptions!B1","v":2014},{"$f":"B2+1","v":2015},{"$f":"C2+1","v":2016},2017,2018]
["Assets:"]
["Current Assets:"]
["cash",{"$f":"'Cashflow Statement'!B46","v":1028030},{"$f":"'Cashflow Statement'!C46","v":1091078},{"$f":"'Cashflow Statement'!D46","v":1219904},{"$f":"'Cashflow Statement'!E46","v":1425417.5},{"$f":"'Cashflow Statement'!F46","v":1688453.825}]
["accounts receivable"]
["inventory"]
["prepaid expenses"]
[]
[]
[]
["Total Current Assets:",{"$f":"SUM(B5:B11)","v":1028030},{"$f":"SUM(C5:C11)","v":1091078},1219904,1425417.5,1688453.825]
[]
["Property:"]
["land"]
["buildings"]
["leasehold improvements"]
["fixtures and equipment"]
["property under capital lease"]
[]
[]
[]
["Total Property",{"$f":"SUM(B15:B22)","v":0},{"$f":"SUM(C15:C22)","v":0},0,0,0]
["less accumulated depreciation"]
["Total Property Net:",{"$f":"SUM(B23:B24)","v":0},{"$f":"SUM(C23:C24)","v":0},0,0,0]
["Goodwill:"]
["Other Assets (see Notes):"]
["Total Assets:",{"$f":"B12+SUM(B25:B27)","v":1028030},{"$f":"C12+SUM(C25:C27)","v":1091078},1219904,1425417.5,1688453.825]
[]
["Liabilities:"]
["Current Liabilities:"]
["short-term loans payable"]
["accounts payable"]
["accrued salaries and wages"]
[]
[]
[]
["Total Current Liabilities:",{"$f":"SUM(B32:B37)","v":0},{"$f":"SUM(C32:C37)","v":0},{"$f":"SUM(D32:D37)","v":0},{"$f":"SUM(E32:E37)","v":0},{"$f":"SUM(F32:F37)","v":0}]
[]
["Long-term liabilities:"]
{"$rows_left_out":24}
{"sheet":"Graphs","index":4,"n_rows":34,"n_cols":7,"rows_kept":34,"cut":false,"hidden":false,"merged":[]}
["Table for Written Plan:"]
[]
[null,null,2012,2013,2014,2015,2016]
[null,"Sales",{"$f":"'Income Statement'!B10","v":100000},{"$f":"'Income Statement'!C10","v":226000},{"$f":"'Income Statement'!D10","v":466300},{"$f":"'Income Statement'!E10","v":683965},{"$f":"'Income Statement'!F10","v":889180.74999999988}]
[null,"COGS",{"$f":"'Income Statement'!B13","v":10000},{"$f":"'Income Statement'!C13","v":22600},{"$f":"'Income Statement'!D13","v":46630},{"$f":"'Income Statement'!E13","v":68396.5},{"$f":"'Income Statement'!F13","v":88918.074999999983}]
[null,"R&D",{"$f":"'Income Statement'!B14","v":0},{"$f":"'Income Statement'!C14","v":0},{"$f":"'Income Statement'!D14","v":0},{"$f":"'Income Statement'!E14","v":0},{"$f":"'Income Statement'!F14","v":0}]
[null,"Marketing",{"$f":"'Income Statement'!B15","v":41970},{"$f":"'Income Statement'!C15","v":83940},{"$f":"'Income Statement'!D15","v":167880},{"$f":"'Income Statement'!E15","v":209850},{"$f":"'Income Statement'!F15","v":251820}]
[null,"SG&A",{"$f":"SUM('Income Statement'!B16:B20)","v":20000},{"$f":"SUM('Income Statement'!C16:C20)","v":45200},{"$f":"SUM('Income Statement'!D16:D20)","v":93260},{"$f":"SUM('Income Statement'!E16:E20)","v":136793},{"$f":"SUM('Income Statement'!F16:F20)","v":177836.15}]
[null,"Other",{"$f":"'Income Statement'!B33-SUM(C5:C8)-C10","v":0},{"$f":"'Income Statement'!C33-SUM(D5:D8)-D10","v":0},{"$f":"'Income Statement'!D33-SUM(E5:E8)-E10","v":0},{"$f":"'Income Statement'!E33-SUM(F5:F8)-F10","v":0},{"$f":"'Income Statement'!F33-SUM(G5:G8)-G10","v":0}]
[null,"Taxes",{"$f":"'Income Statement'!B30","v":11212},{"$f":"'Income Statement'!C30","v":29704},{"$f":"'Income Statement'!D30","v":63412},{"$f":"'Income Statement'!E30","v":107570.20000000001},{"$f":"'Income Statement'!F30","v":148242.60999999996}]
[null,"Total:",{"$f":"C4-SUM(C5:C10)","v":16818},{"$f":"D4-SUM(D5:D10)","v":44556},95118,161355.29999999999,222363.91499999992]
[]
[]
[]
[null,null,null,null,null,null,"Revenue Breakdown:"]
[]
[]
[]
[]
[]
[]
[]
[]
[]
[]
[]
[]
[]
[]
[]
[]
[]
[]
[null,null,null,null,null,null,"Growth Curve:"]

{"sheet":"Data","index":5,"n_rows":1001,"n_cols":13,"rows_kept":1001,"cut":false,"hidden":true,"merged":[]}
["Year 1 Share Price","Year 2 Share Price","Year 3 Share Price","Year 4 Share Price","Year 5 Share Price","Open Rate","Click Rate","Conversion Rate","5-year Simple Growth","Bin Range","Bins","Bin Labels","Frequency"]
[1.1451736618499999,1.42629749981,1.9958720725800012,2.7852531060874988,3.7709837777571251,7.3000000000000009E-2,0.32250000000000001,0.114,2.2929361749947983,{"$f":"MIN(I:I)","v":0.62512113364886468},{"$f":"((($J$3-$J$2)/15)*1)+$J$2","v":0.86793073030513712},{"$f":"ROUND(J2,2)*100&\" - \"&ROUND(K2,2)*100&\"%\"","v":"63 - 87%"},{"$f":"COUNTIF(I:I,\"<=\"&K2)","v":18}]
[1.1175042943999998,1.3471760614399997,1.8127693299199985,2.4645889136000001,3.2800958156959994,9.8000000000000004E-2,0.32,7.3000000000000009E-2,1.9351975040571263,{"$f":"MAX(I:I)","v":4.2672650834929513},{"$f":"((($J$3-$J$2)/15)*2)+$J$2","v":1.1107403269614096},{"$f":"ROUND(K2,2)*100&\" - \"&ROUND(K3,2)*100&\"%\"","v":"87 - 111%"},{"$f":"COUNTIF(I:I,\"<=\"&K3)-COUNTIF(I:I,\"<=\"&K2)","v":50}]
[1.1618788658999999,1.4740987573399991,2.1065205961199998,2.9791484302250004,4.0679175723497494,8.4000000000000005E-2,0.29749999999999999,0.11700000000000001,2.5011546312951571,null,{"$f":"((($J$3-$J$2)/15)*3)+$J$2","v":1.353549923617682},{"$f":"ROUND(K3,2)*100&\" - \"&ROUND(K4,2)*100&\"%\"","v":"111 - 135%"},{"$f":"COUNTIF(I:I,\"<=\"&K4)-COUNTIF(I:I,\"<=\"&K3)","v":80}]
[1.0988022870000003,1.2935935262,1.6886821415999995,2.2468954917500001,2.9464877756425003,8.1000000000000003E-2,0.20749999999999999,0.12,1.6815449972234173,null,{"$f":"((($J$3-$J$2)/15)*4)+$J$2","v":1.5963595202739547},"135 - 160%",120]
[1.1671650600999997,1.48927229026,2.1416832206800001,3.0409401262750002,4.1627070133652504,0.11600000000000002,0.29749999999999999,8.7000000000000008E-2,2.5665109894641644,null,{"$f":"((($J$3-$J$2)/15)*5)+$J$2","v":1.8391691169302271},"160 - 184%",136]
[1.0809445112250009,1.2425156206849999,1.5704668233300003,2.0398193006187499,2.6294413567868129,8.7000000000000008E-2,0.2225,9.0999999999999998E-2,1.4325405508622719,null,{"$f":"((($J$3-$J$2)/15)*6)+$J$2","v":2.0819787135864996},"184 - 208%",133]
[1.2014056738500001,1.5872318110099997,2.36842064418,3.4381957065874995,4.7710060997121246,0.114,0.29749999999999999,0.10300000000000001,2.9711865888089708,null,{"$f":"((($J$3-$J$2)/15)*7)+$J$2","v":2.3247883102427718},"208 - 232%",121]
[1.2483510720000002,1.7215412671999992,2.6792959295999994,3.982874767999999,5.605056832479999,0.128,0.26250000000000001,0.124,3.4899683736403264,null,{"$f":"((($J$3-$J$2)/15)*8)+$J$2","v":2.5675979068990444},"232 - 257%",94]
[1.08298697625,1.2483828132500003,1.5840669885000001,2.0637354921874995,2.6661443161281242,0.11800000000000001,0.20250000000000001,7.4999999999999997E-2,1.4618433781725031,null,{"$f":"((($J$3-$J$2)/15)*9)+$J$2","v":2.8104075035553171},"257 - 281%",88]
[1.0808304049499999,1.2421603858700001,1.5696205476600003,2.0382304581125004,2.6269105159048753,7.1000000000000008E-2,0.19500000000000001,0.127,1.4304557901721855,null,{"$f":"((($J$3-$J$2)/15)*10)+$J$2","v":3.0532171002115893},"281 - 305%",59]
[1.2396814194000001,1.6967320864400002,2.6218674799199997,3.8822349423500002,5.4509312040084996,0.12300000000000001,0.26500000000000001,0.124,3.3970419486054122,null,{"$f":"((($J$3-$J$2)/15)*11)+$J$2","v":3.2960266968678615},"305 - 330%",41]
[1.1250375552000003,1.3686728115200002,1.8624795993600001,2.5514800688000006,3.412960191568001,9.6000000000000016E-2,0.215,0.11600000000000002,2.0336411222834889,null,{"$f":"((($J$3-$J$2)/15)*12)+$J$2","v":3.5388362935241346},"330 - 354%",35]
[1.1218471112000001,1.3595986971200003,1.8415213001599999,2.5149572078000002,3.3572163358580007,0.11900000000000001,0.26,7.6000000000000012E-2,1.9925792047250586,null,{"$f":"((($J$3-$J$2)/15)*13)+$J$2","v":3.7816458901804069},"354 - 378%",16]
[1.129893423,1.3825877197999998,1.8947060364000001,2.6080260432499989,3.4996235680075021,8.3000000000000004E-2,0.3,9.9000000000000005E-2,2.09730413220354,null,{"$f":"((($J$3-$J$2)/15)*14)+$J$2","v":4.0244554868366791},"378 - 402%",6]
[1.1467967588000001,1.4309491648800001,2.0066456158400001,2.8041588447000003,3.7999608848170014,0.109,0.23,0.10800000000000001,2.3135434466986577,null,{"$f":"((($J$3-$J$2)/15)*15)+$J$2","v":4.2672650834929513},"402 - 427%",3]
[1.1159516689000002,1.3426960651399997,1.8023681165199994,2.4462251234749997,3.2518467110572509,0.12200000000000001,0.19750000000000001,9.4E-2,1.9139673353977904]
[1.0752380756250002,1.2261915841249991,1.53268448925,1.9736286017187505,2.5280920334078125,9.3000000000000013E-2,0.21249999999999999,8.5000000000000006E-2,1.3511928108928961]
[1.0366094160000003,1.1156449215999995,1.2767849988000004,1.5251567815,1.8412545780649996,7.6999999999999999E-2,0.1825,0.08,0.776227911540598]
[1.0935805250000001,1.278662865,1.65413057,2.1863901937499999,2.8538672550624997,7.400000000000001E-2,0.25,0.105,1.6096544239963484]
[1.2560268855000001,1.7434994723000001,2.7301190814000003,4.0719134401250008,5.7413920085387504,0.10200000000000001,0.32500000000000001,0.129,3.5710741344945123]
[1.1927380831999999,1.5624137043199995,2.3109591497599999,3.3374433307999998,4.6166576995880018,0.124,0.24249999999999999,0.11200000000000002,2.8706382940351496]
[1.1629217406250001,1.4771102131249991,2.1135142112500005,2.9915043804687484,4.0869324998203131,0.125,0.24249999999999999,9.7000000000000017E-2,2.514365891572234]
[1.0709109249000006,1.2138001707400001,1.5039934273200006,1.9233168949750001,2.4510119112222504,8.900000000000001E-2,0.19750000000000001,9.2000000000000012E-2,1.2887168803989189]
[1.2428616510000003,1.7058546325999999,2.6430027468000001,3.9193541202499991,5.5078523022774997,0.126,0.29499999999999998,0.11,3.4315892262392271]
[1.1345404688000005,1.3959342108800001,1.9256410438399998,2.6624162972000009,3.5830846530920013,0.11200000000000002,0.31,7.3000000000000009E-2,2.158181441409329]
[1.0921899248999993,1.2746765707400005,1.6448972773199997,2.1701838524750001,2.8290243478472505,8.4000000000000005E-2,0.20250000000000001,0.113,1.5902311341191646]
[1.1694672630999994,1.4958240380600001,2.1568189610800004,3.0673309345250006,4.2030001313227503,9.2000000000000012E-2,0.30249999999999999,0.109,2.5939442376364816]
[1.0867418500000006,1.2591078100000002,1.6088765799999998,2.1071390875000007,2.7325471071250007,8.2000000000000017E-2,0.25,0.09,1.5144399354133635]
[1.1442587760000003,1.4236886576000001,1.9898407968,2.7747175939999997,3.7548803853400008,0.126,0.2,0.10600000000000001,2.2814958155409419]
[1.1921622324000007,1.5607716202399997,2.3071628683200007,3.3308118731000005,4.6065215447410006,0.12200000000000001,0.255,0.10800000000000001,2.8640056022135378]
[1.1925148923,1.5618092019800001,2.3095883936399999,3.3351671443249997,4.6132880308007493,0.11900000000000001,0.3075,9.2000000000000012E-2,2.8685370393179026]
[1.2184980641500001,1.6361148277900002,2.4815513342200006,3.6363442529124961,5.0743643913328746,0.10300000000000001,0.29499999999999998,0.12300000000000001,3.1644418982911144]
[1.067029340875,1.2026908087750003,1.4782759229500002,1.8782420086562499,2.3819755981084381,7.9000000000000001E-2,0.21249999999999999,9.3000000000000013E-2,1.2323431107856302]
[1.1817402039000007,1.5309361561399999,2.2380898045199995,3.2097225922249999,4.4210387887697502,9.3000000000000013E-2,0.29749999999999999,0.11600000000000002,2.7411258195154544]
[1.2131174759999999,1.6207392775999994,2.4459779568000011,3.5740837190000008,4.9790884720900008,0.12,0.28249999999999997,0.10800000000000001,3.1043745313994648]
[1.1733003479999999,1.5067752248000001,2.1821541264000004,3.1116643370000001,4.2708349740699996,8.3000000000000004E-2,0.3,0.124,2.6400185011024986]
[1.2072785124000001,1.604005148239998,2.4072205723200004,3.5060706130999999,4.8748433309410002,0.129,0.22,0.126,3.037877988278026]
[1.1573301357000001,1.4611483908200016,2.0765984067599996,2.926956100175,3.988212747594249,0.11800000000000001,0.315,7.6999999999999999E-2,2.4460458814390216]
[1.0857028295999991,1.2561246209600003,1.6019627932800007,2.0949865573999995,2.7139023107140008,9.6000000000000016E-2,0.1925,9.9000000000000005E-2,1.4996732408939861]
{"$rows_left_out":962}
{"sheet":"Inputs","index":6,"n_rows":4,"n_cols":3,"rows_kept":4,"cut":false,"hidden":true,"merged":[]}
[0.7,1.3,{"$f":"IF($H$1=$J$5,J6,IF($H$1=$K$5,K6,IF($H$1=$L$5,L6,0)))","v":0}]
[0.7,1.3,{"$f":"IF($H$1=$J$5,J7,IF($H$1=$K$5,K7,IF($H$1=$L$5,L7,0)))","v":0}]
[0.7,1.3,{"$f":"IF($H$1=$J$5,J8,IF($H$1=$K$5,K8,IF($H$1=$L$5,L8,0)))","v":0}]
[1000]