{"text_format":"1","workbook":"xlsx","n_sheets":12,"sheets":["LongTerm Budget","Value of Personal Investments","Annual Expenses","Annual Investment Contributions","Life Insurance","529","EducationLoans","Mortgage","Missions","Calculator","Sheet4","TaxTables"],"not_rendered":{"charts":7,"images":4,"macros":1,"external_links":0,"defined_names":15,"comments":3,"pivot_tables":0},"unopened":[{"sheet":"Value of Personal Investments","index":1,"reason":"not_a_worksheet"},{"sheet":"Annual Expenses","index":2,"reason":"not_a_worksheet"},{"sheet":"Annual Investment Contributions","index":3,"reason":"not_a_worksheet"}],"bounds":{"document_bytes":16777216,"sheet_cells":100000,"rows_first":2000,"rows_last":500,"rows_between":2000,"halvings":0,"cell_chars":16384,"cell_head_chars":4096},"cells_cut":0,"cells_raw":0,"read":"whole","date_system":"1900"}

{"sheet":"LongTerm Budget","index":0,"n_rows":33,"n_cols":21,"rows_kept":33,"cut":false,"hidden":false,"merged":[[9,4,9,6],[0,0,0,11],[3,11,3,12],[8,11,8,12],[7,11,7,12],[6,11,6,12],[5,11,5,12],[4,11,4,12],[3,4,3,6],[2,4,2,6],[8,4,8,6],[2,11,2,12],[1,10,1,12],[6,4,6,6],[7,4,7,6],[5,4,5,6]]}
["20-Year Budget"]
["Assumptions:",null,null,null,null,null,null,"PV","FV (in 20 yrs)",null,"Legend:"]
["Salary Growth Rate:",7.0000000000000007E-2,"Nominal Rate of Return:",0.05,"Estimated annual living expenses during retirment=",null,null,40000,{"$f":"(FV($D$5,$U$12,,-$H$3))","v":72244.449386776527},null,null,"=input cell"]
["% of Income for Living Expenses:",0.5,"Capital Gains Tax:",0.15,"Value of investments needed to live off interest=",null,null,null,{"$f":"(FV($D$5,$U$12,,-H3))/(1-TaxTables!$E$21)/$D$3","v":1699869.3973359182},null,null,"=non-input cell"]
["% Gross Pay for 401K:",{"$f":"4.5%","v":4.4999999999999998E-2},"Expected Inflation:",0.03,null,null,null,null,null,null,null,"=positive cashflow"]
["% 401K Employer Contribution:",0.06,null,null,"Instructions:",null,null,null,null,null,null,"=taxes, expenses"]
["State Tax Rate:",3.5700000000000003E-2,null,null,"(1) Insert gross pay in cell B15",null,null,null,null,null,null,"=annual contribution"]
["Mortgage Term:","30 yr",null,null,"(2) Adjust input cells (see legend)",null,null,null,null,null,null,"=accruing account"]
["Education Debt Repayment Term:","25 yr",null,null,"(3) Click \"Calculate Take-Home Pay\" Button",null,null,null,null,null,null,"=sum total"]
[null,null,null,null,"(4) Adjust input cells on all tabs"]
["Age",33,34,35,36,37,38,39,40,41,42,43,44,45,46,47,48,49,50,51,52]
["Year #",1,2,3,4,5,6,7,8,9,10,11,12,13,14,15,16,17,18,19,20]
["Month Period","June-May","June-May","June-May","June-May","June-May","June-May","June-May","June-May","June-May","June-May","June-May","June-May","June-May","June-May","June-May","June-May","June-May","June-May","June-May","June-May"]
["Year",2014,2015,2016,2017,2018,2019,2020,2021,2022,2023,2024,2025,2026,2027,2028,2029,2030,2031,2032,2033]
[{"$f":"Calculator!D5","v":"Gross Pay:"},100000,{"$f":"(B15)*(1+$B$3)","v":107000},{"$f":"C15*(1+$B$3)","v":114490},122504.3,131079.60100000002,140255.17307000005,150073.03518490007,160578.14764784308,171818.61798319212,183845.92124201558,196715.13572895669,210485.19522998368,225219.15889608255,240984.50001880835,257853.41502012496,275903.1540715337,295216.37485654111,315881.521096499,337993.22757325397,361652.7535033818]
["Pretax Deductions:",13435.893,13447.155510000001,14208.206400000001,15022.530839999999,15893.858,16826.178059999998,17823.76053,18891.173759999998,20033.305929999999,21255.387340000001,22016.014460000002,23415.175470000002,24912.277750000001,25718.177190000002,27432.209600000002,29266.224270000002,30577.61997,32677.383370000003,34343.130200000007,36747.149320000004]
[{"$f":"Calculator!D29","v":"FICA Social Security (6.2%)"},6733.7536599999994,6740.7364161999994,7212.5879653340007,7717.4691229073806,8257.6919615108982,8835.7303988166623,9454.231526733829,10116.027733605197,10824.149674957562,11581.840152204593,12392.568962858915,13260.048790259041,14188.252205577175,15181.429859967579,16244.12995016531,17381.219046676884,18597.904379944266,19899.757686540364,21292.740724598192,22783.232575320064]
[{"$f":"Calculator!D30","v":"FICA Medicare (1.45%)"},1574.8294849999997,1576.4625489499999,1686.8149273765,1804.8919722928549,1931.2344103533551,2066.4208190780901,2211.0702764135567,2365.8451957625057,2531.4543594658812,2708.6561646284931,2898.2620961524881,3101.1404428831625,3318.2202738849842,3550.4956930569333,3799.0303915709192,4064.9625189808835,4349.5098953095458,4653.9755879812137,4979.7538791398993,5328.336650679692]
[{"$f":"Calculator!D31","v":"Federal Tax"},8405.3452724999988,8419.7894415749979,9395.8372018402515,10625.347178615113,12487.808980818176,14480.643109475452,16612.975625688738,18894.57142126195,21335.878919050294,23948.077944658813,26879.880899234937,29984.058070259147,33568.120935989289,37625.948202208565,41729.341774487169,46119.972899261265,51042.233237955414,56966.715663919298,63497.641862340635,70280.581790724478]
[{"$f":"Calculator!D34","v":"State & Local Taxes"},2518.1221748550001,2521.5598870948502,2753.85925403798,3002.4195771062382,3268.3791224608358,3552.9558360330948,3857.4529193483522,4183.2647989562065,4531.8835096403827,4904.905530497279,5323.5669924107497,5750.639903958041,6207.6079193386349,6724.9808957815922,7248.1635762471142,7807.9690446558116,8430.2015957424501,9071.1228763694526,9777.6503469259424,10511.441120996558]
{"$rows_left_out":14}
{"sheet":"Life Insurance","index":4,"n_rows":23,"n_cols":13,"rows_kept":23,"cut":false,"hidden":false,"merged":[[21,9,21,10],[22,9,22,10],[0,0,0,13]]}
["Full Life Insurance Policy Paid Up at Age 96"]
[]
[null,null,2011,2012,2013,null,null,"Dividend","Base Cash Value","Cash Value of Adds","Net Cash Value","∆ Cash Value","∆ in ∆ of Cash Value"]
[null,"Cash Value",6616,8174,9800,null,1,36,2035,378,{"$f":"I4+J4","v":2413},{"$f":"H4/K4","v":1.4919187733112309E-2},{"$f":"L5-L4","v":-4.2439809009799361E-3}]
[null,"Annual Contribution:",{"$f":"771.65*2","v":1543.3},{"$f":"771.65*2","v":1543.3},1543.3,null,2,40,3216,531,{"$f":"I5+J5","v":3747},{"$f":"H5/K5","v":1.0675206832132373E-2},{"$f":"L6-L5","v":-2.121552088742016E-3}]
[null,"Death Benefit",159470,160366,161268,null,3,44,4448,696,5144,8.553654743390357E-3,-1.1674624009122142E-3]
[null,null,null,null,null,null,4,49,5735,899,6634,7.3861923424781428E-3,2.7037663251610507E-3]
[null,null,null,null,null,null,5,83,7073,1153,8226,1.0089958667639193E-2,2.7060111056605544E-3]
[null,null,null,null,null,null,6,127,8463,1462,9925,1.2795969773299748E-2,1.9437422485116176E-3]
[null,null,null,null,null,null,7,173,9905,1832,11737,1.4739712021811366E-2,9.8888157390030103E-4]
[null,null,null,null,null,null,8,223,11400,2778,14178,1.5728593595711667E-2,1.3130296495528458E-3]
[null,null,null,null,null,null,9,278,12946,3367,16313,1.7041623245264512E-2,9.8269613491411625E-4]
[null,null,null,null,null,null,10,335,14543,4043,18586,1.8024319380178629E-2,9.7025359897018673E-4]
[null,null,null,null,null,null,11,399,16192,4814,21006,1.8994572979148815E-2,7.4031881774272792E-4]
[null,null,null,null,null,null,12,466,17892,5721,23613,1.9734891796891543E-2,6.0062530084769097E-4]
[null,null,null,null,null,null,13,537,19634,6773,26407,2.0335517097739234E-2,1.7205576686159067E-3]
[null,null,null,null,null,null,14,649,21441,7984,29425,2.2056074766355141E-2,1.3713766944153626E-3]
[null,null,null,null,null,null,15,765,23288,9366,32654,2.3427451460770504E-2,1.214001554346613E-3]
[null,null,null,null,null,null,16,890,25185,10933,36118,2.4641453015117117E-2,1.0742677282279366E-3]
[null,null,null,null,null,null,17,1024,27128,12692,39820,2.5715720743345053E-2,{"$f":"L22-L20","v":2.7556695019076424E-2}]
{"$rows_left_out":4}
{"sheet":"529","index":5,"n_rows":11,"n_cols":6,"rows_kept":11,"cut":false,"hidden":false,"merged":[[0,0,0,9]]}
["College Savings Plans"]
[]
[null,null,null,"Clark","Cayson","Baby"]
[null,null,"Current Annual Cost of Attendence",17470,17470,17470]
[null,null,"Years Until College",13,16,18]
[null,null,"# Years in College",4,4,4]
[null,null,"Annual Increase in College Costs",0.05,0.05,0.05]
[null,null,"% of College Covered by Investment:",1,1,1]
[null,null,"Annual Contribution to 529",{"$f":"-PMT('LongTerm Budget'!$D$3,D5+D6,,FV(D7,D5+D6,,-D4*D6*D8),0)","v":6198.296024182273},{"$f":"-PMT('LongTerm Budget'!$D$3,E5+E6,,FV(E7,E5+E6,,-E4*E6*E8),0)","v":5607.3519928855094},{"$f":"-PMT('LongTerm Budget'!$D$3,F5+F6,,FV(F7,F5+F6,,-F4*F6*F8),0)","v":5308.8191379202171}]
[]
["http://www.savingforcollege.com/college-savings-calculator/index.php?current_cost=22826&years_until_college=13&years_attendance=4&attendance_rate=100&coverage_rate=100&save_until=ends&starting_balance=0&contribution_rate=1&inflation_rate=5&investment_performance=6&page=results"]

{"sheet":"EducationLoans","index":6,"n_rows":27,"n_cols":16,"rows_kept":27,"cut":false,"hidden":false,"merged":[[2,9,3,9],[0,0,0,16],[12,10,12,11],[13,10,13,11],[1,0,1,7],[2,10,3,10],[2,11,2,12],[3,11,3,12],[2,13,3,13],[2,14,3,14],[2,15,3,15]]}
["Education Loan Repayment"]
["Please click on number in first column to see details"]
[null,"Type of Loan","Loan Amount","Loan Date","Disbursed Amount","Canceled Amount","Outstanding Principal","Outstanding Interest",null,"Repayment Plan","Repayment Period","Monthly Payment",null,"Projected Loan Forgiveness","Total Interest Paid","Total Amount Paid"]
[1,"DIRECT STAFFORD UNSUBSIDIZED",0,"2013-08-27",0,0,0,0,null,null,null,"Initial to Final Amounts"]
[2,"DIRECT CONSOLIDATED UNSUBSIDIZED",0,"2012-09-07",0,0,0,0,null,"Standard*","120 months",800,"to    $800","-",0,0]
[3,"DIRECT CONSOLIDATED SUBSIDIZED",0,"2012-09-07",0,0,0,0,null,"Graduated*","120 months",456,"to    $1,369","-",0,0]
[4,"DIRECT STAFFORD UNSUBSIDIZED",0,"2012-08-17",0,0,0,0,null,"Extended Fixed","300 months",458,"to    $458","-",0,0]
[5,"DIRECT STAFFORD UNSUBSIDIZED",0,"2011-11-10",0,0,0,0,null,"Extended Graduated","300 months",348,"to    $703","-",0,0]
[6,"DIRECT STAFFORD SUBSIDIZED",0,"2011-08-19",0,0,0,0,null,"Pay As You Earn**","145 months",508,"to    $738",0,0,0]
[7,"STAFFORD UNSUBSIDIZED",0,"2007-02-23",0,0,0,0,null,"Income-Based Repayment (IBR)**","-","-","to    -","-","-","-"]
[8,"STAFFORD SUBSIDIZED",0,"2007-01-22",0,0,0,0,null,"Income-Contingent Repayment (ICR)**","98 months",824,"to    $926",0,17819,84610]
[9,"STAFFORD SUBSIDIZED",0,"2006-11-09",0,0,0,0]
[10,"STAFFORD SUBSIDIZED",0,"2006-09-15",0,0,0,0,null,"Your Loan Balance",72973]
[11,"STAFFORD SUBSIDIZED",0,"2006-09-06",0,0,0,0,null,"Interest Rate",5.7000000000000002E-2]
[12,"STAFFORD SUBSIDIZED",0,"2005-08-31",0,0,0,0,null,"Loan Terms","10 yr","25 yr"]
[13,"FFEL CONSOLIDATED",0,"2005-08-17",0,0,0,0,null,"Montlhly Installment",800,458]
[14,"FFEL CONSOLIDATED",0,"2005-08-17",0,0,0,0]
[15,"STAFFORD UNSUBSIDIZED",0,"2005-01-18",0,0,0,0]
[16,"STAFFORD SUBSIDIZED",0,"2003-05-19",0,0,0,0]
["Total  DIRECT STAFFORD UNSUBSIDIZED",null,null,null,null,null,0,0]
{"$rows_left_out":8}
{"sheet":"Mortgage","index":7,"n_rows":8,"n_cols":5,"rows_kept":8,"cut":false,"hidden":false,"merged":[[0,0,0,7]]}
["Mortgage"]
[]
[null,null,"Mortgage Type:","30 yr","15 yr"]
[null,null,"Down Payment:",{"$f":"((1/3)*'LongTerm Budget'!B24)+8000+(14000*0.7)","v":30847.047951234679},{"$f":"D4","v":30847.047951234679}]
[null,null,"Annualized Interest:",4.2500000000000003E-2,3.2500000000000001E-2]
[null,null,"Monthly Payment:",665,949]
[null,null,"Fees:",1212,1043]
[null,null,"www.zillow.com"]

{"sheet":"Missions","index":8,"n_rows":7,"n_cols":7,"rows_kept":7,"cut":false,"hidden":false,"merged":[[0,0,0,11]]}
["LDS Mission Savings"]
[]
[null,null,null,null,null,"Current 2-yr Mission Price:",9600]
[null,null,null,null,"Age","FV of Mission Price:","Annual Savings Required:"]
[null,null,null,"Clark",5,{"$f":"FV('LongTerm Budget'!$D$5,18-E5,,-$G$3)","v":14097.923649135013},{"$f":"PMT('LongTerm Budget'!$D$3,18-E5,,F5)","v":-795.90906688812038}]
[null,null,null,"Cayson",2,{"$f":"FV('LongTerm Budget'!$D$5,18-E6,,-$G$3)","v":15405.181815348356},{"$f":"PMT('LongTerm Budget'!$D$3,18-E6,,F6)","v":-651.1756177136765}]
[null,null,null,"Baby",0,{"$f":"FV('LongTerm Budget'!$D$5,18-E7,,-$G$3)","v":16343.357387903072},{"$f":"PMT('LongTerm Budget'!$D$3,18-E7,,F7)","v":-580.94461516130275}]

{"sheet":"Calculator","index":9,"n_rows":36,"n_cols":5,"rows_kept":36,"cut":false,"hidden":false,"merged":[[21,3,21,4],[26,3,26,4],[0,0,0,13],[2,3,2,4],[3,3,3,4],[9,3,9,4],[13,3,13,4]]}
["Paycheck Calculator (no input necessary)"]
[]
[null,null,null,"For Wages Paid in 2014"]
[null,null,null," Gross Pay"]
[null,null,null,"Gross Pay:",367471.49315032363]
[null,null,null,"Pay Period:","Annually"]
[null,null,null,"Periods Per Year:",{"$f":"INDEX(TaxTables!$D$32:$D$38,MATCH(E6,TaxTables!$C$32:$C$38,0))","v":1}]
[null,null,null,"Est. Gross Annual Pay:",{"$f":"E5*E7","v":367471.49315032363}]
[]
[null,null,null," Filing Status and Withholdings"]
[null,null,null,"Filing Status:","Married"]
[null,null,null,"Number of Allowances:",5]
[null,null,null,"One Allowance:",{"$f":"INDEX(TaxTables!$E$32:$E$38,MATCH(E6,TaxTables!$C$32:$C$38,0))","v":3950}]
[null,null,null," Pre-Tax Adjustments"]
[null,null,null,"Tax Deferral Plan, 401(k):",{"$f":"'LongTerm Budget'!B5","v":4.4999999999999998E-2}]
[null,null,null,"Other Pre-Tax Deductions:",36747.149320000004]
[null,null,null,"Federal Taxable Gross:",{"$f":"MAX(0,E5-E12*E13-E15*E5-E16)","v":294438.12663855904}]
[null,null,null,"Federal Withholding Tables"]
[null,null,null,"Excess Over",{"$f":"IF(E$11=\"single\",INDEX(TaxTables!$C$9:$C$16,MATCH(E$17*E$7,TaxTables!$C$9:$C$16,1)),INDEX(TaxTables!$C$19:$C$26,MATCH(E$17*E$7,TaxTables!$C$19:$C$26,1)))","v":235300}]
[null,null,null,"Withhold",{"$f":"IF(E$11=\"single\",INDEX(TaxTables!$D$9:$D$16,MATCH(E$17*E$7,TaxTables!$C$9:$C$16,1)),INDEX(TaxTables!$D$19:$D$26,MATCH(E$17*E$7,TaxTables!$C$19:$C$26,1)))","v":50765}]
{"$rows_left_out":17}
{"sheet":"Sheet4","index":10,"n_rows":0,"n_cols":0,"rows_kept":0,"cut":false,"hidden":false,"merged":[]}

{"sheet":"TaxTables","index":11,"n_rows":38,"n_cols":5,"rows_kept":38,"cut":false,"hidden":false,"merged":[[2,0,2,4],[0,0,0,9]]}
["Federal Tax Tables (no input necessary)"]
[]
["These tables are used to estimate the federal tax withholding and need to be updated each year. The federal tax is calculated by multiplying the Federal Taxable Gross by the number of payments per year, then using the ANNUAL Table to calculate the withholding. The Federal Taxable Gross is the Gross Pay minus the Allowances minus the pre-tax withholdings and deductions."]
[]
["2014 ANNUAL Table for Percentage Method for Income Tax Withholding"]
[]
["Source: IRS Publication 15, Table 7, pg 44",null,"SINGLE"]
["http://www.irs.gov/pub/irs-pdf/p15.pdf",null,"Excess over","Withhold","Percent"]
[null,null,0,0,0]
[null,null,2250,0,0.1]
[null,null,11325,907.5,0.15]
[null,null,39150,5081.25,0.25]
[null,null,91600,18193.75,0.28000000000000003]
[null,null,188600,45353.75,0.33]
[null,null,407350,117541.25,0.35]
[null,null,409000,118118.75,0.39600000000000002]
[null,null,"MARRIED"]
[null,null,"Excess over","Withhold","Percent"]
[null,null,0,0,0]
[null,null,8450,0,0.1]
{"$rows_left_out":18}