{"text_format":"1","workbook":"xlsx","n_sheets":13,"sheets":["1040 Page 1","1040 Page 2","Sch. B","8863, pg 1","8863, pg 2 (1)","8863, pg 2 (2)","Statements","W-2s","1099-Ints","1098-Ts","States_Countries","Tax Brackets","Deductions_Exemptions"],"not_rendered":{"charts":0,"images":3,"macros":1,"external_links":3,"defined_names":261,"comments":0,"pivot_tables":0},"unopened":[],"bounds":{"document_bytes":16777216,"sheet_cells":100000,"rows_first":2000,"rows_last":500,"rows_between":2000,"halvings":0,"cell_chars":16384,"cell_head_chars":4096},"cells_cut":0,"cells_raw":0,"read":"whole","date_system":"1900"}

{"sheet":"1040 Page 1","index":0,"n_rows":69,"n_cols":32,"rows_kept":69,"cut":false,"hidden":false,"merged":[[67,26,67,30],[62,26,62,30],[63,10,63,17],[63,26,63,30],[64,26,64,30],[62,19,62,23],[63,19,63,23],[64,19,64,23],[65,19,65,23],[61,13,61,17],[54,4,54,17],[57,19,57,23],[58,19,58,23],[59,19,59,23],[60,19,60,23],[61,19,61,23],[65,26,65,30],[66,17,66,18],[66,20,66,24],[66,26,66,30],[55,26,55,30],[56,26,56,30],[56,19,56,23],[50,13,50,16],[50,26,50,30],[51,13,51,23],[51,26,51,30],[52,18,52,23],[52,26,52,30],[53,19,53,23],[54,19,54,23],[55,19,55,23],[46,9,46,11],[46,13,46,16],[46,26,46,30],[47,26,47,30],[48,26,48,30],[49,26,49,30],[42,26,42,30],[43,26,43,30],[44,26,44,30],[45,9,45,11],[45,13,45,16],[45,26,45,30],[36,26,36,30],[38,26,38,30],[40,26,40,30],[41,26,41,30],[31,31,32,31],[32,3,32,12],[32,13,32,16],[32,17,32,20],[34,26,34,29],[35,26,35,30],[35,14,35,24],[37,26,37,30],[39,26,39,30],[39,19,39,23],[37,19,37,23],[30,17,30,20],[31,0,31,1],[31,3,31,12],[31,13,31,16],[31,17,31,20],[31,26,32,29],[28,0,28,1],[28,13,28,16],[28,26,30,29],[29,0,29,1],[29,3,29,12],[29,13,29,16],[29,17,29,20],[30,0,30,1],[30,3,30,12],[30,13,30,16],[22,26,23,30],[24,26,25,29],[25,31,26,31],[26,13,26,16],[26,21,26,25],[27,13,27,16],[27,21,27,25],[12,0,13,11],[12,12,13,17],[12,18,13,22],[15,0,16,1],[19,25,19,31],[20,8,20,17],[9,23,9,31],[10,0,10,22],[10,23,11,31],[3,23,3,31],[4,0,4,7],[4,8,4,22],[4,23,4,31],[5,23,5,31],[6,0,6,7],[6,8,6,22],[6,23,6,31],[0,0,1,0],[0,1,1,2],[0,15,1,18],[1,23,1,31],[2,9,2,15],[2,17,2,22],[2,23,2,31],[7,25,8,31],[8,0,8,19],[8,20,8,22]]}
[" Form",1040,null,"Department of the Treasury––Internal Revenue Service    (99)",null,null,null,null,null,null,null,null,null,null,null,2014,null,null,null,null,41639]
[null,null,null,"U.S. Individual Income Tax Return",null,null,null,null,null,null,null,null,null,null,null,null,null,null,null,"OMB No. 1545-0074",null,null,null,"Do not write or staple in this space"]
[null,"For the year Jan. 1--Dec. 31, 2014, or other tax year beginning",null,null,null,null,null,null,null,null,null,null,null,null,null,null,", ending",null,null,null,null,null,null,"See separate instructions."]
[null,"Your first name and initial",null,null,null,null,null,null,"   Last name",null,null,null,null,null,null,null,null,null,null,null,null,null,null,"Your social security number"]
["JOHN A.",null,null,null,null,null,null,null,"DOE",null,null,null,null,null,null,null,null,null,null,null,null,null,null,111111111]
[null,"If joint return, spouse's name & initial",null,null,null,null,null,null,"   Last name",null,null,null,null,null,null,null,null,null,null,null,null,null,null,"Spouse's social security number"]
["JANE B.",null,null,null,null,null,null,null,"DOE",null,null,null,null,null,null,null,null,null,null,null,null,null,null,222222222]
[null,"Home address (number and street). If you have a P.O. box, see instructions.",null,null,null,null,null,null,null,null,null,null,null,null,null,null,null,null,null,null,"  Apt. no.",null,null,null,null,"Make sure the SSN(s) above\nand on line 6c are correct."]
["123 STATE ST.",null,null,null,null,null,null,null,null,null,null,null,null,null,null,null,null,null,null,null,"14"]
[null,"City, town or post office, state, and ZIP code. If you have a foreign address, also complete spaces below (see instructions).",null,null,null,null,null,null,null,null,null,null,null,null,null,null,null,null,null,null,null,null,null,"Presidential Election Campaign"]
{"$rows_left_out":60}
{"sheet":"1040 Page 2","index":1,"n_rows":60,"n_cols":32,"rows_kept":60,"cut":false,"hidden":false,"merged":[[58,2,58,5],[58,6,58,20],[58,23,58,31],[56,9,56,16],[56,24,56,27],[57,2,57,5],[57,6,57,20],[57,24,57,31],[56,20,56,23],[56,28,56,31],[48,2,48,4],[48,5,48,11],[48,12,48,13],[48,14,48,18],[38,16,38,17],[42,7,42,14],[43,7,43,16],[43,17,43,24],[39,26,39,30],[27,26,27,30],[30,26,30,30],[35,26,35,30],[36,26,36,30],[32,26,32,30],[33,26,33,30],[31,13,31,17],[31,26,31,30],[21,26,21,30],[22,26,22,30],[23,26,23,30],[24,26,24,30],[25,26,25,30],[26,19,26,23],[26,26,26,30],[28,19,28,23],[29,19,29,23],[30,19,30,23],[31,19,32,23],[19,26,19,30],[15,1,16,1],[18,1,19,1],[18,13,18,14],[18,16,18,17],[1,0,1,1],[1,26,1,30],[2,0,2,1],[2,23,3,24],[2,26,2,30],[3,26,3,30],[51,17,51,23],[45,26,45,30],[40,26,40,30],[41,26,41,30],[42,26,42,30],[43,26,43,30],[44,26,44,30],[44,19,44,23],[46,19,46,23],[55,2,55,8],[55,9,55,16],[55,24,55,25],[56,2,56,8],[20,26,20,30],[54,2,54,12],[54,13,54,16],[54,17,54,23],[54,24,54,26],[54,27,54,31],[52,2,52,12],[52,13,52,16],[52,17,52,23],[52,24,52,31],[53,17,53,23],[48,26,48,31],[11,26,11,30],[12,1,13,1],[6,26,6,30],[7,26,7,30],[4,26,4,30],[5,1,10,1],[5,26,5,30],[8,26,8,30],[9,22,9,24],[9,26,9,30],[10,26,10,30],[37,19,37,23],[38,19,38,23],[12,19,12,23],[13,19,13,23],[14,19,14,23],[15,19,15,23],[16,19,16,23],[17,19,17,23],[18,19,18,23],[33,19,33,23],[34,19,34,23],[35,19,35,23],[36,19,36,23]]}
["Form 1040  (2014)",null,null,null,null,null,null,null,null,null,null,null,null,"",null,null,null,null,null,null,null,null,null,null,null,null,null,null,null,null,null,"Page  2"]
["  Tax and",null,38,null,"Amount from line 37 (adjusted gross income)",null,null,null,null,null,null,null,null,null,null,null,null,0,0,null,0,null,null,0,null,38,{"$f":"'1040 Page 1'!AA68:AE68","v":16927}]
["  Credits",null,39,"a","Check",null,""," You were born before",null,null,null,null,{"$f":"\"January 2, 1950\"","v":"January 2, 1950"},null,null,null,null,null,"Blind.   Total boxes",null,null,null,null,{"$f":"COUNTIF(R3:R4,\"X\")","v":0},null,null,"You MUST indicate"]
["Standard",null,null,null,"if:",null,"","  Spouse was born before",null,null,null,null,null,{"$f":"\"January 2, 1950\"","v":"January 2, 1950"},null,null,null,null,"Blind.   checked ",null,null,null,"39a",null,null,null,"your filing status"]
[null,null,null,"b","If your spouse itemizes on a separate return or you were a dual-status alien, check here",null,null,null,null,null,null,null,null,null,null,null,null,null,null,null,null,null,null,null,null,null,"in lines 1-5."]
["•","People who check any box on line 39a or 39b or who can be claimed as a dependent, see instructions.",{"$f":"C3+1","v":40},null,"Itemized deductions (from Schedule A) or your standard deduction (see left margin)",null,null,null,null,null,null,null,null,null,null,null,null,null,null,null,null,null,null,null,".   .   .   .   .  ","40",{"$f":"IF('1040 Page 1'!D16=\"X\",Deductions_Exemptions!C4,IF('1040 Page 1'!D18=\"X\",Deductions_Exemptions!C6,IF('1040 Page 1'!D20=\"X\",Deductions_Exemptions!C7,IF('1040 Page 1'!T16=\"X\",Deductions_Exemptions!C5,0))))","v":12400}]
[null,null,41,null,"Subtract line 40 from line 38",null,null,null,null,null,null,null,null,null,null,null,null,null,null,null,null,null,null,null,".   .   .   .   .   .   .   .   .   .   .   .   .   .   .   .   .   .   .   .   .   .   .   .   .   .   .   .   .  ",41,{"$f":"AA2-AA6","v":4527}]
[null,null,42,null,"Exemptions.",null,"If line 38 is $150,000 or less, multiply $3,950 by number on line 6d. Otherwise, see instructions.",null,null,null,null,null,null,null,null,null,null,null,null,null,null,null,null,null,null,42,{"$f":"'1040 Page 1'!AF35*Deductions_Exemptions!C10","v":11850}]
[null,null,43,null,"Taxable income.",null,null," Subtract line 42 from line 41. If line 42 is more than line 41, enter -0-",null,null,null,null,null,null,null,null,null,null,null,null,null,null,null,null,".   .   .   .   .   .  ",43,{"$f":"IF(AA8>AA7,0,AA7-AA8)","v":0}]
[null,null,44,null,"Tax (see instructions). Check if any tax is from: a",null,null,null,null,null,null,null,null,"Form(s) 8814      b",null,null,null,null,"Form 4972  c",null,null,null,null,null,null,44,0]
{"$rows_left_out":51}
{"sheet":"Sch. B","index":2,"n_rows":72,"n_cols":21,"rows_kept":72,"cut":false,"hidden":false,"merged":[[53,7,53,13],[55,8,56,10],[55,11,56,13],[67,3,67,7],[68,1,69,1],[49,2,49,5],[49,7,49,13],[50,2,50,5],[50,7,50,13],[51,2,51,5],[51,7,51,13],[46,2,46,5],[46,7,46,13],[47,2,47,5],[47,7,47,13],[48,2,48,5],[48,7,48,13],[43,2,43,5],[43,7,43,13],[44,2,44,5],[44,7,44,13],[45,2,45,5],[45,7,45,13],[40,2,40,5],[40,7,40,13],[41,2,41,5],[41,7,41,13],[42,2,42,5],[42,7,42,13],[37,2,37,5],[37,7,37,13],[38,2,38,5],[38,7,38,13],[39,2,39,5],[39,7,39,13],[34,2,34,5],[34,7,34,13],[35,2,35,5],[35,7,35,13],[36,2,36,5],[36,7,36,13],[33,2,33,5],[33,7,33,13],[23,7,23,13],[24,2,24,5],[24,7,24,13],[25,2,25,5],[25,7,25,13],[26,7,26,13],[28,7,28,13],[30,7,30,13],[31,7,31,13],[32,3,32,5],[32,7,32,13],[19,0,30,0],[19,2,19,5],[19,7,19,13],[20,2,20,5],[20,7,20,13],[21,2,21,5],[21,7,21,13],[22,2,22,5],[22,7,22,13],[23,2,23,5],[16,2,16,5],[16,7,16,13],[17,2,17,5],[17,7,17,13],[18,2,18,5],[18,7,18,13],[13,2,13,5],[13,7,13,13],[14,2,14,5],[14,7,14,13],[15,2,15,5],[15,7,15,13],[9,7,9,13],[10,7,10,13],[11,2,11,5],[11,7,11,13],[12,2,12,5],[12,7,12,13],[8,7,8,13],[1,7,1,13],[2,7,3,13],[4,2,4,6],[6,6,6,13],[7,6,7,13],[7,0,7,5]]}
[]
["SCHEDULE B",null,null,null,null,null,null,"OMB No. 1545-0074"]
["(Form 1040A or 1040)",null,null,"Interest and Ordinary Dividends",null,null,null,{"$f":"2014","v":2014}]
["Department of the Treasury",null,null,"      4 Attach to Form 1040A or 1040."]
["Internal Revenue Service (99)",null," 4 Information about Schedule B (Form 1040A or 1040) and its instructions is at www.irs.gov/scheduleb.",null,null,null,null,"   Attachment"]
[null,null,null,null,null,null,null,"   Sequence No. 08"]
["Name(s) shown on return",null,null,null,null,null,"Your social security number"]
[{"$f":"IFERROR('1040 Page 1'!A5 & \" \" & '1040 Page 1'!I5,\"\")","v":"JOHN A. DOE"},null,null,null,null,null,{"$f":"IFERROR('1040 Page 1'!X5,\"XXX-XX-XXXX\")","v":111111111}]
["Part I",1,"List name of payer. If any interest is from a seller-financed mortgage and the",null,null,null,null,"Amount",null,null,null,null,null,null,null,null,null,null,null,null,"`"]
["Interest",null,"buyer used the property as a personal residence, see instructions on back and list"]
{"$rows_left_out":63}
{"sheet":"8863, pg 1","index":3,"n_rows":49,"n_cols":11,"rows_kept":49,"cut":false,"hidden":false,"merged":[[45,1,45,6],[45,9,45,12],[37,1,37,3],[38,1,38,3],[39,1,39,3],[40,1,40,3],[41,1,41,3],[42,1,42,3],[43,1,43,6],[44,1,44,6],[44,9,44,12],[39,4,40,4],[39,5,40,6],[39,7,40,7],[37,4,38,4],[37,5,38,6],[46,1,46,6],[46,8,47,8],[46,9,47,12],[46,13,47,13],[47,1,47,6],[37,7,38,7],[34,1,34,3],[34,4,36,4],[34,5,36,6],[34,7,36,7],[35,1,35,3],[36,1,36,3],[32,1,32,3],[32,4,33,4],[32,5,33,6],[32,7,33,7],[33,1,33,3],[28,9,29,12],[30,1,30,6],[30,9,30,12],[31,1,31,6],[31,9,31,12],[20,1,20,6],[20,8,22,8],[20,9,23,12],[28,13,29,13],[29,1,29,6],[24,1,24,6],[24,8,25,8],[24,9,25,12],[24,13,25,13],[25,1,25,6],[26,0,26,1],[26,2,26,13],[27,1,27,6],[27,9,27,12],[28,1,28,6],[28,8,29,8],[13,7,14,7],[14,1,14,3],[14,8,16,8],[15,1,15,3],[20,13,23,13],[21,1,21,6],[22,1,22,6],[23,1,23,6],[15,4,16,4],[15,5,16,6],[15,7,16,7],[16,1,16,3],[17,1,17,3],[18,1,18,6],[19,1,19,6],[19,9,19,12],[7,1,7,6],[7,9,7,12],[8,1,8,3],[8,5,9,6],[8,8,10,8],[9,1,9,3],[10,1,10,3],[10,4,12,4],[10,5,12,6],[10,7,12,7],[11,1,11,3],[11,8,13,8],[12,1,12,3],[13,1,13,3],[13,4,14,4],[13,5,14,6],[6,0,6,1],[0,0,2,1],[0,2,0,6],[0,10,0,13],[1,2,1,6],[2,2,2,6],[2,10,2,13],[3,0,3,6],[3,7,3,13],[4,0,4,6],[4,7,4,13],[5,2,5,13]]}
["Form   8863\nDepartment of the Treasury\nInternal Revenue Service   (99)",null,"Education Credits\n\n",null,null,null,null,null,null,null,"OMB No. 1545-0074"]
[null,null,"(American Opportunity and Lifetime Learning Credits)"]
[null,null,"▶ Information about Form 8863 and its separate instructions is at www.irs.gov/form8863.\n▶ Attach to Form 1040 or Form 1040A.",null,null,null,null,null,null,null,"2014\nAttachment\nSequence No. 50"]
["Name(s) shown on return",null,null,null,null,null,null,"Your social security number"]
[{"$f":"IFERROR('1040 Page 1'!A5 & \" \" & '1040 Page 1'!I5,\"\")","v":"JOHN A. DOE"},null,null,null,null,null,null,{"$f":"IFERROR('1040 Page 1'!X5,\"XXX-XX-XXXX\")","v":111111111}]
[null,null,"Complete a separate Part III on page 2 for each student for whom you are claiming either credit before you complete Parts I and II."]
["Part I",null,"Refundable American Opportunity Credit"]
[1,"After completing Part III for each student, enter the total of all amounts from all Parts III, line 30    .",null,null,null,null,null,null,1,{"$f":"'8863, pg 2 (1)'!X46+'8863, pg 2 (2)'!X46","v":4590.75}]
[2,"Enter:  $180,000  if  married  filing  jointly;  $90,000  if  single,  head  of ",null,null,null,{"$f":"IF('1040 Page 1'!D18=\"X\",180000,90000)","v":180000}]
[null,"household,  or qualifying widow(er)    .   .   .   .   .   .   .   .   .   .   .   .   .",null,null,2]
{"$rows_left_out":40}
{"sheet":"8863, pg 2 (1)","index":4,"n_rows":51,"n_cols":27,"rows_kept":51,"cut":false,"hidden":false,"merged":[[0,0,0,15],[0,23,0,25],[1,0,1,15],[1,19,1,26],[2,0,2,15],[2,16,2,18],[2,19,2,26],[11,1,11,8],[11,13,11,23],[3,2,3,26],[4,0,4,1],[4,2,4,26],[6,1,6,10],[6,13,6,26],[7,1,7,8],[7,13,7,24],[7,25,7,26],[8,1,8,10],[9,1,9,4],[9,13,9,26],[10,1,10,9],[10,13,10,26],[12,1,12,8],[13,1,13,3],[13,13,13,15],[14,2,14,3],[14,14,14,15],[12,12,12,29],[15,2,15,3],[15,14,15,15],[16,2,16,3],[16,14,16,15],[17,2,17,3],[17,14,17,15],[18,0,18,3],[18,12,18,26],[19,2,19,8],[19,14,19,23],[20,2,20,8],[20,14,20,23],[21,2,22,7],[21,14,22,22],[23,1,23,11],[24,1,24,11],[24,13,24,15],[24,18,24,25],[31,1,31,10],[25,1,25,11],[25,13,25,15],[26,1,26,10],[27,1,27,10],[28,1,28,10],[28,13,28,15],[28,18,28,26],[29,1,29,10],[29,13,29,15],[29,18,29,26],[30,1,30,10],[32,1,32,10],[32,13,32,15],[32,18,32,26],[33,13,33,15],[34,1,34,10],[34,18,34,26],[35,1,35,10],[35,13,35,15],[35,18,35,26],[36,1,36,10],[36,13,36,15],[36,18,36,26],[37,2,37,25],[38,2,38,25],[39,2,39,25],[40,2,40,25],[42,1,42,21],[42,23,42,26],[48,1,48,21],[48,22,49,22],[48,23,49,26],[49,1,49,21],[43,1,43,21],[43,23,43,26],[44,1,44,21],[44,23,44,26],[45,1,45,20],[45,22,46,22],[45,23,46,26],[46,1,46,21]]}
["Form 8863 (2014)",null,null,null,null,null,null,null,null,null,null,null,null,null,null,null,null,null,null,null,null,null,null,"Page",null,null,2]
["Name(s) shown on return",null,null,null,null,null,null,null,null,null,null,null,null,null,null,null,null,null,null,"Your social security number"]
[{"$f":"IFERROR('1040 Page 1'!A5 & \" \" & '1040 Page 1'!I5,\"\")","v":"JOHN A. DOE"},null,null,null,null,null,null,null,null,null,null,null,null,null,null,null,null,null,null,{"$f":"IFERROR('1040 Page 1'!X5,\"XXX-XX-XXXX\")","v":111111111}]
[null,null,"Complete Part III for each student for whom you are claiming either the American opportunity credit or lifetime learning credit. Use additional copies of Page 2 as needed for each student."]
["Part III",null,"Student and Educational Institution Information"]
[null,null,"See instructions."]
[20,"Student name (as shown on page 1 of your tax return)",null,null,null,null,null,null,null,null,null,null,21,"Student social security number (as shown on page 1 of your tax return)"]
[null,{"$f":"IF(VLOOKUP(\"Student's name\",'1098-Ts'!A1:AM372,3, FALSE)=\"\", \"\",VLOOKUP(\"Student's name\",'1098-Ts'!A1:AM372,3, FALSE))","v":"JOHN A DOE"},null,null,null,null,null,null,null,null,null,null,null,{"$f":"IF(VLOOKUP(\"Student's SSN\",'1098-Ts'!A1:AM372,3, FALSE)=\"\",\"\",VLOOKUP(\"Student's SSN\",'1098-Ts'!A1:AM372,3, FALSE))","v":111111111}]
[22,"Educational institution information (see instructions)"]
[null,"a. Name of first educational institution (if any)",null,null,null,null,null,null,null,null,null,null,null,"b. Name of second educational institution (if any)"]
{"$rows_left_out":42}
{"sheet":"8863, pg 2 (2)","index":5,"n_rows":51,"n_cols":27,"rows_kept":51,"cut":false,"hidden":false,"merged":[[0,0,0,15],[0,23,0,25],[1,0,1,15],[1,19,1,26],[2,0,2,15],[2,16,2,18],[2,19,2,26],[11,1,11,8],[11,13,11,23],[3,2,3,26],[4,0,4,1],[4,2,4,26],[6,1,6,10],[6,13,6,26],[7,1,7,8],[7,13,7,24],[7,25,7,26],[8,1,8,10],[9,1,9,4],[9,13,9,26],[10,1,10,9],[10,13,10,26],[12,1,12,8],[12,12,12,29],[13,1,13,3],[13,13,13,15],[14,2,14,3],[14,14,14,15],[15,2,15,3],[15,14,15,15],[16,2,16,3],[16,14,16,15],[17,2,17,3],[17,14,17,15],[18,0,18,3],[18,12,18,26],[19,2,19,8],[19,14,19,23],[20,2,20,8],[20,14,20,23],[21,2,22,7],[21,14,22,22],[23,1,23,11],[24,1,24,11],[24,13,24,15],[24,18,24,25],[31,1,31,10],[25,1,25,11],[25,13,25,15],[26,1,26,10],[27,1,27,10],[28,1,28,10],[28,13,28,15],[28,18,28,26],[29,1,29,10],[29,13,29,15],[29,18,29,26],[30,1,30,10],[32,1,32,10],[32,13,32,15],[32,18,32,26],[33,13,33,15],[34,1,34,10],[34,18,34,26],[35,1,35,10],[35,13,35,15],[35,18,35,26],[36,1,36,10],[36,13,36,15],[36,18,36,26],[37,2,37,25],[38,2,38,25],[39,2,39,25],[40,2,40,25],[42,1,42,21],[42,23,42,26],[48,1,48,21],[48,22,49,22],[48,23,49,26],[49,1,49,21],[43,1,43,21],[43,23,43,26],[44,1,44,21],[44,23,44,26],[45,1,45,20],[45,22,46,22],[45,23,46,26],[46,1,46,21]]}
["Form 8863 (2014)",null,null,null,null,null,null,null,null,null,null,null,null,null,null,null,null,null,null,null,null,null,null,"Page",null,null,2]
["Name(s) shown on return",null,null,null,null,null,null,null,null,null,null,null,null,null,null,null,null,null,null,"Your social security number"]
[{"$f":"IFERROR('1040 Page 1'!A5 & \" \" & '1040 Page 1'!I5,\"\")","v":"JOHN A. DOE"},null,null,null,null,null,null,null,null,null,null,null,null,null,null,null,null,null,null,{"$f":"IFERROR('1040 Page 1'!X5,\"XXX-XX-XXXX\")","v":111111111}]
[null,null,"Complete Part III for each student for whom you are claiming either the American opportunity credit or lifetime learning credit. Use additional copies of Page 2 as needed for each student."]
["Part III",null,"Student and Educational Institution Information"]
[null,null,"See instructions."]
[20,"Student name (as shown on page 1 of your tax return)",null,null,null,null,null,null,null,null,null,null,21,"Student social security number (as shown on page 1 of your tax return)"]
[null,{"$f":"IF(VLOOKUP(\"Student's name\",'1098-Ts'!A1:AM372,2, FALSE)=\"\", \"\",VLOOKUP(\"Student's name\",'1098-Ts'!A1:AM372,2, FALSE))","v":"JANE B. DOE"},null,null,null,null,null,null,null,null,null,null,null,{"$f":"IF(VLOOKUP(\"Student's SSN\",'1098-Ts'!A1:AM372,2, FALSE)=\"\",\"\",VLOOKUP(\"Student's SSN\",'1098-Ts'!A1:AM372,2, FALSE))","v":222222222}]
[22,"Educational institution information (see instructions)"]
[null,"a. Name of first educational institution (if any)",null,null,null,null,null,null,null,null,null,null,null,"b. Name of second educational institution (if any)"]
{"$rows_left_out":42}
{"sheet":"Statements","index":6,"n_rows":8,"n_cols":15,"rows_kept":8,"cut":false,"hidden":false,"merged":[[0,4,0,9],[7,0,7,2]]}
["FORM 1040",null,null,null,"WAGES RECEIVED AND TAXES WITHHELD",null,null,null,null,null,null,null,null,null,"STATEMENT        1"]
[]
[null,null,null,null,null,null,"FEDERAL",null,"STATE",null,"CITY"]
["T",null,null,null,"AMOUNT",null,"TAX",null,"TAX",null,"SDI",null,"FICA",null,"MEDICARE"]
["S",null,"EMPLOYER'S NAME",null,"PAID",null,"WITHHELD",null,"WITHHELD",null,"TAX W/H",null,"TAX",null,"TAX"]
["T",null,"BRIGHAM YOUNG UNIVERSITY",null,9247,null,682,null,0,null,0,null,243,null,57]
["S",null,"BRIGHAM YOUNG UNIVERSITY",null,6680,null,458,null,0,null,0,null,119,null,41]
["TOTALs",null,null,null,15927,null,1140,null,0,null,0,null,362,null,98]

{"sheet":"W-2s","index":7,"n_rows":51,"n_cols":3,"rows_kept":51,"cut":false,"hidden":true,"merged":[]}
["Statement Number","2","1"]
["Employee's Social Security Number",222222222,111111111]
["Employer's federal ID no.",870217281,870217280]
["Employer's name","BRIGHAM YOUNG UNIVERSITY","BRIGHAM YOUNG UNIVERSITY"]
["Street address","123 UNIVERSITY PLACE","123 UNIVERSITY PLACE"]
["APT/Suite"]
["City","PROVO","PROVO"]
["State","UT","UT"]
["ZIP",84602,84602]
["Control Number"]
{"$rows_left_out":42}
{"sheet":"1099-Ints","index":8,"n_rows":41,"n_cols":2,"rows_kept":41,"cut":false,"hidden":false,"merged":[]}
["Statement Number","1"]
["Payer's name","Wells Fargo"]
["Street address","1234 Main St"]
["APT/Suite","3000"]
["City or town","Provo"]
["State/Province","UT"]
["Country","US"]
["ZIP/Postal code","84601"]
["Telephone no.","(801) 222-2222"]
["Payer's federal ID no.","12-123456789"]
{"$rows_left_out":32}
{"sheet":"1098-Ts","index":9,"n_rows":34,"n_cols":3,"rows_kept":34,"cut":false,"hidden":true,"merged":[]}
["Statement Number",2,1]
["Filer's name","UTAH VALLEY UNIVERSITY","BRIGHAM YOUNG UNIVERSITY"]
["1-Street address","321 UNIVERSITY PKWY","123 UNIVERSITY PLACE"]
["1-APT/Suite"]
["1-City or town","OREM","PROVO"]
["1-State/Province","UT","UT"]
["1-Country","US","US"]
["1-ZIP/Postal code",84058,84602]
["1-Telephone no.","8018631234","8014221234"]
["Filer's federal ID no.",870280648,870217280]
{"$rows_left_out":25}
{"sheet":"States_Countries","index":10,"n_rows":261,"n_cols":8,"rows_kept":261,"cut":false,"hidden":true,"merged":[]}
[null,"States",null,"Countries",null,"W2, Box 12 Codes",null,"Depency Relationships"]
[]
[null,"AK",null,"US",null,"A",null,"Son"]
[null,"AL",null,"AA",null,"B",null,"Daughter"]
[null,"AR",null,"AC",null,"C",null,"Father"]
[null,"AS",null,"AE",null,"D",null,"Mother"]
[null,"AZ",null,"AF",null,"E",null,"Brother"]
[null,"CA",null,"AG",null,"F",null,"Sister"]
[null,"CO",null,"AJ",null,"G",null,"Grandparent"]
[null,"CT",null,"AL",null,"H"]
{"$rows_left_out":252}
{"sheet":"Tax Brackets","index":11,"n_rows":20,"n_cols":13,"rows_kept":20,"cut":false,"hidden":true,"merged":[]}
[]
[null,"S",null,null,null,null,null,null,"MFJ/QW"]
[null,"If taxable income is over—","but not over—",null,"Plus","the tax is:",null,null,"If taxable income is over—","but not over—",null,"Plus","the tax is:"]
[null,0,9075,0.1,0,"10% of the amount over $0",null,null,0,18150,0.1,0,"10% of the amount over $0"]
[null,9075,36900,0.15,{"$f":"LEFT(F5,FIND(\".\",F5)+2)","v":"$907.50"},"$907.50 plus 15% of the amount over $9,075",null,null,18150,73800,0.15,{"$f":"LEFT(M5,FIND(\",\",M5)+3)","v":"$1,815"},"$1,815 plus 15% of the amount over $18,150"]
[null,36900,89350,0.25,"$5,081.25","$5,081.25 plus 25% of the amount over $36,900",null,null,73800,148850,0.25,"$10,162","$10,162.50 plus 25% of the amount over $73,800"]
[null,89350,186350,0.28000000000000003,"$18,193.75","$18,193.75 plus 28% of the amount over $89,350",null,null,148850,226850,0.28000000000000003,"$28,925","$28,925 plus 28% of the amount over $148,850"]
[null,186350,405100,0.33,"$45,353.75","$45,353.75 plus 33% of the amount over $186,350",null,null,226850,405100,0.33,"$50,765","$50,765 plus 33% of the amount over $226,850"]
[null,405100,406750,0.35,"$117,541.25","$117,541.25 plus 35% of the amount over $405,100",null,null,405100,457600,0.35,"$109,587","$109,587.50 plus 35% of the amount over $405,100"]
[null,406750,"no limit",0.39600000000000002,"$118,118.75","$118,118.75 plus 39.6% of the amount over $406,750",null,null,457600,"no limit",0.39600000000000002,"$127,962","$127,962.50 plus 39.6% of the amount over $457,600"]
{"$rows_left_out":11}
{"sheet":"Deductions_Exemptions","index":12,"n_rows":10,"n_cols":3,"rows_kept":10,"cut":false,"hidden":true,"merged":[[2,0,2,2],[9,0,9,1],[3,0,3,1],[4,0,4,1],[5,0,5,1],[6,0,6,1]]}
[]
[]
["Standard Deduction"]
["Single",null,6200]
["Head of Household",null,9100]
["Married Filing Jointly",null,12400]
["Married Filing Separately",null,6200]
[]
[]
["Personal Exemption",null,3950]