{"text_format":"1","workbook":"xlsx","n_sheets":4,"sheets":["Dashboard","Industry Conditions","Courier Data","Raw Data"],"not_rendered":{"charts":1,"images":2,"macros":1,"external_links":0,"defined_names":6,"comments":0,"pivot_tables":0},"unopened":[],"bounds":{"document_bytes":16777216,"sheet_cells":100000,"rows_first":2000,"rows_last":500,"rows_between":2000,"halvings":0,"cell_chars":16384,"cell_head_chars":4096},"cells_cut":0,"cells_raw":0,"read":"whole","date_system":"1900"}

{"sheet":"Dashboard","index":0,"n_rows":34,"n_cols":29,"rows_kept":34,"cut":false,"hidden":false,"merged":[[2,16,2,17],[1,14,1,18],[0,14,0,24],[1,4,1,5],[1,6,1,7],[1,8,1,9],[1,10,1,11],[2,14,2,15],[1,21,1,23]]}
[null,null,null,null,null,null,null,null,null,null,null,null,null,null,"Estimates"]
["Date",{"$f":"DATE(YEAR(TODAY())+$B$7,12,31)","v":"2021-12-31"},null,"Month","Ideal",null,"Deviation",null,"Top L",null,"Bottom R",null,null,null,"Positioning",null,null,null,null,null,null,"Marketing",null,null,"Prod","Share","Sold","Surplus:",{"$f":"SUM(AB4:AB13)","v":14565}]
["Market Size:",{"$f":"INDEX('Industry Conditions'!$E$23:$I$23,1,MATCH(Dashboard!$B$8,'Industry Conditions'!$E$2:$I$2,0))","v":21713.678067879773},null,0,"P","S","P","S","P","S","P","   S",6,"Products","Current (P/S)",null,"Estimate (P/S)",null,"Date","MTBF","Age","Price","Aware","Access","Units","%","Units"]
["Percent Goal:",0.12,null,{"$f":"DATE(YEAR($B$2),MONTH($B$2)+1+$D$3,1)","v":"2022-01-01"},{"$f":"IdealPfmn","v":5.7416666666666671},{"$f":"IdealSize","v":14.258333333333335},{"$f":"Deviation()","v":0.45833314259846958},{"$f":"Deviation()","v":-0.45833314259847135},{"$f":"TopLPfm","v":4.7738997137002981},{"$f":"TopLSize","v":15.226100286299703},{"$f":"BotRPfmn","v":8.309433619633035},{"$f":"BotRSize","v":11.690566380366965},null,"Acre",4.5,15.5,6.1999998092651367,13.800000190734863,null,14000,8.3999996185302734,14.989999771118164,1,1,4300,0.10799319727891156,{"$f":"IF(Z4=0,\"\",ROUND(Z4*$B$3,0))","v":2345},{"$f":"IF(Y4<>\"\",IF(Y4<AA4,AA4-Y4,AA4),0)","v":2345}]
["Units Goal:",{"$f":"B3*B4","v":2605.6413681455729},null,{"$f":"DATE(YEAR(D4),MONTH(D4)+1,1)","v":"2022-02-01"},5.7833333333333332,14.216666666666667,{"$f":"Deviation()","v":0.4166664759318035},-0.4166664759318035,4.8155663803669642,15.184433619633035,8.351100286299701,11.648899713700297,null,"Bead",4.0999999046325684,16,6.1999998092651367,13.800000190734863,null,12000,9.8000001907348633,13.979999542236328,1,1,2142,7.7097505668934238E-2,{"$f":"IF(Z5=0,\"\",ROUND(Z5*$B$3,0))","v":1674},{"$f":"IF(Y5<>\"\",IF(Y5<AA5,AA5-Y5,AA5),0)","v":1674}]
["Ideal Position:",{"$f":"\"( \" & INDEX('Industry Conditions'!$E$19:$I$19,1,MATCH(Dashboard!$B$8,'Industry Conditions'!$E$2:$I$2,0)) & \", \" & INDEX('Industry Conditions'!$E$20:$I$20,1,MATCH(Dashboard!$B$8,'Industry Conditions'!$E$2:$I$2,0)) & \")\"","v":"( 5.7, 14.3)"},null,{"$f":"DATE(YEAR(D5),MONTH(D5)+1,1)","v":"2022-03-01"},5.8250000000000002,14.175000000000001,0.37499980926513654,-0.37499980926513743,4.8572330470336311,15.142766952966369,8.3927669529663689,11.607233047033631,null,"Cedar",5.6999998092651367,14.300000190734863,6.1999998092651367,13.800000190734863,null,15000,1.7999999523162842,16.489999771118164,1,1,2906,0.13520408163265307,2936,30]
["Round ",8,null,"2022-04-01",5.8666666666666671,14.133333333333335,0.33333314259846958,-0.33333314259847135,4.8988997137002981,15.101100286299703,8.434433619633035,11.565566380366965,null,"Dell",4.9000000953674316,15.100000381469727,6.1999998092651367,13.800000190734863,null,14000,5.0999999046325684,16.989999771118164,1,1,2434,0.1578798185941043,3428,994]
["Segment","Low",null,"2022-05-01",5.9083333333333332,14.091666666666667,0.2916664759318035,-0.2916664759318035,4.9405663803669642,15.059433619633035,8.476100286299701,11.523899713700297,null,"Ebb",5.5,14.5,6.1999998092651367,13.800000190734863,null,12500,5,18.489999771118164,1,1,1808,0.22789115646258504,4948,3140]
[{"$f":"INDEX('Industry Conditions'!$E$19:$I$20,1,MATCH($B$8,'Industry Conditions'!$E$2:$I$2,0))","v":5.7},{"$f":"INDEX('Industry Conditions'!$E$19:$I$20,2,MATCH($B$8,'Industry Conditions'!$E$2:$I$2,0))","v":14.3},null,"2022-06-01",5.95,14.05,0.24999980926513654,-0.24999980926513743,4.9822330470336311,15.017766952966369,8.5177669529663689,11.482233047033631,null,"Feat",5.6999998092651367,14.300000190734863,6.1999998092651367,13.800000190734863,null,12000,8.1000003814697266,12,1,1,8124,0.29393424036281179,6382,6382]
[null,null,null,"2022-07-01",5.9916666666666671,14.008333333333335,0.20833314259846958,-0.20833314259847135,5.0238997137002981,14.976100286299703,8.559433619633035,11.440566380366965,null,null,null,null,null,null,null,null,null,null,null,null,null,null,"",0]
{"$rows_left_out":25}
{"sheet":"Industry Conditions","index":1,"n_rows":23,"n_cols":9,"rows_kept":23,"cut":false,"hidden":false,"merged":[[10,1,11,2],[12,1,13,2],[14,1,15,2],[16,1,17,2],[1,1,1,2],[2,1,3,2],[4,1,5,2],[6,1,7,2],[8,1,9,2]]}
[]
[null,"Initial Conditions",null,"Segments","Trad","Low","High","Pfmn","Size"]
[null,"Starting Position",null,"Pfmn",5,2.5,7.5,8,3]
[null,null,null,"Size",15,17.5,12.5,17,12]
[null,"Drift",null,"Pfmn",0.7,0.5,0.9,1,0.7]
[null,null,null,"Size",-0.7,-0.5,-0.9,-0.7,-1]
[null,"Ideal Offset",null,"Pfmn",0,-0.8,1.4,1.4,1]
[null,null,null,"Size",0,0.8,-1.4,-1,-1.4]
[null,"Market Makeup",null,"Size",7387,8960,2554,1915,1984]
[null,null,null,"Growth",9.1999999999999998E-2,0.11700000000000001,0.16200000000000001,0.19800000000000001,0.183]
{"$rows_left_out":14}
{"sheet":"Courier Data","index":2,"n_rows":63,"n_cols":169,"rows_kept":63,"cut":false,"hidden":false,"merged":[]}
[]
[null,"Round 0",null,null,null,null,null,null,null,null,null,null,null,null,null,null,null,null,null,null,"Round 1",null,null,null,null,null,null,null,null,null,null,null,null,null,null,null,null,null,null,"Round 2",null,null,null,null,null,null,null,null,null,null,null,null,null,null,null,null,null,null,"Round 3",null,null,null,null,null,null,null,null,null,null,null,null,null,null,null,null,null,null,"Round 4",null,null,null,null,null,null,null,null,null,null,null,null,null,null,null,null,null,null,"Round 5",null,null,null,null,null,null,null,null,null,null,null,null,null,null,null,null,null,null,"Round 6",null,null,null,null,null,null,null,null,null,null,null,null,null,null,null,null,null,null,"Round 7",null,null,null,null,null,null,null,null,null,null,null,null,null,null,null,null,null,null,"Round 8"]
[null,"Financial Summary",null,null,null,null,null,null,null,null,null,null,null,null,null,null,null,null,null,null,"Financial Summary",null,null,null,null,null,null,null,null,null,null,null,null,null,null,null,null,null,null,"Financial Summary",null,null,null,null,null,null,null,null,null,null,null,null,null,null,null,null,null,null,"Financial Summary",null,null,null,null,null,null,null,null,null,null,null,null,null,null,null,null,null,null,"Financial Summary",null,null,null,null,null,null,null,null,null,null,null,null,null,null,null,null,null,null,"Financial Summary",null,null,null,null,null,null,null,null,null,null,null,null,null,null,null,null,null,null,"Financial Summary",null,null,null,null,null,null,null,null,null,null,null,null,null,null,null,null,null,null,"Financial Summary",null,null,null,null,null,null,null,null,null,null,null,null,null,null,null,null,null,null,"Financial Summary"]
[null,"Andrews","Baldwin","Chester","Digby","Erie","Ferris",null,null,null,null,null,null,null,null,null,null,null,null,null,"Andrews","Baldwin","Chester","Digby","Erie","Ferris",null,null,null,null,null,null,null,null,null,null,null,null,null,"Andrews","Baldwin","Chester","Digby","Erie","Ferris",null,null,null,null,null,null,null,null,null,null,null,null,null,"Andrews","Baldwin","Chester","Digby","Erie","Ferris",null,null,null,null,null,null,null,null,null,null,null,null,null,"Andrews","Baldwin","Chester","Digby","Erie","Ferris",null,null,null,null,null,null,null,null,null,null,null,null,null,"Andrews","Baldwin","Chester","Digby","Erie","Ferris",null,null,null,null,null,null,null,null,null,null,null,null,null,"Andrews","Baldwin","Chester","Digby","Erie","Ferris",null,null,null,null,null,null,null,null,null,null,null,null,null,"Andrews","Baldwin","Chester","Digby","Erie","Ferris",null,null,null,null,null,null,null,null,null,null,null,null,null,"Andrews","Baldwin","Chester","Digby","Erie","Ferris"]
["ROS",4.0999999046325684,4.0999999046325684,4.0999999046325684,4.0999999046325684,4.0999999046325684,4.0999999046325684,null,null,null,null,null,null,null,null,null,null,null,null,"ROS",-4.0999999046325684,-1,1.2000000476837158,-2.4000000953674316,-10.899999618530273,2.5999999046325684,null,null,null,null,null,null,null,null,null,null,null,null,"ROS",2.5999999046325684,-1.7999999523162842,1.2999999523162842,-2.5,-5.5999999046325684,1.6000000238418579,null,null,null,null,null,null,null,null,null,null,null,null,"ROS",0.69999998807907104,1.1000000238418579,0.80000001192092896,-3.0999999046325684,-6,0.30000001192092896,null,null,null,null,null,null,null,null,null,null,null,null,"ROS",2.0999999046325684,3.7999999523162842,3.5,-10.600000381469727,1.2000000476837158,1.2000000476837158,null,null,null,null,null,null,null,null,null,null,null,null,"ROS",6.5,7.9000000953674316,5.5999999046325684,1.2999999523162842,9,7.5999999046325684,null,null,null,null,null,null,null,null,null,null,null,null,"ROS",9.5,14.300000190734863,8.3999996185302734,4.9000000953674316,6.3000001907348633,7.4000000953674316,null,null,null,null,null,null,null,null,null,null,null,null,"ROS",11,12.699999809265137,8.6000003814697266,-1,6.0999999046325684,11.300000190734863,null,null,null,null,null,null,null,null,null,null,null,null,"ROS",16.399999618530273,11.199999809265137,9.5,9.1000003814697266,10.699999809265137,13.600000381469727]
["Asset Turnover",1.0499999523162842,1.0499999523162842,1.0499999523162842,1.0499999523162842,1.0499999523162842,1.0499999523162842,null,null,null,null,null,null,null,null,null,null,null,null,"Asset Turnover",0.79000002145767212,0.88999998569488525,1.0499999523162842,0.9100000262260437,0.94999998807907104,1.2000000476837158,null,null,null,null,null,null,null,null,null,null,null,null,"Asset Turnover",1.1200000047683716,0.76999998092651367,1.0199999809265137,0.81999999284744263,1.1599999666213989,1.0299999713897705,null,null,null,null,null,null,null,null,null,null,null,null,"Asset Turnover",1.1299999952316284,0.93999999761581421,1.2599999904632568,0.63999998569488525,1.2799999713897705,1.1699999570846558,null,null,null,null,null,null,null,null,null,null,null,null,"Asset Turnover",1.1299999952316284,1.059999942779541,1.309999942779541,0.56999999284744263,1.4800000190734863,1.2899999618530273,null,null,null,null,null,null,null,null,null,null,null,null,"Asset Turnover",1.2599999904632568,1.0399999618530273,1.3700000047683716,0.70999997854232788,1.75,1.3300000429153442,null,null,null,null,null,null,null,null,null,null,null,null,"Asset Turnover",1.1100000143051147,1.2799999713897705,1.2599999904632568,0.8399999737739563,1.6000000238418579,1.0700000524520874,null,null,null,null,null,null,null,null,null,null,null,null,"Asset Turnover",1.190000057220459,1.4199999570846558,1.4099999666213989,0.82999998331069946,1.9500000476837158,1.2699999809265137,null,null,null,null,null,null,null,null,null,null,null,null,"Asset Turnover",1.3999999761581421,1.3700000047683716,0.97000002861022949,0.81000000238418579,2.3199999332427979,1.5199999809265137]
["ROA",4.4000000953674316,4.4000000953674316,4.4000000953674316,4.4000000953674316,4.4000000953674316,4.4000000953674316,null,null,null,null,null,null,null,null,null,null,null,null,"ROA",-3.2999999523162842,-0.80000001192092896,1.2999999523162842,-2.2000000476837158,-10.399999618530273,3.2000000476837158,null,null,null,null,null,null,null,null,null,null,null,null,"ROA",3,-1.3999999761581421,1.3999999761581421,-2,-6.5,1.7000000476837158,null,null,null,null,null,null,null,null,null,null,null,null,"ROA",0.80000001192092896,1.1000000238418579,1,-2,-7.6999998092651367,0.40000000596046448,null,null,null,null,null,null,null,null,null,null,null,null,"ROA",2.4000000953674316,4.0999999046325684,4.5,-6.0999999046325684,1.7999999523162842,1.5,null,null,null,null,null,null,null,null,null,null,null,null,"ROA",8.1999998092651367,8.1999998092651367,7.6999998092651367,0.89999997615814209,15.800000190734863,10.199999809265137,null,null,null,null,null,null,null,null,null,null,null,null,"ROA",10.5,18.299999237060547,10.600000381469727,4.0999999046325684,10,7.9000000953674316,null,null,null,null,null,null,null,null,null,null,null,null,"ROA",13.100000381469727,18.100000381469727,12.100000381469727,-0.80000001192092896,11.899999618530273,14.300000190734863,null,null,null,null,null,null,null,null,null,null,null,null,"ROA",22.899999618530273,15.300000190734863,9.1999998092651367,7.4000000953674316,24.799999237060547,20.700000762939453]
["Assets/Equity",2,2,2,2,2,2,null,null,null,null,null,null,null,null,null,null,null,null,"Assets/Equity",2.2000000476837158,1.8999999761581421,1.8999999761581421,2.4000000953674316,2.9000000953674316,1.7999999523162842,null,null,null,null,null,null,null,null,null,null,null,null,"Assets/Equity",1.7999999523162842,1.7999999523162842,1.8999999761581421,2.5999999046325684,3.5999999046325684,1.7000000476837158,null,null,null,null,null,null,null,null,null,null,null,null,"Assets/Equity",1.6000000238418579,1.7000000476837158,1.7999999523162842,2.5,4.6999998092651367,1.7999999523162842,null,null,null,null,null,null,null,null,null,null,null,null,"Assets/Equity",1.6000000238418579,1.6000000238418579,1.7999999523162842,2.2000000476837158,4.3000001907348633,1.7999999523162842,null,null,null,null,null,null,null,null,null,null,null,null,"Assets/Equity",1.5,1.5,1.7000000476837158,1.6000000238418579,2.7000000476837158,1.5,null,null,null,null,null,null,null,null,null,null,null,null,"Assets/Equity",1.7000000476837158,1.2999999523162842,1.6000000238418579,1.2999999523162842,2.5999999046325684,1.7999999523162842,null,null,null,null,null,null,null,null,null,null,null,null,"Assets/Equity",1.7999999523162842,1.7999999523162842,1.3999999761581421,1.2999999523162842,1.8999999761581421,1.7999999523162842,null,null,null,null,null,null,null,null,null,null,null,null,"Assets/Equity",1.7999999523162842,1.8999999761581421,1.8999999761581421,1.3999999761581421,1.7000000476837158,1.8999999761581421]
["ROE",8.6999998092651367,8.6999998092651367,8.6999998092651367,8.6999998092651367,8.6999998092651367,8.6999998092651367,null,null,null,null,null,null,null,null,null,null,null,null,"ROE",-7.3000001907348633,-1.6000000238418579,2.4000000953674316,-5.0999999046325684,-29.899999618530273,5.8000001907348633,null,null,null,null,null,null,null,null,null,null,null,null,"ROE",5.3000001907348633,-2.5,2.5999999046325684,-5.1999998092651367,-23.399999618530273,2.9000000953674316,null,null,null,null,null,null,null,null,null,null,null,null,"ROE",1.2000000476837158,1.8999999761581421,1.7999999523162842,-5,-36.400001525878906,0.69999998807907104,null,null,null,null,null,null,null,null,null,null,null,null,"ROE",3.9000000953674316,6.6999998092651367,8.1000003814697266,-13.100000381469727,7.6999998092651367,2.7000000476837158,null,null,null,null,null,null,null,null,null,null,null,null,"ROE",12,12.399999618530273,12.899999618530273,1.5,42,15.5,null,null,null,null,null,null,null,null,null,null,null,null,"ROE",18.299999237060547,24.100000381469727,16.899999618530273,5.4000000953674316,25.899999618530273,14.199999809265137,null,null,null,null,null,null,null,null,null,null,null,null,"ROE",23.100000381469727,33.299999237060547,17.100000381469727,-1.1000000238418579,23.100000381469727,26.200000762939453,null,null,null,null,null,null,null,null,null,null,null,null,"ROE",41.099998474121094,28.799999237060547,17.200000762939453,10.699999809265137,43.099998474121094,38.299999237060547]
["Emergency Loan",0,0,0,0,0,0,null,null,null,null,null,null,null,null,null,null,null,null,"Emergency Loan",7538835,0,0,18525676,0,0,null,null,null,null,null,null,null,null,null,null,null,null,"Emergency Loan",0,1024920,0,5235145,0,0,null,null,null,null,null,null,null,null,null,null,null,null,"Emergency Loan",0,0,0,0,10319206,0,null,null,null,null,null,null,null,null,null,null,null,null,"Emergency Loan",0,0,1002546,0,0,0,null,null,null,null,null,null,null,null,null,null,null,null,"Emergency Loan",0,0,0,0,0,0,null,null,null,null,null,null,null,null,null,null,null,null,"Emergency Loan",0,0,0,0,0,0,null,null,null,null,null,null,null,null,null,null,null,null,"Emergency Loan",0,712215,25858318,0,0,0,null,null,null,null,null,null,null,null,null,null,null,null,"Emergency Loan",0,0,0,0,0,0]
{"$rows_left_out":54}
{"sheet":"Raw Data","index":3,"n_rows":757,"n_cols":9,"rows_kept":757,"cut":false,"hidden":false,"merged":[]}
[]
["C:\\Users\\bsa25\\SkyDrive\\Bryan\\School\\Winter 2013\\Isys 520\\Final Project\\Couriers\\CourierRound0.PDF","C:\\Users\\bsa25\\SkyDrive\\Bryan\\School\\Winter 2013\\Isys 520\\Final Project\\Couriers\\CourierRound1.PDF","C:\\Users\\bsa25\\SkyDrive\\Bryan\\School\\Winter 2013\\Isys 520\\Final Project\\Couriers\\CourierRound2.PDF","C:\\Users\\bsa25\\SkyDrive\\Bryan\\School\\Winter 2013\\Isys 520\\Final Project\\Couriers\\CourierRound3.PDF","C:\\Users\\bsa25\\SkyDrive\\Bryan\\School\\Winter 2013\\Isys 520\\Final Project\\Couriers\\CourierRound4.PDF","C:\\Users\\bsa25\\SkyDrive\\Bryan\\School\\Winter 2013\\Isys 520\\Final Project\\Couriers\\CourierRound5.PDF","C:\\Users\\bsa25\\SkyDrive\\Bryan\\School\\Winter 2013\\Isys 520\\Final Project\\Couriers\\CourierRound6.PDF","C:\\Users\\bsa25\\SkyDrive\\Bryan\\School\\Winter 2013\\Isys 520\\Final Project\\Couriers\\CourierRound7.PDF","C:\\Users\\bsa25\\SkyDrive\\Bryan\\School\\Winter 2013\\Isys 520\\Final Project\\Couriers\\CourierRound8.PDF"]
["Round: 0","Round: 1","Round: 2","Round: 3","Round: 4","Round: 5","Round: 6","Round: 7","Round: 8"]
["Dec. 31, 2013 C55132","Dec. 31, 2014 C55132","Dec. 31, 2015 C55132","Dec. 31, 2016 C55132","Dec. 31, 2017 C55132","Dec. 31, 2018 C55132","Dec. 31, 2019 C55132","Dec. 31, 2020 C55132","Dec. 31, 2021 C55132"]
["Andrews","Andrews","Andrews","Andrews","Andrews","Andrews","Andrews","Andrews","Andrews"]
["Alexa Holland","Alexa Holland","Alexa Holland","Alexa Holland","Alexa Holland","Alexa Holland","Alexa Holland","Alexa Holland","Alexa Holland"]
["Bradley Judd","Bradley Judd","Bradley Judd","Bradley Judd","Bradley Judd","Bradley Judd","Bradley Judd","Bradley Judd","Bradley Judd"]
["Briana Martinson","Briana Martinson","Briana Martinson","Briana Martinson","Briana Martinson","Briana Martinson","Briana Martinson","Briana Martinson","Briana Martinson"]
["Anna McKean","Anna McKean","Anna McKean","Anna McKean","Anna McKean","Anna McKean","Anna McKean","Anna McKean","Anna McKean"]
["Jacob Ricks","Jacob Ricks","Jacob Ricks","Jacob Ricks","Jacob Ricks","Jacob Ricks","Jacob Ricks","Jacob Ricks","Jacob Ricks"]
{"$rows_left_out":747}