{"text_format":"1","workbook":"xlsx","n_sheets":4,"sheets":["Shopping List","PriceList","FinalPriceList","ItemList"],"not_rendered":{"charts":0,"images":0,"macros":1,"external_links":0,"defined_names":24,"comments":0,"pivot_tables":0},"unopened":[],"bounds":{"document_bytes":16777216,"sheet_cells":100000,"rows_first":2000,"rows_last":500,"rows_between":2000,"halvings":0,"cell_chars":16384,"cell_head_chars":4096},"cells_cut":0,"cells_raw":0,"read":"whole","date_system":"1900"}

{"sheet":"Shopping List","index":0,"n_rows":250,"n_cols":27,"rows_kept":250,"cut":false,"hidden":false,"merged":[]}
["Shopping List"]
["Updated",{"$f":"NOW()","v":"2012-04-12T14:52:44.790"},"Deals:",null,{"$f":"COUNTA(D6:D185)","v":9},"Deals:",null,{"$f":"COUNTA(G6:G185)","v":0},"Deals:",null,{"$f":"COUNTA(J6:J185)","v":0},"Deals:",null,{"$f":"COUNTA(M6:M185)","v":6},"Deals:",null,{"$f":"COUNTA(P6:P185)","v":0},"Deals:",null,{"$f":"COUNTA(S6:S185)","v":5},"Deals:",null,{"$f":"COUNTA(V6:V185)","v":5},"Deals:",null,{"$f":"COUNTA(Y6:Y185)","v":5}]
[null,null,"Average Rating:",null,{"$f":"IFERROR(AVERAGE(D6:D185),0)","v":3.1111111111111112},"Average Rating:",null,{"$f":"IFERROR(AVERAGE(G6:G185),0)","v":0},"Average Rating:",null,{"$f":"IFERROR(AVERAGE(J6:J185),0)","v":0},"Average Rating:",null,{"$f":"IFERROR(AVERAGE(M6:M185),0)","v":3.5},"Average Rating:",null,{"$f":"IFERROR(AVERAGE(P6:P185),0)","v":0},"Average Rating:",null,{"$f":"IFERROR(AVERAGE(S6:S185),0)","v":3.6},"Average Rating:",null,{"$f":"IFERROR(AVERAGE(V6:V185),0)","v":3.2},"Average Rating:",null,{"$f":"IFERROR(AVERAGE(Y6:Y185),0)","v":3}]
[null,null,"Maceys",null,null,"Walmart",null,null,"Smiths",null,null,"Fresh Market",null,null,"Target",null,null,"Harmons",null,null,"Rite Aid",null,null,"Walgreens"]
["Grocery Item","Quantity/Details","Price","Rating","Coupon","Price","Rating","Coupon","Price","Rating","Coupon","Price","Rating","Coupon","Price","Rating","Coupon","Price","Rating","Coupon","Price","Rating","Coupon","Price","Rating","Coupon"]
["Advil Liqui-Gels 160ct",null,null,null,null," ",null,null," ",null,null," ",null,null," ",null,null," ",null,null,7.39,3,"Advil, any 20 ct. or larger $1/1 (06-30-12) RP-4/1"," ",null,null," "]
["Advil Tablets or Caplets 200ct",null,null,null,null," ",null,null," ",null,null," ",null,null," ",null,null," ",null,null,7.39,3,"http://coupons.redplum.com/GrocerySmarts/"," ",null,null," "]
["Aim Toothpaste, 4.8-6 oz. assorted",null,1,4,null," ",null,null," ",null,null,1,4,null," ",null,null," ",null,null," ",null,null," ",null,null," "]
["Air Wick Candles, 5.29-6.35 oz.",null,null,null,null," ",null,null," ",null,null," ",null,null," ",null,null," ",null,null," ",null,null," ",null,null," "]
["Allegra Allergy Relief, 30 ct. Tablets",null,7.99,3,"http://grocerysmarts.coupons.smartsource.com/Web/index.aspx?Link=235ZMFJDIS36M"," ",null,null," ",null,null," ",null,null," ",null,null," ",null,null," ",null,null," ",null,null," "]
["Always Panti-liners 64 Ct",null,null,null,null," ",null,null," ",null,null," ",null,null," ",null,null," ",null,null,1.49,4,"Always Pantiliners, 30 ct. or higher .50/1 (04-30-12) PG-4/1"," ",null,null," "]
["Apples, Fuji, organic",null,null,null,null," ",null,null," ",null,null," ",null,null," ",null,null," ",null,null," ",null,null," ",null,null," "]
["Apples",null,null,null,null," ",null,null," ",null,null," ",null,null," ",null,null,"1.78 lb",3,null," ",null,null," ",null,null," "]
["Asparagus",null,null,null,null," ",null,null," ",null,null," ",null,null," ",null,null," ",null,null," ",null,null," ",null,null," "]
["Avocados, large",null,null,null,null," ",null,null," ",null,null," ",null,null," ",null,null,1.5,3,null," ",null,null," ",null,null," "]
["Ball Park Beef Franks, 14-16 oz",null,null,null,null," ",null,null," ",null,null," ",null,null," ",null,null," ",null,null," ",null,null," ",null,null," "]
["Bananas",null,7.99,3,null," ",null,null," ",null,null," ",null,null," ",null,null," ",null,null," ",null,null," ",null,null," "]
["Bayer Pain Relievers 100 ct",null,null,null,null," ",null,null," ",null,null," ",null,null," ",null,null," ",null,null,"3.00 ea",3,"Bayer Aspirin Product, any 20ct or larger $1/1 (04-30-12) SS-1/29 AND (06-30-12) SS-3/18"," ",null,null," "]
["Beef - Albertsons Petite Sirloin or Tri-Tip Steak, boneless max pak",null,null,null,null," ",null,null," ",null,null," ",null,null," ",null,null," ",null,null," ",null,null," ",null,null," "]
["Beef - Chuck Roast, boneless",null,null,null,null," ",null,null," ",null,null,"2.99 lb",3,null," ",null,null," ",null,null," ",null,null," ",null,null," "]
["Bell Peppers, Green",null,".50 ea",3,null," ",null,null," ",null,null,".50 ea",3,null," ",null,null," ",null,null," ",null,null," ",null,null," "]
["Broccoli",null,13.99,3,null," ",null,null," ",null,null,".69 lb",5,null," ",null,null,".68 lb",5,null," ",null,null," ",null,null," "]
["Celery",null,".89 ea",3,null," ",null,null," ",null,null," ",null,null," ",null,null,1.98,3,null," ",null,null," ",null,null," "]
["Cheese",null,13.99,3,"http://grocerysmarts.coupons.smartsource.com/Web/index.aspx?Link=235ZMFJDIS36M"," ",null,null," ",null,null,9.99,3,null," ",null,null,"1.17 ea",4,"http://grocerysmarts.coupons.smartsource.com/Web/index.aspx?Link=235ZMFJDIS36M"," ",null,null," ",null,null," "]
["Allegra Allergy Relief, 30 ct. Tablets",null,7.99,3,"http://grocerysmarts.coupons.smartsource.com/Web/index.aspx?Link=235ZMFJDIS36M"," ",null,null," ",null,null," ",null,null," ",null,null," ",null,null," ",null,null," ",null,null," "]
["Diapers",null,8.99,3,"Huggies Diapers, any $1/1 (EXPIRES 04-14-12) SS-3/18"," ",null,null," ",null,null,8.99,3,"Huggies Diapers, any $1/1 (EXPIRES 04-14-12) SS-3/18"," ",null,null," ",null,null,5,3,"Also Qualifies for Single Check Rebate $3 When You Buy 2.",5.99,3,null," "]
["Pampers",null,null,null,null," ",null,null," ",null,null," ",null,null," ",null,null," ",null,null," ",null,null,5.24,3,"http://print.coupons.com/alink.asp?go=12812dl8910"," "]
["Pampers Cruisers 20 ct",null,null,null,null," ",null,null," ",null,null," ",null,null," ",null,null," ",null,null," ",null,null," ",null,null," "]
["Pampers Cruisers Super Pack Diapers",null,null,null,null," ",null,null," ",null,null," ",null,null," ",null,null," ",null,null," ",null,null,23.99,3,"Pampers Diapers or Pants $1/2 Bags or (1) Box, excludes trial/travel size (04-30-12) PG-4/1"," "]
["Pampers Swaddlers 76 ct",null,null,null,null," ",null,null," ",null,null," ",null,null," ",null,null," ",null,null," ",null,null," ",null,null," "]
["Pampers Wipes 192 or 216 pk",null,null,null,null," ",null,null," ",null,null," ",null,null," ",null,null," ",null,null," ",null,null,5.24,3,"http://print.coupons.com/alink.asp?go=12812dl8910"," "]
["Pampers Wipes 72 ct",null,null,null,null," ",null,null," ",null,null," ",null,null," ",null,null," ",null,null," ",null,null," ",null,null," "]
["Pampers",null,null,null,null," ",null,null," ",null,null," ",null,null," ",null,null," ",null,null," ",null,null,5.24,3,"http://print.coupons.com/alink.asp?go=12812dl8910"," "]
[null,null,null,null,null," ",null,null," ",null,null," ",null,null," ",null,null," ",null,null," ",null,null," ",null,null," "]
[null,null,null,null,null," ",null,null," ",null,null," ",null,null," ",null,null," ",null,null," ",null,null," ",null,null," "]
[null,null,null,null,null," ",null,null," ",null,null," ",null,null," ",null,null," ",null,null," ",null,null," ",null,null," "]
[null,null,null,null,null," ",null,null," ",null,null," ",null,null," ",null,null," ",null,null," ",null,null," ",null,null," "]
[null,null,null,null,null," ",null,null," ",null,null," ",null,null," ",null,null," ",null,null," ",null,null," ",null,null," "]
[null,null,null,null,null," ",null,null," ",null,null," ",null,null," ",null,null," ",null,null," ",null,null," ",null,null," "]
[null,null,null,null,null," ",null,null," ",null,null," ",null,null," ",null,null," ",null,null," ",null,null," ",null,null," "]
[null,null,null,null,null," ",null,null," ",null,null," ",null,null," ",null,null," ",null,null," ",null,null," ",null,null," "]
[null,null,null,null,null," ",null,null," ",null,null," ",null,null," ",null,null," ",null,null," ",null,null," ",null,null," "]
[null,null,null,null,null," ",null,null," ",null,null," ",null,null," ",null,null," ",null,null," ",null,null," ",null,null," "]
[null,null,null,null,null," ",null,null," ",null,null," ",null,null," ",null,null," ",null,null," ",null,null," ",null,null," "]
[null,null,null,null,null," ",null,null," ",null,null," ",null,null," ",null,null," ",null,null," ",null,null," ",null,null," "]
[null,null,null,null,null," ",null,null," ",null,null," ",null,null," ",null,null," ",null,null," ",null,null," ",null,null," "]
[null,null,null,null,null," ",null,null," ",null,null," ",null,null," ",null,null," ",null,null," ",null,null," ",null,null," "]
[null,null,null,null,null," ",null,null," ",null,null," ",null,null," ",null,null," ",null,null," ",null,null," ",null,null," "]
[null,null,null,null,null," ",null,null," ",null,null," ",null,null," ",null,null," ",null,null," ",null,null," ",null,null," "]
[null,null,null,null,null," ",null,null," ",null,null," ",null,null," ",null,null," ",null,null," ",null,null," ",null,null," "]
[null,null,null,null,null," ",null,null," ",null,null," ",null,null," ",null,null," ",null,null," ",null,null," ",null,null," "]
[null,null,null,null,null," ",null,null," ",null,null," ",null,null," ",null,null," ",null,null," ",null,null," ",null,null," "]
[null,null,null,null,null," ",null,null," ",null,null," ",null,null," ",null,null," ",null,null," ",null,null," ",null,null," "]
[null,null,null,null,null," ",null,null," ",null,null," ",null,null," ",null,null," ",null,null," ",null,null," ",null,null," "]
[null,null,null,null,null," ",null,null," ",null,null," ",null,null," ",null,null," ",null,null," ",null,null," ",null,null," "]
[null,null,null,null,null," ",null,null," ",null,null," ",null,null," ",null,null," ",null,null," ",null,null," ",null,null," "]
[null,null,null,null,null," ",null,null," ",null,null," ",null,null," ",null,null," ",null,null," ",null,null," ",null,null," "]
[null,null,null,null,null," ",null,null," ",null,null," ",null,null," ",null,null," ",null,null," ",null,null," ",null,null," "]
[null,null,null,null,null," ",null,null," ",null,null," ",null,null," ",null,null," ",null,null," ",null,null," ",null,null," "]
[null,null,null,null,null," ",null,null," ",null,null," ",null,null," ",null,null," ",null,null," ",null,null," ",null,null," "]
[null,null,null,null,null," ",null,null," ",null,null," ",null,null," ",null,null," ",null,null," ",null,null," ",null,null," "]
[null,null,null,null,null," ",null,null," ",null,null," ",null,null," ",null,null," ",null,null," ",null,null," ",null,null," "]
[null,null,null,null,null," ",null,null," ",null,null," ",null,null," ",null,null," ",null,null," ",null,null," ",null,null," "]
[null,null,null,null,null," ",null,null," ",null,null," ",null,null," ",null,null," ",null,null," ",null,null," ",null,null," "]
[null,null,null,null,null," ",null,null," ",null,null," ",null,null," ",null,null," ",null,null," ",null,null," ",null,null," "]
[null,null,null,null,null," ",null,null," ",null,null," ",null,null," ",null,null," ",null,null," ",null,null," ",null,null," "]
[null,null,null,null,null," ",null,null," ",null,null," ",null,null," ",null,null," ",null,null," ",null,null," ",null,null," "]
[null,null,null,null,null," ",null,null," ",null,null," ",null,null," ",null,null," ",null,null," ",null,null," ",null,null," "]
[null,null,null,null,null," ",null,null," ",null,null," ",null,null," ",null,null," ",null,null," ",null,null," ",null,null," "]
[null,null,null,null,null," ",null,null," ",null,null," ",null,null," ",null,null," ",null,null," ",null,null," ",null,null," "]
[null,null,null,null,null," ",null,null," ",null,null," ",null,null," ",null,null," ",null,null," ",null,null," ",null,null," "]
[null,null,null,null,null," ",null,null," ",null,null," ",null,null," ",null,null," ",null,null," ",null,null," ",null,null," "]
[null,null,null,null,null," ",null,null," ",null,null," ",null,null," ",null,null," ",null,null," ",null,null," ",null,null," "]
[null,null,null,null,null," ",null,null," ",null,null," ",null,null," ",null,null," ",null,null," ",null,null," ",null,null," "]
[null,null,null,null,null," ",null,null," ",null,null," ",null,null," ",null,null," ",null,null," ",null,null," ",null,null," "]
[null,null,null,null,null," ",null,null," ",null,null," ",null,null," ",null,null," ",null,null," ",null,null," ",null,null," "]
[null,null,null,null,null," ",null,null," ",null,null," ",null,null," ",null,null," ",null,null," ",null,null," ",null,null," "]
[null,null,null,null,null," ",null,null," ",null,null," ",null,null," ",null,null," ",null,null," ",null,null," ",null,null," "]
[null,null,null,null,null," ",null,null," ",null,null," ",null,null," ",null,null," ",null,null," ",null,null," ",null,null," "]
[null,null,null,null,null," ",null,null," ",null,null," ",null,null," ",null,null," ",null,null," ",null,null," ",null,null," "]
[null,null,null,null,null," ",null,null," ",null,null," ",null,null," ",null,null," ",null,null," ",null,null," ",null,null," "]
[null,null,null,null,null," ",null,null," ",null,null," ",null,null," ",null,null," ",null,null," ",null,null," ",null,null," "]
[null,null,null,null,null," ",null,null," ",null,null," ",null,null," ",null,null," ",null,null," ",null,null," ",null,null," "]
[null,null,null,null,null," ",null,null," ",null,null," ",null,null," ",null,null," ",null,null," ",null,null," ",null,null," "]
[null,null,null,null,null," ",null,null," ",null,null," ",null,null," ",null,null," ",null,null," ",null,null," ",null,null," "]
[null,null,null,null,null," ",null,null," ",null,null," ",null,null," ",null,null," ",null,null," ",null,null," ",null,null," "]
[null,null,null,null,null," ",null,null," ",null,null," ",null,null," ",null,null," ",null,null," ",null,null," ",null,null," "]
[null,null,null,null,null," ",null,null," ",null,null," ",null,null," ",null,null," ",null,null," ",null,null," ",null,null," "]
[null,null,null,null,null," ",null,null," ",null,null," ",null,null," ",null,null," ",null,null," ",null,null," ",null,null," "]
[null,null,null,null,null," ",null,null," ",null,null," ",null,null," ",null,null," ",null,null," ",null,null," ",null,null," "]
[null,null,null,null,null," ",null,null," ",null,null," ",null,null," ",null,null," ",null,null," ",null,null," ",null,null," "]
[null,null,null,null,null," ",null,null," ",null,null," ",null,null," ",null,null," ",null,null," ",null,null," ",null,null," "]
[null,null,null,null,null," ",null,null," ",null,null," ",null,null," ",null,null," ",null,null," ",null,null," ",null,null," "]
[null,null,null,null,null," ",null,null," ",null,null," ",null,null," ",null,null," ",null,null," ",null,null," ",null,null," "]
[null,null,null,null,null," ",null,null," ",null,null," ",null,null," ",null,null," ",null,null," ",null,null," ",null,null," "]
[null,null,null,null,null," ",null,null," ",null,null," ",null,null," ",null,null," ",null,null," ",null,null," ",null,null," "]
[null,null,null,null,null," ",null,null," ",null,null," ",null,null," ",null,null," ",null,null," ",null,null," ",null,null," "]
[null,null,null,null,null," ",null,null," ",null,null," ",null,null," ",null,null," ",null,null," ",null,null," ",null,null," "]
[null,null,null,null,null," ",null,null," ",null,null," ",null,null," ",null,null," ",null,null," ",null,null," ",null,null," "]
[null,null,null,null,null," ",null,null," ",null,null," ",null,null," ",null,null," ",null,null," ",null,null," ",null,null," "]
[null,null,null,null,null," ",null,null," ",null,null," ",null,null," ",null,null," ",null,null," ",null,null," ",null,null," "]
[null,null,null,null,null," ",null,null," ",null,null," ",null,null," ",null,null," ",null,null," ",null,null," ",null,null," "]
[null,null,null,null,null," ",null,null," ",null,null," ",null,null," ",null,null," ",null,null," ",null,null," ",null,null," "]
[null,null,null,null,null," ",null,null," ",null,null," ",null,null," ",null,null," ",null,null," ",null,null," ",null,null," "]
[null,null,null,null,null," ",null,null," ",null,null," ",null,null," ",null,null," ",null,null," ",null,null," ",null,null," "]
[null,null,null,null,null," ",null,null," ",null,null," ",null,null," ",null,null," ",null,null," ",null,null," ",null,null," "]
[null,null,null,null,null," ",null,null," ",null,null," ",null,null," ",null,null," ",null,null," ",null,null," ",null,null," "]
[null,null,null,null,null," ",null,null," ",null,null," ",null,null," ",null,null," ",null,null," ",null,null," ",null,null," "]
[null,null,null,null,null," ",null,null," ",null,null," ",null,null," ",null,null," ",null,null," ",null,null," ",null,null," "]
[null,null,null,null,null," ",null,null," ",null,null," ",null,null," ",null,null," ",null,null," ",null,null," ",null,null," "]
[null,null,null,null,null," ",null,null," ",null,null," ",null,null," ",null,null," ",null,null," ",null,null," ",null,null," "]
[null,null,null,null,null," ",null,null," ",null,null," ",null,null," ",null,null," ",null,null," ",null,null," ",null,null," "]
[null,null,null,null,null," ",null,null," ",null,null," ",null,null," ",null,null," ",null,null," ",null,null," ",null,null," "]
[null,null,null,null,null," ",null,null," ",null,null," ",null,null," ",null,null," ",null,null," ",null,null," ",null,null," "]
[null,null,null,null,null," ",null,null," ",null,null," ",null,null," ",null,null," ",null,null," ",null,null," ",null,null," "]
[null,null,null,null,null," ",null,null," ",null,null," ",null,null," ",null,null," ",null,null," ",null,null," ",null,null," "]
[null,null,null,null,null," ",null,null," ",null,null," ",null,null," ",null,null," ",null,null," ",null,null," ",null,null," "]
[null,null,null,null,null," ",null,null," ",null,null," ",null,null," ",null,null," ",null,null," ",null,null," ",null,null," "]
[null,null,null,null,null," ",null,null," ",null,null," ",null,null," ",null,null," ",null,null," ",null,null," ",null,null," "]
[null,null,null,null,null," ",null,null," ",null,null," ",null,null," ",null,null," ",null,null," ",null,null," ",null,null," "]
[null,null,null,null,null," ",null,null," ",null,null," ",null,null," ",null,null," ",null,null," ",null,null," ",null,null," "]
[null,null,null,null,null," ",null,null," ",null,null," ",null,null," ",null,null," ",null,null," ",null,null," ",null,null," "]
[null,null,null,null,null," ",null,null," ",null,null," ",null,null," ",null,null," ",null,null," ",null,null," ",null,null," "]
[null,null,null,null,null," ",null,null," ",null,null," ",null,null," ",null,null," ",null,null," ",null,null," ",null,null," "]
[null,null,null,null,null," ",null,null," ",null,null," ",null,null," ",null,null," ",null,null," ",null,null," ",null,null," "]
[null,null,null,null,null," ",null,null," ",null,null," ",null,null," ",null,null," ",null,null," ",null,null," ",null,null," "]
[null,null,null,null,null," ",null,null," ",null,null," ",null,null," ",null,null," ",null,null," ",null,null," ",null,null," "]
[null,null,null,null,null," ",null,null," ",null,null," ",null,null," ",null,null," ",null,null," ",null,null," ",null,null," "]
[null,null,null,null,null," ",null,null," ",null,null," ",null,null," ",null,null," ",null,null," ",null,null," ",null,null," "]
[null,null,null,null,null," ",null,null," ",null,null," ",null,null," ",null,null," ",null,null," ",null,null," ",null,null," "]
[null,null,null,null,null," ",null,null," ",null,null," ",null,null," ",null,null," ",null,null," ",null,null," ",null,null," "]
[null,null,null,null,null," ",null,null," ",null,null," ",null,null," ",null,null," ",null,null," ",null,null," ",null,null," "]
[null,null,null,null,null," ",null,null," ",null,null," ",null,null," ",null,null," ",null,null," ",null,null," ",null,null," "]
[null,null,null,null,null," ",null,null," ",null,null," ",null,null," ",null,null," ",null,null," ",null,null," ",null,null," "]
[null,null,null,null,null," ",null,null," ",null,null," ",null,null," ",null,null," ",null,null," ",null,null," ",null,null," "]
[null,null,null,null,null," ",null,null," ",null,null," ",null,null," ",null,null," ",null,null," ",null,null," ",null,null," "]
[null,null,null,null,null," ",null,null," ",null,null," ",null,null," ",null,null," ",null,null," ",null,null," ",null,null," "]
[null,null,null,null,null," ",null,null," ",null,null," ",null,null," ",null,null," ",null,null," ",null,null," ",null,null," "]
[null,null,null,null,null," ",null,null," ",null,null," ",null,null," ",null,null," ",null,null," ",null,null," ",null,null," "]
[null,null,null,null,null," ",null,null," ",null,null," ",null,null," ",null,null," ",null,null," ",null,null," ",null,null," "]
[null,null,null,null,null," ",null,null," ",null,null," ",null,null," ",null,null," ",null,null," ",null,null," ",null,null," "]
[null,null,null,null,null," ",null,null," ",null,null," ",null,null," ",null,null," ",null,null," ",null,null," ",null,null," "]
[null,null,null,null,null," ",null,null," ",null,null," ",null,null," ",null,null," ",null,null," ",null,null," ",null,null," "]
[null,null,null,null,null," ",null,null," ",null,null," ",null,null," ",null,null," ",null,null," ",null,null," ",null,null," "]
[null,null,null,null,null," ",null,null," ",null,null," ",null,null," ",null,null," ",null,null," ",null,null," ",null,null," "]
[null,null,null,null,null," ",null,null," ",null,null," ",null,null," ",null,null," ",null,null," ",null,null," ",null,null," "]
[null,null,null,null,null," ",null,null," ",null,null," ",null,null," ",null,null," ",null,null," ",null,null," ",null,null," "]
[null,null,null,null,null," ",null,null," ",null,null," ",null,null," ",null,null," ",null,null," ",null,null," ",null,null," "]
[null,null,null,null,null," ",null,null," ",null,null," ",null,null," ",null,null," ",null,null," ",null,null," ",null,null," "]
[null,null,null,null,null," ",null,null," ",null,null," ",null,null," ",null,null," ",null,null," ",null,null," ",null,null," "]
[null,null,null,null,null," ",null,null," ",null,null," ",null,null," ",null,null," ",null,null," ",null,null," ",null,null," "]
[null,null,null,null,null," ",null,null," ",null,null," ",null,null," ",null,null," ",null,null," ",null,null," ",null,null," "]
[null,null,null,null,null," ",null,null," ",null,null," ",null,null," ",null,null," ",null,null," ",null,null," ",null,null," "]
[null,null,null,null,null," ",null,null," ",null,null," ",null,null," ",null,null," ",null,null," ",null,null," ",null,null," "]
[null,null,null,null,null," ",null,null," ",null,null," ",null,null," ",null,null," ",null,null," ",null,null," ",null,null," "]
[null,null,null,null,null," ",null,null," ",null,null," ",null,null," ",null,null," ",null,null," ",null,null," ",null,null," "]
[null,null,null,null,null," ",null,null," ",null,null," ",null,null," ",null,null," ",null,null," ",null,null," ",null,null," "]
[null,null,null,null,null," ",null,null," ",null,null," ",null,null," ",null,null," ",null,null," ",null,null," ",null,null," "]
[null,null,null,null,null," ",null,null," ",null,null," ",null,null," ",null,null," ",null,null," ",null,null," ",null,null," "]
[null,null,null,null,null," ",null,null," ",null,null," ",null,null," ",null,null," ",null,null," ",null,null," ",null,null," "]
[null,null,null,null,null," ",null,null," ",null,null," ",null,null," ",null,null," ",null,null," ",null,null," ",null,null," "]
[null,null,null,null,null," ",null,null," ",null,null," ",null,null," ",null,null," ",null,null," ",null,null," ",null,null," "]
[null,null,null,null,null," ",null,null," ",null,null," ",null,null," ",null,null," ",null,null," ",null,null," ",null,null," "]
[null,null,null,null,null," ",null,null," ",null,null," ",null,null," ",null,null," ",null,null," ",null,null," ",null,null," "]
[null,null,null,null,null," ",null,null," ",null,null," ",null,null," ",null,null," ",null,null," ",null,null," ",null,null," "]
[null,null,null,null,null," ",null,null," ",null,null," ",null,null," ",null,null," ",null,null," ",null,null," ",null,null," "]
[null,null,null,null,null," ",null,null," ",null,null," ",null,null," ",null,null," ",null,null," ",null,null," ",null,null," "]
[null,null,null,null,null," ",null,null," ",null,null," ",null,null," ",null,null," ",null,null," ",null,null," ",null,null," "]
[null,null,null,null,null," ",null,null," ",null,null," ",null,null," ",null,null," ",null,null," ",null,null," ",null,null," "]
[null,null,null,null,null," ",null,null," ",null,null," ",null,null," ",null,null," ",null,null," ",null,null," ",null,null," "]
[null,null,null,null,null," ",null,null," ",null,null," ",null,null," ",null,null," ",null,null," ",null,null," ",null,null," "]
[null,null,null,null,null," ",null,null," ",null,null," ",null,null," ",null,null," ",null,null," ",null,null," ",null,null," "]
[null,null,null,null,null," ",null,null," ",null,null," ",null,null," ",null,null," ",null,null," ",null,null," ",null,null," "]
[null,null,null,null,null," ",null,null," ",null,null," ",null,null," ",null,null," ",null,null," ",null,null," ",null,null," "]
[null,null,null,null,null," ",null,null," ",null,null," ",null,null," ",null,null," ",null,null," ",null,null," ",null,null," "]
[null,null,null,null,null," ",null,null," ",null,null," ",null,null," ",null,null," ",null,null," ",null,null," ",null,null," "]
[null,null,null,null,null," ",null,null," ",null,null," ",null,null," ",null,null," ",null,null," ",null,null," ",null,null," "]
[null,null,null,null,null," ",null,null," ",null,null," ",null,null," ",null,null," ",null,null," ",null,null," ",null,null," "]
[null,null,null,null,null," ",null,null," ",null,null," ",null,null," ",null,null," ",null,null," ",null,null," ",null,null," "]
[null,null,null,null,null," ",null,null," ",null,null," ",null,null," ",null,null," ",null,null," ",null,null," ",null,null," "]
[null,null,null,null,null," ",null,null," ",null,null," ",null,null," ",null,null," ",null,null," ",null,null," ",null,null," "]
[null,null,null,null,null," ",null,null," ",null,null," ",null,null," ",null,null," ",null,null," ",null,null," ",null,null," "]
[null,null,null,null,null," ",null,null," ",null,null," ",null,null," ",null,null," ",null,null," ",null,null," ",null,null," "]
[null,null,null,null,null," ",null,null," ",null,null," ",null,null," ",null,null," ",null,null," ",null,null," ",null,null," "]
[null,null,null,null,null," ",null,null," ",null,null," ",null,null," ",null,null," ",null,null," ",null,null," ",null,null," "]
[null,null,null,null,null," ",null,null," ",null,null," ",null,null," ",null,null," ",null,null," ",null,null," ",null,null," "]
[null,null,null,null,null," ",null,null," ",null,null," ",null,null," ",null,null," ",null,null," ",null,null," ",null,null," "]
[null,null,null,null,null," ",null,null," ",null,null," ",null,null," ",null,null," ",null,null," ",null,null," ",null,null," "]
[null,null,null,null,null,null,null,null,null,null,null,null,null,null,null,null,null,null,null,null,null,null,null,null,null,null," "]
[null,null,null,null,null,null,null,null,null,null,null,null,null,null,null,null,null,null,null,null,null,null,null,null,null,null," "]
[null,null,null,null,null,null,null,null,null,null,null,null,null,null,null,null,null,null,null,null,null,null,null,null,null,null," "]
[null,null,null,null,null,null,null,null,null,null,null,null,null,null,null,null,null,null,null,null,null,null,null,null,null,null," "]
[null,null,null,null,null,null,null,null,null,null,null,null,null,null,null,null,null,null,null,null,null,null,null,null,null,null," "]
[null,null,null,null,null,null,null,null,null,null,null,null,null,null,null,null,null,null,null,null,null,null,null,null,null,null," "]
[null,null,null,null,null,null,null,null,null,null,null,null,null,null,null,null,null,null,null,null,null,null,null,null,null,null," "]
[null,null,null,null,null,null,null,null,null,null,null,null,null,null,null,null,null,null,null,null,null,null,null,null,null,null," "]
[null,null,null,null,null,null,null,null,null,null,null,null,null,null,null,null,null,null,null,null,null,null,null,null,null,null," "]
[null,null,null,null,null,null,null,null,null,null,null,null,null,null,null,null,null,null,null,null,null,null,null,null,null,null," "]
[null,null,null,null,null,null,null,null,null,null,null,null,null,null,null,null,null,null,null,null,null,null,null,null,null,null," "]
[null,null,null,null,null,null,null,null,null,null,null,null,null,null,null,null,null,null,null,null,null,null,null,null,null,null," "]
[null,null,null,null,null,null,null,null,null,null,null,null,null,null,null,null,null,null,null,null,null,null,null,null,null,null," "]
[null,null,null,null,null,null,null,null,null,null,null,null,null,null,null,null,null,null,null,null,null,null,null,null,null,null," "]
[null,null,null,null,null,null,null,null,null,null,null,null,null,null,null,null,null,null,null,null,null,null,null,null,null,null," "]
[null,null,null,null,null,null,null,null,null,null,null,null,null,null,null,null,null,null,null,null,null,null,null,null,null,null," "]
[null,null,null,null,null,null,null,null,null,null,null,null,null,null,null,null,null,null,null,null,null,null,null,null,null,null," "]
[null,null,null,null,null,null,null,null,null,null,null,null,null,null,null,null,null,null,null,null,null,null,null,null,null,null," "]
[null,null,null,null,null,null,null,null,null,null,null,null,null,null,null,null,null,null,null,null,null,null,null,null,null,null," "]
[null,null,null,null,null,null,null,null,null,null,null,null,null,null,null,null,null,null,null,null,null,null,null,null,null,null," "]
[null,null,null,null,null,null,null,null,null,null,null,null,null,null,null,null,null,null,null,null,null,null,null,null,null,null," "]
[null,null,null,null,null,null,null,null,null,null,null,null,null,null,null,null,null,null,null,null,null,null,null,null,null,null," "]
[null,null,null,null,null,null,null,null,null,null,null,null,null,null,null,null,null,null,null,null,null,null,null,null,null,null," "]
[null,null,null,null,null,null,null,null,null,null,null,null,null,null,null,null,null,null,null,null,null,null,null,null,null,null," "]
[null,null,null,null,null,null,null,null,null,null,null,null,null,null,null,null,null,null,null,null,null,null,null,null,null,null," "]
[null,null,null,null,null,null,null,null,null,null,null,null,null,null,null,null,null,null,null,null,null,null,null,null,null,null," "]
[null,null,null,null,null,null,null,null,null,null,null,null,null,null,null,null,null,null,null,null,null,null,null,null,null,null," "]
[null,null,null,null,null,null,null,null,null,null,null,null,null,null,null,null,null,null,null,null,null,null,null,null,null,null," "]
[null,null,null,null,null,null,null,null,null,null,null,null,null,null,null,null,null,null,null,null,null,null,null,null,null,null," "]
[null,null,null,null,null,null,null,null,null,null,null,null,null,null,null,null,null,null,null,null,null,null,null,null,null,null," "]
[null,null,null,null,null,null,null,null,null,null,null,null,null,null,null,null,null,null,null,null,null,null,null,null,null,null," "]
[null,null,null,null,null,null,null,null,null,null,null,null,null,null,null,null,null,null,null,null,null,null,null,null,null,null," "]
[null,null,null,null,null,null,null,null,null,null,null,null,null,null,null,null,null,null,null,null,null,null,null,null,null,null," "]
[null,null,null,null,null,null,null,null,null,null,null,null,null,null,null,null,null,null,null,null,null,null,null,null,null,null," "]
[null,null,null,null,null,null,null,null,null,null,null,null,null,null,null,null,null,null,null,null,null,null,null,null,null,null," "]
[null,null,null,null,null,null,null,null,null,null,null,null,null,null,null,null,null,null,null,null,null,null,null,null,null,null," "]
[null,null,null,null,null,null,null,null,null,null,null,null,null,null,null,null,null,null,null,null,null,null,null,null,null,null," "]
[null,null,null,null,null,null,null,null,null,null,null,null,null,null,null,null,null,null,null,null,null,null,null,null,null,null," "]
[null,null,null,null,null,null,null,null,null,null,null,null,null,null,null,null,null,null,null,null,null,null,null,null,null,null," "]
[null,null,null,null,null,null,null,null,null,null,null,null,null,null,null,null,null,null,null,null,null,null,null,null,null,null," "]
[null,null,null,null,null,null,null,null,null,null,null,null,null,null,null,null,null,null,null,null,null,null,null,null,null,null," "]
[null,null,null,null,null,null,null,null,null,null,null,null,null,null,null,null,null,null,null,null,null,null,null,null,null,null," "]
[null,null,null,null,null,null,null,null,null,null,null,null,null,null,null,null,null,null,null,null,null,null,null,null,null,null," "]
[]
[]
[]
[]
[]
[]
[]
[]
[]
[]
[]
[]
[]
[]
[null,null,null,null,null,null,null,null,null,null,null,null,null,null,null,null,null,null,null,null,null,null,null,null,null,null," "]
[null,null,null,null,null,null,null,null,null,null,null,null,null,null,null,null,null,null,null,null,null,null,null,null,null,null," "]
[null,null,null,null,null,null,null,null,null,null,null,null,null,null,null,null,null,null,null,null,null,null,null,null,null,null," "]
[null,null,null,null,null,null,null,null,null,null,null,null,null,null,null,null,null,null,null,null,null,null,null,null,null,null," "]
[null,null,null,null,null,null,null,null,null,null,null,null,null,null,null,null,null,null,null,null,null,null,null,null,null,null," "]

{"sheet":"PriceList","index":1,"n_rows":2309,"n_cols":10,"rows_kept":2309,"cut":false,"hidden":false,"merged":[[2305,0,2305,8],[2307,0,2307,8],[1450,0,1450,8],[1496,0,1496,8],[1498,0,1498,8],[1606,0,1606,8],[1611,0,1611,8],[1613,0,1613,8],[1738,0,1738,8],[1743,0,1743,8],[1745,0,1745,8],[1870,0,1870,8],[1875,0,1875,8],[1877,0,1877,8],[2046,0,2046,8],[2052,0,2052,8],[2056,0,2056,8],[2067,0,2067,8],[2073,0,2073,8],[703,0,703,8],[710,0,710,8],[715,0,715,8],[720,0,720,8],[728,0,728,8],[769,0,769,8],[816,0,816,8],[818,0,818,8],[938,0,938,8],[944,0,944,8],[949,0,949,8],[1073,0,1073,8],[1089,0,1089,8],[1091,0,1091,8],[1159,0,1159,8],[1161,0,1161,8],[1299,0,1299,8],[565,0,565,8],[571,0,571,8],[579,0,579,8],[590,0,590,8],[604,0,604,8],[624,0,624,8],[629,0,629,8],[634,0,634,8],[639,0,639,8],[644,0,644,8],[652,0,652,8],[659,0,659,8],[667,0,667,8],[672,0,672,8],[679,0,679,8],[684,0,684,8],[698,0,698,8],[2303,0,2303,4],[2304,0,2304,4],[2306,0,2306,4],[2308,0,2308,4],[142,0,142,8],[151,0,151,8],[160,0,160,8],[162,0,162,8],[247,0,247,8],[330,0,330,8],[341,0,341,8],[349,0,349,8],[357,0,357,8],[365,0,365,8],[373,0,373,8],[387,0,387,8],[392,0,392,8],[403,0,403,8],[408,0,408,8],[415,0,415,8],[419,0,419,8],[423,0,423,8],[428,0,428,8],[441,0,441,8],[451,0,451,8],[456,0,456,8],[464,0,464,8],[469,0,469,8],[481,0,481,8],[489,0,489,8],[491,0,491,8],[549,0,549,8],[2286,0,2286,4],[2287,0,2287,4],[2288,0,2288,4],[2289,0,2289,4],[2290,0,2290,4],[2291,0,2291,4],[2292,0,2292,4],[2293,0,2293,4],[2294,0,2294,4],[2295,0,2295,4],[2296,0,2296,4],[2297,0,2297,4],[2298,0,2298,4],[2299,0,2299,4],[2300,0,2300,4],[2301,0,2301,4],[2302,0,2302,4],[2270,0,2270,4],[2271,0,2271,4],[2272,0,2272,4],[2274,0,2275,4],[2274,5,2275,5],[2274,6,2275,6],[2274,8,2275,8],[2276,0,2276,4],[2277,0,2277,4],[2278,0,2278,4],[2279,0,2279,4],[2280,0,2280,4],[2281,0,2281,4],[2282,0,2282,4],[2283,0,2283,4],[2284,0,2284,4],[2285,0,2285,4],[2284,5,2285,5],[2284,6,2285,6],[2284,8,2285,8],[2273,0,2273,8],[2254,0,2254,4],[2256,0,2257,4],[2256,5,2257,5],[2256,6,2257,6],[2256,8,2257,8],[2258,0,2258,4],[2259,0,2259,4],[2260,0,2260,4],[2261,0,2261,4],[2262,0,2262,4],[2263,0,2263,4],[2264,0,2264,4],[2265,0,2265,4],[2266,0,2266,4],[2267,0,2267,4],[2268,0,2268,4],[2269,0,2269,4],[2255,0,2255,8],[2241,0,2241,4],[2242,0,2242,4],[2243,0,2243,4],[2244,0,2244,4],[2245,0,2245,4],[2246,0,2246,4],[2247,0,2247,4],[2248,0,2248,4],[2249,0,2249,4],[2250,0,2250,4],[2251,0,2251,4],[2252,0,2252,4],[2253,0,2253,4],[2252,5,2253,5],[2252,6,2253,6],[2252,7,2253,7],[2252,8,2253,8],[2225,0,2225,4],[2226,0,2226,4],[2227,0,2227,4],[2228,0,2228,4],[2229,0,2229,4],[2230,0,2230,4],[2231,0,2231,4],[2232,0,2232,4],[2233,0,2233,4],[2234,0,2234,4],[2235,0,2235,4],[2236,0,2236,4],[2237,0,2237,4],[2239,0,2240,4],[2239,5,2240,5],[2239,6,2240,6],[2239,8,2240,8],[2238,0,2238,8],[2209,0,2209,4],[2210,0,2210,4],[2211,0,2211,4],[2212,0,2212,4],[2213,0,2213,4],[2214,0,2214,4],[2215,0,2215,4],[2216,0,2216,4],[2217,0,2217,4],[2219,0,2220,4],[2219,5,2220,5],[2219,6,2220,6],[2219,8,2220,8],[2221,0,2221,4],[2222,0,2222,4],[2223,0,2223,4],[2224,0,2224,4],[2218,0,2218,8],[2190,0,2190,4],[2191,0,2191,4],[2192,0,2192,4],[2193,0,2193,4],[2194,0,2194,4],[2195,0,2195,4],[2196,0,2196,4],[2197,0,2197,4],[2198,0,2198,4],[2199,0,2199,4],[2200,0,2200,4],[2201,0,2201,4],[2202,0,2202,4],[2203,0,2203,4],[2204,0,2204,4],[2205,0,2205,4],[2207,0,2207,4],[2163,5,2164,5],[2163,6,2164,6],[2163,7,2164,7],[2163,8,2164,8],[2171,0,2172,4],[2171,5,2172,5],[2171,6,2172,6],[2171,8,2172,8],[2177,0,2177,4],[2179,0,2179,4],[2181,0,2181,4],[2183,0,2183,4],[2185,0,2185,4],[2186,0,2186,4],[2187,0,2187,4],[2188,0,2188,4],[2189,0,2189,4],[2170,0,2170,8],[2093,0,2093,4],[2095,0,2095,4],[2113,0,2113,4],[2114,0,2114,4],[2115,0,2115,4],[2126,0,2128,4],[2126,6,2128,6],[2126,7,2128,7],[2126,8,2128,8],[2141,0,2144,4],[2141,5,2144,5],[2141,6,2144,6],[2141,8,2144,8],[2145,0,2146,4],[2145,6,2146,6],[2145,7,2146,7],[2145,8,2146,8],[2094,0,2094,8],[2099,0,2099,8],[2106,0,2106,8],[2112,0,2112,8],[2118,0,2118,8],[2123,0,2123,8],[2125,0,2125,8],[2129,0,2129,8],[2131,0,2131,8],[2133,0,2133,8],[2021,0,2021,4],[2022,0,2022,4],[2023,0,2023,4],[2024,0,2024,4],[2025,0,2025,4],[2037,0,2039,4],[2037,6,2039,6],[2037,8,2039,8],[2040,0,2042,4],[2040,6,2042,6],[2040,8,2042,8],[2045,0,2045,4],[2047,0,2047,4],[2079,0,2080,4],[2079,5,2080,5],[2079,6,2080,6],[2079,8,2080,8],[2078,0,2078,8],[1970,6,1972,6],[1970,7,1972,7],[1970,8,1972,8],[1982,0,1984,4],[1982,6,1984,6],[1982,7,1984,7],[1982,8,1984,8],[1990,0,1991,4],[1990,5,1991,5],[1990,6,1991,6],[1990,8,1991,8],[1998,0,1998,4],[2000,0,2000,4],[2001,0,2001,4],[2002,0,2002,4],[2003,0,2003,4],[2004,0,2004,4],[1885,6,1891,6],[1885,7,1891,7],[1885,8,1891,8],[1907,0,1907,4],[1908,0,1908,4],[1920,0,1922,4],[1920,6,1922,6],[1920,8,1922,8],[1926,0,1926,4],[1931,0,1931,4],[1934,0,1934,4],[1935,0,1937,4],[1935,6,1937,6],[1935,7,1937,7],[1935,8,1937,8],[1940,0,1940,4],[1946,0,1946,4],[1739,6,1742,6],[1739,8,1742,8],[1754,0,1756,4],[1754,6,1756,6],[1754,7,1756,7],[1754,8,1756,8],[1757,0,1761,4],[1757,6,1761,6],[1757,7,1761,7],[1757,8,1761,8],[1762,0,1762,4],[1763,0,1763,4],[1764,0,1764,4],[1765,0,1765,4],[1766,0,1766,4],[1767,0,1767,4],[1769,0,1769,4],[1521,6,1522,6],[1521,7,1522,7],[1521,8,1522,8],[1523,0,1524,4],[1523,6,1524,6],[1523,7,1524,7],[1523,8,1524,8],[1583,0,1583,4],[1584,0,1584,4],[1585,0,1585,4],[1586,0,1586,4],[1587,0,1587,4],[1588,0,1588,4],[1590,0,1590,4],[1596,0,1597,4],[1596,5,1597,5],[1596,6,1597,6],[1596,8,1597,8],[1439,0,1440,4],[1439,6,1440,6],[1439,7,1440,7],[1439,8,1440,8],[1441,0,1441,4],[1442,0,1443,4],[1442,6,1443,6],[1442,7,1443,7],[1442,8,1443,8],[1444,0,1445,4],[1444,6,1445,6],[1444,7,1445,7],[1444,8,1445,8],[1446,0,1447,4],[1446,6,1447,6],[1446,7,1447,7],[1446,8,1447,8],[1429,6,1430,6],[1429,7,1430,7],[1429,8,1430,8],[1431,0,1432,4],[1431,6,1432,6],[1431,7,1432,7],[1431,8,1432,8],[1433,0,1434,4],[1433,6,1434,6],[1433,7,1434,7],[1433,8,1434,8],[1435,0,1436,4],[1435,6,1436,6],[1435,7,1436,7],[1435,8,1436,8],[1437,0,1438,4],[1437,6,1438,6],[1437,7,1438,7],[1437,8,1438,8],[1419,6,1420,6],[1419,7,1420,7],[1419,8,1420,8],[1421,0,1422,4],[1421,6,1422,6],[1421,7,1422,7],[1421,8,1422,8],[1423,0,1424,4],[1423,6,1424,6],[1423,7,1424,7],[1423,8,1424,8],[1425,0,1426,4],[1425,6,1426,6],[1425,7,1426,7],[1425,8,1426,8],[1427,0,1428,4],[1427,6,1428,6],[1427,7,1428,7],[1427,8,1428,8],[1409,6,1410,6],[1409,7,1410,7],[1409,8,1410,8],[1411,0,1412,4],[1411,6,1412,6],[1411,7,1412,7],[1411,8,1412,8],[1413,0,1414,4],[1413,6,1414,6],[1413,7,1414,7],[1413,8,1414,8],[1415,0,1416,4],[1415,6,1416,6],[1415,7,1416,7],[1415,8,1416,8],[1417,0,1418,4],[1417,6,1418,6],[1417,7,1418,7],[1417,8,1418,8],[1398,6,1399,6],[1398,7,1399,7],[1398,8,1399,8],[1400,0,1401,4],[1400,6,1401,6],[1400,7,1401,7],[1400,8,1401,8],[1402,0,1404,4],[1402,6,1404,6],[1402,7,1404,7],[1402,8,1404,8],[1405,0,1406,4],[1405,6,1406,6],[1405,7,1406,7],[1405,8,1406,8],[1407,0,1408,4],[1407,6,1408,6],[1407,7,1408,7],[1407,8,1408,8],[1387,6,1388,6],[1387,7,1388,7],[1387,8,1388,8],[1389,0,1390,4],[1389,6,1390,6],[1389,7,1390,7],[1389,8,1390,8],[1391,0,1392,4],[1391,6,1392,6],[1391,7,1392,7],[1391,8,1392,8],[1393,0,1394,4],[1393,6,1394,6],[1393,7,1394,7],[1393,8,1394,8],[1395,0,1396,4],[1395,6,1396,6],[1395,7,1396,7],[1395,8,1396,8],[1377,6,1378,6],[1377,7,1378,7],[1377,8,1378,8],[1379,0,1380,4],[1379,6,1380,6],[1379,7,1380,7],[1379,8,1380,8],[1381,0,1382,4],[1381,6,1382,6],[1381,7,1382,7],[1381,8,1382,8],[1383,0,1384,4],[1383,6,1384,6],[1383,7,1384,7],[1383,8,1384,8],[1385,0,1386,4],[1385,6,1386,6],[1385,7,1386,7],[1385,8,1386,8],[1367,7,1368,7],[1367,8,1368,8],[1369,0,1370,4],[1369,6,1370,6],[1369,7,1370,7],[1369,8,1370,8],[1371,0,1372,4],[1371,6,1372,6],[1371,7,1372,7],[1371,8,1372,8],[1373,0,1374,4],[1373,6,1374,6],[1373,7,1374,7],[1373,8,1374,8],[1375,0,1376,4],[1375,6,1376,6],[1375,7,1376,7],[1375,8,1376,8],[1351,6,1352,6],[1351,7,1352,7],[1351,8,1352,8],[1353,0,1354,4],[1353,6,1354,6],[1353,7,1354,7],[1353,8,1354,8],[1355,0,1356,4],[1355,6,1356,6],[1355,7,1356,7],[1355,8,1356,8],[1357,0,1358,4],[1357,6,1358,6],[1357,7,1358,7],[1357,8,1358,8],[1359,0,1360,4],[1359,6,1360,6],[1359,7,1360,7],[1359,8,1360,8],[1341,6,1342,6],[1341,7,1342,7],[1341,8,1342,8],[1343,0,1344,4],[1343,6,1344,6],[1343,7,1344,7],[1343,8,1344,8],[1345,0,1346,4],[1345,6,1346,6],[1345,7,1346,7],[1345,8,1346,8],[1347,0,1348,4],[1347,6,1348,6],[1347,7,1348,7],[1347,8,1348,8],[1349,0,1350,4],[1349,6,1350,6],[1349,7,1350,7],[1349,8,1350,8],[1329,6,1331,6],[1329,7,1331,7],[1329,8,1331,8],[1332,0,1333,4],[1332,6,1333,6],[1332,7,1333,7],[1332,8,1333,8],[1334,0,1335,4],[1334,6,1335,6],[1334,7,1335,7],[1334,8,1335,8],[1336,0,1338,4],[1336,6,1338,6],[1336,7,1338,7],[1336,8,1338,8],[1339,0,1340,4],[1339,6,1340,6],[1339,7,1340,7],[1339,8,1340,8],[1312,6,1313,6],[1312,7,1313,7],[1312,8,1313,8],[1314,0,1315,4],[1314,6,1315,6],[1314,7,1315,7],[1314,8,1315,8],[1316,0,1317,4],[1316,6,1317,6],[1316,7,1317,7],[1316,8,1317,8],[1318,0,1320,4],[1318,6,1320,6],[1318,7,1320,7],[1318,8,1320,8],[1321,0,1322,4],[1321,6,1322,6],[1321,7,1322,7],[1321,8,1322,8],[1231,8,1232,8],[1233,0,1234,4],[1233,5,1234,5],[1233,6,1234,6],[1233,8,1234,8],[1235,0,1235,4],[1256,0,1256,4],[1257,0,1257,4],[1258,0,1258,4],[1259,0,1259,4],[1260,0,1260,4],[1261,0,1261,4],[1262,0,1262,4],[1263,0,1263,4],[1300,0,1303,4],[1300,5,1303,5],[1300,6,1303,6],[1300,8,1303,8],[1067,6,1068,6],[1067,7,1068,7],[1067,8,1068,8],[1069,0,1070,4],[1069,6,1070,6],[1069,7,1070,7],[1069,8,1070,8],[1071,0,1072,4],[1071,6,1072,6],[1071,7,1072,7],[1071,8,1072,8],[1094,0,1094,4],[1095,0,1095,4],[1096,0,1096,4],[1097,0,1097,4],[1098,0,1098,4],[1099,0,1099,4],[1057,6,1058,6],[1057,7,1058,7],[1057,8,1058,8],[1059,0,1060,4],[1059,6,1060,6],[1059,7,1060,7],[1059,8,1060,8],[1061,0,1062,4],[1061,6,1062,6],[1061,7,1062,7],[1061,8,1062,8],[1063,0,1064,4],[1063,6,1064,6],[1063,7,1064,7],[1063,8,1064,8],[1065,0,1066,4],[1065,6,1066,6],[1065,7,1066,7],[1065,8,1066,8],[1045,6,1046,6],[1045,7,1046,7],[1045,8,1046,8],[1047,0,1048,4],[1047,6,1048,6],[1047,7,1048,7],[1047,8,1048,8],[1049,0,1052,4],[1049,6,1052,6],[1049,7,1052,7],[1049,8,1052,8],[1053,0,1054,4],[1053,6,1054,6],[1053,7,1054,7],[1053,8,1054,8],[1055,0,1056,4],[1055,6,1056,6],[1055,7,1056,7],[1055,8,1056,8],[1033,7,1036,7],[1033,8,1036,8],[1037,0,1038,4],[1037,6,1038,6],[1037,7,1038,7],[1037,8,1038,8],[1039,0,1040,4],[1039,6,1040,6],[1039,7,1040,7],[1039,8,1040,8],[1041,0,1042,4],[1041,6,1042,6],[1041,7,1042,7],[1041,8,1042,8],[1043,0,1044,4],[1043,6,1044,6],[1043,7,1044,7],[1043,8,1044,8],[1016,6,1017,6],[1016,7,1017,7],[1016,8,1017,8],[1018,0,1019,4],[1018,6,1019,6],[1018,7,1019,7],[1018,8,1019,8],[1020,0,1021,4],[1020,6,1021,6],[1020,7,1021,7],[1020,8,1021,8],[1022,0,1023,4],[1022,6,1023,6],[1022,7,1023,7],[1022,8,1023,8],[1024,0,1026,4],[1024,6,1026,6],[1024,7,1026,7],[1024,8,1026,8],[997,6,998,6],[997,7,998,7],[997,8,998,8],[999,0,1000,4],[999,6,1000,6],[999,7,1000,7],[999,8,1000,8],[1001,0,1002,4],[1001,6,1002,6],[1001,7,1002,7],[1001,8,1002,8],[1003,0,1004,4],[1003,6,1004,6],[1003,7,1004,7],[1003,8,1004,8],[1005,0,1007,4],[1005,6,1007,6],[1005,7,1007,7],[1005,8,1007,8],[987,6,988,6],[987,7,988,7],[987,8,988,8],[989,0,990,4],[989,6,990,6],[989,7,990,7],[989,8,990,8],[991,0,992,4],[991,6,992,6],[991,7,992,7],[991,8,992,8],[993,0,994,4],[993,6,994,6],[993,7,994,7],[993,8,994,8],[995,0,996,4],[995,6,996,6],[995,7,996,7],[995,8,996,8],[976,6,977,6],[976,7,977,7],[976,8,977,8],[978,0,980,4],[978,6,980,6],[978,7,980,7],[978,8,980,8],[981,0,982,4],[981,6,982,6],[981,7,982,7],[981,8,982,8],[983,0,984,4],[983,6,984,6],[983,7,984,7],[983,8,984,8],[985,0,986,4],[985,6,986,6],[985,7,986,7],[985,8,986,8],[965,6,966,6],[965,7,966,7],[965,8,966,8],[967,0,968,4],[967,6,968,6],[967,7,968,7],[967,8,968,8],[969,0,971,4],[969,6,971,6],[969,7,971,7],[969,8,971,8],[972,0,973,4],[972,6,973,6],[972,7,973,7],[972,8,973,8],[974,0,975,4],[974,6,975,6],[974,7,975,7],[974,8,975,8],[953,6,954,6],[953,7,954,7],[953,8,954,8],[955,0,957,4],[955,6,957,6],[955,7,957,7],[955,8,957,8],[958,0,959,4],[958,6,959,6],[958,7,959,7],[958,8,959,8],[960,0,962,4],[960,6,962,6],[960,7,962,7],[960,8,962,8],[963,0,964,4],[963,6,964,6],[963,7,964,7],[963,8,964,8],[920,0,920,4],[925,0,925,4],[926,0,926,4],[927,0,927,4],[928,0,928,4],[929,0,929,4],[930,0,930,4],[931,0,931,4],[932,0,932,4],[933,0,933,4],[934,0,934,4],[935,0,935,4],[936,0,936,4],[937,0,937,4],[939,0,943,4],[939,5,943,5],[939,6,943,6],[890,0,890,4],[891,0,891,4],[892,0,892,4],[893,0,893,4],[894,0,895,4],[894,5,895,5],[894,6,895,6],[894,8,895,8],[898,0,898,4],[899,0,899,4],[900,0,900,4],[901,0,901,4],[903,0,903,4],[904,0,904,4],[905,0,905,4],[906,0,906,4],[907,0,907,4],[839,0,839,4],[840,0,840,4],[841,0,841,4],[842,0,842,4],[844,0,844,4],[845,0,845,4],[846,0,846,4],[847,0,847,4],[849,0,849,4],[850,0,850,4],[851,0,851,4],[852,0,852,4],[857,0,857,4],[858,0,858,4],[859,0,859,4],[860,0,860,4],[864,0,864,4],[768,0,768,4],[770,0,772,4],[770,6,772,6],[770,8,772,8],[773,0,773,4],[777,0,779,4],[777,5,779,5],[777,6,779,6],[777,8,779,8],[780,0,782,4],[780,6,782,6],[780,7,782,7],[780,8,782,8],[783,0,785,4],[783,6,785,6],[783,7,785,7],[783,8,785,8],[742,6,745,6],[742,7,745,7],[742,8,745,8],[746,0,746,4],[747,0,750,4],[747,6,750,6],[747,7,750,7],[747,8,750,8],[751,0,754,4],[751,6,754,6],[751,7,754,7],[751,8,754,8],[755,0,755,4],[756,0,759,4],[756,6,759,6],[756,7,759,7],[756,8,759,8],[704,7,706,7],[704,8,706,8],[707,0,709,4],[707,5,709,5],[707,6,709,6],[707,8,709,8],[711,0,713,4],[711,6,713,6],[711,7,713,7],[711,8,713,8],[714,0,714,4],[716,7,718,7],[719,0,719,4],[724,0,724,4],[725,0,725,4],[726,0,726,4],[727,0,727,4],[668,6,670,6],[668,7,670,7],[668,8,670,8],[673,0,675,4],[673,6,675,6],[673,7,675,7],[673,8,675,8],[676,5,677,5],[676,6,677,6],[676,7,677,7],[676,8,677,8],[678,0,678,4],[680,0,682,4],[680,6,682,6],[680,7,682,7],[680,8,682,8],[685,0,687,4],[685,6,687,6],[685,7,687,7],[685,8,687,8],[635,6,637,6],[635,7,637,7],[635,8,637,8],[640,0,642,4],[640,6,642,6],[640,7,642,7],[640,8,642,8],[645,0,647,4],[645,6,647,6],[645,7,647,7],[645,8,647,8],[653,0,655,4],[653,6,655,6],[653,7,655,7],[653,8,655,8],[660,0,662,4],[660,6,662,6],[660,7,662,7],[660,8,662,8],[606,7,608,7],[606,8,608,8],[609,0,611,4],[609,6,611,6],[609,7,611,7],[609,8,611,8],[612,7,614,7],[615,7,617,7],[618,0,620,4],[618,6,620,6],[618,7,620,7],[618,8,620,8],[621,0,623,4],[621,6,623,6],[621,7,623,7],[621,8,623,8],[626,0,628,4],[626,6,628,6],[626,7,628,7],[626,8,628,8],[573,7,575,7],[573,8,575,8],[576,0,578,4],[576,6,578,6],[576,7,578,7],[576,8,578,8],[580,0,580,4],[581,0,583,4],[581,6,583,6],[581,7,583,7],[581,8,583,8],[584,0,586,4],[584,6,586,6],[584,7,586,7],[584,8,586,8],[587,0,589,4],[587,6,589,6],[587,8,589,8],[512,0,512,4],[513,0,513,4],[514,0,514,4],[515,0,515,4],[516,0,516,4],[518,0,518,4],[519,0,519,4],[520,0,520,4],[521,0,521,4],[523,0,523,4],[524,0,524,4],[525,0,525,4],[526,0,526,4],[527,0,527,4],[528,0,528,4],[529,0,529,4],[530,0,530,4],[465,0,466,4],[465,6,466,6],[465,7,466,7],[465,8,466,8],[467,0,467,4],[468,0,468,4],[470,0,470,4],[471,0,472,4],[471,6,472,6],[471,7,472,7],[471,8,472,8],[473,0,473,4],[474,0,475,4],[474,6,475,6],[474,7,475,7],[474,8,475,8],[476,0,477,4],[476,6,477,6],[476,7,477,7],[476,8,477,8],[431,6,433,6],[431,8,433,8],[434,0,436,4],[434,6,436,6],[434,8,436,8],[437,0,438,4],[437,6,438,6],[437,7,438,7],[437,8,438,8],[439,0,440,4],[439,6,440,6]],"merged_total":2692,"flags":["merged_cut"]}
["USE \"PLAN MODE\" TO QUICKLY CUSTOMIZE AND PRINT YOUR PLANNED GROCERY LIST:"]
["-The START button activates \"PLAN MODE\", enabling you to click and highlight lines you want to include onto your PLANNED GROCERY LIST."]
["-Click the SHRINK button to hide everything not highlighted.  Be careful what you hide, you may need that info. (If you click UNSHRINK, you can adjust without starting over!)"]
[]
["**TIME SAVER- You can highlight all the **** (4 star) and ***** (5 star EXTREME or FREE) items. Just click START, then click the little red star above the words \"Stock Up Scale\"."]
[]
[null,null,null,null,null,null,null,null,null,"Activate reset Toggle gray rows "]
[]
["*",null,null,null,null,"Become an instructor"]
[]
["*****",null,null,null,null,"Todays date: ","Sale","We are not affiliated with this store.  The store's ad is the only OFFICIAL authority"]
["toggle 4 and 5 star rows",null,null,null,null,null,"Price"]
["Stock up scale",null,null,null,null,"How to use this list",null,"Printable coupons:","Bottom line"]
[null,null,null,null,null,null,null,"Group A  Group B  Group C  Singles"]
[null,null,null,null,null,"Smiths"]
[null,null,null,null,null,null,null,"Coupon Index"]
[null,null,null,null,null,"Current list"]
[null,null,null,null,null,"-This list is valid during the dates listed below"]
["*****",null,null,null,null,"Valid Dates: 04-11 through 04-17",null,"This list is made by Rebecca, a Grocerysmarts/PYP affiliated instructor. She answers list questions at this thread at PYP."]
["****",null,null,null,null,"Apples, Fuji, organic","1.49 lb",null,"1.49 lb"]
["****",null,null,null,null,"Apples, Jazz or Gala",".89 lb",null,".89 lb"]
["***",null,null,null,null,"Asparagus","2.99 lb",null,"2.99 lb"]
["***",null,null,null,null,"Artichokes",2.5,null,2.5]
["***",null,null,null,null,"Blackberries, 6 oz",2.99,null,2.99]
["***",null,null,null,null,"Cantaloupe",".49 lb",null,".49 lb"]
["***",null,null,null,null,"Carrots, 2 lb bag",0.99,null,0.99]
["***",null,null,null,null,"Celery",0.99,null,0.99]
["***",null,null,null,null,"Dole Salad Kits, 8-13 oz",2.99,null,2.99]
["***",null,null,null,null,"Fresh Selections Salad Kit, 8-13 oz",2.99,null,2.99]
["***",null,null,null,null,"Grapes, Red, Seedless","2.49 lb",null,"2.49 lb"]
["***",null,null,null,null,"Grape Tomatoes, organic, pint",2.5,null,2.5]
["***",null,null,null,null,"Nature Sweet Sunburst or Cherry Tomatoes, 10.5 oz",3,null,3]
["***",null,null,null,null,"Oranges, Navel, 8 lb",5.99,null,5.99]
["***",null,null,null,null,"Pears,Bartlett, Anjou or Bosc",".99 lb",null,".99 lb"]
["***",null,null,null,null,"Peppers, Red, Yellow or Orange",1,null,1]
["****",null,null,null,null,"Tomatoes, Roma",".79 lb",null,".79 lb"]
["***",null,null,null,null,"Watermelon, seedless",".49 lb",null,".49 lb"]
["***",null,null,null,null,"Beef - Ribeye Steaks, bone in, super value packs","5.99 lb",null,"5.99 lb"]
["***",null,null,null,null,"Beef - Rump or Sirloin Tip Roast","3.99 lb",null,"3.99 lb"]
["***",null,null,null,null,"Beef - Stew Meat, boneless","3.49 lb",null,"3.49 lb"]
["***",null,null,null,null,"Chicken - Smiths Boneless, Skinless Breasts, Tenders or Thighs, super value pack","1.99 lb",null,"1.99 lb"]
["***",null,null,null,null,"Ground Round - Private Selection Angus, 85%","2.99 lb",null,"2.99 lb"]
["***",null,null,null,null,"Pork - Center Cut Chops, boneless, super value pack","2.99 lb",null,"2.99 lb"]
["***",null,null,null,null,"Pork - Center Cut Loin Chops, super value pack","2.59 lb",null,"2.59 lb"]
["***",null,null,null,null,"Pork - Loin Back Ribs","3.99 lb",null,"3.99 lb"]
["***",null,null,null,null,"Pork - Loin Chops, bone in","1.99 lb",null,"1.99 lb"]
["***",null,null,null,null,"Seafood - Catfish Fillets, fresh, farm raised","5.99 lb",null,"5.99 lb"]
["***",null,null,null,null,"Seafood - Cocktail Shrimp, asst, sold in 2 lb bag","6.99 lb",null,"6.99 lb"]
["***",null,null,null,null,"Seafood - Kroger Breaded Shrimp or Calamari Rings, 8-20 oz frozen","buy one get one free",null,"buy one get one free"]
["***",null,null,null,null,"Seafood - Kroger Salmon or Cod Fillets, 2.5 lb frozen",9.99,null,9.99]
["***",null,null,null,null,"Seafood - Tilapia Fillets, fresh, farm raised","5.99 lb",null,"5.99 lb"]
["***",null,null,null,null,"Kraft Cheese, 7-8 oz",1.67,null,1.67]
["****",null,null,null,null,"Kroger Cheese, 32 oz",5.99,"Cheese, $1/2 lbs (active) Group A-03/26 Print Twice!",4.99]
["***",null,null,null,null,"Kroger Cottage Cheese, 24 oz",2,null,2]
["***",null,null,null,null,"Kroger Dip, 24 oz",2,null,2]
["***",null,null,null,null,"Kroger Singles, 12 ct",1,null,1]
["***",null,null,null,null,"Kroger Sour Cream, 24 oz",2,null,2]
["***",null,null,null,null,"Lifeway Kefir, 32 oz",2.99,null,2.99]
["*****",null,null,null,null,"Mountain Dairy Milk, gallon",2.39,"Milk, .75/1 gallon (active) Group A-03/26 Print Twice!",1.64]
["***",null,null,null,null,"Oikos Greek Yogurt, 5.3 oz",1,null,1]
["***",null,null,null,null,"Simple Truth Organic Soymilk, half gallon",2.5,null,2.5]
["***",null,null,null,null,"Yoplait Yogurt, 4-6 oz",0.6,"Yoplait Yogurt cups, any variety including Original, Light, Thick and Creamy or Whips .40/6 (05-05-12) SS-3/11",".53 ea"]
["***",null,null,null,null,"Yoplait Lactose-Free Yogurt, 4-6 oz",0.6,"Yoplait Lactose-Free Yogurt cups, any flavor .20/1 (05-05-12) SS-3/11",0.4]
["***",null,null,null,null,"Yoplait Yogurt, 4-6 oz",0.6,"Yoplait Yogurt cups, any variety including Original, Light, Thick and Creamy or Whips .40/6 (active) Group B-03/02 Print Twice!",".53 ea"]
["***",null,null,null,null,"Yoplait Yogurt, 4-6 oz",0.6,"Yoplait Yogurt cups, any variety including Original, Light, Thick and Creamy or Whips, .50/8 (active) This Link-03/07 Print Twice!",".54 ea"]
["***",null,null,null,null,"Ball Park Beef Franks, 14-16 oz",3.49,null,3.49]
["***",null,null,null,null,"Ball Park Meat Franks, 16 oz","buy one get one free",null,"buy one get one free"]
["***",null,null,null,null,"Hillshire Farms Smoked Sausage, 13-14 oz",2.5,"Hillshire Farm Lunchmeat or Smoked Sausage Products, Buy 2 Get 1 Hillshire Farm Grilled Chicken Breast FREE (active) This Link-04/09","2.50+"]
["****",null,null,null,null,"Hillshire Farms Smoked Sausage, 13-14 oz",2.5,"Smiths CARD DOWNLOAD - Hillshire Farm Smoked Sausage Products, any - Expires 5/31 - This can NOT be combined with manufacturer coupons $1/2 (active) This Link-04/09","2.00 ea"]
["***",null,null,null,null,"Kroger Bacon, 24 oz",5.99,null,5.99]
["***",null,null,null,null,"Kroger Bratwurst, 18 oz",3.88,null,3.88]
["***",null,null,null,null,"Kroger Canadian Bacon, 5 oz",2.5,null,2.5]
["***",null,null,null,null,"Kroger Italian Sausage, 18 oz",3.88,null,3.88]
["***",null,null,null,null,"Oscar Mayer Bologna or Cotto Salami, 16 oz",2.5,null,2.5]
["***",null,null,null,null,"Oscar Mayer Lunchables, 6.7-10.8 oz",2.5,null,2.5]
["***",null,null,null,null,"Oscar Mayer Turkey Bacon, 12 oz",2.5,null,2.5]
["***",null,null,null,null,"7up, 2 liter",1.33,null,1.33]
["***",null,null,null,null,"Arrowhead Water, 24 ct",3.49,null,3.49]
["****",null,null,null,null,"Coke, 2 liter",1,null,1]
["***",null,null,null,null,"Coke, 20 pk",6.5,"Extra Promo: Buy 2, save $2","5.50 ea"]
["***",null,null,null,null,"Pepsi, 2 liter",1.33,null,1.33]
["***",null,null,null,null,"Pepsi 20 pk",5.99,"Extra Promo: Buy 2, save $2","4.99 ea"]
["*****",null,null,null,null,"V8 36-46 oz",1.99,"V8 100 Percent Vegetable Juice, any 46 oz or larger $1/2 (active) This Link-04/02","1.49 ea"]
["****",null,null,null,null,"V8 V Fusion, 36-46 oz",1.99,null,1.99]
["****",null,null,null,null,"Balance Bar, 1.76 oz",0.99,"Balance Bar Singles, any 1.76 oz FACEBOOK COUPON $1.10/3 (active) This Link-03/11",".62 ea"]
["***",null,null,null,null,"Cheez it Crackers, 9.75-14 oz",2.4900000000000002,"Sunshine Cheez-It Baked Snack Crackers, any .70/1 (active) This Link-03/23",1.79]
["****",null,null,null,null,"Doritos, 11-11.5 oz",3,"Extra Promo: Buy 3, save $3","2.00 ea"]
["****",null,null,null,null,"Flipz Pretzels, 5 oz",1,null,1]
["*****",null,null,null,null,"Jolly Time Popcorn, 3-4 ct",1,"Jolly Time Microwave Popcorn, any boxes $1/2 (active) This Link-05/23",".50 ea"]
["***",null,null,null,null,"Kelloggs Cereal, 11-17 oz",1.99,"Kelloggs Cereal, any 8.7 oz or larger $1/3 (active) Group A-04/03 Print Twice!","1.66 ea"]
["***",null,null,null,null,"Kelloggs Cereal, 11-17 oz",1.99,"Kelloggs Cereals, any flavor 10 oz. or larger $1/3 ( Expires 04-15-12) RP-3/4","1.66 ea"]
["***",null,null,null,null,"Kettle Baked Potato Chips, 4 oz",1.67,null,1.67]
["***",null,null,null,null,"Kings Hawaiian Rolls, 12 ct",2.5,"Kings Hawaiian Dinner Rolls, any variety 12 packs $1/2 or (1) 24-pack (05-31-12) RP-4/1","2.00 ea"]
["***",null,null,null,null,"Kroger Coffee, 26-34.5 oz",6.99,null,6.99]
["***",null,null,null,null,"Moms Best Naturals Cereal, 11.5-16.5 oz",2,"Moms Best Naturals Cereal, any .75/2 (active) This Link-03/26","1.63 ea"]
["***",null,null,null,null,"Nutri Grain Cereal Bars, 5-10 ct",2.4900000000000002,null,2.4900000000000002]
["***",null,null,null,null,"Private Selection Coffee, 10-12 oz",6.99,null,6.99]
["***",null,null,null,null,"Special K Bars, 5-10 ct",2.4900000000000002,"Kelloggs Special K Bars or FiberPlus Chewy Bars, any 5 ct or larger $1/2 (active) Group A-04/03 Print Twice!","1.99 ea"]
["***",null,null,null,null,"Cool Classics Fun Daze Sundaes, 4 ct or Ice Cream Sammies, 12-16 ct",2.5,null,2.5]
["***",null,null,null,null,"Eggo Waffles or Pancakes, 6-10 ct",2,null,2]
["****",null,null,null,null,"Freschetta Pizza, 9.4-30.6 oz",4.49,"Freschetta Multi-Serve Pizzas, any $1.50/2 (06-30-12) SS-3/4","3.74 ea"]
["***",null,null,null,null,"Haagen Dazs Ice Cream, 3.6 oz",1,null,1]
["***",null,null,null,null,"Healthy Choice Entrees, 9.5-10.8 oz",2.25,"Healthy Choice Complete Meals, any $1/3 (active) This Link-01/21","1.92 ea"]
["***",null,null,null,null,"Healthy Choice 100% Natural Entrees (If this variety is included)",2.25,"Healthy Choice 100% Natural Entrees, any $1/2 (active) This Link-01/21","1.75 ea"]
["***",null,null,null,null,"Healthy Choice Frozen Traditional Classics or Modern Classics (If this variety is included)",2.25,"Healthy Choice Frozen Traditional Classics or Modern Classics, any $1/2 (05-05-12) SS-3/25","1.75 ea"]
["***",null,null,null,null,"Hot or Lean Pockets, 2-4 ct",2,null,2]
["****",null,null,null,null,"Kashi Steam Meal, 9-10 oz",2.99,"Smiths CARD DOWNLOAD - Kashi Steam Meal, any - Expires 5/30 - This can NOT be combined with manufacturer coupons $1/1 (active) This Link-04/09",1.99]
["****",null,null,null,null,"Kashi Steam Meal, 9-10 oz",2.99,"Kashi Steam Meal, any $1/1 (active) Group A-04/01 Print Twice!",1.99]
["***",null,null,null,null,"Kroger Deluxe Sherbet, 16 oz",1,null,1]
["***",null,null,null,null,"Marie Callenders Entrees, 8.5-19 oz",2.25,"Marie Callenders Single Serve Frozen Meals, any $1/3 (active) This Link-01/21","1.92 ea"]
["***",null,null,null,null,"Michelinas Entrees, 4-9.5 oz",0.88,null,0.88]
["***",null,null,null,null,"Private Selection Ice Cream, 48 oz",3.99,null,3.99]
["***",null,null,null,null,"Red Baron Pizza or Pan Pasta, 9.4-30.6 oz",4.49,null,4.49]
["***",null,null,null,null,"Tyson Anytizers, 22-32 oz",6.99,"Tyson Anytizers snacks, any bag $1/1 (06-08-12) SS-3/4 AND (04-22-12) SS-1/22",5.99]
["***",null,null,null,null,"Tyson Chicken, 22-32 oz",6.99,"Tyson Chicken Nuggets, any bag .75/1 (05-31-12) SS-2/12",6.24]
["***",null,null,null,null,"Weight Watchers Frozen Treats, 4-12 ct",3.99,null,3.99]
["***",null,null,null,null,"Colgate Toothbrush, 1-2 ct",2.99,"Colgate Adult or Kids Manual Toothbrush, any excluding Colgate Plus and Colgate Extra Clean .40/1 (Expires 04-14-12) SS-3/25",2.59]
["***",null,null,null,null,"Colgate Optic White Toothpaste, 4-5.8 oz",2.99,"Colgate Optic White Toothpaste 4 oz $1/1 (active) Group C-04/07 Print Twice!",1.99]
["***",null,null,null,null,"Colgate Toothpaste, 4-5.8 oz",2.99,"Colgate Toothpaste, any 4 oz. or larger .75/1 (Expires 04-14-12) SS-3/25",2.2400000000000002]
["***",null,null,null,null,"Colgate Total Advanced Toothpaste (If this variety is included)",2.99,"Colgate Total Advanced Toothpaste, any 4 oz or larger $1/1 (active) Group A-04/04 Print Twice!",1.99]
["***",null,null,null,null,"Cottonelle, 12 double rolls",6.49,"Smiths CARD DOWNLOAD - Cottonelle Toilet Paper 12 pk - Expires 8/1 - This can NOT be combined with manufacturer coupons $1/1 (active) This Link-04/09",5.49]
["***",null,null,null,null,"Emergen C, 30 ct",7.99,null,7.99]
["*****",null,null,null,null,"Kroger Acetaminophen, 500 ct",5,null,5]
["*****",null,null,null,null,"Kroger Ibuprofen, 500 ct",5,null,5]
["***",null,null,null,null,"LOreal Cosmetics","20% off",null,"20% off"]
["****",null,null,null,null,"LOreal Colour Riche Lipcolour or Nail Colour","20% off","LOreal Colour Riche Lipcolour or Nail Colour, any $1/1 (05-20-12) RP-3/25","unknown"]
["****",null,null,null,null,"LOreal Paris Face Cosmetic product","20% off","LOreal Paris Face Cosmetic product, any excluding Magic Perfecting Base .17 oz. mini size $2/1 (04-29-12) RP-3/4 AND (Expires 04-15-12) RP-2/19","unknown"]
["****",null,null,null,null,"LOreal Paris Eyeliner or Eye Shadow","20% off","LOreal Paris Eyeliner or Eye Shadow, any $1/1 (05-20-12) RP-3/25","unknown"]
["****",null,null,null,null,"LOreal Paris Eye product","20% off","LOreal Paris Eye product, any $1/1 (05-20-12) RP-3/25","unknown"]
["****",null,null,null,null,"Lady Speed Stick Deodorant, 2.3-3.5 oz",2,"Speed Stick Antiperspirant/Deodorant or Lady Speed Stick Antiperspirant/Deodorant, any excluding 2 oz, 1.4 oz, and .5 oz sizes $1/1 (Expires 04-14-12) SS-3/25",1]
["****",null,null,null,null,"Nature Made CoQ10","50% off","Nature Made CoQ10 $2/1 (active) This Link-03/18","unknown"]
["****",null,null,null,null,"Nature Made Fish Oil","50% off","Nature Made Fish Oil, any $1/1 (active) This Link-03/18","unknown"]
["****",null,null,null,null,"Nature Made Vitamins","50% off","Nature Made Product, any $1/1 (active) This Link-03/18","unknown"]
["****",null,null,null,null,"Nature Made Vitamin B","50% off","Nature Made Vitamin B, any $1/1 (active) This Link-03/18","unknown"]
["****",null,null,null,null,"Nature Made Vitamin D","50% off","Nature Made Vitamin D Nature Made Vitamin D, any $1/1 (active) This Link-03/18","unknown"]
["*****",null,null,null,null,"Purex, 26 ct packs",2.99,"Purex UltraPacks Detergent, excludes trial size $1/1 (04-21-12) RP-3/11",1.99]
["*****",null,null,null,null,"Purex Crystals, 28 oz or larger (If this variety is included)",2.99,"Purex Crystals, any 28 oz or larger bottle $1/1 (active) Group A-03/28 Print Twice!",1.99]
["****",null,null,null,null,"Purex Liquid Detergent",2.99,"Purex Liquid Detergent, excludes trial size .50/1 (04-21-12) RP-3/11",2.4900000000000002]
["***",null,null,null,null,"Seventh Generation Laundry Detergent, 50-100 oz",11.99,null,11.99]
["***",null,null,null,null,"Snuggle Fabric Softener, 32-40 loads or 70-80 ct sheets",2.99,"Snuggle Fabric Softener Liquid or Dryer Sheets, any .50/1 (Expires 04-15-12) RP-3/4",2.4900000000000002]
["****",null,null,null,null,"Speed Stick Deodorant, 2.3-3.5 oz",2,"Speed Stick Antiperspirant/Deodorant or Lady Speed Stick Antiperspirant/Deodorant, any excluding 2 oz, 1.4 oz, and .5 oz sizes $1/1 (Expires 04-14-12) SS-3/25",1]
["***",null,null,null,null,"Viva, 6 double rolls",6.49,"Viva Paper Towels .50/2 Big Roll packages or any (1) 2-pack (active) This Link-05/14","6.24 ea"]
[]
["*****",null,null,null,null,"Grill Night Promo: Buy $20 of participating products, get $5 off"]
["****",null,null,null,null,"Bushs Best Baked Beans, 21-28 oz",1.67,null,"varies"]
["*****",null,null,null,null,"Heinz Ketchup, 32-40 oz",1.88,null,"varies"]
["***",null,null,null,null,"Kingsford Charcoal, 15.7-16.6 lb bag",7.99,null,"varies"]
["****",null,null,null,null,"Kraft Miracle Whip or Mayo, 30 oz",3.49,"Kraft Mayo or Miracle Whip Dressing products, any .75/2 (04-22-12) SS-3/25","varies"]
["***",null,null,null,null,"Pepsi, 6 pk, 24 oz",3.5,null,"varies"]
["***",null,null,null,null,"Ruffles Potato Chips, 8.5-9.5 oz",3,null,"varies"]
["***",null,null,null,null,"Rold Gold Pretzels, 7-16 oz",3,null,"varies"]
[]
["*****",null,null,null,null,"Grill Night Promo: Buy $10 of participating products, get $2 off"]
["***",null,null,null,null,"Bushs Best Baked Beans, 21-28 oz",1.67,null,"varies"]
["****",null,null,null,null,"Heinz Ketchup, 32-40 oz",1.88,null,"varies"]
["***",null,null,null,null,"Kingsford Charcoal, 15.7-16.6 lb bag",7.99,null,"varies"]
["***",null,null,null,null,"Kraft Miracle Whip or Mayo, 30 oz",3.49,"Kraft Mayo or Miracle Whip Dressing products, any .75/2 (04-22-12) SS-3/25","varies"]
["***",null,null,null,null,"Pepsi, 6 pk, 24 oz",3.5,null,"varies"]
["***",null,null,null,null,"Ruffles Potato Chips, 8.5-9.5 oz",3,null,"varies"]
["***",null,null,null,null,"Rold Gold Pretzels, 7-16 oz",3,null,"varies"]
[]
["*****",null,null,null,null,"Got a list question? Want to check if next week's list is ready? Our listmakers answer questions and post our \"preview\" lists at PYP."]
[]
["****",null,null,null,null,"If you have questions about these, or to tell us about one not listed here, use this thread at PYP",null,"Hint: These deals can be VERY HOT if the item is also on sale, and you use manufacturers coupons when buying them!"]
[null,null,null,null,null,null,null,"Smiths checkout voucher offers"]
[null,null,null,null,null,null,null,"-AKA \"Catalina\" deals"]
["****",null,null,null,null,"California Pizza Kitchen",null,"Buy (2) get $1 voucher"]
[null,null,null,null,null,null,null,"Buy (3) get $2 voucher"]
[null,null,null,null,null,"Expires: 3/18/12 ",null,"Buy (4)+ get $3 voucher"]
[null,null,null,null,null,null,null,"on your next shopping trip"]
["****",null,null,null,null,"Canine Carry Outs Dog Snacks",null,"Buy (2) get .75 voucher"]
[null,null,null,null,null,null,null,"on your next shopping trip"]
[null,null,null,null,null,"Expires: 3/18/12 "]
["****",null,null,null,null,"Chex Mix or Chex 100 Calorie Snack 4.5 oz or more",null,"Buy (3) get $1 voucher"]
[null,null,null,null,null,null,null,"Buy (4) get $2 voucher"]
[null,null,null,null,null,"Expires: 3/18/12 ",null,"Buy (5)+ get $3 voucher"]
[null,null,null,null,null,null,null,"on your next shopping trip"]
["****",null,null,null,null,"Coffee-Mate Creamer, 32 oz",null,"Buy (2) get $1.25 voucher"]
[null,null,null,null,null,null,null,"on your next shopping trip"]
[null,null,null,null,null,"Expires: 3/4/12"]
["****",null,null,null,null,"Cottonelle 12 pack Toilet Paper",null,"Buy (2) get $2 voucher"]
[null,null,null,null,null,null,null,"Buy (3) get $3 voucher"]
[null,null,null,null,null,"Expires: 3/4/12 ",null,"on your next shopping trip"]
["****",null,null,null,null,"Dole Fruit Bowls, Gels, Parfaits, or Crisps",null,"Buy (3) get .50 voucher"]
[null,null,null,null,null,null,null,"Buy (4) get .75 voucher"]
[null,null,null,null,null,"Expires: 3/18/12 ",null,"Buy (5)+ get $1 voucher"]
[null,null,null,null,null,null,null,"on your next shopping trip"]
["****",null,null,null,null,"Dole Mandarin Oranges",null,"Buy (4)+ get .75 voucher"]
[null,null,null,null,null,null,null,"on your next shopping trip"]
[null,null,null,null,null,"Expires: 3/18/12"]
["****",null,null,null,null,"Dole Pineapple, 20 oz cans",null,"Buy (4)+ get .75 voucher"]
[null,null,null,null,null,null,null,"on your next shopping trip"]
[null,null,null,null,null,"Expires: 3/18/12"]
["****",null,null,null,null,"Dole Pineapple, 8 oz cans",null,"Buy (4)+ get .50 voucher"]
[null,null,null,null,null,null,null,"on your next shopping trip"]
[null,null,null,null,null,"Expires: 3/18/12"]
["****",null,null,null,null,"Dole Real Fruit Bites (Pineapple, Mango or Apple)",null,"Buy (2)+ get $1 voucher"]
[null,null,null,null,null,null,null,"on your next shopping trip"]
[null,null,null,null,null,"Expires: 3/18/12"]
["****",null,null,null,null,"Dole Tropical Fruit Cans",null,"Buy (4)+ get $1 voucher"]
[null,null,null,null,null,null,null,"on your next shopping trip"]
[null,null,null,null,null,"Expires: 3/18/12 "]
["****",null,null,null,null,"Fiber One Chewy Bars, Fiber One 90 Calorie Chewy Bars, or Fiber One 90 Calorie Brownies",null,"Buy (3) get $1 voucher"]
[null,null,null,null,null,null,null,"Buy (4) get $2 voucher"]
[null,null,null,null,null,"Expires: 3/14/12",null,"Buy (5)+ get $3 voucher"]
[null,null,null,null,null,null,null,"on your next shopping trip"]
["****",null,null,null,null,"Gortons Products 6.3 – 24.5 oz",null,"Buy ($10) get $2 voucher"]
[null,null,null,null,null,"Van De Kamp 18 – 24.6 oz",null,"Buy ($15) get $3 voucher"]
[null,null,null,null,null,"MorningStar Farms Products 8 – 9.5oz",null,"Buy ($20) get $5 voucher"]
[null,null,null,null,null,"Stouffers Macaroni and Cheese 40 oz",null,"on your next shopping trip"]
[null,null,null,null,null,"Ore-Ida Products 19 – 32 oz"]
[null,null,null,null,null,"Birds Eye Vegetables 10 – 16 oz"]
[]
[null,null,null,null,null,"Expires: 3/10/12"]
["****",null,null,null,null,"Listerine Pocketpaks, 72 ct or more",null,"Buy (2) get $2 voucher"]
[null,null,null,null,null,null,null,"Buy (3) get $4.00 voucher"]
[null,null,null,null,null,"Expires: 3/18/12 ",null,"Buy (4)+ get $4 voucher"]
[null,null,null,null,null,null,null,"on your next shopping trip"]
["****",null,null,null,null,"Nature Valley Granola Bars (6 ct or more), Nature Valley Granola Nut Clusters or Nature Valley Granola Thins",null,"Buy (3) get $1 voucher"]
[null,null,null,null,null,null,null,"Buy (4) get $2.00 voucher"]
[null,null,null,null,null,"Expires: 3/18/12 ",null,"Buy (5)+ get $3 voucher"]
[null,null,null,null,null,null,null,"on your next shopping trip"]
["****",null,null,null,null,"Post Pebbles Cereal or Treats, 6 oz or more",null,"Buy (3) get $2 voucher"]
[null,null,null,null,null,null,null,"Buy (4) get $3.00 voucher"]
[null,null,null,null,null,"Expires: 3/25/12",null,"Buy (5)+ get $4 voucher"]
[null,null,null,null,null,null,null,"on your next shopping trip"]
["****",null,null,null,null,"Rembrandt Kits, Paste, or Rinse",null,"Buy ($7) get $2 voucher"]
[null,null,null,null,null,null,null,"Buy ($15) get $4 voucher"]
[null,null,null,null,null,"Expires: 3/18/12",null,"Buy ($25)+ get $8 voucher"]
[null,null,null,null,null,null,null,"on your next shopping trip"]
["****",null,null,null,null,"Right Guard Total Defense 5 Products",null,"Buy (2) get $1 voucher"]
[null,null,null,null,null,null,null,"Buy (3) get $2 voucher"]
[null,null,null,null,null,"Expires: 3/18/12 ",null,"Buy (4)+ get $4 voucher"]
[null,null,null,null,null,null,null,"on your next shopping trip"]
["****",null,null,null,null,"Swanson Canned Chicken",null,"Buy (2) get $1 voucher"]
[null,null,null,null,null,null,null,"Buy (3)+ get $1.50 voucher"]
[null,null,null,null,null,"Expires: 3/18/12 ",null,"on your next shopping trip"]
["****",null,null,null,null,"Tasters Choice Coffee or Nescafe Clasico Coffee",null,"Buy (2) get $1 voucher"]
[null,null,null,null,null,null,null,"Buy (3) get $2.00 voucher"]
[null,null,null,null,null,"Expires: 3/18/12 ",null,"Buy (4)+ get $3 voucher"]
[null,null,null,null,null,null,null,"on your next shopping trip"]
["****",null,null,null,null,"Viactiv Soft Chews",null,"Buy (1) get $3 voucher"]
[null,null,null,null,null,null,null,"on your next shopping trip"]
[null,null,null,null,null,"Expires: 3/18/12"]
["****",null,null,null,null,"Yoplait Trix Yogurt Multipacks",null,"Buy (2)+ get $1 voucher"]
[null,null,null,null,null,null,null,"on your next shopping trip"]
[null,null,null,null,null,"Expires: 3/14/12 "]
[]
["*****",null,null,null,null,"Todays date: ","Sale","We are not affiliated with this store.  The store's ad is the only OFFICIAL authority"]
["toggle 4 and 5 star rows",null,null,null,null,null,"Price"]
["Stock up scale",null,null,null,null,"How to use this list",null,"Printable coupons:","Bottom line"]
[null,null,null,null,null,null,null,"Group A  Group B  Group C  Singles"]
[null,null,null,null,null,"Walgreens"]
[null,null,null,null,null,null,null,"Coupon Index"]
[null,null,null,null,null,"Current list"]
[null,null,null,null,null,"-This list is valid during the dates listed below"]
["*****",null,null,null,null,"Valid Dates: 4/8 - 4/14",null,"This list is made by Aimee. She answers list questions in this thread at PYP."]
["*****",null,null,null,null,"Questions on Walgreens coupon policy and how the Register Rewards work?",null,"See the Walgreens Coupon Policy on their website This Link"]
[null,null,null,null,null,"See FAQ's Here"]
["*****",null,null,null,null,"Walgreens Pharmacy - Transfer a prescription and receive a FREE $25 Walgreens Card - Expires 4-30-12",null,"With in-ad store coupon"]
["***",null,null,null,null,"Oscar Mayer Ready to Serve Bacon 15 slices","2 for 5.00",null,2.5]
[null,null,null,null,null,"Limit 4"]
[null,null,null,null,null,"First item will ring up $2.59, second item will ring up $2.41"]
["***",null,null,null,null,"Dasani Water 16.9 oz 24 pk",3.99,null,3.99]
[null,null,null,null,null,"Limit 3"]
["***",null,null,null,null,"Dunkin Donuts Coffee 12 oz",7.49,"Dunkin Donuts Coffee, any 11 oz. or larger bag $1/1 (06-30-12) RP-4/1",6.49]
[null,null,null,null,null,"Limit 2"]
["***",null,null,null,null,"Folgers Coffee 33.9 oz, Special Roast or Gourmet Supreme 27.8 oz or Decaf 22.6 oz",8.99,"Folgers Coffee Products, any $1/2 (04-30-12) RP-3/25",8.49]
["***",null,null,null,null,"Folgers Instant Coffee 8 oz Classic Roast or Decaf",4.99,null,4.99]
[null,null,null,null,null,"Limit 2"]
["***",null,null,null,null,"Lipton Green Tea 12 pk 16.9 oz",4.99,"With in-ad store coupon",4.99]
[null,null,null,null,null,"Limit 3"]
["***",null,null,null,null,"Pepsi 12 pk products","3 for 12.00",null,4]
[null,null,null,null,null,"Limit 3"]
[null,null,null,null,null,"First and second items will ring up $4.49, third item will ring up $3.02"]
["****",null,null,null,null,"Pepsi 2 liter products","4 for 5.00",null,1.25]
[null,null,null,null,null,"First, second and third items will ring up $1.49, fourth item will ring up $0.53"]
["*****",null,null,null,null,"Pepsi Next 12 pk",2.99,"STORE COUPON, Walgreens, Pepsi Next 12 pk (You can also find this coupon in the Savings Book in-store) (4-28-12) $1/1 (active) This Link-04/03",1.99]
["***",null,null,null,null,"Vitamin or Smart Water 20 or 23.7 oz",1,"With in-ad store coupon",1]
[null,null,null,null,null,"Limit 3"]
["***",null,null,null,null,"Hellmanns Mayonnaise 22 or 30 oz",3.49,"With in-ad store coupon",3.49]
[null,null,null,null,null,"Limit 3"]
["****",null,null,null,null,"Hersheys Candy Bar Singles 1.4 to 2.5 oz",0.59,null,0.59]
["****",null,null,null,null,"Kelloggs Pop-Tarts 8 pk","3 for 5.00","Kelloggs Pop-Tarts or Pop-Tarts Mini Crisps, any 6 ct or larger $1/3 (active) Group A-04/03 Print it twice",1.34]
[null,null,null,null,null,"First and second items will ring up $1.99, third item will ring up $1.02"]
["****",null,null,null,null,"Kelloggs Pop-Tarts 8 pk","3 for 5.00","Kelloggs Pop-Tarts Toaster Pastries, any flavor 8 ct. or larger $1/3 (04-15-12) RP-3/4",1.34]
[null,null,null,null,null,"First and second items will ring up $1.99, third item will ring up $1.02"]
["****",null,null,null,null,"Nice or Walgreens Candy 1.75 to 9.5 oz",0.69,"With in-ad store coupon",0.69]
[null,null,null,null,null,"Limit 3"]
["***",null,null,null,null,"Progresso Soup 18.5 or 19 oz","4 for 5.00","Progresso Soups, any flavor cans $1/4 (04-21-12) SS-2/26",1]
[null,null,null,null,null,"Must buy 4 to receive discount"]
["***",null,null,null,null,"Ragu Pasta Sauce 16 to 24 oz",2,"With in-ad store coupon",2]
[null,null,null,null,null,"Limit 4"]
["***",null,null,null,null,"Walgreens Sweetener 100 packets",0.99,null,0.99]
["****",null,null,null,null,"Wrigleys Orbit Gum 14 piece",0.69,"With in-ad store coupon",0.69]
[null,null,null,null,null,"Limit 6"]
["***",null,null,null,null,"DiGiorno Pizza 12 in","2 for 11.00",null,5.5]
[null,null,null,null,null,"Limit 4"]
[null,null,null,null,null,"First item will ring up $5.99, second item will ring up $5.01"]
["***",null,null,null,null,"Aleve Pain Relief 100 ct Caplets or Tablets",7.99,"Aleve Product, any 80 ct or larger (excludes Aleve-D) $2/1 (active) Group A-04/03 Print it twice",5.99]
["***",null,null,null,null,"Aleve Pain Relief 100 ct Caplets or Tablets",7.99,"Aleve product, any 20ct. or larger excluding Aleve-D products $1/1 (06-30-12) SS-3/18",6.99]
["***",null,null,null,null,"Banana Boat Sun or After-Sun Care",6.99,null,65.989999999999995]
["***",null,null,null,null,"Eucerin Lotion or Skin Care","2 for 11.69","Eucerin Product, any 13.5 oz or larger $2/1 (active) Group A-02/09 Print it twice",3.85]
[]
[null,null,null,null,null,"Ad says B1 G1 50% off"]
[null,null,null,null,null,"Our price check- 13.5 oz - Reg $7.79"]
["***",null,null,null,null,"Hawaiian Tropic Sun or After-Sun Care",6.99,"Hawaiian Tropic Sun Care Product, any 4 oz or larger excluding lip balm $1/1 (active) This Link-08/21",5.99]
["***",null,null,null,null,"John Frieda Precision Foam Hair Colour",11.99,"Extra Promo: John Frieda Shampoo or Conditioner 8.45 oz FREE with purchase (6.49 value)","9.99 +"]
[]
[null,null,null,null,null,null,null,"John Frieda Precision foam Colour Product, any $2/1 (04-28-12) SS-3/4"]
["***",null,null,null,null,"LOreal Preference Hair Color",7.99,"With in-ad store coupon",5.99]
[null,null,null,null,null,"Limit 3"]
[null,null,null,null,null,null,null,"Also use manufacturer coupon: LOreal Preference, any shade $2/1 (05-13-12) RP-3/18"]
[]
[null,null,null,null,null,null,null,"Walgreens allows you to use a manufacturers coupon AND Store coupon on the same purchase"]
["***",null,null,null,null,"Refresh or Refresh Optive Eye Care 2 pk .5 oz ea or 50 pk .01 oz ea",10.99,null,10.99]
["***",null,null,null,null,"Sensodyne Toothpaste 4 oz",4.99,"STORE COUPON, Walgreens, Sensodyne Toothpaste 4 oz (You can also find this coupon in the Savings Book in-store) (4-28-12) $1/1 (active) This Link-04/03",3.99]
["***",null,null,null,null,"Splat Hair Color Kits",6.99,"With in-ad store coupon",6.99]
[null,null,null,null,null,"Limit 3"]
["****",null,null,null,null,"Ajax Dish Liquid 16 oz",0.89,"With in-ad store coupon",0.89]
[null,null,null,null,null,"Limit 3"]
["***",null,null,null,null,"Hefty One Zip Bags - Freezer 13 pk or Storage 17 or 22 pk",3.49,"Hefty One Zip Bags Buy 1 Get 1 FREE in-ad store coupon",1.75]
[null,null,null,null,null,"Limit 4"]
["****",null,null,null,null,"Kleenex Facial Tissue 24, 70 or 100 sheets",0.99,"Kleenex Facial Tissue, any Packs or Boxes .30/3 (04-22-12) SS-3/11",0.89]
["***",null,null,null,null,"Pampers Cruisers Super Pack Diapers",24.99,"Pampers Cruisers or Baby Dry Diapers, any excluding trial or travel sizes $1.50/1 (active) Group A-03/02 Print it twice",22.99]
["***",null,null,null,null,"Pampers Cruisers Super Pack Diapers",24.99,"Pampers Diapers or Pants $1/2 Bags or (1) Box, excludes trial/travel size (04-30-12) PG-4/1",23.99]
["***",null,null,null,null,"Pampers Wipes 192 or 216 pk",24.99,"Pampers Wipes 60 ct or larger, excludes trial/travel size .50/1 (04-30-12) PG-4/1",24.49]
["***",null,null,null,null,"Pampers Wipes 192 or 216 pk",5.99,"Pampers Wipes, any 60 ct or larger .75/1 (active) Group A-03/02 Print it twice",5.24]
["***",null,null,null,null,"Walgreens Baby Wipes 64 to 78 pk",1.99,null,1.99]
["***",null,null,null,null,"Walgreens Premium Diapers, Sleep Pants or Training Pants Jumbo Pack",5.99,null,5.99]
[]
["*****",null,null,null,null,"The following group of items are Buy 1 Get 1 50% off - MIX AND MATCH"]
["***",null,null,null,null,"Revlon Colorstay Pressed Powder","2 for 14.99","Revlon Face product, any $2/1 (05-06-12) SS-4/1",5.5]
[]
[null,null,null,null,null,"Our price check - Reg $9.99"]
["*****",null,null,null,null,"Revlon Emery Boards 10 ct","2 for 2.24","Revlon Beauty Tool $1/1 (04-30-12) SS-4/1",0.12]
[]
[null,null,null,null,null,"Our price check - Reg $1.49"]
["***",null,null,null,null,"Revlon Luxurious Color Diamond Lust Eye Shadow","2 for 7.49","Revlon Color Cosmetic, any $1/1 (05-06-12) SS-4/1 AND (04-15-12) SS-3/11",2.75]
[]
[null,null,null,null,null,"Our price check - Reg $4.99"]
[]
["***",null,null,null,null,"The following group of items are Buy 1 Get 1 50% off - MIX AND MATCH"]
["***",null,null,null,null,"Aussie Shampoo or Conditioner 8 to 13.5 oz","2 for 6.74",null,3.37]
[]
[null,null,null,null,null,"Our price check - Reg $4.49"]
["***",null,null,null,null,"Herbal Essences Shampoo or Conditioner or Herbal Essences or Aussie Stylers 8 to 13.5 oz","2 for 5.99","Herbal Essences or Aussie products, excludes trial/travel size $1/2 (04-30-12) PG-4/1",2.5]
[]
[null,null,null,null,null,"Our price check - Reg $3.99"]
[]
["*****",null,null,null,null,"The following group of items are Buy 1 Get 1 50% off - MIX AND MATCH"]
["***",null,null,null,null,"Clairol Gray Solution Hair Color","2 for 17.24","Clairol Hair Color, excludes trial/travel size $1/1 (04-30-12) PG-4/1",7.62]
[]
[null,null,null,null,null,"Our price check - Reg $11.49"]
["****",null,null,null,null,"Clairol Nice n Easy Hair Color","2 for 10.19","Clairol Hair Color, excludes trial/travel size Citrucal product, any $2/1 (04-30-12) SS-3/18",3.1]
[]
[null,null,null,null,null,"Our price check - Reg $6.79"]
[]
["*****",null,null,null,null,"The following group of items are Buy 1 Get 1 50% off - MIX AND MATCH"]
["***",null,null,null,null,"Sally Hansen Diamond Strength Polish","2 for 7.49",null,3.75]
[]
[null,null,null,null,null,"Our price check - Reg $4.99"]
["****",null,null,null,null,"Sally Hansen Moisturetwists 2-in-1 Primer Color Lipcolor","2 for 7.49","Sally Hansen Lip Product, any $2/1 (active) Group A-03/06 Print it twice",1.75]
[]
[null,null,null,null,null,"Our price check - Reg $4.99"]
[]
["***",null,null,null,null,"The following group of items are Buy 1 Get 1 50% off - MIX AND MATCH"]
["***",null,null,null,null,"Always Radiant Maxi Pads 12 or 16 pk","2 for 8.24","Always Infinity, 12 ct. or higher including Always Radiant Infinity $1/1 (04-30-12) PG-4/1",3.12]
[]
[null,null,null,null,null,"Our price check - Reg $5.49"]
["***",null,null,null,null,"Tampax Radiant Tampons 16 pk","2 for 8.24","Tampax Pearl, Tampax Pearl Compak, or Tampax Radiant 16 ct. or higher $1/1 (04-30-12) PG-4/1",3.12]
[]
[null,null,null,null,null,"Our price check - Reg $5.49"]
[]
["***",null,null,null,null,"The following group of items are Buy 1 Get 1 50% off - MIX AND MATCH"]
["***",null,null,null,null,"Bausch and Lomb Ocuvite Eye Care 50 to 240 ct","2 for 25.49","Bausch and Lomb Ocuvite Product, any $5/1 (04-30-12) SS-2/12",7.75]
[]
[null,null,null,null,null,"Our price check - Reg $16.99"]
["***",null,null,null,null,"Bausch and Lomb PreserVision Eye Care 60 ct","2 for 29.99",null,15]
[]
[null,null,null,null,null,"Our price check - Reg $19.99"]
["***",null,null,null,null,"Schiff MegaRed 60 ct","2 for 35.99",null,18]
[]
[null,null,null,null,null,"Our price check - Reg $23.99"]
["***",null,null,null,null,"Schiff Move Free 80 to 120 ct","2 for 44.99","Schiff Move Free Product, any $5/1 (04-30-12) JohnsonsSS-1/8",17.5]
[]
[null,null,null,null,null,"Our price check - Reg $29.99"]
[]
["*****",null,null,null,null,"The following group of items are Buy 1 Get 1 FREE - MIX AND MATCH",null,"Walgreens allows you to use 1 coupon on EACH item on a B1 G1 FREE sale"]
["*****",null,null,null,null,"Summers Eve Cleansing Cloths 16 pk or Douche 2 to 4 pk","2 for 2.99","Summers Eve Products, any $2/2 (active) This Link-04/06",0.5]
[]
[null,null,null,null,null,"Our price check - Reg $2.99"]
[]
["*****",null,null,null,null,"The following group of items are Buy 1 Get 1 FREE - MIX AND MATCH",null,"Walgreens allows you to use 1 coupon on EACH item on a B1 G1 FREE sale"]
["****",null,null,null,null,"Nature Made B-1 100 mg 100 ct","2 for 5.99","Nature Made Vitamin B, any $1/1 (active) This Link-03/18",2]
[]
[null,null,null,null,null,"Our price check - Reg $5.99"]
["****",null,null,null,null,"Nature Made D3 400 IU 100 ct","2 for 4.99","Nature Made Vitamin D, any $1/1 (active) This Link-03/18",1.5]
[]
[null,null,null,null,null,"Our price check - Reg $4.99"]
["****",null,null,null,null,"Nature Made Potassium Gluconate 550 mg 100 ct","2 for 4.99","Nature Made Product, any $1/1 (active) This Link-09/05",1.5]
[]
[null,null,null,null,null,"Our price check - Reg $4.99"]
[]
["***",null,null,null,null,"The following group of items are Buy 1 Get 1 FREE - MIX AND MATCH",null,"Walgreens allows you to use 1 coupon on EACH item on a B1 G1 FREE sale"]
["***",null,null,null,null,"Riesen Candy 2.75 to 5.5 oz","2 for 2.49",null,1.25]
["***",null,null,null,null,"Toffifay Candy 2.75 to 5.5 oz","2 for 2.49",null,1.25]
["***",null,null,null,null,"Werthers Candy 2.75 to 5.5 oz","2 for 2.49",null,1.25]
[]
["***",null,null,null,null,"The following group of items must be purchased in groups of 2 to receive discount."]
[null,null,null,null,null,"Limit 4"]
[null,null,null,null,null,"First item will ring up $2.99, second item will ring up $1.01"]
["***",null,null,null,null,"Godiva Chocolate Bar 3.5 oz","2 for 4.00",null,2]
["***",null,null,null,null,"Lindt Chocolate Bar 3.5 oz","2 for 4.00",null,2]
["***",null,null,null,null,"Werthers Chocolate Bar 3.5 oz","2 for 4.00",null,2]
[]
["***",null,null,null,null,"The following group of items have a COMBINED LIMIT OF 4 TOTAL, MIX OR MATCH"]
["***",null,null,null,null,"Hersheys Miniatures or Kisses Candy 19.75 oz",3.99,"Hersheys Kisses, Reeses, Hersheys Miniatures, Hersheys Eggs Cadbury or Whoppers bags candy, any 8 oz. or larger $2/3 (EXPIRES 04-08-12) SS-3/25",3.32]
["***",null,null,null,null,"M and Ms Candy 19.2 oz",3.99,null,3.99]
[]
["***",null,null,null,null,"The following group of items have a COMBINED LIMIT OF 4 TOTAL, MIX OR MATCH",null,"With in-ad store coupon"]
["***",null,null,null,null,"Degree Antiperspirant/Deodorant 2.6 to 3 oz",1.99,null,1.99]
["***",null,null,null,null,"Dove Antiperspirant/Deodorant 2.6 to 3 oz",1.99,null,1.99]
[]
["***",null,null,null,null,"The following group of items have a COMBINED LIMIT OF 3 TOTAL, MIX OR MATCH"]
["***",null,null,null,null,"Breyers Ice Cream 48 oz",2.99,null,2.99]
["***",null,null,null,null,"Magnum Ice Cream Bars 3 pk",2.99,null,2.99]
["***",null,null,null,null,"Reeses Ice Cream Cups 6 pk",2.99,null,2.99]
[]
["*****",null,null,null,null,"REGISTER REWARDS:"]
[null,null,null,null,null,"The following items will earn you a voucher good on your next shopping purchase."]
["***",null,null,null,null,"All Laundry Detergent 84 or 96 loads",11.99,"Receive a $1.00 voucher with purchase",9.99]
[null,null,null,null,null,"Limit 1 voucher"]
[null,null,null,null,null,null,null,"Manufacturers coupon- All Mighty Pacs or All Liquid Laundry Detergent, any 24 loads or larger $1/1 (active) Group C-04/01 Print it twice"]
["***",null,null,null,null,"All Laundry Detergent 84 or 96 loads",11.99,"Receive a $1.00 voucher with purchase",9.99]
[null,null,null,null,null,"Limit 1 voucher"]
[null,null,null,null,null,null,null,"Manufacturers coupon- All Mighty Pacs or All Liquid Laundry Detergent, any 24 loads or larger $1/1 (04-15-12) RP-3/4 AND (06-02-12) RP-4/1"]
["****",null,null,null,null,"Reach Total Care Toothbrush",2.99,"Receive a $2.00 voucher with purchase",0.99]
[null,null,null,null,null,"Limit 1 voucher"]
["***",null,null,null,null,"Similac Infant Formula 22.5 to 23.2 oz",24.99,"Receive a $2.00 voucher with purchase",22.99]
[null,null,null,null,null,"Limit 1 voucher"]
[]
["*****",null,null,null,null,"Buy 4 of these products and receive a $3.00 voucher good on your next shopping purchase.",null,"Sale is essentially a $0.75 off discount on each item. Sale price indicated is BEFORE/AFTER voucher is calculated."]
[null,null,null,null,null,"Limit 1 voucher"]
[null,null,null,null,null,"First, second and third items will ring up $2.99, fourth item will ring up $1.03"]
["****",null,null,null,null,"Cheez-It Crackers 9 oz","2.50/1.75","Sunshine Cheez-It Baked Snack Crackers, any .70/1 (active) This Link-03/23",1.05]
["****",null,null,null,null,"Keebler Club Crackers 11.5 to 16 oz","2.50/1.75","Keebler Club Crackers, any .70/1 (active) Group A-04/01 Print it twice",1.05]
["***",null,null,null,null,"Kelloggs Nutri-Grain Bars 8 pk","2.50/1.75",null,1.75]
["***",null,null,null,null,"Kelloggs Rice Krispies Treats 8 pk","2.50/1.75",null,1.75]
["****",null,null,null,null,"Kelloggs Special K Bars 5 or 6 pk","2.50/1.75","Kelloggs Special K Bars or FiberPlus Chewy Bars, any 5 ct or larger $1/2 (active) Group A-04/03 Print it twice",1.25]
["****",null,null,null,null,"Kelloggs Special K Cracker Crisps 4 oz","2.50/1.75","Kelloggs Special K Cracker Chips, any 4 oz or larger .70/1 (active) Group A-04/03 Print it twice",1.05]
[]
["*****",null,null,null,null,"Buy 1 of these products and receive a $1.50 voucher good on your next shopping purchase.",null,"Sale is essentially a $1.50 off discount on each item. Sale price indicated is BEFORE/AFTER voucher is calculated."]
[null,null,null,null,null,"Limit 1 voucher "]
["****",null,null,null,null,"Finish Tabs or Gelpacs 20 pk","3.99/2.49","Finish Powerball Tabs or Gelpacs, any .75/1 (04-15-12) SS-3/11",1.74]
["***",null,null,null,null,"Jet-Dry Rinse 8.45 oz","3.99/2.49","Finish Jet-Dry Rinse Agent or Drying Agent, any .50/1 (05-06-12) SS-3/11",1.99]
[]
["*****",null,null,null,null,"Buy 2 of these products and receive a $1.00 voucher good on your next shopping purchase.",null,"Sale is essentially a $0.50 off discount on each item. Sale price indicated is BEFORE/AFTER voucher is calculated."]
[null,null,null,null,null,"Limit 1 voucher"]
[null,null,null,null,null,"First item will ring up $3.19, second item will ring up $2.81"]
["***",null,null,null,null,"Glade Carpet and Room Deodorizer 32 oz","3.00/2.50",null,2.5]
["***",null,null,null,null,"Glade Decor Scents Refills 2 pk","3.00/2.50",null,2.5]
["****",null,null,null,null,"Glade Decor Scents Warmer","3.00/2.50","Glade Decor Scents holder, any $1/1 or (2) refill packs (05-05-12) SS-3/25",1.5]
["***",null,null,null,null,"Glade Relaxing Moments Spray 9.7 oz","3.00/2.50","Glade Premium Room Spray, any 9.7 oz. .55/1 (05-05-12) SS-3/25",1.95]
[]
["***",null,null,null,null,"Buy 1 of these products and receive a $3.00 voucher good on your next shopping purchase.",null,"Sale is essentially a $3.00 off discount on each item. Sale price indicated is BEFORE/AFTER voucher is calculated."]
[null,null,null,null,null,"Limit 1 voucher "]
["***",null,null,null,null,"Schick Intuition Razor System or 3 or 4 pk Cartridges","8.99/5.99",null,5.99]
["***",null,null,null,null,"Schick Quattro Razor System or 3 or 4 pk Cartridges","8.99/5.99",null,5.99]
[]
["*****",null,null,null,null,"Buy $10 of these products and receive a $2 voucher good on your next shopping purchase.",null,"Sale is essentially a 20% off discount on each item. Sale price indicated is BEFORE/AFTER voucher is calculated. Use the 'before' price to reach $10."]
["***",null,null,null,null,"Nice Bath Tissue 12 rolls","2 for 10.00/4.00",null,4]
[null,null,null,null,null,"First item will ring up $5.49, second item will ring up $4.51"]
["***",null,null,null,null,"Nice Honey 32 oz","5.00/4.00",null,4]
["***",null,null,null,null,"Nice Paper Towels 6 rolls","2 for 10.00/4.00",null,4]
[null,null,null,null,null,"First item will ring up $5.49, second item will ring up $4.51"]
["***",null,null,null,null,"Nice Peanut Butter 18 oz","2 for 5.00/2.00",null,2]
[null,null,null,null,null,"First item will ring up $2.99, second item will ring up $2.01"]
["****",null,null,null,null,"Nice Tableware - Plastic Cups 16 pk, Designer Bowls 24 pk or Designer Plates 24 to 48 pk","2 for 3.00/1.20",null,1.2]
[null,null,null,null,null,"First item will ring up $1.79, second item will ring up $1.21"]
["***",null,null,null,null,"Nice Trash Bags 18 to 80 pk, 13 to 55 gal","5.00/4.00",null,4]
[]
["*****",null,null,null,null,"Monthly Register Reward Deals",null,"Valid thru 4/28"]
["****",null,null,null,null,"Gillette Venus with Olay Razor",8.99,"Receive a $4.00 voucher with purchase",2.99]
[null,null,null,null,null,"Limit 1 voucher"]
[null,null,null,null,null,null,null,"Manufacturers coupon- Gillette Venus Razor, Refill or Disposable, excludes trial/travel size $2/1 (04-30-12) PG-4/1"]
["*****",null,null,null,null,"Luster Toothpaste 2.6 or 8 oz",4.99,"Receive a $4.00 voucher with purchase",0.24]
[null,null,null,null,null,"Limit 1 voucher"]
[null,null,null,null,null,"Note - $4.99 sale price this week only, $5.99 after that",null,"Manufacturers coupon- Luster White7 Toothpaste, any .75/1 (04-30-12) SS-3/18"]
[]
["*****",null,null,null,null,"Got a list question? Want to check if next week's list is ready? Our listmakers answer questions and post our \"preview\" lists at PYP."]
[]
["*****",null,null,null,null,"Todays date: ","Sale","We are not affiliated with this store.  The store's ad is the only OFFICIAL authority"]
["toggle 4 and 5 star rows",null,null,null,null,null,"Price"]
["Stock up scale",null,null,null,null,"How to use this list",null,"Printable coupons:","Bottom line"]
[null,null,null,null,null,null,null,"Group A  Group B  Group C  Singles"]
[null,null,null,null,null,"Rite Aid"]
[null,null,null,null,null,"Current list",null,"Coupon Index"]
[null,null,null,null,null,"-This list is valid during the dates listed below"]
["*****",null,null,null,null,"Valid Dates: 4/8 - 4/14",null,"Rite Aid coupon policy-"]
[null,null,null,null,null,null,null,"Rite Aid will accept a Manufacturers coupon from a Rite Aid source (The Ad or online Video Values) -IN ADDITION TO- a Manufacturers coupon from another source -this means YOU CAN USE 2 MANUFACTURERS COUPONS for the same purchase!"]
[null,null,null,null,null,"This list is made by Jen. See the Rite Aid thread in this section at PYP for questions and more Rite-Aid info. ALL RITE AID DEALS REQUIRE THAT YOU HAVE A RITE AID LOYALTY CARD"]
[null,null,null,null,null,null,null,"If an Item is listed as B1 G1 FREE in the RITE AID Ad, only the PAID item can have a coupon applied to it. This is a recent change."]
[null,null,null,null,null,"Rite Aid limits the purchase of any particular item to 4 per household. Ask your store manager if you wish further clarification, stores may vary."]
["***",null,null,null,null,"Altoids 0.37-0.76 oz",0.99,null,0.99]
["***",null,null,null,null,"Dove Miniatures 8.5-9.5 oz",2.99,null,2.99]
["***",null,null,null,null,"Hersheys Bliss 8.6-9.6 oz",2.99,"STORE COUPON, Rite Aid, Hersheys Bliss Chocolates, any bags (You can only print ONE of these, Rite Aid will let you use this IN ADDITION to another manufacturers coupon for the same purchase!) Print by 4/28 (expires 5/12) $1/2 (active) This Link-04/03",2.4900000000000002]
["***",null,null,null,null,"Hersheys Miniatures, Nuggets, Drops, Pieces or Minis 8-12 oz",2.99,null,2.99]
["****",null,null,null,null,"Kelloggs Frosted Mini-Wheats16-20 oz",2.37,"Kelloggs Frosted Mini-Wheats Cereal, any $1/2 (active) This Link-03/18",1.87]
["****",null,null,null,null,"Kelloggs Raisin Bran 16-20 oz",2.37,"Kellogs Raisin Bran or Smart Start Cereal, any 14.7 oz or larger $1/2 (active) Group A-04/03 Print it twice",1.87]
["***",null,null,null,null,"Kelloggs Nutri-Grain Bars 8 ct",2.37,null,2.37]
["****",null,null,null,null,"Kelloggs Pop Tarts 8 ct",1.99,"Kelloggs Pop-Tarts or Pop-Tarts Mini Crisps, any 6 ct or larger $1/3 (active) Group A-04/03 Print it twice",1.67]
["****",null,null,null,null,"Kelloggs Rice Krispies, Frosted Flakes, Froot Loops, Apple Jacks, Corn Pops, or Raisin Bran 8.7-16.5 oz",1.99,"Kelloggs Cereal, any 8.7 oz or larger $1/3 (active) Group A-04/03 Print it twice",1.67]
["***",null,null,null,null,"Kelloggs Rice Krispy Treats 8 ct",1.99,null,1.99]
["***",null,null,null,null,"M and Ms 9.9-12.6 oz",2.99,null,2.99]
["****",null,null,null,null,"Mentos UP2U Gum 14-15 ct",0.99,"Mentos UP2U Gum, any packs $1/2 (05-25-12) SS-3/25",0.5]
["***",null,null,null,null,"Orbit Mist Gum 14-15 ct",0.99,null,0.99]
["***",null,null,null,null,"Reeses Pieces 15 oz",2.99,null,2.99]
["***",null,null,null,null,"Stride Shift, Spark, or Shawn White Gum 14-15 ct",0.99,null,0.99]
["***",null,null,null,null,"Tic Tacs 1 oz",0.99,null,0.99]
["***",null,null,null,null,"Trident Xtra Care or Layers Gum 14-15 ct",0.99,null,0.99]
["***",null,null,null,null,"Wrigleys 5 Gum 14-15 ct",0.99,null,0.99]
["****",null,null,null,null,"Allegra Allergy Relief 15 ct Tablets",11.99,"Allegra, any excluding Allegra-D and Childrens Allegra $7/1 EXPIRES (04-08-12) SS-4/1",4.99]
["***",null,null,null,null,"Allegra Allergy Relief 15 ct Tablets",11.99,"Allegra Allergy 30 ct or higher, Allegra-D 24 hr 10 ct or higher or Allegra-D 12 hr 20 ct or higher $4/1 (active) Group B-03/18 Print it twice",7.99]
["***",null,null,null,null,"Allegra -D Allergy 10 ct",11.99,"Allegra Allergy 5, 12 or 15 ct, Childrens Allegra, Allegra-D 24 hr 5 ct or Allegra-D 12 hr 10 ct $2/1 (active) Group B-03/18 Print it twice",9.99]
["***",null,null,null,null,"Always Maxi Pads 20-48 Ct",5.99,"Always Pads, Clean or Feminine Cleansing Cloths, excludes trial/travel size .50/1 (04-30-12) PG-4/1",5.49]
["***",null,null,null,null,"Always Panti-liners 68-80 ct",5.99,"Always Pantiliners, 30 ct. or higher .50/1 (04-30-12) PG-4/1",5.49]
["****",null,null,null,null,"Children's Advil Liquid 0.5oz or Tablets 24ct",4.99,"Advil Childrens Product, any $2/1 (active) Group C-04/01 Print it twice",2.99]
["***",null,null,null,null,"CoverGirl Blast Eye or Blast Lip",7.99,"CoverGirl product, excludes trial/travel size $1/1 (04-30-12) PG-4/1",6.99]
["****",null,null,null,null,"Dimetapp Liquid 4 oz",4.99,"Dimetapp Childrens Product, any $2/1 (active) This Link-03/18",2.99]
["***",null,null,null,null,"Downy Fabric Softener Liquid 41-51 oz or sheets 90 ct",5.97,"Tide, Downy, Bounce or Tide Stain Release, excludes Tide PODS and trial/travel size .50/1 (04-30-12) PG-4/1",5.47]
["***",null,null,null,null,"Olay Complete Facial Care",9.99,null,9.99]
["****",null,null,null,null,"Robitussin Liquid 4oz",4.99,"Robitussin product, any $2/1 (active) This Link-03/28",2.99]
["***",null,null,null,null,"Tampax Tampons 40 ct",5.99,"Tampax, 18 ct. or higher .50/1 (04-30-12) PG-4/1",5.49]
["***",null,null,null,null,"Tide Landry Detergent 50 oz 24-32 loads",5.97,"Tide, Downy, Bounce or Tide Stain Release, excludes Tide PODS and trial/travel size $1/2 (04-30-12) PG-4/1",5.47]
["***",null,null,null,null,"Tide Stain Release 18 ct",5.97,"Tide, Downy, Bounce or Tide Stain Release, excludes Tide PODS and trial/travel size $2/3 (04-30-12) PG-4/1",5.3]
["***",null,null,null,null,"Clorox Clean-Up 32 oz",3.99,null,3.99]
["***",null,null,null,null,"Liquid Plumr 17-20 oz",3.99,null,3.99]
["****",null,null,null,null,"Lysol No-Touch Kitchen System",6.99,"Lysol No-Touch Kitchen System Starter Kit, any $3/1 (05-01-12) SS-3/18",3.99]
["****",null,null,null,null,"Pledge Furniture Polish or Multi-Surface Spray 9.7 oz",3.99,"Pledge Furniture Care products, any $2/1 (05-05-12) SS-3/25",1.99]
["***",null,null,null,null,"Scrubbing Bubbles Mega Foamer 28 oz",3.99,"Scrubbing Bubbles Bathroom Cleaners, any $2/2 (06-30-12) SS-3/11",2.99]
["***",null,null,null,null,"Bounty Basic Paper Towels 8 pk",6.99,"Bounty Basic Towels, 6-roll ct. or larger $1/1 (04-30-12) PG-4/1",5.99]
["***",null,null,null,null,"Charmin Basic Bathroom Tissue 12 pk",6.99,"Charmin, excludes trial/travel size .25/1 (04-30-12) PG-4/1",6.74]
["***",null,null,null,null,"Glad Trash Bags Drawstring 13 gal 22 ct, 30 gal 18 ct, or quick-tie 13 gal 35 ct, 30 gal 27 ct",4.49,"Glad Trash Bags, any 13 gallon $2/2 (active) Group A-03/18 Print it twice",3.49]
["***",null,null,null,null,"Kleenex Family Size 240 ct, Pocket Paks 8 pk, or Cool Touch 50 ct",2.19,"Kleenex Facial Tissue, any Packs or Boxes .30/3 (04-22-12) SS-3/11",2.09]
["***",null,null,null,null,"Scott Bathroom Tissue 12 ct",7.97,"Scott Bath Tissue, any $1/8 or more rolls (04-22-12) SS-3/11",6.97]
["***",null,null,null,null,"Scott Mega Roll Paper Towels 8 ct",7.97,"Scott Towels, any $1/4 or more rolls (05-06-12) SS-3/25",6.97]
["***",null,null,null,null,"Huggies Little Movers Big Pack Diapers",19.989999999999998,"Huggies Little Movers Slip-On Diapers, any $3/2 (active) Group A-03/11 Print it twice",17.489999999999998]
["***",null,null,null,null,"Huggies Snug and Dry Big Pack Diapers",19.989999999999998,"Huggies Diapers, any $1/1 (04-14-12) SS-3/18",18.989999999999998]
[]
["***",null,null,null,null,"The following group of items must be purchased in groups of 4 to receive discount."]
["***",null,null,null,null,"Cheez-its 4.5 oz",1.25,null,1.25]
["***",null,null,null,null,"Combos Snacks 7 oz",1.25,null,1.25]
["***",null,null,null,null,"Lays Stax 5.5-5.75 oz",1.25,null,1.25]
["***",null,null,null,null,"Nabisco Cookies or Crackers 3.5-8 oz",1.25,null,1.25]
["***",null,null,null,null,"TGI Fridays Snacks 5.5 oz",1.25,null,1.25]
[]
["*****",null,null,null,null,"The following group of items must be purchased in groups of 2 to receive discount."]
["***",null,null,null,null,"Natural Harvest Trail Mix 4 oz",2,null,2]
["***",null,null,null,null,"New York Style Bagel Crisps 6 oz",2,null,2]
["***",null,null,null,null,"Old Wisconsin Beef Bites 4 oz",2,null,2]
["****",null,null,null,null,"Planters Trail Mix 6 oz",2,"Planters Peanuts, any variety 4 oz. - 21.25 oz. sizes only $1.50/2 (04-30-12) SS-1/29",1.25]
[]
["***",null,null,null,null,"The following group of items must be purchased in groups of 2 to receive discount."]
["***",null,null,null,null,"Claritin Allergy Relief 30 ct",15,"Claritin Non-Drowsy Allergy Product, any 24 ct or larger $4/1 (active) Group A-03/07 Print it twice",11]
[]
["*****",null,null,null,null,"The following group of items must be purchased in groups of 5 to receive discount."]
["***",null,null,null,null,"Glade Aerosol 9 oz",1,null,1]
["*****",null,null,null,null,"Glade Plug-Ins Scented Oil Warmer",1,"Glade PlugIns Scented Oil warmer, any $1/1 (05-05-12) SS-3/25","FREE"]
["FREE"]
["***",null,null,null,null,"Rite-Aid Home Erase Away Cleaning Pads",1,null,1]
[]
["*****",null,null,null,null,"The following group of items are BUY 1, GET 1 FREE"]
["***",null,null,null,null,"Sundown Fish Oil 60 ct","2 for 11.29","Sundown Naturals Vitamin or Supplement Product, any $1/1 (active) Group C-03/18 AND (active) Group A-04/03 Print it twice","5.15 ea"]
[]
[null,null,null,null,null,"Our price check- Reg $ 11.29"]
["*****",null,null,null,null,"Sundown Vitamin D 100 ct","2 for 3.79","Sundown Naturals Vitamin or Supplement product, any $1/1 (04-17-12) RP-3/18","1.40 ea"]
[]
[null,null,null,null,null,"Our price check- Reg $ 3.79"]
[]
["*****",null,null,null,null,"The following group of items are BUY 1, GET 1 FREE"]
["***",null,null,null,null,"Nature Made Calcium 500mg 130ct","2 for 10.99",null,"5.50 ea"]
[]
[null,null,null,null,null,"Our price check- Reg $10.99"]
["***",null,null,null,null,"Nature Made Multi-Complete Vitamin 60ct","2 for 11.99","Nature Made Product, any $1/1 (active) This Link-03/18","5.50 ea"]
[]
[null,null,null,null,null,"Our price check- Reg $11.99"]
["****",null,null,null,null,"Nature Made Vitamin B-12 100ct","2 for 8.99","STORE COUPON, Rite Aid, Nature Made Vitamin B Item (You can only print ONE of these, Rite Aid will let you use this IN ADDITION to another manufacturers coupon for the same purchase!) Print by 4/28 (expires 5/12) $2/1 (active) This Link-04/03","3.00 ea"]
[]
[null,null,null,null,null,"Our price check- Reg $8.99",null,"Also use manufacturers coupon: Nature Made Vitamin B, any $1/1 (active) This Link-03/18"]
[]
["***",null,null,null,null,"The following group of items are BUY 1, GET 1 FREE"]
["***",null,null,null,null,"Move-free 20-30 ct + 30 ct","2 for 29.99","Schiff Move Free Product, any $5/1 (04-30-12) KensSS-1/8","12.50 ea"]
[]
[null,null,null,null,null,"Our price check- Reg $29.99"]
["***",null,null,null,null,"Schiff Glucosamine 150 ct","2 for 19.99",null,"10.00 ea"]
[]
[null,null,null,null,null,"Our price check- Reg $ 19.99"]
["***",null,null,null,null,"Schiff Mega D-3 90 ct","2 for 19.99","Schiff Mega-D3, any $1/1 (active) Group A-03/18 Print it twice","9.50 ea"]
[]
[null,null,null,null,null,"Our price check- Reg $19.99"]
["***",null,null,null,null,"Schiff MegaRed 50-68 ct","2 for 32.99","Schiff MegaRed Product, any $2/1 (05-31-12) SS-2/5","16.00 ea"]
[]
[null,null,null,null,null,"Our price check- Reg $32.99"]
[]
["*****",null,null,null,null,"The following group of items are BUY 1, GET 1 FREE - MIX OR MATCH"]
["****",null,null,null,null,"Ajax Dish Liquid 16 oz","2 for 1.89",null,"0.95 ea"]
[]
[null,null,null,null,null,"Our price check- Reg $1.89"]
["***",null,null,null,null,"Finish Automatic Dishwasher Detergent Powerball Tabs or Gelpacs 20 ct","2 for 6.49","Finish Powerball or Gelpacs Dishwasher detergent .50/1 (active) This Link-01/28","3.00 ea"]
[]
[null,null,null,null,null,"Our price check- Reg $6.49"]
["***",null,null,null,null,"Finish Automatic Dishwasher Detergent Powerball Tabs or Gelpacs 20 ct","2 for 6.49","Finish Powerball Tabs or Gelpacs, any .75/1 (04-15-12) SS-3/11","2.87ea"]
[]
[null,null,null,null,null,"Our price check- Reg $6.49"]
["****",null,null,null,null,"Finish Automatic Dishwasher Detergent Quantum Powerball 10 ct","2 for 3.99","Finish Quantum Automatic Dishwasher detergent .75/1 (active) This Link-04/02","1.62 ea"]
[]
[null,null,null,null,null,"Our price check- Reg $3.99"]
["****",null,null,null,null,"Finish Automatic Dishwasher Detergent Quantum Powerball 10 ct","2 for 3.99","Finish Quantum Automatic Dishwasher detergent, any .75/1 (active) This Link-03/18","1.50 ea"]
[]
[null,null,null,null,null,"Our price check- Reg $3.99"]
["****",null,null,null,null,"Finish Automatic Dishwasher Detergent Quantum Powerball 10 ct","2 for 3.99","Finish Quantum, any $1/1 (04-15-12) SS-3/11","1.50 ea"]
[]
[null,null,null,null,null,"Our price check- Reg $3.99"]
[]
["***",null,null,null,null,"The following group of items are BUY 1, GET 1 FREE - MIX OR MATCH"]
["***",null,null,null,null,"Osteo-Bi-Flex 30 ct","2 for 19.99","Osteo Bi-Flex Caplets, Softgels or Powder, any $3/1 (active) Group A-04/03 Print it twice","8.50 ea"]
[]
[null,null,null,null,null,"Our price check- Reg $19.99"]
[]
["*****",null,null,null,null,"Rite Aid +UP REWARDS",null,"Sale Price listed is BEFORE/AFTER the value of the Reward."]
[null,null,null,null,null,"Purchase the items shown and get a store credit toward your next shopping visit, or A Rebate Check!"]
[null,null,null,null,null,null,null,"+Up Rewards are very similar to Catalina Vouchers, but they are in the form of A BAR CODE ON THE BOTTOM OF YOUR ACTUAL RECEIPTS."]
[null,null,null,null,null,"BUY THE QUANTITY INDICATED, MIX OR MATCH."]
[]
["***",null,null,null,null,"$1 Reward, Buy 2 items",null,"Sale price listed is Before/After calculating a .50 discount (1.00 divided by 2 items = .50 each)"]
[]
[null,null,null,null,null,"LIMIT 2 rewards per household."]
["***",null,null,null,null,"9 Lives Cat Food 4 ct 5.5 oz cans","1.50/1.00",null,1]
[]
["***",null,null,null,null,"$1.00 Reward, Buy 1 item",null,"Sale price listed is Before/After calculating a 1.00 discount"]
[]
[null,null,null,null,null,"LIMIT 2 reward per household."]
["***",null,null,null,null,"GE Light Bulbs Soft White 4pk or Long Life 2pk","2.99/1.99",null,1.99]
[]
["*****",null,null,null,null,"$1.00 Reward, Buy 1 item",null,"Sale price listed is Before/After calculating a 1.00 discount"]
[]
[null,null,null,null,null,"LIMIT 2 rewards per household."]
["****",null,null,null,null,"Listerine Mouthwash 1 liter","3.99/2.99","Listerine Antiseptic Mouthwash, any 1 L or larger $1/1 (active) This Link-02/10",1.99]
["***",null,null,null,null,"Listerine Toothpaste 4.2 oz","3.99/2.99",null,2.99]
["***",null,null,null,null,"Reach Floss 200 yds","3.99/2.99",null,2.99]
["***",null,null,null,null,"Reach Toothbrushes by Design 2ct","3.99/2.99",null,2.99]
[]
["***",null,null,null,null,"$1.00 Reward, Buy 2 items",null,"Sale price listed is Before/After calculating a 0.50 discount (1.00 divided by 2 items = 0.50 each)"]
[]
[null,null,null,null,null,"LIMIT 2 rewards per household."]
["***",null,null,null,null,"Rite-Aid Cashew Halves or Mixed Nuts 8-10 oz","3.50/3.00",null,3]
["***",null,null,null,null,"Rite-Aid Prune Juice 64 oz","3.50/3.00",null,3]
["***",null,null,null,null,"Rite-Aid Prunes 18 oz","3.50/3.00",null,3]
[]
["***",null,null,null,null,"$1.00 Reward, Buy 2 items",null,"Sale price listed is Before/After calculating a 1.00 discount (1.00 divided by 2 items = .50 each)"]
[]
[null,null,null,null,null,"LIMIT 3 rewards per household."]
["***",null,null,null,null,"Crisco Vegetable Oil 32oz","3.00/2.50",null,2.5]
["***",null,null,null,null,"Hungry Jack Syrup 27.6oz","3.00/2.50",null,2.5]
["***",null,null,null,null,"Jif Peanut Butter 18oz","3.00/2.50",null,2.5]
["***",null,null,null,null,"Smuckers Strawberry Squeeze Jam 20oz","3.00/2.50",null,2.5]
[]
["*****",null,null,null,null,"$2.00 Reward, Buy 1 item",null,"Sale price listed is Before/After calculating a 2.00 discount"]
[]
[null,null,null,null,null,"LIMIT 2 rewards per household."]
["****",null,null,null,null,"Marc Anthony Shampoo, Conditioner or Stylers","3.99/1.99",null,1.99]
[]
["*****",null,null,null,null,"$2.00 Reward, Buy 1 item",null,"Sale price listed is Before/After calculating a 2.00 discount"]
[]
[null,null,null,null,null,"LIMIT 4 rewards per household."]
["*****",null,null,null,null,"Bic Twin Select Silky Touch Disposable Razor 10ct","2.99/0.99","Bic Disposable Razor, any excluding trial size $2/1 (04-15-12) SS-3/18","FREE"]
["FREE"]
["****",null,null,null,null,"Eos Shave Cream 7oz","2.99/0.99",null,0.99]
[]
["***",null,null,null,null,"$2.00 Reward, Buy 1 item",null,"Sale price listed is Before/After calculating a 2.00 discount"]
[]
[null,null,null,null,null,"LIMIT 2 rewards per household."]
["***",null,null,null,null,"Luvs Family Pack Diapers","16.99/14.99",null,14.99]
[]
["***",null,null,null,null,"$2.00 Reward, Buy 2 items",null,"Sale price listed is Before/After calculating a 1.00 discount (2.00 divided by 2 items = 1.00 each)"]
[]
[null,null,null,null,null,"LIMIT 2 rewards per household."]
["***",null,null,null,null,"Lays Potato Chips 10-10.5 oz","3.00/2.00",null,2]
["***",null,null,null,null,"Tostitos 9-11 oz","3.00/2.00",null,2]
["***",null,null,null,null,"Tostitos Queso Dip 15 oz","3.00/2.00",null,2]
[]
["*****",null,null,null,null,"$2.00 Reward, Buy 1 item",null,"Sale price listed is Before/After calculating a 2.00 discount"]
[]
[null,null,null,null,null,"LIMIT 3 rewards per household."]
["****",null,null,null,null,"Always Panti-liners 64 Ct","3.99/1.99","Always Pantiliners, 30 ct. or higher .50/1 (04-30-12) PG-4/1",1.49]
["*****",null,null,null,null,"Always Radiant Infinity Maxi pads 12-16 ct","3.99/1.99","Always Infinity, 12 ct. or higher including Always Radiant Infinity $1/1 (04-30-12) PG-4/1",0.99]
["*****",null,null,null,null,"Tampax Radiant Tampons 16 ct","3.99/1.99","Tampax Pearl, Tampax Pearl Compak, or Tampax Radiant 16 ct. or higher $1/1 (04-30-12) PG-4/1",0.99]
[]
["***",null,null,null,null,"$2.00 Reward, Buy 1 items",null,"Sale price listed is Before/After calculating a 2.00 discount"]
[]
[null,null,null,null,null,"LIMIT 1 rewards per household."]
["***",null,null,null,null,"Duracell Coppertop Batteries AAA or AA 8 pk, C or D 4 pk, or 9V 2 ok","6.99/4.99","Duracell CopperTop, Ultra Power, Ultra Photo Lithium or Specialty Batteries, excludes trial/travel size .75/1 (04-30-12) PG-4/1",4.24]
[]
["***",null,null,null,null,"$2.00 Reward, Buy 2 items",null,"Sale price listed is Before/After calculating a 1.00 discount (2.00 divided by 2 items = 1.00 each)"]
[]
[null,null,null,null,null,"LIMIT 4 rewards per household."]
["***",null,null,null,null,"Tugaboos Jumbo Pack Diapers","7.50/6.50","Also Qualifies for Single Check Rebate $3 When You Buy 2.",5]
[]
[null,null,null,null,null,null,null,"SINGLE CHECK REBATES may be redeemed at Rite aid.com"]
[]
["*****",null,null,null,null,"$2.00 Reward, Buy 4 items",null,"Sale price listed is Before/After calculating a 0.50 discount (2.00 divided by 4 items = 0.50 each)"]
[]
[null,null,null,null,null,"LIMIT 2 rewards per household."]
["****",null,null,null,null,"Pepsi and Pepsi Products 12 pk 12 oz Cans","3.00/2.50",null,2.5]
[]
["***",null,null,null,null,"$3.00 Reward, Buy 1 item",null,"Sale price listed is Before/After calculating a 3.00 discount"]
[]
[null,null,null,null,null,"LIMIT 3 rewards per household."]
["***",null,null,null,null,"Prilosec OTC 28ct","18.99/15.99","Prilosec OTC product $1/1 (04-30-12) PG-4/1",14.99]
[]
["*****",null,null,null,null,"$3.00 Reward, Buy 2 items",null,"Sale price listed is Before/After calculating a 1.50 discount (3.00 divided by 2 items = 1.50 each)"]
[]
[null,null,null,null,null,"LIMIT 4 rewards per household."]
["*****",null,null,null,null,"CareFree Pantiliners 36-60ct or Ultra 16ct","3.00/1.50","Carefree product, any $1/1 (04-30-12) SS-3/18",0.5]
["*****",null,null,null,null,"OB Tampons 18ct","3.00/1.50","OB Product, any excluding trial size .75/1 (active) Group A-03/23 Print it twice",0.75]
["*****",null,null,null,null,"Stayfree Sanitary Protection Pads 14-24ct","3.00/1.50","Stayfree products, any $2/2 (04-30-12) SS-3/18",0.5]
["*****",null,null,null,null,"Stayfree Sanitary Protection Pads 14-24ct","3.00/1.50","Stayfree Product, any excluding trial sizes $1/1 (active) Group A-04/03 Print it twice",0.5]
[]
["*****",null,null,null,null,"$10 Reward, Buy $25 of participating items",null,"Sale price listed is Before/After calculating a 40% discount (10.00 divided by 25.00 = 40%)"]
[]
[null,null,null,null,null,"LIMIT 2 rewards per household.",null,"Use the 'Before' price to reach $25"]
["***",null,null,null,null,"Advil Liqui-Gels 160ct","13.99/8.39","Advil, any 20 ct. or larger $1/1 (06-30-12) RP-4/1",7.39]
["***",null,null,null,null,"Advil PM 120ct","13.99/8.39","AdvilPM, any 4ct. or larger $1/1 (06-09-12) RP-3/11",7.39]
["***",null,null,null,null,"Advil Tablets or Caplets 200ct","13.99/8.39","Advil, any 20 ct or larger $1/1 (active) Group C-04/01 Print it twice",7.39]
["***",null,null,null,null,"Kaz Heating Pad","19.99/12.00","Kaz Heating Pad $3/1 in-ad store coupon",9]
[]
[null,null,null,null,null,"Our price check- Reg $19.99"]
["***",null,null,null,null,"Aleve Pain Relievers 100 ct","2 for 14.99/8.99","Aleve Product, any 80 ct or larger (excludes Aleve-D) $2/1 (active) Group A-04/03 Print it twice","2.50 ea"]
[null,null,null,null,null,"Ad says B1 G1 50% OFF"]
[]
[null,null,null,null,null,"Our price check- Reg $9.99"]
["***",null,null,null,null,"Bayer Pain Relievers 100 ct","2 for 14.99/8.99","Bayer Aspirin Product, any 20ct or larger $1/1 (04-30-12) SS-1/29 AND (06-30-12) SS-3/18","3.00 ea"]
[null,null,null,null,null,"Ad says B1 G1 50% OFF"]
[]
[null,null,null,null,null,"Our price check- Reg $9.99"]
["****",null,null,null,null,"Rite-Aid Childrens Acetaminophen 4 oz","3.99/2.39",null,2.39]
["***",null,null,null,null,"Rite-Aid Adult Acetaminophen 100 Ct","2 for 7.99/4.79",null,"2.40 ea"]
[null,null,null,null,null,"Ad says B1 G1 FREE"]
[]
[null,null,null,null,null,"Our price check- Reg $7.99"]
["***",null,null,null,null,"Rite-Aid Asprin 100 Ct","2 for 7.49/4.50",null,"2.40 ea"]
[null,null,null,null,null,"Ad says B1 G1 FREE"]
[]
[null,null,null,null,null,"Our price check- Reg $7.49"]
["****",null,null,null,null,"Rite-Aid Childrens Ibuprofen 4 oz","3.99/2.39",null,2.39]
["***",null,null,null,null,"Rite-Aid Ibuprofen 100 Ct","2 for 7.99/4.79",null,"2.40 ea"]
[null,null,null,null,null,"Ad says B1 G1 FREE"]
[]
[null,null,null,null,null,"Our price check- Reg $7.99"]
["****",null,null,null,null,"Vicks Thermometers","11.99/7.19","Vicks Thermometer $3/1 in-ad store coupon",4.1900000000000004]
[]
[null,null,null,null,null,"Our price check- Reg $11.99"]
["***",null,null,null,null,"Rite-Aid Naproxen Sodium 100 Ct","2 for 7.99/4.79",null,"2.40 ea"]
[null,null,null,null,null,"Ad says B1 G1 FREE"]
[]
[null,null,null,null,null,"Our price check- Reg $7.99"]
["*****",null,null,null,null,"ThermaCare Heat Wraps 2-3ct","5.99/3.59","ThermaCare HeatWraps, any 2 ct or larger $3/1 (active) This Link-03/28",0.59]
["****",null,null,null,null,"LOreal Feria Hair Color","9.99/5.99","LOreal Feria Hair Color $2/1 in-ad store coupon",3.99]
[]
["*****",null,null,null,null,"$10 Reward, Buy $25 of participating items",null,"Sale price listed is Before/After calculating a 40% discount (10.00 divided by 25.00 = 40%)"]
[]
[null,null,null,null,null,"LIMIT 4 rewards per household.",null,"Use the 'Before' price to reach $25"]
["***",null,null,null,null,"LOreal Age Perfect and Revitalift Skin Care","11.99/7.19",null,7.19]
["***",null,null,null,null,"LOreal EverCreme, EverPure, EverStrong or EverSleek Hair Care","7.99/4.79","LOreal EverCreme, EverSleek, EverPure, EverStrong Shampoo or Conditioner, any $1/1 (05-06-12) RP-3/11",3.79]
[]
[null,null,null,null,null,"Our price check- Shampoo or Conditioner- Reg $7.99"]
["*****",null,null,null,null,"LOreal Sublime Mousse Hair Color","8.99/5.39","LOreal Sublime Mousse Hair Color $3/1 in-ad store coupon",1.39]
[]
[null,null,null,null,null,null,null,"Also use manufacturer coupon: LOreal Sublime Mousse haircolor, any $2/1 (05-06-12) RP-3/11"]
["****",null,null,null,null,"LOreal Preference Hair color","7.99/4.79","LOreal Preference, any shade $2/1 (05-13-12) RP-3/18",2.79]
[]
[null,null,null,null,null,"Our price check- Reg $7.99"]
["****",null,null,null,null,"LOreal Preference Hair color","7.99/4.79","LOreal Preference, any shade $2/1 (04-08-12) SS-2/12",2.79]
[]
[null,null,null,null,null,"Our price check- Reg $7.99"]
["****",null,null,null,null,"LOreal Excellence Hair color","7.99/4.79","LOreal Excellence or Excellence to-Go shades, any $4/2 (05-20-12) RP-3/25",2.79]
[]
[null,null,null,null,null,"Our price check- Reg $7.99"]
["****",null,null,null,null,"LOreal Excellence Hair color","7.99/4.79","LOreal Excellence or Excellence to-Go shade, any $1/1 (05-20-12) RP-3/25",3.79]
[]
[null,null,null,null,null,"Our price check- Reg $7.99"]
["***",null,null,null,null,"LOreal True Match Foundation","7.99/4.79",null,4.79]
["****",null,null,null,null,"LOreal Colour Riche Lip","5.99/3.59","LOreal Colour Riche Lipcolour or Nail Colour, any $1/1 (05-20-12) RP-3/25",2.59]
["****",null,null,null,null,"LOreal Voluminous Mascara","5.99/3.59","LOreal Paris Eye product, any $1/1 (05-20-12) RP-3/25",2.59]
["***",null,null,null,null,"LOreal Voluminous Mascara and Colour Riche Lip","5.99/3.59",null,3.59]
[]
["*****",null,null,null,null,"$10 Reward, Buy $20 of participating items",null,"Sale price listed is Before/After calculating a 50% discount (10.00 divided by 20.00 = 50%)"]
[]
[null,null,null,null,null,"LIMIT 1 reward per household.",null,"Use the 'Before' price to reach $20"]
["****",null,null,null,null,"Colgate Sensitive Pro Relief Toothpaste 4oz","2 for 6.29/3.15","Colgate Toothpaste, any 4 oz. or larger .75/1 (04-14-12) SS-3/25","1.20 ea"]
[null,null,null,null,null,"Ad says B1 G1 FREE"]
[]
[null,null,null,null,null,"Our price check- Reg $6.29"]
["****",null,null,null,null,"Colgate Power Toothbrush","2 for 7.49/3.75",null,"1.88 ea"]
[null,null,null,null,null,"Ad says B1 G1 FREE"]
[]
[null,null,null,null,null,"Our price check- Reg $7.49"]
["*****",null,null,null,null,"Colgate Manual Toothbrush 2 pk","2 for 3.79/1.90","Colgate Adult or Kids Manual Toothbrush, any excluding Colgate Plus and Colgate Extra Clean .40/1 (04-14-12) SS-3/25","0.75 ea"]
[null,null,null,null,null,"Ad says B1 G1 FREE"]
[]
[null,null,null,null,null,"Our price check- Reg $3.79"]
["*****",null,null,null,null,"Colgate Any Multipack Toothpaste","2 for 6.49/3.25","Colgate Toothpaste, any 4 oz. or larger .75/1 (04-14-12) SS-3/25","1.25 ea"]
[null,null,null,null,null,"Ad says B1 G1 FREE"]
[]
[null,null,null,null,null,"Our price check- Maxfresh 6 oz twin pack- Reg $6.49"]
[]
["*****",null,null,null,null,"Got a list question? Want to check if next week's list is ready? Our listmakers answer questions and post our \"preview\" lists at PYP."]
[]
["*****",null,null,null,null,"Todays date: ","Sale","We are not affiliated with this store.  The store's ad is the only OFFICIAL authority"]
["toggle 4 and 5 star rows",null,null,null,null,null,"Price"]
["Stock up scale",null,null,null,null,"How to use this list",null,"Printable coupons:","Bottom line"]
[null,null,null,null,null,null,null,"Group A  Group B  Group C  Singles"]
[null,null,null,null,null,"Fresh Market"]
[null,null,null,null,null,null,null,"Coupon Index"]
[null,null,null,null,null,"Current list"]
[null,null,null,null,null,"-This list is valid during the dates listed below"]
["*****",null,null,null,null,"Valid Dates: 4/11 through 4/17",null,"This list is made by Misti. She answers list questions in this thread at PYP."]
["***",null,null,null,null,"Bell Peppers, Green",".50 ea",null,".50 ea"]
["*****",null,null,null,null,"Broccoli",".69 lb",null,".69 lb"]
["*****",null,null,null,null,"Cauliflower",".69 lb",null,".69 lb"]
["***",null,null,null,null,"Cucumbers",".50 ea",null,".50 ea"]
["***",null,null,null,null,"Dole Salad, 9 oz. Classic Romaine or 11 oz. Just Lettuce",1.49,null,1.49]
["****",null,null,null,null,"Kiwi",".33 ea",null,".33 ea"]
["***",null,null,null,null,"Mushrooms, 8 oz. Cello Wrapped Sliced or Whole Crimini",2.5,null,2.5]
["***",null,null,null,null,"Pears, Red, Bosc or Danjou","1.29 lb",null,"1.29 lb"]
["***",null,null,null,null,"Pom Wonderful Pistachios, 8 oz.",3.99,"Wonderful Pistachios, 5 oz. packages or larger $1/2 (06-30-12) SS-3/18","3.49 ea"]
["***",null,null,null,null,"Squash, Zucchini or Yellow",".69 lb",null,".69 lb"]
["***",null,null,null,null,"Strawberries, 2 lb.",4.99,null,4.99]
["***",null,null,null,null,"Tomatoes, Cluster","1.39 lb",null,"1.39 lb"]
["***",null,null,null,null,"Beef - Chuck Roast, boneless","2.99 lb",null,"2.99 lb"]
["***",null,null,null,null,"Beef - Round Steaks, Full Cut boneless","3.79 lb",null,"3.79 lb"]
["***",null,null,null,null,"Beef - Top Sirloin Steaks, boneless","4.99 lb",null,"4.99 lb"]
["***",null,null,null,null,"Beef - Tri Tip Steaks or Roast, boneless","6.99 lb",null,"6.99 lb"]
["***",null,null,null,null,"Chicken - Boneless Skinless Breast Tenders","2.49 lb",null,"2.49 lb"]
["***",null,null,null,null,"Chicken - Drums or Thighs","1.19 lb",null,"1.19 lb"]
["***",null,null,null,null,"Pork - Country Style Ribs, bone-in","1.99 lb",null,"1.99 lb"]
["***",null,null,null,null,"Pork - Loin Chops, boneless","2.49 lb",null,"2.49 lb"]
["***",null,null,null,null,"Pork - St. Louis Style Ribs","2.99 lb",null,"2.99 lb"]
["***",null,null,null,null,"Pork - Tenderloins","3.99 lb",null,"3.99 lb"]
["***",null,null,null,null,"Turkey - Jennie-O 85% Lean Ground","3.49 lb",null,"3.49 lb"]
["***",null,null,null,null,"Chobani Greek Yogurt, 32 oz. Plain or Vanilla",4.99,null,4.99]
["*****",null,null,null,null,"ShurSaving Milk, gallon 1%, 2% or Skim",2.39,"Milk, any brand gallon White or Chocolate excluding Soy Milk .75/1 or (2) half gallons (active) Group A-12/01 Print Twice",1.64]
["****",null,null,null,null,"Sunny D, 64 oz.",0.99,null,0.99]
["****",null,null,null,null,"Western Family Cottage Cheese, 16 oz.",1.19,null,1.19]
["***",null,null,null,null,"Western Family Jumbos Biscuits, 16 oz.",1.25,null,1.25]
["***",null,null,null,null,"Western Family Orange Juice, 89 oz.",2.99,null,2.99]
["***",null,null,null,null,"Western Family Yogurt, 32 oz. assorted",2,null,2]
["***",null,null,null,null,"Bar S Bologna, 16 oz. Classic, thick or chicken",1.29,null,1.29]
["***",null,null,null,null,"Bar S Ham or Turkey Breast, 16 oz.",3.49,null,3.49]
["***",null,null,null,null,"Bar S Sliced Bacon, 16 oz. assorted",3.59,null,3.59]
["***",null,null,null,null,"Farmland Sausage, 14 oz. Polska Kielbasa or Original Smoked",2.5,null,2.5]
["****",null,null,null,null,"Micellis String Cheese, 12 oz.",1.99,null,1.99]
["***",null,null,null,null,"Oscar Mayer Lunchables, 3.4-4.5 oz.",1.5,null,1.5]
["***",null,null,null,null,"Tillamook Sliced Cheese, 12 oz.",3.99,null,3.99]
["***",null,null,null,null,"Western Family Individually Wrapped Cheese Slices, 12 oz.",1.79,null,1.79]
["***",null,null,null,null,"Western Family Jumbo Franks, 1 lb.",1.19,null,1.19]
["****",null,null,null,null,"Arrowhead Spring Water, 24 pk. half liter bottles",2.99,null,2.99]
["***",null,null,null,null,"Coke Products, 2 liter bottle",1.33,null,1.33]
["***",null,null,null,null,"Coke Products, 20 pk. cans","2 for $13","Use in-ad store coupon: 2 for $11 with coupon and purchase of 2.","5.50 ea"]
["*****",null,null,null,null,"Fuze, 18.5 oz. bottles",1,"Use in-ad store coupon: 10 for $5 with coupon and purchase of 10.",".50 ea"]
["***",null,null,null,null,"Langers Juice Cocktails, 64 oz. Cranberry or Pomegranate",2.5,null,2.5]
["***",null,null,null,null,"Lipton Naturals, 20 oz. bottles",1,null,1]
["****",null,null,null,null,"Pepsi Next, 12 pk. cans",2.99,null,2.99]
["****",null,null,null,null,"Pepsi Next, 2 liter bottle",0.99,null,0.99]
["***",null,null,null,null,"Pepsi, 7-Up or A and W Products, 6 pk. 24 oz. bottles or 12 pk. cans",4.67,null,4.67]
["***",null,null,null,null,"Powerade Sports Drinks, 32 oz. assorted",0.79,null,0.79]
["***",null,null,null,null,"Sobe Lifewater, 20 oz. bottles",1,null,1]
["***",null,null,null,null,"Ball Park Hamburger or Hot Dog Buns, 8 ct.",2,null,2]
["***",null,null,null,null,"Black Forest Fruit Snacks, 25.2 oz.",4.99,null,4.99]
["****",null,null,null,null,"Crystal Light On the Go Drink Mixes, 7-10 ct.",2,"Crystal Light Drink Mix products, any $1/2 (04-30-12) SS-3/18","1.50 ea"]
["***",null,null,null,null,"Doritos, 10.5-11.5 oz.",2.99,null,2.99]
["***",null,null,null,null,"Fritos or Cheetos, 9-10.5 oz.",2.5,null,2.5]
["***",null,null,null,null,"Grandma Sycamores Bread, 24 oz. White or Wheat",2,null,2]
["***",null,null,null,null,"Hatch Green Chiles, 4 oz. chopped or diced",1.25,null,1.25]
["***",null,null,null,null,"Kelloggs Fruit Snacks, 8 oz.",1.67,null,1.67]
["***",null,null,null,null,"Kelloggs Nutri-Grain Bars, 7.8-10.4 oz.",2.5,"Kelloggs Nutri-Grain Cereal Bars, any flavor 8 ct. or larger $1/2 (06-10-12) RP-4/15","2.00 ea"]
["***",null,null,null,null,"La Choy Bi-Packs, 42-43.5 oz.",3,null,3]
["***",null,null,null,null,"La Victoria Salsa, 16 oz.",2.29,null,2.29]
["***",null,null,null,null,"La Victoria Taco Sauce, 15 oz. Mild or Medium",2.29,null,2.29]
["*****",null,null,null,null,"Las Palmas Enchilada Sauce or Red Chile Sauce, 28 oz. can",2,"Las Palmas Product, any $1/1 (active) This Link-10/08",1]
["***",null,null,null,null,"Lays Chips, 10-10.5 oz.",2.5,null,2.5]
["***",null,null,null,null,"Minute Rice, 14 oz. Brown or Long Grain White",1.99,"Minute Rice Product, any .50/1 (04-30-12) PurinaRP-1/29",1.49]
["***",null,null,null,null,"Nabisco Cheese Nips, 10.5-12 oz.",1.5,null,1.5]
["*****",null,null,null,null,"Pompeian Olive Oil, 68 oz. Extra Virgin",14.99,"Use in-ad store coupon: $9.99 with coupon.",8.99]
[null,null,null,null,null,null,null,"Also use manufacturers coupon: Pompeian Olive Oil or OlivExtra Plus, any size or variety $1/1 (active) This Link-01/01"]
["***",null,null,null,null,"Post Cereal, 11-20 oz. Fruity or Cocoa Pebbles, Honeycomb or Raisin Bran",1.99,null,1.99]
["***",null,null,null,null,"Taco Bell Bold and Creamy Sauce, 8 oz. Chipotle or Spicy Ranchero",1.5,null,1.5]
["***",null,null,null,null,"Taco Bell Taco Shells, 12 ct.",1.25,null,1.25]
["***",null,null,null,null,"Tostitos Tortilla Chips, 9-13 oz.",2.99,null,2.99]
["****",null,null,null,null,"Western Family Bread, 24 oz. Buttermilk White Roundtop, Cracked Wheat or Golden Split top",1.25,null,1.25]
["***",null,null,null,null,"Western Family Chow Mein or Rice Noodles, 6 oz. bag",1,null,1]
["****",null,null,null,null,"Western Family Mexican Style Tomato Sauce, 8 oz.",0.33,null,0.33]
["***",null,null,null,null,"Wonder Classic Bread, 20 oz.",2,null,2]
["***",null,null,null,null,"Lean Cuisine Frozen Entrees, 5.25-11.5 oz. assorted","6 for $15","Use in-ad store coupon: Get (1) Skinny Cow 4-12 ct. Cones, Bars or Sandwiches and (1) Nestle 6 pk. Fruit Flavored Water FREE when you buy (6) Lean Cuisine Frozen Entrees.","2.50 ea"]
["***",null,null,null,null,"Ore-Ida Potatoes, 19-32 oz. Onion Rings, Steam n Mash, Tator Tots, Fries or Hashbrowns",2.99,null,2.99]
["***",null,null,null,null,"Pace Juice or Fruit Bars, 6-12 ct.",3,null,3]
["***",null,null,null,null,"PictSweet Vegetables, 8-12 oz. Deluxe or Seasoned",1.5,null,1.5]
["***",null,null,null,null,"Purely Asian Entrees, 22-24 oz. assorted",5,"Purely Asian Entree, any $1.50/1 (05-31-12) SS-3/4",3.5]
["***",null,null,null,null,"Rhodes Warm N Serve Rolls, 6-9 ct. pan",2,"Rhodes Bread or Rolls, any .55/1 (05-20-12) RP-3/25",1.45]
["***",null,null,null,null,"Stouffers Frozen Meals, 6-12.7 oz.",2.69,null,2.69]
["***",null,null,null,null,"Tillamook Ice Cream, 1.75 qt.",3.5,null,3.5]
["***",null,null,null,null,"Tombstone Pizza, 12 inch",3.99,null,3.99]
["***",null,null,null,null,"Western Family Burritos, 5 oz.",0.33,null,0.33]
["***",null,null,null,null,"Western Family Chicken, 26 oz. Dino Nuggets or Popcorn",4.99,null,4.99]
["***",null,null,null,null,"Western Family Ice Cream or Sherbet, 5 quart",6.99,null,6.99]
["***",null,null,null,null,"Western Family Pizza Bites, 20 oz. Pepperoni or Combination",2.99,null,2.99]
["****",null,null,null,null,"Aim Toothpaste, 4.8-6 oz. assorted",1,null,1]
["***",null,null,null,null,"Allegra Allergy Relief, 15 ct. 24 Hour",11.99,"Allegra Allergy 5, 12 or 15 ct, Childrens Allegra, Allegra-D 24 hr 5 ct or Allegra-D 12 hr 10 ct $2/1 (active) Group B-03/18 Print Twice",9.99]
["****",null,null,null,null,"Barbasol or Pure Silk Shaving Cream, 9.5-11 oz. assorted",1,null,1]
["***",null,null,null,null,"Coppertone Sun Screen Spray, 2 pk. 6 oz.",12.88,"Coppertone Sun Care, any excluding lip balm and trial sizes $1/1 (active) This Link-02/04",11.88]
["***",null,null,null,null,"Finish Powerball Tabs, 32 ct.",5.99,"Finish Powerball Tabs or Gelpacs, any .75/1 (04-15-12) SS-3/11",5.24]
["***",null,null,null,null,"Finish Powerball Tabs, 32 ct.",5.99,"Finish Powerball or Gelpacs Dishwasher detergent .50/1 (active) This Link-04/02",5.49]
["***",null,null,null,null,"Glad Freezer or Storage Bags, 30-50 ct. Gallon or Quart",2.99,"Glad Food Storage Products, any $1/2 (active) This Link-08/21","2.49 ea"]
["***",null,null,null,null,"Huggies Diapers, 15-50 ct.",9.99,"Huggies Diapers, any $1/1 (EXPIRES 04-14-12) SS-3/18",8.99]
["***",null,null,null,null,"Huggies Pull-Ups, 15-50 ct.",9.99,"Pull-Ups Training Pants, any Jumbo Pack or larger $2/1 (EXPIRES 04-14-12) SS-3/18",7.99]
["***",null,null,null,null,"Kleenex Facial Tissue, 50-164 ct.",1.5,"Kleenex Facial Tissue, any Packs or Boxes .30/3 (04-22-12) SS-3/11","1.40 ea"]
["***",null,null,null,null,"Suave Shampoo or Conditioner, 15 oz.",0.88,null,0.88]
["***",null,null,null,null,"U by Kotex Feminine Hygiene Products, 18 ct. Tampons, 14-60 ct. Maxis or Liners",4,"U by Kotex products, any $1/1 (05-05-12) SS-3/25",3]
["***",null,null,null,null,"Western Family Feminine Products, 14-24 ct. Pads or 46-64 ct. Liners",1.99,null,1.99]
["***",null,null,null,null,"Western Family Hair Gel, 20 oz. assorted",1,null,1]
["****",null,null,null,null,"Western Family Hydrogen Peroxide, 16 oz.",0.5,null,0.5]
["***",null,null,null,null,"Western Family Isopropyl Alcohol, 16 oz.",1,null,1]
["***",null,null,null,null,"Western Family Laundry Detergent, 30 lb. Regular or With Bleach",6.99,null,6.99]
["****",null,null,null,null,"Western Family Mouth Rinse, 1 liter bottle",1,null,1]
["****",null,null,null,null,"Western Family Petal Soft Bath Tissue, 36 Roll Advantage Pack or 18 Big Pack",6.99,null,6.99]
["****",null,null,null,null,"Western Family White Paper Towels, 15 Roll Mega Pack",6.99,null,6.99]
["***",null,null,null,null,"Wisk Liquid Laundry Detergent, 100 oz.",7.99,"Wisk Laundry Detergent, any 45 oz. or larger $2/1 (05-06-12) RP-3/25",5.99]
[]
["***",null,null,null,null,"First Aid Coupon",8,"Use in-ad store coupon: Get all this for $8.00","8.00"]
[null,null,null,null,null,null,null,"- (1) Western Family 10-60 ct. Bandages"]
[null,null,null,null,null,null,null,"- (1) Western Family 1 oz. Triple Antibiotic Ointment"]
[null,null,null,null,null,null,null,"- (1) 1 oz. Hydro-Cortizone Cream"]
[null,null,null,null,null,null,null,"- (1) 40 ct. Alcohol or Hydrogen Peroxide Wipes"]
[]
["***",null,null,null,null,"Lasagna Meal Deal",9.99,"Use in-ad store coupon: Get all this for $9.99","9.99"]
[null,null,null,null,null,null,null,"- (1) Western Family 96 oz. Lasagna with Meat Sauce"]
[null,null,null,null,null,null,null,"- (1) Western Family 10 oz. Frozen Italian Style Garlic Bread"]
[null,null,null,null,null,null,null,"- (1) Western Family 12 oz. Steam-Its Vegetables"]
[]
["*****",null,null,null,null,"Case Lot Sale!"]
["***",null,null,null,null,"Angel Soft Bathroom Tissue, 24 roll white",5.99,null,5.99]
[null,null,null,null,null,"Case of 24 - $23.96"]
["***",null,null,null,null,"Banquet Frozen Dinners, 4.66-10.25 oz. Value Menu",1,null,1]
[null,null,null,null,null,"Case of 12 - $12.00"]
["****",null,null,null,null,"Campbells SpaghettiOs or Spaghetti, 14.75-15 oz. Original",0.79,null,0.79]
[null,null,null,null,null,"Case of 24 - $18.96"]
[null,null,null,null,null,"Case of 12 - $9.48"]
["***",null,null,null,null,"Campbells Tomato or Chicken Noodle Soup, 10.75 oz.",0.69,"Campbells Condensed Chicken Noodle and Tomato Soups, any .40/4 (EXPIRES 04-15-12) SS-2/12",".59 ea"]
[null,null,null,null,null,"Case of 48 - $33.12"]
["***",null,null,null,null,"DaVinci Pasta, 16 oz. assorted",0.99,null,0.99]
[null,null,null,null,null,"Case of 12 - $11.88"]
[null,null,null,null,null,"Case of 20: $19.80"]
["****",null,null,null,null,"Dinty Moore Beef Stew, 15 oz. can",0.99,null,0.99]
[null,null,null,null,null,"Case of 12 - $11.88"]
["****",null,null,null,null,"Geisha Chunk Light Tuna, 5 oz.",0.59,null,0.59]
[null,null,null,null,null,"Case of 24 - $14.16"]
["***",null,null,null,null,"Gold Medal Flour, 10 lb. All Purpose or Unbleached",4.99,null,4.99]
[null,null,null,null,null,"Case of 4 - $19.96"]
["****",null,null,null,null,"Hormel Spam Luncheon Meat, 12 oz. assorted",2,null,2]
[null,null,null,null,null,"Case of 24 - $48.00"]
[null,null,null,null,null,"Case of 12 - $24.00"]
["***",null,null,null,null,"Hunts Pasta Sauce, 24-26.5 oz. assorted",1,null,1]
[null,null,null,null,null,"Case of 12 - $12.00"]
["***",null,null,null,null,"Kraft Macaroni and Cheese, 5 pk. 7.25 oz.",3.99,null,3.99]
[null,null,null,null,null,"Case of 5 - $19.95"]
["****",null,null,null,null,"Langers 100% Apple Juice, 64 oz.",1.5,null,1.5]
[null,null,null,null,null,"Case of 8 - $12.00"]
["***",null,null,null,null,"Libbys Vienna Sausage, 5 oz. Original or Chicken",0.69,null,0.69]
[null,null,null,null,null,"Case of 24 - $16.56"]
[null,null,null,null,null,"Case of 48 - $33.12"]
["****",null,null,null,null,"Maruchan Ramen Noodles Instant Lunch, 2.25 oz. cup",0.25,null,0.25]
[null,null,null,null,null,"Case of 12 - $3.00"]
["***",null,null,null,null,"Ragu Pasta Sauce, 23.9-24 oz. Traditional Garden, Meat, Onion Garlic, Mushroom, Parmesan or 7 Herb",1.25,null,1.25]
[null,null,null,null,null,"Case of 12 - $15.00"]
["***",null,null,null,null,"ShurSaving Chunk White Chicken, 5 oz. in water",1,null,1]
[null,null,null,null,null,"Case of 12 - $12.00"]
["***",null,null,null,null,"ShurSaving Granulated Sugar, 4 lb. bag",1.99,null,1.99]
[null,null,null,null,null,"Case of 10 - $19.90"]
["****",null,null,null,null,"ShurSaving Pears or Peaches, 29 oz. can",0.99,null,0.99]
[null,null,null,null,null,"Case of 12 - $11.88"]
["***",null,null,null,null,"Sparkle Paper Towels, 6 Big Rolls or 8 Roll Pick A Size",5.99,null,5.99]
[null,null,null,null,null,"Case of 24 - $23.96"]
["***",null,null,null,null,"Taco Bell Refried Beans, 16 oz. Regular or Fat Free",0.79,null,0.79]
[null,null,null,null,null,"Case of 12 - $9.48"]
["****",null,null,null,null,"Top Ramen Noodles, 3 oz. assorted",0.15,null,0.15]
[null,null,null,null,null,"Case of 24 - $3.60"]
["***",null,null,null,null,"Tree Top Growers Best Apple Cider, 10 oz. Organic",0.5,null,0.5]
[null,null,null,null,null,"Case of 24 - $12.00"]
["***",null,null,null,null,"Western Family 100% Juice, 46 oz. Tomato or Vegetable",1.67,null,1.67]
[null,null,null,null,null,"Case of 12 - $20.00"]
["****",null,null,null,null,"Western Family Apple Sauce, 15 oz. Original",0.59,null,0.59]
[null,null,null,null,null,"Case of 24 - $14.16"]
["***",null,null,null,null,"Western Family Beef Stew, 24 oz. can",2,null,2]
[null,null,null,null,null,"Case of 12 - $24.00 "]
["***",null,null,null,null,"Western Family Cake Mix, 18.25-18.5 oz.",1,null,1]
[null,null,null,null,null,"Case of 12 - $12.00"]
[null,null,null,null,null,"Case of 24 - $24.00"]
["****",null,null,null,null,"Western Family Canned Fruit, 15-15.25 oz. assorted can",0.79,null,0.79]
[null,null,null,null,null,"Case of 24 - $18.96"]
["***",null,null,null,null,"Western Family Cereal, 28-32 oz. bag assorted",3,null,3]
[null,null,null,null,null,"Case of 8 - $24.00"]
["***",null,null,null,null,"Western Family Chicken Noodle or Tomato Soup, 10.5-10.75 oz.",0.5,null,0.5]
[null,null,null,null,null,"Case of 24: $12.00"]
["***",null,null,null,null,"Western Family Chili Con Carne, 15 oz. With Beans",1,null,1]
[null,null,null,null,null,"Case of 24 - $24.00"]
["****",null,null,null,null,"Western Family Chocolate Chips, 11.5-12 oz. Real Milk or Semi-Sweet",1.67,null,1.67]
[null,null,null,null,null,"Case of 24 - $40.00"]
["***",null,null,null,null,"Western Family Cream Soup, 10.5 oz. Chicken or Mushroom",0.59,null,0.59]
[null,null,null,null,null,"Case of 24 - $14.16"]
["***",null,null,null,null,"Western Family Diced or Whole Green Chiles, 4 oz.",0.5,null,0.5]
[null,null,null,null,null,"Case of 24 - $12.00"]
["****",null,null,null,null,"Western Family Dressing or Seasoning Mixes, .6-1.38 oz. Envelopes",0.33,null,0.33]
[null,null,null,null,null,"Case of 24 - $8.00"]
["***",null,null,null,null,"Western Family Evaporated Milk, 12 oz.",1,null,1]
[null,null,null,null,null,"Case of 12 - $12.00"]
[null,null,null,null,null,"Case of 24 - $24.00"]
["***",null,null,null,null,"Western Family Frozen Orange Juice, 12 oz. assorted",1.25,null,1.25]
[null,null,null,null,null,"Case of 24 - $30.00"]
["***",null,null,null,null,"Western Family Fruit Snacks, 6 ct.",1,null,1]
[null,null,null,null,null,"Case of 12 - $12.00"]
["***",null,null,null,null,"Western Family Instant Oatmeal, 10 ct. assorted",1.67,null,1.67]
[null,null,null,null,null,"Case of 12 - $20.00"]
["***",null,null,null,null,"Western Family Ketchup, 24 oz. Regular or 20 oz. Upside Down Bottle",1,null,1]
[null,null,null,null,null,"Case of 24 - $24.00"]
[null,null,null,null,null,"Case of 16 - $16.00"]
[null,null,null,null,null,"Case of 12 - $12.00"]
["****",null,null,null,null,"Western Family Liquid Bleach, 96 oz. Regular Scent",1,null,1]
[null,null,null,null,null,"Case of 6 - $6.00"]
["***",null,null,null,null,"Western Family Macaroni and Cheese, 5.5 oz. Spiral or 7.25 oz. Original",0.39,null,0.39]
[null,null,null,null,null,"Case of 24 - $9.36"]
["***",null,null,null,null,"Western Family Mandarin Oranges, 10.5-11 oz. can",0.59,null,0.59]
[null,null,null,null,null,"Case of 24 - $14.16"]
["***",null,null,null,null,"Western Family Mushrooms, 4 oz. Stems and Pieces",0.59,null,0.59]
[null,null,null,null,null,"Case of 24 - $12.00"]
["***",null,null,null,null,"Western Family Oatmeal, 42 oz. Quick or Old Fashioned",2,null,1.99]
[null,null,null,null,null,"Case of 12 - $24.00"]
["***",null,null,null,null,"Western Family Pasta, 48 oz. Elbow Macaroni, Thin or Long Spaghetti",3,null,2.99]
[null,null,null,null,null,"Case of 8 - $24.00"]
["***",null,null,null,null,"Western Family Pineapple, 20 oz. can",1,null,1]
[null,null,null,null,null,"Case of 24 - $24.00"]
[null,null,null,null,null,"Case of 16 - $16.00"]
[null,null,null,null,null,"Case of 12 - $12.00"]
["****",null,null,null,null,"Western Family Refried Beans, 16 oz. assorted",0.69,null,0.69]
[null,null,null,null,null,"Case of 24 - $16.56"]
["***",null,null,null,null,"Western Family Saltine Crackers, 16 oz. assorted",1.67,null,1.67]
[null,null,null,null,null,"Case of 12 - $20.00"]
["***",null,null,null,null,"Western Family Skillet Meals, 4.66-10.25 oz. assorted",1,null,0.99]
[null,null,null,null,null,"Case of 12 - $12.00"]
["***",null,null,null,null,"Western Family Sloppy Joe Sauce, 26.5 oz.",1.25,null,1.25]
[null,null,null,null,null,"Case of 12 - $15.00"]
["***",null,null,null,null,"Western Family Solid White Albacore Tuna, 5 oz.",1.25,null,1.25]
[null,null,null,null,null,"Case of 24 - $30.00"]
["****",null,null,null,null,"Western Family Specialty Beans, 15 oz. assorted",0.5,null,0.5]
[null,null,null,null,null,"Case of 24 - $12.00"]
["***",null,null,null,null,"Western Family Sweetened Condensed Milk, 14 oz.",1.67,null,1.67]
[null,null,null,null,null,"Case of 24 - $40.00"]
["*****",null,null,null,null,"Western Family Tomato Sauce, 8 oz. Regular or No Salt",0.33,null,0.33]
[null,null,null,null,null,"Case of 48 - $16.00"]
["****",null,null,null,null,"Western Family Vegetables, 11-15.25 oz. can Corn, Green Beans or Hominy",0.5,null,0.5]
[null,null,null,null,null,"Case of 24 - $12.00"]
["***",null,null,null,null,"Western Family Waterchestnuts, 8 oz. sliced or whole",0.5,null,0.5]
[null,null,null,null,null,"Case of 24 - $12.00"]
[]
["***",null,null,null,null,"Food Storage Sale!"]
["***",null,null,null,null,"Blue Storage Water Drum, 55 gallon",39.99,null,39.99]
["***",null,null,null,null,"Hot Pockets, 12 pk. Ham and Cheese or Pepperoni Pizza",9.99,null,9.99]
["***",null,null,null,null,"Krusteaz Buttermilk Pancake Mix, 10 lb. bag",6.99,null,6.99]
["***",null,null,null,null,"Mrs. Butterworths Pancake Syrup, 2 pk. 64 oz.",6.99,null,6.99]
["****",null,null,null,null,"Storage Pail with Lid, 5 gallon",3.99,null,3.99]
["***",null,null,null,null,"Western Family Clover Honey, 80 oz.",11.99,null,11.99]
["***",null,null,null,null,"Western Family Cooking Oil, 128 oz.",8.99,null,8.99]
["***",null,null,null,null,"Western Family Dry Black Beans, 20 lb. bag",19.989999999999998,null,19.989999999999998]
["***",null,null,null,null,"Western Family Dry Pinto Beans, 20 lb. bag",19.989999999999998,null,19.989999999999998]
["****",null,null,null,null,"Western Family Flour, 25 lb. bag All Purpose Bleached or Unbleached",9.99,null,9.99]
["***",null,null,null,null,"Western Family Granulated Sugar, 25 lb. bag",12.99,null,12.99]
["***",null,null,null,null,"Western Family Instant Nonfat Dry Milk, makes 8 quarts",6.99,null,6.99]
["***",null,null,null,null,"Western Family Long Grain Enriched Rice, 20 lb. bag",11.99,null,11.99]
["***",null,null,null,null,"Western Family Medium Grain Enriched Rice, 20 lb. bag",12.99,null,12.99]
[]
["*****",null,null,null,null,"Got a list question? Want to check if next week's list is ready? Our listmakers answer questions and post our \"preview\" lists at PYP."]
[]
["*****",null,null,null,null,"Todays date: ","Sale","We are not affiliated with this store.  The store's ad is the only OFFICIAL authority"]
["toggle 4 and 5 star rows",null,null,null,null,null,"Price"]
["Stock up scale",null,null,null,null,"How to use this list",null,"Printable coupons:","Bottom line"]
[null,null,null,null,null,null,null,"Group A  Group B  Group C  Singles"]
[null,null,null,null,null,"Harmons"]
[null,null,null,null,null,"Current list",null,"Coupon Index"]
[null,null,null,null,null,"-This list is valid during the dates listed below"]
["*****",null,null,null,null,"Valid Dates: 04/09 through 04/15",null,"This list is made by Rebecca. She answers list questions in this thread at PYP."]
["***",null,null,null,null,"Apples, Gala, organic","1.78 lb",null,"1.78 lb"]
["****",null,null,null,null,"Ataulfo Mangos",0.68,null,0.68]
["***",null,null,null,null,"Avocados, large",1.5,null,1.5]
["*****",null,null,null,null,"Broccoli",".68 lb",null,".68 lb"]
["*****",null,null,null,null,"Cauliflower",".68 lb",null,".68 lb"]
["***",null,null,null,null,"Dole Spinach 9 oz. Bag",1.98,null,1.98]
["***",null,null,null,null,"Earthbound Farms Celery Hearts, organic",1.98,null,1.98]
["***",null,null,null,null,"Earthbound Organic Salad Blends",2.98,null,2.98]
["***",null,null,null,null,"Grapes","1.68 lb",null,"1.68 lb"]
["***",null,null,null,null,"Grape Tomatoes, 10 oz",1.48,null,1.48]
["***",null,null,null,null,"Kiwi, organic",0.48,null,0.48]
["***",null,null,null,null,"Mushrooms, 8 oz",1.98,null,1.98]
["***",null,null,null,null,"Oranges, Navel",".78 lb",null,".78 lb"]
["****",null,null,null,null,"Zucchini",".68 lb",null,".68 lb"]
["***",null,null,null,null,"Beef - Cross Rib Roast","3.49 lb",null,"3.49 lb"]
["***",null,null,null,null,"Seafood - Sockeye Salmon, wild caught","9.99 lb",null,"9.99 lb"]
["***",null,null,null,null,"Turkey Breasts Boneless, Skinless Hand Trimmed, Turkey - Boneless, Skinless, Recipe Ready","3.99 lb",null,"3.99 lb"]
["*****",null,null,null,null,"Maid o Clover Gallon Milk",2.39,"Milk, gallon, .75/1 (active) Group A-03/26 Print Twice!",1.64]
["****",null,null,null,null,"Cascade Fresh Yogurt Assorted Varieties 6 Ounce",0.5,null,0.5]
["***",null,null,null,null,"Hormel Entrees Beef, Pork, Turkey or Meat Loaf, 17 Ounce",5.99,"Hormel Refrigerated Entrees, any $1/1 ( Expires 04-09-12) SS-2/12",4.99]
["***",null,null,null,null,"Hormel Entrees Beef, Pork, Turkey or Meat Loaf, 17 Ounce",5.99,"Hormel Refrigerated Entree, any $1/1 (active) This Link-10/05",4.99]
["***",null,null,null,null,"Kozy Shack Pudding 22 oz. Tubs or 4-6 Pack Assorted Varieties",2.5,null,2.5]
["****",null,null,null,null,"Lloyds Barbeque Chicken, Beef, Pork or Honey Chicken 18 Ounce",3.99,"Lloyds Barbeque product, any $1/1 (Expires 04-09-12) SS-2/12",2.99]
["***",null,null,null,null,"Dole Juice Assorted Varieties 59 Ounce",2.5,null,2.5]
["***",null,null,null,null,"Dasani Water .5 Liter Bottles 24 Pack",3.99,null,3.99]
["****",null,null,null,null,"Pepsi Next Soda Pop 12 Pack 12 Ounce",2.99,null,2.99]
["***",null,null,null,null,"American Licorice Jumbo Red Vines 16 Ounce",1.5,null,1.5]
["***",null,null,null,null,"Great Grains Bread White or Wheat Split Top, 22.5 oz.",1.5,null,1.5]
["***",null,null,null,null,"Hersheys Chocolate Syrup Assorted Varieties 24 Ounce",2,null,2]
["*****",null,null,null,null,"Malt-O-Meal Cereals 11 oz. Frosted Flakes or 12 oz. Frosted Mini Spooners",1,"Malt O Meal, $1/2 (active) THIS LINK",".50 ea"]
["****",null,null,null,null,"Nabisco Cheese Nips Assorted Varieties 10-12 Ounce",1.67,"Nabisco Crackers, any 9 to 16 oz $1/2 (active) Group B-01/12 Print Twice!","1.17 ea"]
["***",null,null,null,null,"Nutella Hazelnut Spread 13 Ounce",3,null,3]
["****",null,null,null,null,"Pompeian Olive Oil With Canola, 48 oz. or Extra Virgin, 32 oz",4.99,"Pompeian Olive Oil or OlivExtra Plus, any size or variety $1/1 (active) This Link-01/01",3.99]
["***",null,null,null,null,"Post Cereals Marshmallow Pebbles 10.75 oz., Waffle Crisp 11.5 oz., Golden Crisp 14.75 oz., Cocoa Pebbles 11 oz., Fruity Pebbles 11 oz., Honeycomb 12.5 oz., Alpha Bits 11.5 oz. or Raisin Bran 20 oz.",2,null,2]
["***",null,null,null,null,"Quaker Cereals Assorted Life, Capn Crunch or Oatmeal Squares Cereal 12-14.5 Ounce",2,null,2]
["***",null,null,null,null,"Quaker Granola Bars Assorted Varieties 6.7 Ounce",2.25,"Quaker Chewy Granola, Quaker Chewy Dipps Granola or Quaker Chewy Smashbar Bars, 6 ct. or larger boxes .75/2 (04-28-12) RP-3/18","1.88 ea"]
["****",null,null,null,null,"Quaker Yogurt Granola Bars",2.25,"Quaker Yogurt Granola Bars, any .75/1 (04-21-12) RP-3/11",1.5]
["***",null,null,null,null,"Simply Organic Spices, Select 0.75-2.99 oz",2.99,null,2.99]
["***",null,null,null,null,"Wonder Classic Bread 20 Ounce",1.99,null,1.99]
["****",null,null,null,null,"Zatarains Rice Mixes Assorted Varieties 6-8 Ounce",1,null,1]
["***",null,null,null,null,"Bertolli Frozen Entrees Assorted Varieties 24 Ounce",5.99,null,5.99]
["*****",null,null,null,null,"Blue Bunny Ice Cream, 56 oz",3.5,"Blue Bunny Novelty Carton, any $1/1 (active) This Link-04/06",2.5]
["****",null,null,null,null,"Freschetta Pizza Assorted Varieties 16.44-30.63 Ounce",3.99,"Freschetta Multi-Serve Pizzas, any $1.50/2 (06-30-12) SS-3/4","3.24 ea"]
["****",null,null,null,null,"Marie Callenders Dinners Assorted Varieties 10-21 Ounce",2,"Marie Callenders Single Serve Frozen Meals, any $1/3 (active) This Link-01/21","1.67 ea"]
["***",null,null,null,null,"Michelinas Frozen Dinners Assorted Varieties 4-9 Ounce",1,null,1]
["***",null,null,null,null,"Pace Fruit Bars Assorted Varieties 6 Count or 36 Ounce",2.5,null,2.5]
["***",null,null,null,null,"Polar Treat Ice Cream, 4.5 Quart",5.99,null,5.99]
["***",null,null,null,null,"Red Baron Pizza Assorted Varieties 16.44-30.63 Ounce",3.99,null,3.99]
["****",null,null,null,null,"Stouffers Family Size Entrees Assorted Varieties 53-57 Ounce",7.99,"Stouffers multi-serve entree, any 28-96 oz. $2/1 (04-30-12) PurinaRP-1/29",5.99]
["***",null,null,null,null,"Tombstone Pizza Assorted 12 inch",3.99,null,3.99]
["***",null,null,null,null,"409 Cleaner Select Varieties 30-48 Ounce",3,null,3]
["***",null,null,null,null,"Aquafresh Toothpaste Select Varieties 6-6.4 Ounce",1,null,1]
["***",null,null,null,null,"Cascade Dishwasher Detergent Assorted Varieties 120 Ounce",6.99,"Cascade, excludes trial/travel size .25/1 (04-30-12) PG-4/1",6.74]
["***",null,null,null,null,"Clorox, Select Varieties 30-48 Ounce",3,null,3]
["***",null,null,null,null,"Joy Dish Soap Assorted Varieties 30 Ounce",2.5,null,2.5]
["***",null,null,null,null,"Pine Sol Select Varieties 30-48 Ounce",3,"Pine-Sol Product, any - Write a review to get coupon .50/1 (active) This Link-07/26",2.5]
["*****",null,null,null,null,"Purell Jelly Wrap Assorted Va",1,"Purrell Jelly Wrap Carriers $1/3 (active) Group A-03/26 Print Twice!",".67 ea"]
["***",null,null,null,null,"Quilted Northern Bath Tissue 18 Double Roll Package",9.99,null,9.99]
["***",null,null,null,null,"Simple Face Care Select Varieties 4.2-6.7 oz. or 25 ct.","20% off","Simple Skincare Product, any excluding trial and travel sizes $2/1 (04-22-12) SS-3/25","unknown"]
[]
["*****",null,null,null,null,"Got a list question? Want to check if next week's list is ready? Our listmakers answer questions and post our \"preview\" lists at PYP."]
[]
["*****",null,null,null,null,"Todays date: ","Sale","We are not affiliated with this store.  The store's ad is the only OFFICIAL authority"]
["toggle 4 and 5 star rows",null,null,null,null,null,"Price"]
["Stock up scale",null,null,null,null,"How to use this list",null,"Printable coupons:","Bottom line"]
[null,null,null,null,null,null,null,"Group A  Group B  Group C  Singles"]
[null,null,null,null,null,"Maceys"]
[null,null,null,null,null,null,null,"Coupon Index"]
[null,null,null,null,null,"Current list"]
[null,null,null,null,null,"-This list is valid during the dates listed below"]
["*****",null,null,null,null,"Valid Dates: 4/11 - 4/17",null,"This list is made by Misti. She answers list questions in this thread at PYP."]
["****",null,null,null,null,"Avocados, Small",".69 ea",null,".69 ea"]
["***",null,null,null,null,"Bell Peppers, Green",".50 ea",null,".50 ea"]
["***",null,null,null,null,"Carrots, 2 lb. cello bag",0.99,null,0.99]
["***",null,null,null,null,"Celery, Extra Large",".89 ea",null,".89 ea"]
["***",null,null,null,null,"Cucumbers",".50 ea",null,".50 ea"]
["****",null,null,null,null,"Dole Salads, 9 oz. Classic Romaine or Just Lettuce",1.39,null,1.39]
["***",null,null,null,null,"Green Onions, Organic bunch",".59 ea",null,".59 ea"]
["***",null,null,null,null,"Onions, 3 lb. bag Yellow",1.49,null,1.49]
["****",null,null,null,null,"Oranges, Large Navel",".69 lb",null,".69 lb"]
["***",null,null,null,null,"Squash, Zucchini or Yellow",".69 lb",null,".69 lb"]
["*****",null,null,null,null,"Tomatoes, Extra Large Roma",".59 lb",null,".59 lb"]
["***",null,null,null,null,"Beef - Quarter Pound Patties, 5 lb. box",15.99,null,15.99]
["***",null,null,null,null,"Beef - Short Ribs, bone-in","3.79 lb",null,"3.79 lb"]
["***",null,null,null,null,"Beef - Sirloin Tip Oven Roast, boneless","2.99 lb",null,"2.99 lb"]
["***",null,null,null,null,"Chicken - Gold n Plump Boneless Skinless Stir Fry, Tenders or Breasts, 14-15 oz.",4,"Gold n Plump All Natural Chicken, any $1/1 (active) This Link-08/21",3]
["***",null,null,null,null,"Pork - Shoulder Butt Roast","1.99 lb",null,"1.99 lb"]
["***",null,null,null,null,"Pork - St. Louis Style Ribs","3.29 lb",null,"3.29 lb"]
["***",null,null,null,null,"Cream o Weber Sour Cream, 24 oz.",1.99,null,1.99]
["***",null,null,null,null,"I Cant Believe Its Not Butter, 15 oz. tubs, 2 pk. 8 oz. tubs or 8 oz. sprays",2.99,"I Cant Believe Its Not Butter Product, any $1.25/1 (active) Group A-02/21 Print Twice",1.74]
["***",null,null,null,null,"Natural Directions Almondmilk or Soy Milk, 64 oz. Original or Vanilla",2.19,null,2.19]
["****",null,null,null,null,"Sunny D, 64 oz.",0.99,null,0.99]
["****",null,null,null,null,"Western Family Cottage Cheese, 16 oz.",1.19,null,1.19]
["***",null,null,null,null,"Western Family Jumbos Biscuits, 16 oz. assorted",1.25,null,1.25]
["***",null,null,null,null,"Western Family Orange Juice, 89 oz. assorted",2.99,null,2.99]
["***",null,null,null,null,"Western Family Yogurt, 32 oz. assorted",2,null,2]
["***",null,null,null,null,"Bar S Bologna, 16 oz. Classic, thick or chicken",1.29,null,1.29]
["***",null,null,null,null,"Bar S Ham or Turkey Breast, 16 oz. assorted",3.49,null,3.49]
["***",null,null,null,null,"Bar S Sliced Bacon, 16 oz. assorted",3.59,null,3.59]
["***",null,null,null,null,"Farmland Sausage, 14 oz. Polska Kielbasa or Original Smoked",2.5,null,2.5]
["***",null,null,null,null,"Hormel Fully Cooked Entrees, 17 oz. assorted",5.49,null,5.49]
["***",null,null,null,null,"Johnsonville Breakfast Sausage, 12 oz.",2.99,"Johnsonville Breakfast Sausage Links or Patties .75/1 (05-31-12) SS-2/5",2.2400000000000002]
["****",null,null,null,null,"Micellis String Cheese, 12 oz.",1.99,null,1.99]
["***",null,null,null,null,"Western Family Individually Wrapped Cheese Slices, 12 oz.",1.79,null,1.79]
["***",null,null,null,null,"Western Family Jumbo Franks, 1 lb.",1.19,null,1.19]
["***",null,null,null,null,"Arrowhead Spring Water, 24 pk. half liter bottles",3.99,null,3.99]
["***",null,null,null,null,"Coke Products, 2 liter bottle",1.34,null,1.34]
["***",null,null,null,null,"Coke Products, 20 pk. cans","2 for $13","Use in-ad store coupon: 2 for $11 with coupon and purchase of 2.","5.50 ea"]
["*****",null,null,null,null,"Fuze, 18.5 oz. bottles",1,"Use in-ad vendor coupon: 10 for $5 with coupon and purchase of 10.",".50 ea"]
["***",null,null,null,null,"Juicy Juice, 8 pk. 6.75 oz. assorted",2.99,null,2.99]
["***",null,null,null,null,"Nestle Fruit Flavored Water, 6 pk. Raspberry Splash, Acai Grape or Wild Berry",3.49,null,3.49]
["***",null,null,null,null,"Nestle Spring Water, 24 pk. half liter bottles",3.99,null,3.99]
["****",null,null,null,null,"Pepsi Next, 12 pk. cans",2.99,null,2.99]
["****",null,null,null,null,"Pepsi Next, 2 liter bottles",0.99,null,0.99]
["***",null,null,null,null,"Pepsi, 7-Up or A and W Products, 12 pk. cans or 6 pk. 24 oz. bottles",4.33,null,4.33]
["***",null,null,null,null,"Powerade Sports Drinks, 32 oz. assorted",0.79,null,0.79]
["****",null,null,null,null,"Shasta Soda Pop, 24 pk. cans",3.99,null,3.99]
["***",null,null,null,null,"Ball Park Hamburger or Hot Dog Buns, 8 ct.",2,null,2]
["***",null,null,null,null,"Clover Club Potato Chips, 8-10 oz. assorted",2,null,2]
["****",null,null,null,null,"Crystal Light On the Go Drink Mixes, 7-10 ct.",1.99,"Crystal Light Drink Mix products, any $1/2 (04-30-12) SS-3/18","1.49 ea"]
["***",null,null,null,null,"Del Monte Fruit Cups, 4 pk.",2.5,null,2.5]
["***",null,null,null,null,"Don Julio Tortilla Chips, 9 oz. assorted",0.99,null,0.99]
["***",null,null,null,null,"Doritos, 10-11.5 oz.",2.99,null,2.99]
["***",null,null,null,null,"Fritos or Cheetos, 9-10.5 oz.",2.5,null,2.5]
["***",null,null,null,null,"Grandma Sycamores Bread, 24 oz. White or Wheat",2,null,2]
["***",null,null,null,null,"Kelloggs Cereal, 11-17 oz. Froot Loops, Apple Jacks, Frosted Flakes, Chocolate or Double Chocolate Krave",3,"Look for FREE Milk offer with on package coupon","2.67 ea"]
[null,null,null,null,null,null,null,"Kelloggs Cereal, any 8.7 oz or larger $1/3 (active) Group A-04/03 Print Twice"]
["***",null,null,null,null,"Kelloggs Cereal, 11-17 oz. Froot Loops, Apple Jacks, Frosted Flakes, Chocolate or Double Chocolate Krave",3,"Look for FREE Milk offer with on package coupon","2.67 ea"]
[null,null,null,null,null,null,null,"Kelloggs Cereals, any flavor 10 oz. or larger $1/3 (04-15-12) RP-3/4"]
["***",null,null,null,null,"Kelloggs Cereal, 11-17 oz. Chocolate or Double Chocolate Krave",3,"Look for FREE Milk offer with on package coupon","2.67 ea"]
[null,null,null,null,null,null,null,"Kelloggs Krave Cereal, any .50/1 (active) This Link-03/18"]
["***",null,null,null,null,"Kelloggs Cereal, 11-17 oz. Chocolate or Double Chocolate Krave",3,"Look for FREE Milk offer with on package coupon","2.50 ea"]
[null,null,null,null,null,null,null,"Kelloggs Krave, Raisin Bran Cinnamon Almond, Crunchy Nut Caramel Nut and/or Frosted Mini Wheats Little Bites Cinnamon Roll Cereal, any 11 oz. or larger $1/2 (05-13-12) RP-4/1"]
["***",null,null,null,null,"Kelloggs Cereal, 11-17 oz. Chocolate or Double Chocolate Krave",3,"Look for FREE Milk offer with on package coupon",2.2999999999999998]
[null,null,null,null,null,null,null,"Kelloggs Krave, Raisin Bran Cinnamon Almond, Crunchy Nut Caramel Nut or Frosted Mini Wheats Little Bites Cinnamon Roll Cereal, any 11 oz. or larger .70/1 (05-13-12) RP-4/1"]
["***",null,null,null,null,"Kelloggs Fruit Snacks, 8 oz.",1.67,null,1.67]
["***",null,null,null,null,"Kelloggs Nutri-Grain Bar, 7.8-10.4 oz. assorted",2.5,null,2.5]
["***",null,null,null,null,"Kraft Macaroni and Cheese, 5 pk.",3.5,null,3.5]
["***",null,null,null,null,"Kraft Miracle Whip or Mayo, 30 oz.",2.99,"Kraft Mayo or Miracle Whip Dressing products, any .75/2 (04-22-12) SS-3/25","2.62 ea"]
["***",null,null,null,null,"La Choy Bi-Packs, 42-43.5 oz. assorted",3,null,3]
["***",null,null,null,null,"La Victoria Salsa, 16 oz. assorted",2.29,null,2.29]
["***",null,null,null,null,"La Victoria Taco Sauce, 15 oz. Mild or Medium",2.29,null,2.29]
["*****",null,null,null,null,"Las Palmas Enchilada Sauce or Red Chile Sauce, 28 oz. can",2,"Las Palmas Product, any $1/1 (active) This Link-10/08",1]
["***",null,null,null,null,"Mothers Cookies, 14 oz. bag",2.5,null,2.5]
["***",null,null,null,null,"Mrs. Butterworths Original Syrup, 2 pk. 64 oz.",6.99,null,6.99]
["***",null,null,null,null,"Nabisco Cheese Nips, 10.5-12 oz.",1.5,null,1.5]
["***",null,null,null,null,"Nestle Nesquik, 16-21.8 oz.",4.49,null,4.49]
["*****",null,null,null,null,"Pompeian Extra Virgin Olive Oil, 68 oz.",14.99,"Use in-ad store coupon: $9.99 with coupon.",8.99]
[null,null,null,null,null,null,null,"Also use manufacturers coupon: Pompeian Olive Oil or OlivExtra Plus, any size or variety $1/1 (active) This Link-01/01"]
["***",null,null,null,null,"Post Honey Bunches of Oats, 48 oz. Double Pack Box Roasted Almond or Honey Roasted",5.99,null,5.99]
["***",null,null,null,null,"Quaker Cereal, 10.5-14.5 oz. Honey Graham Ohs, Life, Oatmeal Squares, Whole Hearts or Capn Crunch",2.5,null,2.5]
["***",null,null,null,null,"Rold Gold, 7-16 oz.",2.5,null,2.5]
["***",null,null,null,null,"Santitas Tortilla Chips, 11 oz. assorted",1.88,null,1.88]
["***",null,null,null,null,"Sara Lee English Muffins, 6 ct.",2.5,null,2.5]
["***",null,null,null,null,"ShurSaving Granulated Sugar, 4 lb. bag",2,null,2]
["***",null,null,null,null,"Simply Asia Stir-Fry Sauce, 3.98-4.43 oz. assorted",1.5,null,1.5]
["***",null,null,null,null,"Snyders Pretzels, 9-10 oz. Rods, Snaps or Sticks",2.29,null,2.29]
["***",null,null,null,null,"Taco Bell Bold and Creamy Sauce, 8 oz. Chipotle or Spicy Ranchero",1.5,null,1.5]
["***",null,null,null,null,"Taco Bell Taco Shells, 12 ct.",1.25,null,1.25]
["***",null,null,null,null,"Tostitos Tortilla Chips, 9-13 oz.",2.99,null,2.99]
["****",null,null,null,null,"Western Family Bread, 24 oz. Buttermilk White Roundtop, Cracked Wheat or Golden Split Top",1.25,null,1.25]
["***",null,null,null,null,"Western Family Chow Mein or Rice Noodles, 6 oz. bag",1,null,1]
["***",null,null,null,null,"Western Family Cooking Oil, 128 oz. assorted",8.99,null,8.99]
["****",null,null,null,null,"Western Family Mixes, .6-1.38 oz. Envelope Ranch, Onion or Italian Dressing or Seasoning Mixes",0.33,null,0.33]
["***",null,null,null,null,"Western Family Saltine Crackers, 16 oz. assorted",1.5,null,1.5]
["***",null,null,null,null,"Wonder Classic White Bread, 20 oz.",2,null,2]
["***",null,null,null,null,"Banquet Frozen Dinners, 4.66-10.25 oz. Value Menu",1,null,1]
["***",null,null,null,null,"Hot Pockets, 12 pk. Ham and cheese or Pepperoni Pizza",10.99,null,10.99]
["***",null,null,null,null,"Lean Cuisine Frozen Entrees, 5.25-11.5 oz. assorted","6 for $15","Use in-ad store coupon: Get (1) Skinny Cow 4-12 ct. Cones, Bars or Sandwiches and (1) Nestle 6 pk. Fruit Flavored Water FREE when you buy (6) Lean Cuisine Frozen Entrees.","2.50 ea"]
["***",null,null,null,null,"Pace Fruit or Juice Bars, 6-12 ct.",3,null,3]
["***",null,null,null,null,"PictSweet Vegetables, 8-12 oz. Deluxe or Seasoned",1.5,null,1.5]
["***",null,null,null,null,"Rhodes Warm N Serve Rolls, 6-9 ct. pan",2,"Rhodes Bread or Rolls, any .55/1 (05-20-12) RP-3/25",1.45]
["***",null,null,null,null,"Stouffers Frozen Meals, 6-12.7 oz.",2.69,"Stouffers Entrees or French Bread Pizzas, any $1.10/5 (active) This Link-04/07","2.47 ea"]
["***",null,null,null,null,"Tillamook Ice Cream, 1.75 qt.",3.99,null,3.99]
["***",null,null,null,null,"Tombstone Pizza, 12 inch",3.99,null,3.99]
["***",null,null,null,null,"Western Family Ice Cream or Sherbet, 56 oz. squares",2.5,null,2.5]
["***",null,null,null,null,"Western Family Pizza Bites, 20 oz. Pepperoni or Combination",2.99,null,2.99]
["****",null,null,null,null,"Aim Toothpaste, 4.8-6 oz. assorted",1,null,1]
["***",null,null,null,null,"Allegra Allergy Relief, 15 ct. 24 Hour",11.99,"Allegra Allergy 5, 12 or 15 ct, Childrens Allegra, Allegra-D 24 hr 5 ct or Allegra-D 12 hr 10 ct $2/1 (active) Group B-03/18 Print Twice",9.99]
["***",null,null,null,null,"Allegra Allergy Relief, 30 ct. Tablets",11.99,"Allegra Allergy 30 ct or higher, Allegra-D 24 hr 10 ct or higher or Allegra-D 12 hr 20 ct or higher $4/1 (active) Group B-03/18 Print Twice",7.99]
["****",null,null,null,null,"Aquafresh Toothpaste, 6-6.4 oz. assorted",0.79,null,0.79]
["****",null,null,null,null,"Barbasol or Pure Silk Shaving Cream, 9.5-11 oz.",1,null,1]
["***",null,null,null,null,"Huggies Diapers, 15-50 ct.",9.99,"Huggies Diapers, any $1/1 (EXPIRES 04-14-12) SS-3/18",8.99]
["***",null,null,null,null,"Huggies Pull-Ups, 15-50 ct.",9.99,"Pull-Ups Training Pants, any Jumbo Pack or larger $2/1 (EXPIRES 04-14-12) SS-3/18",7.99]
["***",null,null,null,null,"Huggies Wipes, 64-72 ct.",2.4900000000000002,"Huggies Baby Wipes, any 56 ct. or larger .50/1 (04-28-12) SS-4/1",1.99]
["****",null,null,null,null,"Ivory Soap Bars, 10 pk.",3.5,"Ivory Bar, Body Wash or Safeguard Bars, excludes trial/travel size $1/2 (04-30-12) PG-4/1","3.00 ea"]
["***",null,null,null,null,"Johnson and Johnson Band-Aids, 10-80 ct.",2,null,2]
["***",null,null,null,null,"Neosporin, .5 oz, 7.7 mL or 1 ct. On the Go",3.99,"Neosporin product, any excluding trial sizes $1/1 (EXPIRES 04-15-12) SS-2/26",2.99]
["****",null,null,null,null,"Soffs Baby Wipes Refill, 80 ct.",0.69,null,0.69]
["***",null,null,null,null,"Suave Shampoo or Conditioner, 15 oz. assorted",0.88,null,0.88]
["***",null,null,null,null,"U by Kotex Feminine Hygiene Products, 18 ct. Tampons, 14-60 ct. Maxis or Liners",4,"U by Kotex products, any $1/1 (05-05-12) SS-3/25",3]
["****",null,null,null,null,"Western Family AA Batteries, 24 pk.",5,null,5]
["***",null,null,null,null,"Western Family Feminine Products, 14-24 ct. Pads or 46-64 ct. Liners",1.99,null,1.99]
["***",null,null,null,null,"Western Family Hair Gel, 20 oz.",1,null,1]
["****",null,null,null,null,"Western Family Hydrogen Peroxide, 16 oz.",0.5,null,0.5]
["***",null,null,null,null,"Western Family Laundry Detergent, 30 lb. Regular or With Bleach",6.99,null,6.99]
["***",null,null,null,null,"Western Family Mouth Rinse, 1 liter bottle",1.25,null,1.25]
["****",null,null,null,null,"Western Family Petal Soft Bath Tissue, 36 Roll Advantage Pack or 18 Big Pack",6.49,null,6.49]
["****",null,null,null,null,"Western Family White Paper Towels, 15 Roll Mega Pack",6.49,null,6.49]
[]
["*****",null,null,null,null,"Dessert Meal Deal",5,"Use in-ad store coupon: Get all this for $5.00","5.00"]
[null,null,null,null,null,null,null,"- (1) Western Family 56 oz. Ice Cream or Sherbet"]
[null,null,null,null,null,null,null,"- (1) Western Family 18.25-18.5 oz. Cake Mix"]
[null,null,null,null,null,null,null,"- (1) Western Family 16 oz. Ready to Spread Frosting"]
[]
["***",null,null,null,null,"In-ad store coupon: .69 each when you buy 10. $1.29 each without."]
["****",null,null,null,null,"Amp, 16 oz. cans",0.69,null,0.69]
["****",null,null,null,null,"Lipton, 20 oz. bottle",0.69,null,0.69]
["****",null,null,null,null,"Pepsi, 20 oz. bottle",0.69,null,0.69]
["****",null,null,null,null,"Sobe or Sobe Lifewater, 20 oz. bottles",0.69,null,0.69]
[]
["*****",null,null,null,null,"Case Lot Sale!"]
["****",null,null,null,null,"Campbells Spaghettios or Spaghetti, 14.75-15 oz. Original",0.79,null,0.79]
[null,null,null,null,null,"Case of 24 - $18.96"]
["*****",null,null,null,null,"Campbells Spaghettios, 26 oz. can original",0.88,null,0.88]
[null,null,null,null,null,"Case of 12 - $10.56"]
["***",null,null,null,null,"Campbells Tomato or Chicken Noodle Soup, 10.75 oz.",0.59,"Campbells Condensed Chicken Noodle and Tomato Soups, any .40/4 (EXPIRES 04-15-12) SS-2/12",".49 ea"]
[null,null,null,null,null,"Case of 48 - $28.32"]
["***",null,null,null,null,"DaVinci Pasta, 16 oz. assorted",0.99,null,0.99]
[null,null,null,null,null,"Case of 20 - $19.80"]
[null,null,null,null,null,"Case of 12 - $11.88"]
["*****",null,null,null,null,"Dinty Moore Beef Stew, 24 oz.",1.25,null,1.25]
[null,null,null,null,null,"Case of 12 - $15.00"]
["***",null,null,null,null,"Geisha Chunk Light Tuna, 5 oz.",0.69,null,0.69]
[null,null,null,null,null,"Case of 24 - $16.56"]
["***",null,null,null,null,"Gold Medal Flour, 10 lb. All Purpose or Unbleached",4.99,null,4.99]
[null,null,null,null,null,"Case of 4 - $19.96"]
["***",null,null,null,null,"Hatch Green Chiles, 4 oz. chopped or diced",1.25,null,1.25]
[null,null,null,null,null,"Case of 24 - $30.00"]
["****",null,null,null,null,"Hormel Spam Luncheon Meat, 12 oz.",2,null,2]
[null,null,null,null,null,"Case of 12 - $24.00"]
[null,null,null,null,null,"Case of 24 - $48.00"]
["****",null,null,null,null,"Hunts Spaghetti Sauce, 24-26.5 oz. assorted",0.88,null,0.88]
[null,null,null,null,null,"Case of 12 - $10.56"]
["***",null,null,null,null,"Krusteaz Buttermilk Pancake Mix, 10 lb. bag",6.99,null,6.99]
[null,null,null,null,null,"Case of 4 - $27.96"]
["***",null,null,null,null,"Libbys Vienna Sausage, 5 oz. Original or Chicken",0.69,null,0.69]
[null,null,null,null,null,"Case of 24 - $16.56"]
[null,null,null,null,null,"Case of 48 - $33.12"]
["***",null,null,null,null,"Maruchan Ramen Noodles Instant Lunch, 2.25 oz. cup",0.33,null,0.33]
[null,null,null,null,null,"Case of 12 - $3.96"]
["***",null,null,null,null,"Minute Rice, 14 oz. Brown or Long Grain White",1.99,null,1.99]
[null,null,null,null,null,"Case of 12 - $23.88"]
["***",null,null,null,null,"Quaker Granola Bars, 6.5-7.4 oz. assorted",2.29,"Quaker Chewy Granola, Quaker Chewy Dipps Granola or Quaker Chewy Smashbar Bars, 6 ct. or larger boxes .75/2 (04-28-12) RP-3/18","1.92 ea"]
[null,null,null,null,null,"Case of 12 - $27.48"]
["***",null,null,null,null,"Quaker Soft Baked Bars, 6.5-7.4 oz.",2.29,null,2.29]
[null,null,null,null,null,"Case of 12 - $27.48"]
["***",null,null,null,null,"ShurSaving Chunk White Chicken, 5 oz. in water",0.88,null,0.88]
[null,null,null,null,null,"Case of 12 - $10.56"]
["****",null,null,null,null,"ShurSaving Pears or Peaches, 29 oz. can",0.99,null,0.99]
[null,null,null,null,null,"Case of 12 - $11.88"]
["***",null,null,null,null,"Taco Bell Refried Beans, 16 oz. Regular or Fat Free",0.79,null,0.79]
[null,null,null,null,null,"Case of 12 - $9.48"]
["***",null,null,null,null,"Top Ramen Noodles, 3 oz. assorted",0.2,null,0.2]
[null,null,null,null,null,"Case of 24 - $4.80"]
["***",null,null,null,null,"Western Family 100% Apple Juice or Cider, 96 oz.",2.5,null,2.5]
[null,null,null,null,null,"Case of 6 - $15.00"]
["***",null,null,null,null,"Western Family 100% Juice, 46 oz. Tomato or Vegetable",1.67,null,1.67]
[null,null,null,null,null,"Case of 12 - $20.00"]
["****",null,null,null,null,"Western Family Apple Sauce, 15 oz. Original",0.59,null,0.59]
[null,null,null,null,null,"Case of 24 - $14.16"]
["***",null,null,null,null,"Western Family Beef Stew, 24 oz. can",2.19,null,2.19]
[null,null,null,null,null,"Case of 12 - $26.28 "]
["***",null,null,null,null,"Western Family Brownie Mixes, 19.8-21.5 oz.",1.25,null,1.25]
[null,null,null,null,null,"Case of 12 - $15.00"]
["***",null,null,null,null,"Western Family Buttermilk Pancake Mix, 7 lb. bag",5.49,null,5.49]
[null,null,null,null,null,"Case of 6 - $32.94"]
["***",null,null,null,null,"Western Family Cake Mix, 18.25-18.5 oz.",0.99,null,0.99]
[null,null,null,null,null,"Case of 12 - $11.88"]
["****",null,null,null,null,"Western Family Canned Fruit, 15-15.25 oz. assorted can",0.79,null,0.79]
[null,null,null,null,null,"Case of 24 - $18.96"]
["***",null,null,null,null,"Western Family Canned Vegetables, 11-15.25 oz. Cream, No Salt or Whole Supersweet Corn, No Salt Beans, Golden or White Hominy",0.69,null,0.69]
[null,null,null,null,null,"Case of 24 - $16.56"]
["***",null,null,null,null,"Western Family Cereal, 28-32 oz. bag",2.99,null,2.99]
[null,null,null,null,null,"Case of 8 - $23.92"]
["***",null,null,null,null,"Western Family Chicken Noodle or Tomato Soup, 10.5-10.75 oz.",0.5,null,0.5]
[null,null,null,null,null,"Case of 24: $12.00"]
["***",null,null,null,null,"Western Family Chili Con Carne, 15 oz. can",0.88,null,0.88]
[null,null,null,null,null,"Case of 24 - $21.12"]
["****",null,null,null,null,"Western Family Chocolate Chips, 11.5-12 oz. Real Milk or Semi-Sweet",1.67,null,1.67]
[null,null,null,null,null,"Case of 24 - $40.00"]
["***",null,null,null,null,"Western Family Clover Honey, 80 oz.",11.99,null,11.99]
[null,null,null,null,null,"Case of 6 - $71.94"]
["****",null,null,null,null,"Western Family Concord Grape Jelly, 32 oz.",1.5,null,1.5]
[null,null,null,null,null,"Case of 12 - $18.00"]
["***",null,null,null,null,"Western Family Cream Soup, 10.5 oz. Chicken or Mushroom",0.59,null,0.59]
[null,null,null,null,null,"Case of 24 - $14.16"]
["***",null,null,null,null,"Western Family Diced or Whole Green Chiles, 4 oz.",0.5,null,0.5]
[null,null,null,null,null,"Case of 24 - $12.00"]
["****",null,null,null,null,"Western Family Diced Tomatoes, 14.5 oz. assorted can",0.5,null,0.5]
[null,null,null,null,null,"Case of 24 - $12.00"]
["****",null,null,null,null,"Western Family Evaporated Milk, 12 oz.",0.89,null,0.89]
[null,null,null,null,null,"Case of 24 - $21.36"]
["****",null,null,null,null,"Western Family Frozen Orange Juice, 12 oz. assorted",1.19,null,1.19]
[null,null,null,null,null,"Case of 24 - $28.56"]
["***",null,null,null,null,"Western Family Fruit Snacks, 6 ct.",0.99,null,0.99]
[null,null,null,null,null,"Case of 12 - $11.88"]
["***",null,null,null,null,"Western Family Ice Cream or Sherbet, 56 oz. squares",2.5,null,2.5]
["***",null,null,null,null,"Western Family Instant Nonfat Dry Milk, makes 8 quarts",6.99,null,6.99]
[null,null,null,null,null,"Case of 12 - $83.88"]
["***",null,null,null,null,"Western Family Instant Oatmeal, 10 ct. assorted",1.67,null,1.67]
[null,null,null,null,null,"Case of 12 - $20.00"]
["****",null,null,null,null,"Western Family Ketchup, 24 oz. Regular or 20 oz. Upside Down Bottle",0.88,null,0.88]
[null,null,null,null,null,"Case of 12 - $10.56"]
[null,null,null,null,null,"Case of 16 - $14.08"]
["****",null,null,null,null,"Western Family Macaroni and Cheese, 5.5 oz. Spiral or 7.25 oz. Original",0.33,null,0.33]
[null,null,null,null,null,"Case of 24 - $7.92"]
["****",null,null,null,null,"Western Family Mandarin Oranges, 10.5-11 oz. can",0.5,null,0.5]
[null,null,null,null,null,"Case of 24 - $12.00"]
["****",null,null,null,null,"Western Family Mexican Style Tomato Sauce, 8 oz.",0.33,null,0.33]
[null,null,null,null,null,"Case of 24 - $7.92"]
["****",null,null,null,null,"Western Family Microwaveable Easy Sides, 4.3-4.5 oz. assorted",0.59,null,0.59]
[null,null,null,null,null,"Case of 12 - $7.08"]
["****",null,null,null,null,"Western Family Mushrooms, 4 oz. Diced or Whole",0.5,null,0.5]
[null,null,null,null,null,"Case of 24 - $12.00"]
["***",null,null,null,null,"Western Family Oatmeal, 42 oz. Quick or Old Fashioned",1.99,null,1.99]
[null,null,null,null,null,"Case of 12 - $23.88"]
["****",null,null,null,null,"Western Family Pancake Syrup, 128 oz. Original",5.49,null,5.49]
[null,null,null,null,null,"Case of 4 - $21.96"]
["***",null,null,null,null,"Western Family Pasta, 48 oz. Elbow Macaroni, Thin or Long Spaghetti",2.99,null,2.99]
[null,null,null,null,null,"Case of 8 - $23.92"]
["***",null,null,null,null,"Western Family Peanut Butter, 18 oz. Creamy, Chunky or Reduced Fat",2.5,null,2.5]
[null,null,null,null,null,"Case of 12 - $30.00"]
["***",null,null,null,null,"Western Family Pineapple, 20 oz. can",0.99,null,0.99]
[null,null,null,null,null,"Case of 24 - $23.76"]
["***",null,null,null,null,"Western Family Premium Chunk Chicken Breast, 10 oz. can",2.5,null,2.5]
[null,null,null,null,null,"Case of 12 - $30.00"]
["***",null,null,null,null,"Western Family Ready to Spread Frosting, 16 oz. assorted",1.59,null,1.59]
[null,null,null,null,null,"Case of 12 - $19.08"]
["****",null,null,null,null,"Western Family Refried Beans, 15-16 oz. assorted",0.5,null,0.5]
[null,null,null,null,null,"Case of 24 - $12.00"]
["***",null,null,null,null,"Western Family Skillet Meals, 5.5-7.3 oz. assorted",0.99,null,0.99]
[null,null,null,null,null,"Case of 12 - $11.88"]
["***",null,null,null,null,"Western Family Sloppy Joe Sauce, 26.5 oz.",1.25,null,1.25]
[null,null,null,null,null,"Case of 12 - $15.00"]
["****",null,null,null,null,"Western Family Solid White Albacore Tuna, 5 oz.",0.99,null,0.99]
[null,null,null,null,null,"Case of 24 - $23.76"]
["***",null,null,null,null,"Western Family Spaghetti Rings, 15 oz. Plain",0.59,null,0.59]
[null,null,null,null,null,"Case of 24 - $14.16"]
["****",null,null,null,null,"Western Family Specialty Beans, 15-16 oz. assorted",0.5,null,0.5]
[null,null,null,null,null,"Case of 24 - $12.00"]
["****",null,null,null,null,"Western Family Spring Water, 24 pk. half liter bottles",2.5,null,2.5]
["***",null,null,null,null,"Western Family Sweetened Condensed Milk, 14 oz. can",1.5,null,1.5]
[null,null,null,null,null,"Case of 24 - $36.00"]
["*****",null,null,null,null,"Western Family Tomato Sauce, 8 oz. Regular or No Salt",0.33,null,0.33]
[null,null,null,null,null,"Case of 48 - $15.84"]
["****",null,null,null,null,"Western Family Vegetables, 14.5-15.25 oz. can Whole Kernel or Sweet Crisp Corn, Cut or French Cut Green Beans",0.5,null,0.5]
[null,null,null,null,null,"Case of 24 - $12.00"]
["****",null,null,null,null,"Western Family Waterchestnuts, 8 oz. sliced or whole",0.44,null,0.44]
[null,null,null,null,null,"Case of 24 - $10.56"]
[]
["*****",null,null,null,null,"Long Term Storage Sale!"]
["***",null,null,null,null,"Augason Farms 100% Instant Nonfat Country Fresh Dry Milk, 29 oz.",8.49,null,8.49]
["***",null,null,null,null,"Augason Farms Beef Vegetarian Meat Substitute, 37 oz.",8.49,null,8.49]
["***",null,null,null,null,"Augason Farms Blueberries, 12 oz.",22.99,null,22.99]
["***",null,null,null,null,"Augason Farms Butter Powder, 36 oz.",14.99,null,14.99]
["***",null,null,null,null,"Augason Farms Buttermilk Biscuit Mix, 46 oz.",5.99,null,5.99]
["***",null,null,null,null,"Augason Farms Buttermilk Pancake Mix, 52 oz.",5.99,null,5.99]
["***",null,null,null,null,"Augason Farms Cheese Blend Powder, 52 oz.",13.99,null,13.99]
["***",null,null,null,null,"Augason Farms Cheesy Broccoli Soup Mix, 54 oz.",13.99,null,13.99]
["***",null,null,null,null,"Augason Farms Chopped Onions, 23 oz.",7.99,null,7.99]
["***",null,null,null,null,"Augason Farms Creamy Potato Soup Mix, 58 oz.",10.99,null,10.99]
["***",null,null,null,null,"Augason Farms Dehydrated Apple Slices, 19.2 oz.",10.99,null,10.99]
["***",null,null,null,null,"Augason Farms Dehydrated Potato Shreds, 23 oz. can",6.49,null,6.49]
["***",null,null,null,null,"Augason Farms Dehydrated Potato Slices, 20 oz.",5.99,null,5.99]
["***",null,null,null,null,"Augason Farms Dough Enhancer, 15 oz.",2.4900000000000002,null,2.4900000000000002]
["***",null,null,null,null,"Augason Farms Freeze Dried Sweet Corn, 16 oz.",11.99,null,11.99]
["****",null,null,null,null,"Augason Farms Gulf Pacific Brown Rice, 20 lb. bag",9.99,null,9.99]
["****",null,null,null,null,"Augason Farms Hard Wheat, 45 lb. Red or White",19.989999999999998,null,19.989999999999998]
["*****",null,null,null,null,"Augason Farms Hard Wheat, 50 lb. bag Red or White Wheat",14.99,null,14.99]
["***",null,null,null,null,"Augason Farms Honey Powder, 48 oz.",9.99,null,9.99]
["***",null,null,null,null,"Augason Farms Honey Wheat Bread and Roll Mix , 58 oz.",5.99,null,5.99]
["***",null,null,null,null,"Augason Farms Morning Moos Chocolate Milk Alternative, 71 oz.",10.99,null,10.99]
["***",null,null,null,null,"Augason Farms Morning Moos Milk Alternative, 56 oz.",9.99,null,9.99]
["***",null,null,null,null,"Augason Farms Potato Gems, 48 oz. can",9.99,null,9.99]
["***",null,null,null,null,"Augason Farms Red and Green Bell Peppers, 20 oz.",10.99,null,10.99]
["***",null,null,null,null,"Augason Farms Rolled Oats, 23 lb. Regular or Quick",17.989999999999998,null,17.989999999999998]
["*****",null,null,null,null,"Augason Farms Rolled Oats, 50 lb. bag Regular or Quick",22.99,null,22.99]
["***",null,null,null,null,"Augason Farms Scrambled Egg Mix, 36 oz.",17.989999999999998,null,17.989999999999998]
["***",null,null,null,null,"Augason Farms Sliced Bananas, 34 oz.",7.99,null,7.99]
["***",null,null,null,null,"Augason Farms Sliced Strawberries, 6.4 oz. Freeze Dried",14.99,null,14.99]
["***",null,null,null,null,"Augason Farms Spiff-E-Whip Dessert Topping, 20 oz.",5.29,null,5.29]
["***",null,null,null,null,"Augason Farms Super Nutty Granola, 48 oz.",12.99,null,12.99]
["***",null,null,null,null,"Augason Farms Vegetable Stew Blend, 33 oz.",10.99,null,10.99]
["***",null,null,null,null,"Augason Farms Vital Wheat Gluten, 15 oz.",2.99,null,2.99]
["***",null,null,null,null,"Augason Farms Whole Eggs, 33 oz.",13.99,null,13.99]
["***",null,null,null,null,"Blue Storage Water Drum, 15 gallon",24.99,null,24.99]
["***",null,null,null,null,"Blue Storage Water Drum, 55 gallon",34.99,null,34.99]
["****",null,null,null,null,"Food Storage Pail with Lid, 5 gallon",3.5,null,3.5]
["****",null,null,null,null,"Water Storage Jug, 5 gallon",3.5,null,3.5]
["***",null,null,null,null,"Western Family Dry Black Beans, 20 lb. bag",19.989999999999998,null,19.989999999999998]
["***",null,null,null,null,"Western Family Dry Pinto Beans, 20 lb. bag",19.989999999999998,null,19.989999999999998]
["****",null,null,null,null,"Western Family Flour, 25 lb. bag All Purpose Bleached or Unbleached",9.99,null,9.99]
["***",null,null,null,null,"Western Family Granulated Sugar, 25 lb. bag",13.88,null,13.88]
["***",null,null,null,null,"Western Family Long Grain Enriched Rice, 20 lb. bag",9.99,null,9.99]
["***",null,null,null,null,"Western Family Medium Grain Enriched Rice, 20 lb. bag",12.99,null,12.99]
[]
["*****",null,null,null,null,"Got a list question? Want to check if next week's list is ready? Our listmakers answer questions and post our \"preview\" lists at PYP."]
[]
["*****",null,null,null,null,"Todays date: ","Sale","We are not affiliated with this store.  The store's ad is the only OFFICIAL authority"]
["toggle 4 and 5 star rows",null,null,null,null,null,"Price"]
["Stock up scale",null,null,null,null,"How to use this list",null,"Printable coupons:","Bottom line"]
[null,null,null,null,null,null,null,"Group A  Group B  Group C  Singles"]
[null,null,null,null,null,"Reams"]
[null,null,null,null,null,null,null,"Coupon Index"]
[null,null,null,null,null,"Current list"]
[null,null,null,null,null,"-This list is valid during the dates listed below"]
["*****",null,null,null,null,"Valid Dates: 4/10 - 4/16",null,"This list is made by Misti. She answers list questions in this thread at PYP."]
["***",null,null,null,null,"Bananas",".44 lb",null,".44 lb"]
["****",null,null,null,null,"Bell Peppers, green",".39 ea",null,".39 ea"]
["*****",null,null,null,null,"Broccoli Crowns",".69 lb",null,".69 lb"]
["***",null,null,null,null,"Cauliflower",".69 lb",null,".69 lb"]
["****",null,null,null,null,"Celery, large",".39 lb",null,".39 lb"]
["***",null,null,null,null,"Dole Classic Romaine, 9 oz.",1.49,null,1.49]
["***",null,null,null,null,"Grapes, Black Seedless","1.99 lb",null,"1.99 lb"]
["*****",null,null,null,null,"Mangos",".50 ea",null,".50 ea"]
["***",null,null,null,null,"Onions",".79 lb",null,".79 lb"]
["****",null,null,null,null,"Pears, Red",".79 lb",null,".79 lb"]
["***",null,null,null,null,"Zucchini Squash",".49 lb",null,".49 lb"]
["***",null,null,null,null,"Beef - 93% Lean Ground","2.99 lb",null,"2.99 lb"]
["***",null,null,null,null,"Beef - Sirloin Tip, boneless sold whole in the bag","2.89 lb",null,"2.89 lb"]
["*****",null,null,null,null,"Chicken - Boneless Skinless Breasts, 20 lb. case frozen","1.69 lb",null,33.799999999999997]
[null,null,null,null,null,"No Rainchecks"]
["****",null,null,null,null,"Chicken - Breaded Patties, 10 lb. case fully cooked","1.39 lb",null,13.9]
[null,null,null,null,null,"No Rainchecks"]
["****",null,null,null,null,"Chicken - Leg Quarters, fresh Family Pack",".79 lb",null,".79 lb"]
["****",null,null,null,null,"Pork - Picnic Roast",".99 lb",null,".99 lb"]
["****",null,null,null,null,"Seafood - Tilapia Fillets, 10 lb. case frozen","2.49 lb",null,24.9]
["****",null,null,null,null,"I Cant Believe Its Not Butter, 15 oz. Spreads or 8 oz. Spray",2.79,"I Cant Believe Its Not Butter Product, any $1.25/1 (active) Group A-02/21 Print Twice",1.54]
["***",null,null,null,null,"Nestle Coffee-Mate Flavored Creamers, 32 oz. assorted",2.99,"Nestle Coffee-Mate Creamers, any liquid or powder .55/1 (active) This Link-02/20",2.44]
["***",null,null,null,null,"Nestle Coffee-Mate Flavored Creamers, 32 oz. assorted",2.99,"Nestle Coffee-Mate Creamers, any liquid or powder .75/2 (active) This Link-02/20","2.62 ea"]
["***",null,null,null,null,"Nestle Nesquick Flavored Milk, 16 oz. assorted",1.25,null,1.25]
["***",null,null,null,null,"Western Family Orange Juice, 64 oz. chilled",1.88,null,1.88]
["***",null,null,null,null,"Kraft American Singles, 10.7-12 oz.",2.99,null,2.99]
["***",null,null,null,null,"Kraft Shredded Cheese, 8 oz.",2.99,null,2.99]
["***",null,null,null,null,"Oscar Mayer Bologna or Salami, 16 oz.",1.99,null,1.99]
["***",null,null,null,null,"Oscar Mayer Lunchables, 4.5 oz.",1.39,null,1.39]
["***",null,null,null,null,"Oscar Mayer Shaved Turkey or Ham, 16 oz.",3.49,null,3.49]
["*****",null,null,null,null,"Three Blend Shredded Cheese, 5 lb. bag Mozzarella/Cheddar/Monterey Jack",10.95,null,10.95]
["*****",null,null,null,null,"Fuze Drinks, 16.9 oz.",1,"Extra Promo: 10 for $5 when you buy 10 in a single transaction.",".50 ea"]
["***",null,null,null,null,"Kool-Aid Bursts Drinks, 6 ct.",0.89,null,0.89]
["***",null,null,null,null,"Pepsi and Mountain Dew Products, 12 pk. cans","4.33 ea",null,"4.33 ea"]
["***",null,null,null,null,"Pepsi and Mountain Dew Products, 2 liter bottles",1.25,null,1.25]
["****",null,null,null,null,"Pepsi Next, 12 pk. cans",2.99,null,2.99]
["****",null,null,null,null,"Pepsi Next, 2 liter bottle",0.99,null,0.99]
["***",null,null,null,null,"Powerade Sports Drinks, 32 oz. bottles",0.79,null,0.79]
["***",null,null,null,null,"Sobe Juice or Life Water, 20 oz. assorted",0.99,null,0.99]
["****",null,null,null,null,"Crystal Light On the Go Drink Mixes, 7-10 ct.",2,"Crystal Light Drink Mix products, any $1/2 (04-30-12) SS-3/18","1.50 ea"]
["***",null,null,null,null,"Del Monte Fruit Cups, 4 pk.",2.4900000000000002,null,2.4900000000000002]
["***",null,null,null,null,"Doritos Tortilla Chips, 11-11.5 oz. assorted",3,null,3]
["***",null,null,null,null,"Jiffy Baking Mix, 40 oz.",2.59,null,2.59]
["***",null,null,null,null,"Jiffy Corn Muffin or Pizza Crust Mix, 6.5-8.5 oz.",0.5,null,0.5]
["***",null,null,null,null,"Jiffy Muffin Mixes, 7 oz. assorted",0.69,null,0.69]
["***",null,null,null,null,"Kelloggs Cereals, 17 oz. Frosted Flakes, 12.2 oz. Apple Jacks, 12.2 oz. Froot Loops, 12 oz. Rice Krispies, 11 oz. Krave",2.99,"Kelloggs Cereal, any 8.7 oz or larger $1/3 (active) Group A-04/03 Print Twice","2.66 ea"]
["***",null,null,null,null,"Kelloggs Cereals, 17 oz. Frosted Flakes, 12.2 oz. Apple Jacks, 12.2 oz. Froot Loops, 12 oz. Rice Krispies, 11 oz. Krave",2.99,"Kelloggs Cereals, any flavor 10 oz. or larger $1/3 (EXPIRES 04-15-12) RP-3/4","2.66 ea"]
["***",null,null,null,null,"Kelloggs Cereals, 11 oz. Krave",2.99,"Kelloggs Krave Cereal, any .50/1 (active) This Link-03/18",2.4900000000000002]
["***",null,null,null,null,"Kelloggs Cereals, 11 oz. Krave",2.99,"Kelloggs Krave, Raisin Bran Cinnamon Almond, Crunchy Nut Caramel Nut and/or Frosted Mini Wheats Little Bites Cinnamon Roll Cereal, any 11 oz. or larger $1/2 (05-13-12) RP-4/1","2.49 ea"]
["***",null,null,null,null,"Kelloggs Cereals, 11 oz. Krave",2.99,"Kelloggs Krave, Raisin Bran Cinnamon Almond, Crunchy Nut Caramel Nut or Frosted Mini Wheats Little Bites Cinnamon Roll Cereal, any 11 oz. or larger .70/1 (05-13-12) RP-4/1",2.29]
["****",null,null,null,null,"Kelloggs Fruit Snacks, 9 oz. assorted",1.5,null,1.5]
["***",null,null,null,null,"Kelloggs Nutri-Grain or Fusion Bars, 7-10.4 oz. assorted",2.5,null,2.5]
["****",null,null,null,null,"Kraft Homestyle Macaroni Dinners, 12-15 oz.",1.99,"Kraft Homestyle Macaroni and Cheese Dinner, any .75/1 (05-01-12) SS-4/1",1.24]
["***",null,null,null,null,"La Choy Chow Mein Dinners, 42 oz. bi-Pack",2.98,null,2.98]
["***",null,null,null,null,"Lays Kettle Cooked Potato Chips, 8.5 oz.",2.5,null,2.5]
["***",null,null,null,null,"Lays Potato Chips, 10-10.5 oz.",2.5,null,2.5]
["***",null,null,null,null,"Mothers Bagged Cookies, 14 oz. assorted",2.5,null,2.5]
["***",null,null,null,null,"Nissin Souper Meals, Bowl Noodles or Chow Mein Bowls, 3-4 oz.",0.89,null,0.89]
["***",null,null,null,null,"Nissin Top Ramen Noodles, 3 oz.",0.2,null,0.2]
["*****",null,null,null,null,"Pompeian Olive Oil, 16 oz. Classic, Extra Virgin and Extra Light",3.99,"Pompeian Olive Oil or OlivExtra Plus, any size or variety $1/1 (active) This Link-01/01",2.99]
["*****",null,null,null,null,"Pompeian Vinegars, 16 oz. Red Wine, White Wine or Plus Pomegranate",1.59,"Pompeian Vinegar, any size or variety .50/1 (active) This Link-01/01",1.0900000000000001]
["***",null,null,null,null,"Post Cereals, 11.5 oz. Waffle Crisp, 14.7 oz. Golden Crisp, 12.5 oz. Honeycomb, 11.5 oz. Alpha-Bits, 20 oz. Raisin Bran, or 11 oz. Fruity/Cocoa Pebbles",2.5,null,2.5]
["***",null,null,null,null,"Rold Gold Pretzels, 8-16 oz. assorted",2.5,null,2.5]
["***",null,null,null,null,"Sara Lee Bread, 20 oz. Classic White or Wheat or Iron Kids",2,null,2]
["***",null,null,null,null,"Sara Lee Wide Pan Breads, 24 oz.",2.29,null,2.29]
["****",null,null,null,null,"Taco Bell Refried Beans, 16 oz. can",0.69,null,0.69]
["***",null,null,null,null,"Taco Bell Taco Shells, 4.5 oz.",1.29,null,1.29]
["***",null,null,null,null,"Velveeta Skillets Dinners, 12-15 oz.",1.99,null,1.99]
["***",null,null,null,null,"Vlasic Pickles, 46 oz. Whole Dill",2.5,null,2.5]
["****",null,null,null,null,"Western Family Easy Sides Pasta Side Dishes, 4.5 oz.",0.5,null,0.5]
["***",null,null,null,null,"DiGiorno Smalls Pizzas",2.99,null,2.99]
["***",null,null,null,null,"Dreyers Fruit Bars, 6-12 ct. assorted",3,"Dreyers Fruit Bars, any $1/2 (05-31-12) SS-4/1","2.50 ea"]
["***",null,null,null,null,"Krusteaz Frozen Waffles, Pancakes or French Toast Sticks, 7-19 oz.",2.29,null,2.29]
["***",null,null,null,null,"Meadow Gold Fudge, Dream or Root Beer Bars, 6 ct.",2,null,2]
["***",null,null,null,null,"Russells Ice Cream, half gallon",3.5,null,3.5]
["***",null,null,null,null,"Tombstone Pizzas, Original or Double Top",3.99,null,3.99]
["***",null,null,null,null,"Tonys Original Crust Pizzas",2,null,2]
["***",null,null,null,null,"Western Family Lasagna, 96 oz. Family Size",8.99,null,8.99]
["***",null,null,null,null,"Aquafresh Toothpaste, X-Fresh, Tartar or Original",1.19,null,1.19]
["***",null,null,null,null,"Banana Boat Sun Care, assorted Ultra Mist and Sport",7.99,null,7.99]
["***",null,null,null,null,"Blistex Lip Balm, Complete Moisture or Five Star",1.69,null,1.69]
["***",null,null,null,null,"Bounce Fabric Softener, 2 month bar",3.79,"Bounce, excludes trial/travel size .50/1 (04-30-12) SS-3/11",3.29]
["***",null,null,null,null,"Bounce Fabric Softener, 2 month bar",3.79,"Tide, Downy, Bounce or Tide Stain Release, excludes Tide PODS and trial/travel size $2/3 (04-30-12) PG-4/1","2.62 ea"]
["***",null,null,null,null,"Bounty Paper Towels, 8 roll pack",9.99,null,9.99]
["***",null,null,null,null,"Charmin Bathroom Tissue, 12 pk. double roll",7.99,"Charmin, excludes trial/travel size .25/1 (04-30-12) PG-4/1",7.74]
["***",null,null,null,null,"Edge Shaving Gel",2.5,"Edge Shave Gel, any 7 oz. or larger .55/1 (05-06-12) SS-3/25",1.95]
["***",null,null,null,null,"Head and Shoulders, 23.7 oz. assorted",6.99,"Head and Shoulders Product, Buy 1 Get 1 FREE up to $9.99, excludes trial/travel size (04-30-12) PG-4/1","3.50 ea"]
["***",null,null,null,null,"Luvs Diapers, 80-180 ct. Big Pack",17.989999999999998,null,17.989999999999998]
["***",null,null,null,null,"Old Spice Body Wash, 18 oz. assorted",3.59,"Old Spice Deodorant, Buy 1 Get $1.00 off one Old Spice Body Wash, excludes trial/travel size (04-30-12) PG-4/1",3.59]
[null,null,null,null,null,null,null,"NOTE: You must buy BOTH products to use this coupon."]
["***",null,null,null,null,"Pantene, 24.4 oz. assorted",6.99,"Pantene Products, excludes trial/travel size $1/2 (04-30-12) PG-4/1","6.49 ea"]
["***",null,null,null,null,"Skintimate Shaving Gel",2.5,"Skintimate Shave Gel, any excluding 2.75 oz. cans .55/1 (05-06-12) SS-3/25",1.95]
["***",null,null,null,null,"Tide Laundry Detergent, 150 oz.",18.989999999999998,"Tide Detergent, excludes Tide PODS and trial/travel size .50/1 (04-30-12) SS-3/11",18.489999999999998]
["***",null,null,null,null,"Tide Laundry Detergent, 150 oz.",18.989999999999998,"Tide, Downy, Bounce or Tide Stain Release, excludes Tide PODS and trial/travel size $1/2 (04-30-12) PG-4/1","18.49 ea"]
["***",null,null,null,null,"Tide Laundry Detergent, 150 oz.",18.989999999999998,"Tide, Downy, Bounce or Tide Stain Release, excludes Tide PODS and trial/travel size .50/1 (04-30-12) PG-4/1",18.489999999999998]
["***",null,null,null,null,"Western Family Speed 3 Razors, 4 plus 2 Bonus Pack",2.69,null,2.69]
["***",null,null,null,null,"Zyrtec 24 Hour Allergy Relief, 40 ct. Total bonus pack",15,"Zyrtec Products, any 24 ct. or larger $8/2 (04-30-12) RP-4/1","11.00 ea"]
["***",null,null,null,null,"Zyrtec 24 Hour Allergy Relief, 40 ct. Total bonus pack",15,"Zyrtec Products, any 24 ct. or larger $4/1 (04-30-12) RP-4/1",11]
[]
["*****",null,null,null,null,"Meal Deal",5,"Use in-ad store coupon: Get all this for $8.99",8.99]
[null,null,null,null,null,null,null,"- (1) Western Family 96 oz. Lasagna"]
[null,null,null,null,null,null,null,"- (1) French Bread"]
[null,null,null,null,null,null,null,"- (1) 2-liter Pepsi products"]
[]
["*****",null,null,null,null,"Got a list question? Want to check if next week's list is ready? Our listmakers answer questions and post our \"preview\" lists at PYP."]
[]
["*****",null,null,null,null,"Todays date: ","Sale","We are not affiliated with this store.  The store's ad is the only OFFICIAL authority"]
["toggle 4 and 5 star rows",null,null,null,null,null,"Price"]
["Stock up scale",null,null,null,null,"How to use this list",null,"Printable coupons:","Bottom line"]
[null,null,null,null,null,null,null,"Group A  Group B  Group C  Singles"]
[null,null,null,null,null,"Associated Foods"]
[null,null,null,null,null,"\"Early Ad\" Stores",null,"Coupon Index"]
[null,null,null,null,null,"Current list"]
[null,null,null,null,null,"-This list is valid during the dates listed below"]
["*****",null,null,null,null,"\"Early\" ads (run Monday - Saturday)",null,"This list is made by Misti. She answers list questions in this thread at PYP."]
[]
[null,null,null,null,null,"Valid Dates: 4/9 - 4/14"]
["*****",null,null,null,null,"PLEASE NOTE: This list is created from the Lees ad."]
[]
[null,null,null,null,null,"IT IS NOT GUARANTEED TO BE ACCURATE FOR EVERY ASSOCIATED FOOD STORE."]
[]
[null,null,null,null,null,"Each stores ad is the final authority on sale pricing."]
["****",null,null,null,null,"Apples, Large Golden Delicious, Jonagold, Braeburn or Cameo",".99 lb",null,".99 lb"]
["***",null,null,null,null,"Avocados, Organic",".99 ea",null,".99 ea"]
["***",null,null,null,null,"Bell Peppers, Green",".50 ea",null,".50 ea"]
["****",null,null,null,null,"Cilantro, bunch",".39 ea",null,".39 ea"]
["***",null,null,null,null,"Clementine Mandarins, 3 lb. bag",4.99,null,4.99]
["***",null,null,null,null,"Cucumbers",".50 ea",null,".50 ea"]
["***",null,null,null,null,"Dole Salads, 9 oz. Classic Romaine or 11 oz. Just Lettuce",1.69,null,1.69]
["***",null,null,null,null,"Grapes, Red or Black Seedless","1.99 lb",null,"1.99 lb"]
["****",null,null,null,null,"Green Onions, bunch",".39 ea",null,".39 ea"]
["*****",null,null,null,null,"Mangos",".50 ea",null,".50 ea"]
["****",null,null,null,null,"Oranges, Navel",".49 lb",null,".49 lb"]
["***",null,null,null,null,"Potatoes, Baker",".59 lb",null,".59 lb"]
["****",null,null,null,null,"Radishes, bunch",".39 ea",null,".39 ea"]
["***",null,null,null,null,"Spinach, bunch",".99 ea",null,".99 ea"]
["*****",null,null,null,null,"Tomatoes, Extra Large Roma",".69 lb",null,".69 lb"]
["****",null,null,null,null,"I Cant Believe Its Not Butter, 15 oz. tubs, 2 pk. 8 oz. tubs or 8 oz. spray",2.88,"I Cant Believe Its Not Butter Product, any $1.25/1 (active) Group A-02/21 Print Twice",1.63]
["***",null,null,null,null,"Natural Directions Almondmilk or Soy Milk, 64 oz. Original or Vanilla",2.19,null,2.19]
["****",null,null,null,null,"Sunny D, 64 oz.",0.99,null,0.99]
["****",null,null,null,null,"Western Family Cottage Cheese, 16 oz.",1.19,null,1.19]
["***",null,null,null,null,"Western Family Jumbos Biscuits, 16 oz.",1.25,null,1.25]
["***",null,null,null,null,"Western Family Orange Juice, 89 oz. assorted",2.99,null,2.99]
["***",null,null,null,null,"Western Family Yogurt, 32 oz. assorted",2,null,2]
["***",null,null,null,null,"Bar S Bologna, 16 oz. Classic, Thick or Chicken",1.29,null,1.29]
["***",null,null,null,null,"Bar S Ham or Turkey Breast, 16 oz.",3.49,null,3.49]
["****",null,null,null,null,"Dailys Big Buy Bacon, 1 lb.",1.89,null,1.89]
["***",null,null,null,null,"Johnsonville Breakfast Sausage Links, 12 oz.",2.99,"Johnsonville Breakfast Sausage Links or Patties .75/1 (05-31-12) SS-2/5",2.2400000000000002]
["****",null,null,null,null,"Micellis String Cheese, 12 oz.",1.99,null,1.99]
["***",null,null,null,null,"Tyson Fully Cooked Entrees, 17 oz.",5.49,null,5.49]
["***",null,null,null,null,"Western Family Individually Wrapped Cheese Slices, 12 oz.",1.79,null,1.79]
["***",null,null,null,null,"Western Family Jumbo Franks, 1 lb.",1.19,null,1.19]
["***",null,null,null,null,"Arrowhead Spring Water, 24 pk. half liter bottles",4.49,null,4.49]
["***",null,null,null,null,"Coke Products, 2 liter bottle",1.34,null,1.34]
["***",null,null,null,null,"Coke Products, 20 pk. cans","2 for $13","Use in-ad vendor coupon: 2 for $11 with coupon and purchase of 2.","5.50 ea"]
["*****",null,null,null,null,"Fuze, 18.5 oz. bottles",1,"Use in-ad vendor coupon: 10 for $5 with coupon and purchase of 10.",".50 ea"]
["***",null,null,null,null,"Langers Juice Cocktails, 64 oz. Cranberry or Pomegranate",2.5,null,2.5]
["***",null,null,null,null,"Nestle Pure Life Spring Water, 24 pk. half liter bottles",4.49,null,4.49]
["****",null,null,null,null,"Pepsi Next, 12 pk. cans",2.99,null,2.99]
["****",null,null,null,null,"Pepsi Next, 2 liter bottles",0.99,null,0.99]
["***",null,null,null,null,"Pepsi, 7-Up or A and W Products, 12 pk. cans","3 for $14",null,"4.67 ea"]
["***",null,null,null,null,"Powerade Sports Drinks, 32 oz. assorted",0.79,null,0.79]
["***",null,null,null,null,"Sobe Lifewater, 20 oz. bottle",1,null,1]
["***",null,null,null,null,"Western Family 100% Apple Juice or Cider, 96 oz.",2.5,null,2.5]
["***",null,null,null,null,"Aunt Jemima Pancake Mix, 32 oz.",2.4900000000000002,null,2.4900000000000002]
["***",null,null,null,null,"Aunt Jemima Syrup, 24 oz.",2.4900000000000002,null,2.4900000000000002]
["****",null,null,null,null,"Crystal Light On the Go Drink Mixes, 7-10 ct.",1.99,"Crystal Light Drink Mix products, any $1/2 (04-30-12) SS-3/18","1.49 ea"]
["***",null,null,null,null,"DaVinci Pasta, 16 oz. assorted",0.99,null,0.99]
["***",null,null,null,null,"Doritos, 11-11.5 oz.",2.99,null,2.99]
["***",null,null,null,null,"Grandma Sycamores Bread, 24 oz. White or Wheat",2,null,2]
["***",null,null,null,null,"Hatch Green Chiles, 4 oz. Chopped or Diced",1.25,null,1.25]
["***",null,null,null,null,"Jolly Time Microwave Popcorn, 2-4 pk.",1.67,"Jolly Time Microwave Popcorn, any boxes $1/2 (active) This Link-05/23","1.17 ea"]
["***",null,null,null,null,"Kelloggs Cereals, 11-17 oz. Froot Loops, Apple Jacks, Frosted Flakes, Chocolate or Double Chocolate Krave",3,"Kelloggs Cereal, any 8.7 oz or larger $1/3 (active) Group A-04/03 Print Twice","2.67 ea"]
["***",null,null,null,null,"Kelloggs Cereals, 11-17 oz. Froot Loops, Apple Jacks, Frosted Flakes, Chocolate or Double Chocolate Krave",3,"Kelloggs Cereals, any flavor 10 oz. or larger $1/3 (04-15-12) RP-3/4","2.67 ea"]
["***",null,null,null,null,"Kelloggs Cereals, 11-17 oz. Chocolate or Double Chocolate Krave",3,"Kelloggs Krave Cereal, any .50/1 (active) This Link-03/18",2.5]
["***",null,null,null,null,"Kelloggs Cereals, 11-17 oz. Chocolate or Double Chocolate Krave",3,"Kelloggs Krave, Raisin Bran Cinnamon Almond, Crunchy Nut Caramel Nut and/or Frosted Mini Wheats Little Bites Cinnamon Roll Cereal, any 11 oz. or larger $1/2 (05-13-12) RP-4/1","2.50 ea"]
["***",null,null,null,null,"Kelloggs Cereals, 11-17 oz. Chocolate or Double Chocolate Krave",3,"Kelloggs Krave, Raisin Bran Cinnamon Almond, Crunchy Nut Caramel Nut or Frosted Mini Wheats Little Bites Cinnamon Roll Cereal, any 11 oz. or larger .70/1 (05-13-12) RP-4/1",3.3]
["***",null,null,null,null,"Kelloggs Fruit Snacks, 8oz.",1.67,null,1.67]
["***",null,null,null,null,"Kelloggs Nutri-Grain Bar, 7.8-10.4 oz. assorted",2.5,null,2.5]
["***",null,null,null,null,"Kraft Miracle Whip or Mayo, 30 oz. Original",2.99,"Kraft Mayo or Miracle Whip Dressing products, any .75/2 (04-22-12) SS-3/25","2.62 ea"]
["***",null,null,null,null,"La Choy Bi-Packs, 42-43.5 oz.",3,null,3]
["***",null,null,null,null,"La Victoria Salsa, 16 oz.",2.29,null,2.29]
["***",null,null,null,null,"La Victoria Taco Sauce, 15 oz.",2.29,null,2.29]
["*****",null,null,null,null,"Las Palmas Enchilada Sauce, 28 oz.",2,"Las Palmas Product, any $1/1 (active) This Link-10/08",1]
["***",null,null,null,null,"Lays Potato Chips, 10-10.5 oz.",2.5,null,2.5]
["***",null,null,null,null,"Minute Rice, 14 oz. Brown or Long Grain White",1.99,"Minute Rice Product, any .50/1 (04-30-12) PurinaRP-1/29",1.49]
["***",null,null,null,null,"Mothers Cookies, 14 oz. bag",2.5,null,2.5]
["***",null,null,null,null,"Nabisco Cheese Nips, 10.5-12 oz.",1.5,null,1.5]
["***",null,null,null,null,"Quaker Cereal, 10.5-14.5 oz. Honey Graham Ohs, Life, Oatmeal Squares, Whole Hearts or Capn Crunch",2,null,2]
["***",null,null,null,null,"Quaker Snack Bars, 6.5-7.4 oz. Chewy, Chewy Dipps",2.29,"Quaker Chewy Granola, Quaker Chewy Dipps Granola or Quaker Chewy Smashbar Bars, 6 ct. or larger boxes .75/2 (04-28-12) RP-3/18","1.92 ea"]
["***",null,null,null,null,"Quaker Snack Bars, 6.5-7.4 oz. Soft Baked",2.29,null,2.29]
["***",null,null,null,null,"Rold Gold, 7-16 oz.",2.5,null,2.5]
["***",null,null,null,null,"Taco Bell Bold and Creamy Sauce, 8 oz.",1.5,null,1.5]
["***",null,null,null,null,"Taco Bell Refried Beans, 16 oz.",0.79,null,0.79]
["***",null,null,null,null,"Taco Bell Taco Shells, 12 ct.",1.25,null,1.25]
["***",null,null,null,null,"Tostitos Tortilla Chips, 9-13 oz.",2.99,null,2.99]
["****",null,null,null,null,"Western Family Bread, 24 oz. Buttermilk White Roundtop, Cracked Wheat or Golden Split Top",1.25,null,1.25]
["***",null,null,null,null,"Western Family Brownie Mixes, 19.8-21.5 oz. Chewy, Classic or Dark Chocolate",1.49,null,1.49]
["****",null,null,null,null,"Western Family Easy Sides, 4.3-4.5 oz. Microwaveable",0.59,null,0.59]
["***",null,null,null,null,"Western Family Grape Jelly, 32 oz.",1.88,null,1.88]
["***",null,null,null,null,"Western Family Peanut butter, 18 oz. Creamy, Chunky or Reduced Fat",2.4900000000000002,null,2.4900000000000002]
["***",null,null,null,null,"Western Family Premium Chunk Chicken Breast, 10 oz.",2.5,null,2.5]
["*****",null,null,null,null,"Western Family Tomato Sauce, 8 oz.",0.33,null,0.33]
["***",null,null,null,null,"Wonder Classic White Bread, 20 oz.",2,null,2]
["***",null,null,null,null,"Farr Ice Cream, 4 qt. pail",5.99,null,5.99]
["***",null,null,null,null,"PictSweet Vegetables, 8-12 oz. Deluxe or Seasoned",1.5,null,1.5]
["***",null,null,null,null,"Rhodes Warm N Serve Rolls, 6-9 ct. pan",2,"Rhodes Bread or Rolls, any .55/1 (05-20-12) RP-3/25",1.45]
["***",null,null,null,null,"Stouffers Frozen Meals, 6-12.7 oz.",2.69,"Stouffers Entrees or French Bread Pizzas, any $1.10/5 (active) This Link-04/07 Print Twice","2.47 ea"]
["***",null,null,null,null,"Tillamook Ice Cream, 1.75 qt.",3.99,null,3.99]
["***",null,null,null,null,"Tombstone Pizza, 12 inch",3.99,null,3.99]
["***",null,null,null,null,"Western Family Burritos, 5 oz.",0.33,null,0.33]
["***",null,null,null,null,"Western Family Chicken, 26 oz. Frozen Dino Nuggets or Popcorn",4.99,null,4.99]
["***",null,null,null,null,"Western Family Crunchy Fillets or Fish Sticks, 19-24 oz.",3.99,null,3.99]
["***",null,null,null,null,"Allegra Allergy Relief, 30 ct. Tablets",11.99,"Allegra Allergy 30 ct or higher, Allegra-D 24 hr 10 ct or higher or Allegra-D 12 hr 20 ct or higher $4/1 (active) Group B-03/18 Print Twice",7.99]
["***",null,null,null,null,"Allegra Allergy Relief, 15 ct. 24 Hour",11.99,"Allegra Allergy 5, 12 or 15 ct, Childrens Allegra, Allegra-D 24 hr 5 ct or Allegra-D 12 hr 10 ct $2/1 (active) Group B-03/18 Print Twice",9.99]
["****",null,null,null,null,"Aquafresh Toothpaste, 6-6.4 oz. assorted",0.88,null,0.88]
["***",null,null,null,null,"Band-Aid Bandages, 10-80 ct.",2,null,2]
["***",null,null,null,null,"Coppertone Sunscreen, 6-8 oz. Babys or Kids",8.8800000000000008,"Coppertone Sun Care, any excluding lip balm and trial sizes $1/1 (active) This Link-02/04",7.88]
["***",null,null,null,null,"Cottonelle Bathroom Tissue, 12 Double Roll Clean Care or Ultra",6.99,null,6.99]
["***",null,null,null,null,"Edge Shaving Cream, 7-10 oz.",1.88,"Edge Shave Gel, any 7 oz. or larger .55/1 (05-06-12) SS-3/25",1.33]
["***",null,null,null,null,"Finish Powerball Tabs, 32 ct.",4.99,"Finish Powerball Tabs or Gelpacs, any .75/1 (04-15-12) SS-3/11",4.24]
["***",null,null,null,null,"Finish Powerball Tabs, 32 ct.",4.99,"Finish Powerball or Gelpacs Dishwasher detergent .50/1 (active) This Link-04/02",4.49]
["***",null,null,null,null,"Glad Freezer or Storage Bags, 30-50 ct. gallon or quart",2.99,"Glad Food Storage Products, any $1/2 (active) This Link-08/21","2.49 ea"]
["***",null,null,null,null,"Huggies Diapers, 15-50 ct.",9.85,"Huggies Diapers, any $1/1 (04-14-12) SS-3/18",8.85]
["***",null,null,null,null,"Huggies Wipes, 64-72 ct.",2.4900000000000002,"Huggies Baby Wipes, any 56 ct. or larger .50/1 (04-28-12) SS-4/1",1.99]
["***",null,null,null,null,"Kleenex Facial Tissue, 50-184 ct.",1.5,"Kleenex Facial Tissue, any Packs or Boxes .30/3 (04-22-12) SS-3/11","1.40 ea"]
["***",null,null,null,null,"Skintimate Shaving Cream, 7-10 oz.",1.88,"Skintimate Shave Gel, any excluding 2.75 oz. cans .55/1 (05-06-12) SS-3/25",1.33]
["***",null,null,null,null,"Western Family Feminine Products, 14-24 ct. Pads or 46-64 ct. Liners",1.99,null,1.99]
["***",null,null,null,null,"Western Family Light Bulbs, 4 pk.",1.79,null,1.79]
["***",null,null,null,null,"Wisk Liquid Laundry Detergent, 100 oz.",7.99,"Wisk Laundry Detergent, any 45 oz. or larger $2/1 (05-06-12) RP-3/25",5.99]
[]
["*****",null,null,null,null,"Dessert Special",5,"Use in-ad vendor coupon: Get all this for $5.00","5.00"]
[null,null,null,null,null,null,null,"- (1) Western Family 56 oz. Ice Cream or Sherbet"]
[null,null,null,null,null,null,null,"- (1) Western Family 18.25-18.5 oz. Cake Mix"]
[null,null,null,null,null,null,null,"- (1) Western Family 16 oz. Ready to Spread Frosting"]
[]
["*****",null,null,null,null,"Got a list question? Want to check if next week's list is ready? Our listmakers answer questions and post our \"preview\" lists at PYP."]
[]
["*****",null,null,null,null,"Todays date: ","Sale","We are not affiliated with this store.  The store's ad is the only OFFICIAL authority"]
["toggle 4 and 5 star rows",null,null,null,null,null,"Price"]
["Stock up scale",null,null,null,null,"How to use this list",null,"Printable coupons:","Bottom line"]
[null,null,null,null,null,null,null,"Group A  Group B  Group C  Singles"]
[null,null,null,null,null,"Associated Foods"]
[null,null,null,null,null,"\"Late Ad\" Stores",null,"Coupon Index"]
[null,null,null,null,null,"Current list"]
[null,null,null,null,null,"-This list is valid during the dates listed below"]
["*****",null,null,null,null,"Late ads (run Wednesday - Tuesday)",null,"This list is made by Misti. She answers list questions in this thread at PYP."]
[]
[null,null,null,null,null,"Valid Dates: 4/11 - 4/17"]
["*****",null,null,null,null,"PLEASE NOTE: This list is created from the Lees ad."]
[]
[null,null,null,null,null,"IT IS NOT GUARANTEED TO BE ACCURATE FOR EVERY ASSOCIATED FOOD STORE."]
[]
[null,null,null,null,null,"Each stores ad is the final authority on sale pricing."]
["****",null,null,null,null,"Apples, Large Golden Delicious, Jonagold, Braeburn or Cameo",".99 lb",null,".99 lb"]
["***",null,null,null,null,"Avocados, Organic",".99 ea",null,".99 ea"]
["***",null,null,null,null,"Bell Peppers, Green",".50 ea",null,".50 ea"]
["****",null,null,null,null,"Cilantro, bunch",".39 ea",null,".39 ea"]
["***",null,null,null,null,"Clementine Mandarins, 3 lb. bag",4.99,null,4.99]
["***",null,null,null,null,"Cucumbers",".50 ea",null,".50 ea"]
["***",null,null,null,null,"Dole Salads, 9 oz. Classic Romaine or 11 oz. Just Lettuce",1.69,null,1.69]
["***",null,null,null,null,"Grapes, Red or Black Seedless","1.99 lb",null,"1.99 lb"]
["****",null,null,null,null,"Green Onions, bunch",".39 ea",null,".39 ea"]
["*****",null,null,null,null,"Mangos",".50 ea",null,".50 ea"]
["****",null,null,null,null,"Oranges, Navel",".49 lb",null,".49 lb"]
["***",null,null,null,null,"Potatoes, Baker",".59 lb",null,".59 lb"]
["****",null,null,null,null,"Radishes, bunch",".39 ea",null,".39 ea"]
["***",null,null,null,null,"Spinach, bunch",".99 ea",null,".99 ea"]
["*****",null,null,null,null,"Tomatoes, Extra Large Roma",".69 lb",null,".69 lb"]
["****",null,null,null,null,"I Cant Believe Its Not Butter, 15 oz. tubs, 2 pk. 8 oz. tubs or 8 oz. spray",2.88,"I Cant Believe Its Not Butter Product, any $1.25/1 (active) Group A-02/21 Print Twice",1.63]
["***",null,null,null,null,"Natural Directions Almondmilk or Soy Milk, 64 oz. Original or Vanilla",2.19,null,2.19]
["****",null,null,null,null,"Sunny D, 64 oz.",0.99,null,0.99]
["****",null,null,null,null,"Western Family Cottage Cheese, 16 oz.",1.19,null,1.19]
["***",null,null,null,null,"Western Family Jumbos Biscuits, 16 oz.",1.25,null,1.25]
["***",null,null,null,null,"Western Family Orange Juice, 89 oz. assorted",2.99,null,2.99]
["***",null,null,null,null,"Western Family Yogurt, 32 oz. assorted",2,null,2]
["***",null,null,null,null,"Bar S Bologna, 16 oz. Classic, Thick or Chicken",1.29,null,1.29]
["***",null,null,null,null,"Bar S Ham or Turkey Breast, 16 oz.",3.49,null,3.49]
["****",null,null,null,null,"Dailys Big Buy Bacon, 1 lb.",1.89,null,1.89]
["***",null,null,null,null,"Johnsonville Breakfast Sausage Links, 12 oz.",2.99,"Johnsonville Breakfast Sausage Links or Patties .75/1 (05-31-12) SS-2/5",2.2400000000000002]
["****",null,null,null,null,"Micellis String Cheese, 12 oz.",1.99,null,1.99]
["***",null,null,null,null,"Tyson Fully Cooked Entrees, 17 oz.",5.49,null,5.49]
["***",null,null,null,null,"Western Family Individually Wrapped Cheese Slices, 12 oz.",1.79,null,1.79]
["***",null,null,null,null,"Western Family Jumbo Franks, 1 lb.",1.19,null,1.19]
["***",null,null,null,null,"Arrowhead Spring Water, 24 pk. half liter bottles",4.49,null,4.49]
["***",null,null,null,null,"Coke Products, 2 liter bottle",1.34,null,1.34]
["***",null,null,null,null,"Coke Products, 20 pk. cans","2 for $13","Use in-ad vendor coupon: 2 for $11 with coupon and purchase of 2.","5.50 ea"]
["*****",null,null,null,null,"Fuze, 18.5 oz. bottles",1,"Use in-ad vendor coupon: 10 for $5 with coupon and purchase of 10.",".50 ea"]
["***",null,null,null,null,"Langers Juice Cocktails, 64 oz. Cranberry or Pomegranate",2.5,null,2.5]
["***",null,null,null,null,"Nestle Pure Life Spring Water, 24 pk. half liter bottles",4.49,null,4.49]
["****",null,null,null,null,"Pepsi Next, 12 pk. cans",2.99,null,2.99]
["****",null,null,null,null,"Pepsi Next, 2 liter bottles",0.99,null,0.99]
["***",null,null,null,null,"Pepsi, 7-Up or A and W Products, 12 pk. cans","3 for $14",null,"4.67 ea"]
["***",null,null,null,null,"Powerade Sports Drinks, 32 oz. assorted",0.79,null,0.79]
["***",null,null,null,null,"Sobe Lifewater, 20 oz. bottle",1,null,1]
["***",null,null,null,null,"Western Family 100% Apple Juice or Cider, 96 oz.",2.5,null,2.5]
["***",null,null,null,null,"Aunt Jemima Pancake Mix, 32 oz.",2.4900000000000002,null,2.4900000000000002]
["***",null,null,null,null,"Aunt Jemima Syrup, 24 oz.",2.4900000000000002,null,2.4900000000000002]
["****",null,null,null,null,"Crystal Light On the Go Drink Mixes, 7-10 ct.",1.99,"Crystal Light Drink Mix products, any $1/2 (04-30-12) SS-3/18","1.49 ea"]
["***",null,null,null,null,"DaVinci Pasta, 16 oz. assorted",0.99,null,0.99]
["***",null,null,null,null,"Doritos, 11-11.5 oz.",2.99,null,2.99]
["***",null,null,null,null,"Grandma Sycamores Bread, 24 oz. White or Wheat",2,null,2]
["***",null,null,null,null,"Hatch Green Chiles, 4 oz. Chopped or Diced",1.25,null,1.25]
["***",null,null,null,null,"Jolly Time Microwave Popcorn, 2-4 pk.",1.67,"Jolly Time Microwave Popcorn, any boxes $1/2 (active) This Link-05/23","1.17 ea"]
["***",null,null,null,null,"Kelloggs Cereals, 11-17 oz. Froot Loops, Apple Jacks, Frosted Flakes, Chocolate or Double Chocolate Krave",3,"Kelloggs Cereal, any 8.7 oz or larger $1/3 (active) Group A-04/03 Print Twice","2.67 ea"]
["***",null,null,null,null,"Kelloggs Cereals, 11-17 oz. Froot Loops, Apple Jacks, Frosted Flakes, Chocolate or Double Chocolate Krave",3,"Kelloggs Cereals, any flavor 10 oz. or larger $1/3 (EXPIRES 04-15-12) RP-3/4","2.67 ea"]
["***",null,null,null,null,"Kelloggs Cereals, 11-17 oz. Chocolate or Double Chocolate Krave",3,"Kelloggs Krave Cereal, any .50/1 (active) This Link-03/18",2.5]
["***",null,null,null,null,"Kelloggs Cereals, 11-17 oz. Chocolate or Double Chocolate Krave",3,"Kelloggs Krave, Raisin Bran Cinnamon Almond, Crunchy Nut Caramel Nut and/or Frosted Mini Wheats Little Bites Cinnamon Roll Cereal, any 11 oz. or larger $1/2 (05-13-12) RP-4/1","2.50 ea"]
["***",null,null,null,null,"Kelloggs Cereals, 11-17 oz. Chocolate or Double Chocolate Krave",3,"Kelloggs Krave, Raisin Bran Cinnamon Almond, Crunchy Nut Caramel Nut or Frosted Mini Wheats Little Bites Cinnamon Roll Cereal, any 11 oz. or larger .70/1 (05-13-12) RP-4/1",3.3]
["***",null,null,null,null,"Kelloggs Fruit Snacks, 8oz.",1.67,null,1.67]
["***",null,null,null,null,"Kelloggs Nutri-Grain Bar, 7.8-10.4 oz. assorted",2.5,null,2.5]
["***",null,null,null,null,"Kraft Miracle Whip or Mayo, 30 oz. Original",2.99,"Kraft Mayo or Miracle Whip Dressing products, any .75/2 (04-22-12) SS-3/25","2.62 ea"]
["***",null,null,null,null,"La Choy Bi-Packs, 42-43.5 oz.",3,null,3]
["***",null,null,null,null,"La Victoria Salsa, 16 oz.",2.29,null,2.29]
["***",null,null,null,null,"La Victoria Taco Sauce, 15 oz.",2.29,null,2.29]
["*****",null,null,null,null,"Las Palmas Enchilada Sauce, 28 oz.",2,"Las Palmas Product, any $1/1 (active) This Link-10/08",1]
["***",null,null,null,null,"Lays Potato Chips, 10-10.5 oz.",2.5,null,2.5]
["***",null,null,null,null,"Minute Rice, 14 oz. Brown or Long Grain White",1.99,"Minute Rice Product, any .50/1 (04-30-12) PurinaRP-1/29",1.49]
["***",null,null,null,null,"Mothers Cookies, 14 oz. bag",2.5,null,2.5]
["***",null,null,null,null,"Nabisco Cheese Nips, 10.5-12 oz.",1.5,null,1.5]
["***",null,null,null,null,"Quaker Cereal, 10.5-14.5 oz. Honey Graham Ohs, Life, Oatmeal Squares, Whole Hearts or Capn Crunch",2,null,2]
["***",null,null,null,null,"Quaker Snack Bars, 6.5-7.4 oz. Chewy, Chewy Dipps",2.29,"Quaker Chewy Granola, Quaker Chewy Dipps Granola or Quaker Chewy Smashbar Bars, 6 ct. or larger boxes .75/2 (04-28-12) RP-3/18","1.92 ea"]
["***",null,null,null,null,"Quaker Snack Bars, 6.5-7.4 oz. Soft Baked",2.29,null,2.29]
["***",null,null,null,null,"Rold Gold, 7-16 oz.",2.5,null,2.5]
["***",null,null,null,null,"Taco Bell Bold and Creamy Sauce, 8 oz.",1.5,null,1.5]
["***",null,null,null,null,"Taco Bell Refried Beans, 16 oz.",0.79,null,0.79]
["***",null,null,null,null,"Taco Bell Taco Shells, 12 ct.",1.25,null,1.25]
["***",null,null,null,null,"Tostitos Tortilla Chips, 9-13 oz.",2.99,null,2.99]
["****",null,null,null,null,"Western Family Bread, 24 oz. Buttermilk White Roundtop, Cracked Wheat or Golden Split Top",1.25,null,1.25]
["***",null,null,null,null,"Western Family Brownie Mixes, 19.8-21.5 oz. Chewy, Classic or Dark Chocolate",1.49,null,1.49]
["****",null,null,null,null,"Western Family Easy Sides, 4.3-4.5 oz. Microwaveable",0.59,null,0.59]
["***",null,null,null,null,"Western Family Grape Jelly, 32 oz.",1.88,null,1.88]
["***",null,null,null,null,"Western Family Peanut butter, 18 oz. Creamy, Chunky or Reduced Fat",2.4900000000000002,null,2.4900000000000002]
["***",null,null,null,null,"Western Family Premium Chunk Chicken Breast, 10 oz.",2.5,null,2.5]
["*****",null,null,null,null,"Western Family Tomato Sauce, 8 oz.",0.33,null,0.33]
["***",null,null,null,null,"Wonder Classic White Bread, 20 oz.",2,null,2]
["***",null,null,null,null,"Farr Ice Cream, 4 qt. pail",5.99,null,5.99]
["***",null,null,null,null,"PictSweet Vegetables, 8-12 oz. Deluxe or Seasoned",1.5,null,1.5]
["***",null,null,null,null,"Rhodes Warm N Serve Rolls, 6-9 ct. pan",2,"Rhodes Bread or Rolls, any .55/1 (05-20-12) RP-3/25",1.45]
["***",null,null,null,null,"Stouffers Frozen Meals, 6-12.7 oz.",2.69,"Stouffers Entrees or French Bread Pizzas, any $1.10/5 (active) This Link-04/07 Print Twice","2.47 ea"]
["***",null,null,null,null,"Tillamook Ice Cream, 1.75 qt.",3.99,null,3.99]
["***",null,null,null,null,"Tombstone Pizza, 12 inch",3.99,null,3.99]
["***",null,null,null,null,"Western Family Burritos, 5 oz.",0.33,null,0.33]
["***",null,null,null,null,"Western Family Chicken, 26 oz. Frozen Dino Nuggets or Popcorn",4.99,null,4.99]
["***",null,null,null,null,"Western Family Crunchy Fillets or Fish Sticks, 19-24 oz.",3.99,null,3.99]
["***",null,null,null,null,"Allegra Allergy Relief, 30 ct. Tablets",11.99,"Allegra Allergy 30 ct or higher, Allegra-D 24 hr 10 ct or higher or Allegra-D 12 hr 20 ct or higher $4/1 (active) Group B-03/18 Print Twice",7.99]
["***",null,null,null,null,"Allegra Allergy Relief, 15 ct. 24 Hour",11.99,"Allegra Allergy 5, 12 or 15 ct, Childrens Allegra, Allegra-D 24 hr 5 ct or Allegra-D 12 hr 10 ct $2/1 (active) Group B-03/18 Print Twice",9.99]
["****",null,null,null,null,"Aquafresh Toothpaste, 6-6.4 oz. assorted",0.88,null,0.88]
["***",null,null,null,null,"Band-Aid Bandages, 10-80 ct.",2,null,2]
["***",null,null,null,null,"Coppertone Sunscreen, 6-8 oz. Babys or Kids",8.8800000000000008,"Coppertone Sun Care, any excluding lip balm and trial sizes $1/1 (active) This Link-02/04",7.88]
["***",null,null,null,null,"Cottonelle Bathroom Tissue, 12 Double Roll Clean Care or Ultra",6.99,null,6.99]
["***",null,null,null,null,"Edge Shaving Cream, 7-10 oz.",1.88,"Edge Shave Gel, any 7 oz. or larger .55/1 (05-06-12) SS-3/25",1.33]
["***",null,null,null,null,"Finish Powerball Tabs, 32 ct.",4.99,"Finish Powerball Tabs or Gelpacs, any .75/1 (EXPIRES 04-15-12) SS-3/11",4.24]
["***",null,null,null,null,"Finish Powerball Tabs, 32 ct.",4.99,"Finish Powerball or Gelpacs Dishwasher detergent .50/1 (active) This Link-04/02",4.49]
["***",null,null,null,null,"Glad Freezer or Storage Bags, 30-50 ct. gallon or quart",2.99,"Glad Food Storage Products, any $1/2 (active) This Link-08/21","2.49 ea"]
["***",null,null,null,null,"Huggies Diapers, 15-50 ct.",9.85,"Huggies Diapers, any $1/1 (EXPIRES 04-14-12) SS-3/18",8.85]
["***",null,null,null,null,"Huggies Wipes, 64-72 ct.",2.4900000000000002,"Huggies Baby Wipes, any 56 ct. or larger .50/1 (04-28-12) SS-4/1",1.99]
["***",null,null,null,null,"Kleenex Facial Tissue, 50-184 ct.",1.5,"Kleenex Facial Tissue, any Packs or Boxes .30/3 (04-22-12) SS-3/11","1.40 ea"]
["***",null,null,null,null,"Skintimate Shaving Cream, 7-10 oz.",1.88,"Skintimate Shave Gel, any excluding 2.75 oz. cans .55/1 (05-06-12) SS-3/25",1.33]
["***",null,null,null,null,"Western Family Feminine Products, 14-24 ct. Pads or 46-64 ct. Liners",1.99,null,1.99]
["***",null,null,null,null,"Western Family Light Bulbs, 4 pk.",1.79,null,1.79]
["***",null,null,null,null,"Wisk Liquid Laundry Detergent, 100 oz.",7.99,"Wisk Laundry Detergent, any 45 oz. or larger $2/1 (05-06-12) RP-3/25",5.99]
[]
["*****",null,null,null,null,"Dessert Special",5,"Use in-ad vendor coupon: Get all this for $5.00","5.00"]
[null,null,null,null,null,null,null,"- (1) Western Family 56 oz. Ice Cream or Sherbet"]
[null,null,null,null,null,null,null,"- (1) Western Family 18.25-18.5 oz. Cake Mix"]
[null,null,null,null,null,null,null,"- (1) Western Family 16 oz. Ready to Spread Frosting"]
[]
["*****",null,null,null,null,"Got a list question? Want to check if next week's list is ready? Our listmakers answer questions and post our \"preview\" lists at PYP."]
[]
["*****",null,null,null,null,"Todays date: ","Sale","We are not affiliated with this store.  The store's ad is the only OFFICIAL authority"]
["toggle 4 and 5 star rows",null,null,null,null,null,"Price"]
["Stock up scale",null,null,null,null,"How to use this list",null,"Printable coupons:","Bottom line"]
[null,null,null,null,null,null,null,"Group A  Group B  Group C  Singles"]
[null,null,null,null,null,"Albertsons"]
[null,null,null,null,null,"Current list",null,"Coupon Index"]
[null,null,null,null,null,"-This list is valid during the dates listed below"]
["*****",null,null,null,null,"Valid Dates: 4/11 through 4/17",null,"This list is made by Misti. She answers list questions in this thread at PYP."]
[]
[null,null,null,null,null,"Sale prices are effective at the following locations:"]
[null,null,null,null,null,"915 Redcliffs Dr. Washington UT"]
[null,null,null,null,null,"745 N. Dixie Dr. St. George UT"]
[null,null,null,null,null,"835 S. Bluff St. St. George UT"]
[null,null,null,null,null,"740 N. Main, Tooele UT"]
["*****",null,null,null,null,"Apples, Cameo or Braeburn",".68 lb",null,".68 lb"]
["***",null,null,null,null,"Avocados, Medium Hass",".99 ea",null,".99 ea"]
["***",null,null,null,null,"Blackberries, 6 oz.",1.99,null,1.99]
["***",null,null,null,null,"Broccoli, bunch","1.29 lb",null,"1.29 lb"]
["***",null,null,null,null,"Cantaloupe",".99 lb",null,".99 lb"]
["***",null,null,null,null,"Carrots, 1 lb. Farm Stand Baby Cut",1.69,null,1.69]
["***",null,null,null,null,"Cilantro",".50 ea",null,".50 ea"]
["***",null,null,null,null,"Dole Classic Romaine, Greener Selection, Just Lettuce or Spinach, 9-12 oz. bags",1.88,null,1.88]
["***",null,null,null,null,"Eat Smart Cut Vegetables, 12 oz.",1.5,null,1.5]
["***",null,null,null,null,"Leaf Lettuce, Green Red or Romaine","1.29 ea",null,"1.29 ea"]
["***",null,null,null,null,"Mangos","1.00 ea",null,"1.00 ea"]
["***",null,null,null,null,"Onions, 3 lb. bag Yellow",1.49,null,1.49]
["***",null,null,null,null,"Orange, Medium Navel",".99 lb",null,".99 lb"]
["***",null,null,null,null,"Potatoes, 10 lb. bag Farm Stand Russet",2.99,null,2.99]
["***",null,null,null,null,"Strawberries, 1 lb.",2.5,null,2.5]
["***",null,null,null,null,"Wonderful In-Shell Pistachios, 10 oz.",4.99,"Wonderful Pistachios, 5 oz. packages or larger $1/2 (06-30-12) SS-3/18","4.49 ea"]
["***",null,null,null,null,"Beef - Albertsons 85% Lean Ground, 3 lbs or more","2.99 lb",null,"2.99 lb"]
["***",null,null,null,null,"Beef - Albertsons Petite Sirloin or Tri-Tip Steak, boneless max pak","4.99 lb",null,"4.99 lb"]
["***",null,null,null,null,"Chicken - Albertsons Split Breasts, bone-in","1.79 lb",null,"1.79 lb"]
["****",null,null,null,null,"Chicken - Boneless Skinless Breasts","1.99 lb",null,"1.99 lb"]
["***",null,null,null,null,"Chicken - Chefs Trim Boneless Skinless Thighs","2.49 lb",null,"2.49 lb"]
["***",null,null,null,null,"Pork - Shoulder Roasts, bone-in","2.59 lb",null,"2.59 lb"]
["***",null,null,null,null,"Pork - St. Louis Style Spareribs, previously frozen","3.69 lb",null,"3.69 lb"]
["***",null,null,null,null,"Seafood - Atlantic Salmon Portions, fresh","3.99 ea",null,"3.99 ea"]
["***",null,null,null,null,"Albertsons Cottage Cheese, 24 oz.",3.39,null,3.39]
["***",null,null,null,null,"Blue Diamond Almond Breeze, 64 oz.",3,"Blue Diamond Almond Breeze Almondmilk, any Refrigerated .55/1 (04-30-12) SS-3/18",2.4500000000000002]
["***",null,null,null,null,"Blue Diamond Almond Breeze, 64 oz.",3,"Blue Diamond Almond Breeze Almond Milk, any .55/1 (active) This Link-01/28",2.4500000000000002]
["***",null,null,null,null,"Floridas Natural Orange Juice, 59 oz.",3.29,null,3.29]
["*****",null,null,null,null,"Maid O Clover Milk, gallon 2%, 1% or Fat Free",2.39,"With in-ad store coupon.",1.64]
[null,null,null,null,null,"Limit 2",null,"Also use manufacturers coupon: Milk, any brand gallon White or Chocolate excluding Soy Milk .75/1 or (2) half gallons (active) Group A-12/01 Print Twice"]
[null,null,null,null,null,"3 Days Only! 4/13-4/15!"]
["***",null,null,null,null,"Yoplait Delights Multipack, 4 pk.",2.5,null,2.5]
["***",null,null,null,null,"Yoplait Greek Yogurt Multipack, 4 pk.",2.5,"Yoplait Greek Yogurt 4-pack, any flavor .75/1 (05-05-12) SS-3/11",1.75]
["***",null,null,null,null,"Yoplait Go-Gurt or Kid Trix Yogurt, 6-8 pk.",2.5,"Yoplait products listed, any flavor Go-gurt Yogurt, Kids Cup Yogurt, Trix Multipack Yogurt or Yoplait Splitz Yogurt .75/2 (05-05-12) SS-3/11","2.13 ea"]
["****",null,null,null,null,"Yoplait Greek Yogurt Cups, 6 oz.",1,"Yoplait Greek Yogurt, any flavor cups .50/2 (05-19-12) SS-3/25",".75 ea"]
["***",null,null,null,null,"Yoplait Kids Yogurt Multipack, 4 pk.",2,null,2]
["***",null,null,null,null,"Yoplait Light or Original Multipack, 4 pk.",2,null,2]
["****",null,null,null,null,"Yoplait Light Yogurt with Granola, 2 pk.",2,"Yoplait Yogurt Light Yogurt with Granola, any package .75/1 (active) Group B-04/02 Print Twice",1.25]
["****",null,null,null,null,"Yoplait Light or Greek Yogurt with Granola, 2 pk.",2,"Yoplait Light OR Greek Yogurt with Granola .75/1 (05-19-12) SS-3/25",1.25]
["***",null,null,null,null,"Yoplait Parfait, 2 pk.",2,null,2]
["***",null,null,null,null,"Albertsons Cheese Singles, 10.7-12 oz.",3.49,null,3.49]
["***",null,null,null,null,"Albertsons Chunk or Shredded Cheese, 6-8 oz.",2.99,null,2.99]
["***",null,null,null,null,"Albertsons Ricotta Cheese, 15 oz.",3.49,null,3.49]
["****",null,null,null,null,"Bar-S meat Franks, 16 oz.",0.88,"With in-ad store coupon.",0.88]
[null,null,null,null,null,"Limit 4"]
[null,null,null,null,null,"3 Days Only! 4/13-4/15!"]
["***",null,null,null,null,"Bar-S Smoked Sausage, 2.5 lb.",6.99,null,6.99]
["***",null,null,null,null,"Hormel Country Crock Side Dishes, 20-24 oz.",3,"Hormel Country Crock Side Dishes, any .55/1 (active) This Link-10/05",2.4500000000000002]
["***",null,null,null,null,"Hormel Little Sizzlers Breakfast Sausage, 12 oz.",1.67,null,1.67]
["***",null,null,null,null,"Jennie-O Smoked Sausage, 14 oz.",3.79,null,3.79]
["***",null,null,null,null,"Land O Frost Premium Lunchmeat, 16 oz.",4.99,null,4.99]
["***",null,null,null,null,"Albertsons Spring or Purified Water, 24 pk. 16.9 oz. bottles",3.5,null,3.5]
["***",null,null,null,null,"Arrowhead Spring Water, 6 pk. 16.9 oz. bottles or 3 liter bottle",1,null,1]
["***",null,null,null,null,"Coca Cola Soft Drinks, 2 liter bottle",1.25,null,1.25]
["***",null,null,null,null,"Coca Cola Soft Drinks, 20 pk. cans",6.49,"Extra Promo: $5.99 each when you buy 2 in a single transaction","5.99 ea"]
["***",null,null,null,null,"Dasani Water, 24 pk. 16.9 oz. bottles",4,null,4]
["***",null,null,null,null,"Hawaiian Punch Juice, 32 oz.",1,null,1]
["***",null,null,null,null,"Kool Aid Bursts, 6 pk.",1,null,1]
["***",null,null,null,null,"Mi0 Liquid Water Enhancers, 1.62 oz.",3.99,"Mi0 or Mi0 Energy Liquid Water Enhancer, any $1/1 (04-30-12) SS-2/26",2.99]
["****",null,null,null,null,"Nestle Pure Life Water, 24 pk. 16.9 oz. bottles",2.99,"With in-ad store coupon.",2.99]
[null,null,null,null,null,"Limit 2"]
[null,null,null,null,null,"3 Days Only! 4/13-4/15!"]
["****",null,null,null,null,"Pepsi Soft Drinks, 12 pk. cans","2 for $9","Extra Promo: Pepsi Next 12 pk. FREE up to $4.50 when you buy any 2 Pepsi Soft Drink 12 packs.",4.5]
["***",null,null,null,null,"Pepsi Soft Drinks, 2 liter bottle",1.67,null,1.67]
["***",null,null,null,null,"Propel Fitness Water, 24 oz. bottles",1,null,1]
["***",null,null,null,null,"Snapple Tea or Fruit Drink, 16 oz. bottle",1,null,1]
["***",null,null,null,null,"Super Chill Soft Drinks, 12 pk. cans",3.5,null,3.5]
["***",null,null,null,null,"Super Chill Soft Drinks, 2 liter bottle",1,null,1]
["***",null,null,null,null,"Albertsons Apple Sauce, 23-24 oz.",1,null,1]
["***",null,null,null,null,"Albertsons Canned Fruit, 15-15.25 oz.",1.39,null,1.39]
["***",null,null,null,null,"Albertsons Chicken Noodle or Tomato Soup, 10.5-10.75 oz.",1,null,1]
["***",null,null,null,null,"Albertsons Premium Shapes Mac N Cheese, 5.5-7.3 oz.",1,null,1]
["***",null,null,null,null,"Bertolli Extra Virgin or Extra Light Olive Oil, 17 oz.",5.99,null,5.99]
["***",null,null,null,null,"Chef Boyardee Pasta, 14.75-15 oz. can With Meat or 7.5 oz. Microwave",1,null,1]
["***",null,null,null,null,"Chicken of the Sea Premium Chunk Light Tuna, 2.5 oz. pouch",1,null,1]
["***",null,null,null,null,"Dole Mandarin Oranges, 15 oz.",1.5,null,1.5]
["***",null,null,null,null,"Essential Everyday or Albertsons Snacker Crackers, 14.5-16 oz.",2.79,null,2.79]
["***",null,null,null,null,"Essential Everyday Salad Dressing, 16 oz.",2.39,null,2.39]
["***",null,null,null,null,"Essential Everyday Widepan Breads, 24 oz.",1.79,"With in-ad store coupon.",1.79]
[null,null,null,null,null,"Limit 2"]
[null,null,null,null,null,"3 Days Only! 4/13-4/15!"]
["***",null,null,null,null,"Guldens Mustard, 12 oz.",1,null,1]
["***",null,null,null,null,"Hormel Compleats, 10 oz.",2.5,null,2.5]
["***",null,null,null,null,"Hunts Barbecue Sauce, 21.6 oz.",1,null,1]
["***",null,null,null,null,"Hunts Diced Tomatoes or Fire Roasted Diced Tomatoes, 14.5-15 oz.",1,"Hunts Tomatoes, any 11 oz or larger .40/2 (active) This Link-01/23",".80 ea"]
["***",null,null,null,null,"Hunts Ketchup, 24 oz.",1,null,1]
["***",null,null,null,null,"Hunts Pasta Sauce, 24-26.5 oz.",1,null,1]
["***",null,null,null,null,"Idahoan Potatoes, 4-4.1 oz.",1,null,1]
["***",null,null,null,null,"Jif Peanut Butter, 17.3-18 oz.",3.49,null,3.49]
["***",null,null,null,null,"Kelloggs Fruit Snacks, 8 oz.",1.99,null,1.99]
["****",null,null,null,null,"Knorr Rice or Pasta Side Dishes, 3.8-5.8 oz.",0.79,"With in-ad store coupon.",0.79]
[null,null,null,null,null,"Limit 4"]
[null,null,null,null,null,"3 Days Only! 4/13-4/15!"]
["***",null,null,null,null,"Lawrys Seasoning Mixes, .88-1.5 oz.",1,null,1]
["***",null,null,null,null,"Lays Potato Chips, 10-10.5 oz.",3,null,3]
["***",null,null,null,null,"Libbys Vienna Sausage, 5 oz.",1,null,1]
["*****",null,null,null,null,"McCormick Recipe Creations, .23-.46 oz.",1,"McCormick Spice, Herb, Extract or Food Color, any .75/1 (05-06-12) RP-3/25",0.25]
["***",null,null,null,null,"Nabisco Belvita Breakfast Biscuits, 8.8 oz.",2.99,"Nabisco Belvita Breakfast Biscuits $1/1 (04-30-12) SS-2/26",1.99]
["***",null,null,null,null,"Nabisco Belvita Breakfast Biscuits, 8.8 oz.",2.99,"Nabisco Belvita Breakfast Biscuit AND 1 Gallon of Milk, Save $1.00 when you buy BOTH (active) Group A-04/08 Print Twice",2.99]
[null,null,null,null,null,null,null,"NOTE: You must buy BOTH products to use this coupon."]
["***",null,null,null,null,"Rosarita Refried Beans, 16 oz.",1,null,1]
["***",null,null,null,null,"S and W Beans, 15-15.5 oz.",1,null,1]
["***",null,null,null,null,"Seattles Best Coffee, 12 oz.",5.99,null,5.99]
["***",null,null,null,null,"Snyders of Hanover Pounder Pretzels, 16 oz.",2.79,null,2.79]
["***",null,null,null,null,"Star Vinegar, 12 oz.",2.5,null,2.5]
["***",null,null,null,null,"Stride or Trident Multi-pack gum, 3 pk.",2,null,2]
["***",null,null,null,null,"Tostitos Tortilla Chips, 9-13 oz.",3.5,"Extra Promo: Tostitos Salsa or Con Queso or Fritos Chili Cheese Dip, or Lays Dips, 15-15.75 oz. FREE up to $3.49 when you buy any 2 Tostitos Tortilla Chips.",3.5]
["***",null,null,null,null,"Valley Fresh Canned Chicken, 5 oz.",2,null,2]
["***",null,null,null,null,"Wonder Classic Bread, 20 oz.",1.99,null,1.99]
["***",null,null,null,null,"Wrigleys Orbit Single Serve Gum, 14 ct.",1,null,1]
["***",null,null,null,null,"Zatarains Rice, 5.7-8 oz.",1,null,1]
["***",null,null,null,null,"Albertsons French Fries or Potato Rounds, 26-32 oz.",2.79,null,2.79]
["***",null,null,null,null,"Albertsons Ice Cream, 1.5 qt.",3,null,3]
["***",null,null,null,null,"Albertsons Vegetables, 12-16 oz. Frozen or 12 oz. Steamy",1,null,1]
["***",null,null,null,null,"California Pizza Kitchen Crispy Thin Crust, 11.5-17 oz.",5.5,null,5.5]
["***",null,null,null,null,"DiGiorno Original Pizza, 12.6-33.3 oz.",5.5,null,5.5]
["***",null,null,null,null,"Essential Everyday Pasta, 12-16 oz.",1,null,1]
["***",null,null,null,null,"Kashi Steam Meals, 9.5 oz.",3.5,"Kashi Steam Meal, any $1/1 (active) Group A-04/01 Print Twice",2.5]
["***",null,null,null,null,"Michelinas Entrees, 8-9 oz. Authentico, 4.5-7.5 oz. Zapems gourmet, 4.65-9 oz. Lean Gourmet, 8-9 oz. Traditional Recipes",1,null,1]
["***",null,null,null,null,"New York Cheese Toast, 13.5 oz.",3,"New York Brand Frozen Product, any .50/1 (04-30-12) SS-2/5 and (05-15-12) SS-3/11",2.5]
["***",null,null,null,null,"Old Orchard Apple Juice or Cranberry, Apple or Pomegranate Juice Blends, 12 oz. frozen",1.5,null,1.5]
["***",null,null,null,null,"Red Baron Single Serve Pizzas, 10.8-11.6 oz.",3,null,3]
["***",null,null,null,null,"Shoppers Value Pizza, 5.25 oz.",1,null,1]
["***",null,null,null,null,"Stouffers Party Size Entrees, 57-96 oz.",12.99,"Stouffers multi-serve entree, any 28-96 oz. $2/1 (04-30-12) PurinaRP-1/29",10.99]
["****",null,null,null,null,"Aim, Pepsodent or Close Up Toothpaste, 6 oz.",1,null,1]
["***",null,null,null,null,"Allegra 24 Hour Allergy Relief, 15 ct.",11.99,"Allegra Allergy 5, 12 or 15 ct, Childrens Allegra, Allegra-D 24 hr 5 ct or Allegra-D 12 hr 10 ct $2/1 (active) Group B-03/18 Print Twice",9.99]
["***",null,null,null,null,"Aussie or Herbal Essences Shampoo, Conditioner or Styling Products, 5.7-14 oz.",3,"Herbal Essences or Aussie products, excludes trial/travel size $1/2 (04-30-12) PG-4/1","2.50 ea"]
["***",null,null,null,null,"Awesome Paper Towels, 1 ct.",1,null,1]
["***",null,null,null,null,"Bounce Fabric Softener, 80 ct. sheets",3.99,"Bounce, excludes trial/travel size .50/1 (04-30-12) SS-3/11",3.49]
["***",null,null,null,null,"Brawny Paper Towels, 8 Regular Rolls",5.99,"Brawny Paper Towels, any FACEBOOK COUPON $1/1 (active) This Link-03/11",4.99]
["***",null,null,null,null,"Brawny Paper Towels, 8 Regular Rolls",5.99,"Brawny Paper Towels, 2-Roll or larger packs $1/2 (06-04-12) RP-3/4","5.49 ea"]
["***",null,null,null,null,"Colgate Kids Toothpaste, 5-5.2 oz.",2.5,"Colgate Kids Toothpaste, any .50/1 (EXPIRES 04-14-12) SS-3/25",2]
["***",null,null,null,null,"Colgate Total Toothpaste, 5-5.2 oz.",2.5,"Colgate Toothpaste, any 4 oz. or larger .75/1 (EXPIRES 04-14-12) SS-3/25",1.75]
["***",null,null,null,null,"Cottonelle Bath Tissue, 18 ct. Double Roll",9.99,null,9.99]
["***",null,null,null,null,"Dial Basic or Coast Bar or Hand Soap, 3 ct. or 9.4 oz.",1,null,1]
["***",null,null,null,null,"Downy Fabric Softener, 34 or 64 oz.",3.99,"Downy, excludes trial/travel size .50/1 (04-30-12) SS-3/11",3.49]
["***",null,null,null,null,"Downy Unstopables pr Gain Scent Boosters, 13.2 oz.",5.99,"Downy Unstopables or Gain Fireworks, excludes trial/travel size .50/1 (04-30-12) PG-4/1",5.49]
["***",null,null,null,null,"Homelife Liquid Laundry Detergent, 100 oz.",5.99,null,5.99]
["***",null,null,null,null,"Homelife Napkins, 120 ct.",1,null,1]
["***",null,null,null,null,"Homelife Whisper Soft Facial Tissue, 66-160 ct.",1,null,1]
["***",null,null,null,null,"Palmolive Liquid Dish Detergent, 25 oz.",2.5,null,2.5]
["***",null,null,null,null,"Quilted Northern Bath Tissue, 12 ct. Double Roll",5.99,null,5.99]
["***",null,null,null,null,"Shoppers Value Plastic Wrap, 100 sq. ft.",1,null,1]
["****",null,null,null,null,"SpeedStick or Lady SpeedStick, 2.3-3.25 oz.","B1G1 FREE","Speed Stick Antiperspirant/Deodorant or Lady Speed Stick Antiperspirant/Deodorant, any excluding 2 oz, 1.4 oz, and .5 oz sizes $1/1 (EXPIRES 04-14-12) SS-3/25","Varies"]
["***",null,null,null,null,"Suavitel Liquid Fabric Softener, 56 oz.",2.4900000000000002,null,2.4900000000000002]
["***",null,null,null,null,"Tide Liquid Laundry Detergent, 50 oz.",4.99,"With in-ad store coupon.","4.49 ea"]
[null,null,null,null,null,"Limit 2",null,"Also use manufacturers coupon: Tide, Downy, Bounce or Tide Stain Release, excludes Tide PODS and trial/travel size $1/2 (04-30-12) PG-4/1"]
[null,null,null,null,null,"3 Days Only! 4/13-4/15!"]
["***",null,null,null,null,"Tide Liquid Laundry Detergent, 50 oz.",4.99,"With in-ad store coupon.",4.49]
[null,null,null,null,null,"Limit 2",null,"Also use manufacturers coupon: Tide Detergent, excludes Tide PODS and trial/travel size .50/1 (04-30-12) SS-3/11"]
[null,null,null,null,null,"3 Days Only! 4/13-4/15!"]
["***",null,null,null,null,"Tide Stain Release, 36 oz. liquid or 18 ct. packs",5.99,"Tide Stain Release, excludes trial/travel size .50/1 (04-30-12) SS-3/11",5.49]
["***",null,null,null,null,"Tide Stain Release, 36 oz. liquid or 18 ct. packs",5.99,"Tide, Downy, Bounce or Tide Stain Release, excludes Tide PODS and trial/travel size .50/1 (04-30-12) PG-4/1",5.49]
["***",null,null,null,null,"Viva Paper Towels, 8 ct. Mega Roll",9.99,"Viva Paper Towels Big Rolls, any .40/1 or more rolls (05-06-12) SS-3/11",9.59]
[]
["*****",null,null,null,null,"Extra Promo: Buy any 10 participating drink products, get 10 Fuze drinks FREE!",null,"Sale prices listed are BEFORE/AFTER purchase of 10, receiving 10 Fuze free. Bottom line price is 20 drink products for $10 or .50 each!"]
["*****",null,null,null,null,"Fuze, 16.9 oz.","1.00/.50",null,0.5]
["*****",null,null,null,null,"Glaceau Smartwater, 1 liter bottle","1.00/.50",null,0.5]
["*****",null,null,null,null,"Glaceau Vitaminwater, 20 oz. bottle","1.00/.50",null,0.5]
["*****",null,null,null,null,"Powerade or Powerade Zero Sports Drink, 32 oz. bottle","1.00/.50",null,0.5]
[]
["*****",null,null,null,null,"Extra Promo: 4 for $6 when you buy 4 in a single transaction. Individual price $2.00 each.",null,"Must buy 4 for sale price."]
["****",null,null,null,null,"Healthy Choice Steaming or Simple Select Entrees, 8.5-9.9 oz.",1.5,null,1.5]
["***",null,null,null,null,"Kid Cuisine, 7.21-10.6 oz.",1.5,null,1.5]
[]
["*****",null,null,null,null,"Kelloggs Promo: $1.99 each when you buy 4 in a single transaction. Individual price $2.99 each.",null,"Must buy 4 for sale price."]
["***",null,null,null,null,"Keebler Granola Fudge Bars, 7.4 oz.",1.99,null,1.99]
["***",null,null,null,null,"Kelloggs Cereals, 15.5-18 oz. Frosted Mini Wheats Bite Size",1.99,"Kelloggs Frosted Mini-Wheats Cereal, any $1/2 (active) This Link-03/18",1.99]
["***",null,null,null,null,"Kelloggs Cereals, 15.5-18 oz. Frosted Mini Wheats Bite Size, 10.8-14.1 oz. Crunchy Nut, 20 oz. Raisin Bran, 14 oz. Frosted Flakes",1.99,"Kelloggs Cereal, any 8.7 oz or larger $1/3 (active) Group A-04/03 Print Twice","1.66 ea"]
["***",null,null,null,null,"Kelloggs Cereals, 15.5-18 oz. Frosted Mini Wheats Bite Size, 10.8-14.1 oz. Crunchy Nut, 20 oz. Raisin Bran, 14 oz. Frosted Flakes",1.99,"Kelloggs Cereals, any flavor 10 oz. or larger $1/3 (EXPIRES 04-15-12) RP-3/4","1.66 ea"]
["****",null,null,null,null,"Kelloggs Cereals, 20 oz. Raisin Bran",1.99,"Kelloggs Raisin Bran or Smart Start Cereal, any 14.7 oz or larger $1/2 (active) Group A-04/03 Print Twice","1.49 ea"]
["***",null,null,null,null,"Kelloggs Pop-Tarts Mini Crisps, 4.86 oz.",1.99,"Kelloggs Pop-Tarts Mini Crisps, any flavor 6 ct. or larger .50/1 (EXPIRES 04-15-12) RP-3/4",1.49]
["*****",null,null,null,null,"Kelloggs Pop-Tarts, 12 ct.",1.99,"Kelloggs Pop-Tarts or Pop-Tarts Mini Crisps, any 6 ct or larger $1/3 (active) Group A-04/03 Print Twice","1.66 ea"]
["*****",null,null,null,null,"Kelloggs Pop-Tarts, 12 ct.",1.99,"Kelloggs Pop-Tarts Toaster Pastries, any flavor 8 ct. or larger $1/3 (EXPIRES 04-15-12) RP-3/4","1.66 ea"]
["***",null,null,null,null,"Kelloggs Rice Krispies Treats, 8 ct.",1.99,null,1.99]
[]
["***",null,null,null,null,"Extra Promo: FREE First Aid Kit, including 15 in valuable coupons, instantly when you buy 3 participating Johnson and Johnson First Aid products in a single transaction.",null,"Limit 1 per transaction."]
["***",null,null,null,null,"Band-Aid Brand Premium Bandages, 10-80 ct.",3.33,null,3.33]
["***",null,null,null,null,"Neosporin Ointment, .5 oz.",3.33,"Neosporin product, any excluding trial sizes $1/1 (EXPIRES 04-15-12) SS-2/26",2.33]
["***",null,null,null,null,"Red Cross Gauze Pads or Tapes, 1-25 ct.","15% off","Johnson and Johnson Red Cross Product AND Neosporin, any, Save $2.00 when you buy BOTH (active) This Link-09/24","Varies"]
["***",null,null,null,null,"Red Cross Gauze Pads or Tapes, 1-25 ct.","15% off","Johnson and Johnson Red Cross Brand Products, any $1.50/2 (active) This Link-09/24","Varies"]
[]
["***",null,null,null,null,"Baby Savings Promo: Save $5 instantly when you buy 2 participating large powder baby formula products in a single transaction.",null,"Sale prices listed are BEFORE/AFTER $5 instant savings. Discount is essentially $2.50 per item."]
["***",null,null,null,null,"Similac Powder Infant Formula, makes 168-169 oz.","24.79/22.29",null,22.29]
["***",null,null,null,null,"Enfamil Powder Formula, makes 161-170 oz.","24.69/22.19",null,22.19]
["***",null,null,null,null,"Gerber Good Start Formula, makes 164-182 oz.","23.99/21.49","Gerber Good Start Powder Formula, any 22 oz or larger $3.25/2 (active) This Link-03/31","19.87 ea"]
[]
["*****",null,null,null,null,"The following items will earn you a checkout coupon for use on your NEXT shopping trip. Coupon issued at checkout for each qualifying purchase. NO LIMITS!",null,"Coupon will print at checkout valid on your NEXT shopping trip."]
[null,null,null,null,null,null,null,"Final prices factor in each checkout coupon, as well as manufacturers coupons listed."]
["***",null,null,null,null,"Bounty Basic Paper Towels, single roll",0.99,"Receive a $1.00 coupon with purchase of 3",".66 ea"]
["***",null,null,null,null,"Glad Trash Bags, 28-35 ct.",4.49,"Receive a .50 coupon with purchase of 1",3.99]
["***",null,null,null,null,"Glad Trash Bags, 28-80 ct.",7.49,"Receive a .50 coupon with purchase of 1",6.99]
["***",null,null,null,null,"Homelife Bleach, 96 oz.",1.89,"Receive a .50 coupon with purchase of 1",1.39]
["***",null,null,null,null,"Homelife Heavy Duty Scrub Sponges, 3 ct.",2.4900000000000002,"Receive a .50 coupon with purchase of 1",1.99]
["*****",null,null,null,null,"Homelife Latex Simply Clean Gloves, 1 pair",1,"Receive a .50 coupon with purchase of 1",0.5]
["****",null,null,null,null,"Libman Freedom Spray Mop, 1 ct.",15.99,"Receive a $2.00 coupon with purchase of 1",13.99]
[]
["***",null,null,null,null,"Buy 2 of these products and receive a $1 coupon valid on your NEXT shopping purchase. NO LIMITS!",null,"$1 coupon will print at checkout valid on your NEXT shopping purchase. Sale prices listed are BEFORE/AFTER $1 coupon. Discount is essentially .50 per item."]
["***",null,null,null,null,"Lysol Cleaners, 24-40 oz.","2.50/2.00","Lysol Products, any .50/2 (active) This Link-03/18","1.75 ea"]
["***",null,null,null,null,"Lysol Neutra Air Fabric Mist, 7 oz.","2.50/2.00","Lysol Neutra Air Aerosol or Fabric Mist .50/1 (active) This Link-02/04",1.5]
["***",null,null,null,null,"Lysol Toilet Cleaners, 24 oz.","2.50/2.00","Lysol Toilet Bowl Cleaners or No Mess Automatic Toilet Bowl Cleaner .50/2 (active) This Link-02/04","1.75 ea"]
["***",null,null,null,null,"Lysol Wipes, 28-35 oz.","2.50/2.00","Lysol Disinfecting or Dual Action Wipes, any .50/1 (active) This Link-02/04",1.5]
[]
["*****",null,null,null,null,"Buy 1 of these products and receive a $2 coupon valid on your NEXT shopping purchase. NO LIMITS!",null,"$2 coupon will print at checkout valid on your NEXT shopping purchase. Sale prices listed are BEFORE/AFTER $2 coupon. Discount is essentially $2 per item."]
["***",null,null,null,null,"Lysol Disinfecting Wipes, 150 ct.","6.99/4.99","Lysol Disinfecting or Dual Action Wipes, any .50/1 (active) This Link-02/04",4.49]
["*****",null,null,null,null,"Lysol No Touch Starter Kit with One Refill, 1 ct.","6.99/4.99","Lysol No-Touch Kitchen System Starter Kit, any $3/1 (05-01-12) SS-3/18",1.99]
["*****",null,null,null,null,"Lysol No Touch Starter Kit with One Refill, 1 ct.","6.99/4.99","Lysol No-Touch Kitchen System Starter Kit .75/1 (active) This Link-02/04",4.24]
[]
["*****",null,null,null,null,"Buy 2 of these products and receive a $1 coupon valid on your NEXT shopping purchase. NO LIMITS!",null,"$1 coupon will print at checkout valid on your NEXT shopping purchase. Sale prices listed are BEFORE/AFTER $1 coupon. Discount is essentially .50 per item."]
["****",null,null,null,null,"Glade Candle, 4 oz.","2.50/2.00","Glade Jar Candles 4 oz, any $1/2 (active) Group A-03/12 Print Twice","1.50 ea"]
["****",null,null,null,null,"Glade Candle, 4 oz.","2.50/2.00","Glade 4 oz. Jar or Scented Oil Candle Products, any $1/2 (05-05-12) SS-3/25","1.50 ea"]
["***",null,null,null,null,"Glade Aerosol, 9.7 oz.","2.50/2.00",null,2]
["***",null,null,null,null,"Glade Plug In Scented Oil Refill, 1 ct.","2.50/2.00","Glade PlugIns Scented Oil Twin Refill $1/1 or (2) Single Refills, any (active) Group A-03/12","1.50 ea"]
["***",null,null,null,null,"Glade Plug In Scented Oil Refill, 1 ct.","2.50/2.00","Glade PlugIns Scented Oil twin refill, any $1/1 or (2) single refills (05-05-12) SS-3/25","1.50 ea"]
[]
["*****",null,null,null,null,"Buy 2 of these products and receive a $1 coupon valid on your NEXT shopping purchase. NO LIMITS!",null,"$1 coupon will print at checkout valid on your NEXT shopping purchase. Sale prices listed are BEFORE/AFTER $1 coupon. Discount is essentially .50 per item."]
["***",null,null,null,null,"Scrubbing Bubbles Aerosol, 22 oz.","3.00/2.50","Scrubbing Bubbles Bathroom Cleaners, any $1/2 (active) Group A-03/19 Print Twice","2.00 ea"]
["****",null,null,null,null,"Scrubbing Bubbles Aerosol, 22 oz.","3.00/2.50","Scrubbing Bubbles Bathroom Cleaners, any $2/2 (06-30-12) SS-3/11","1.50 ea"]
["***",null,null,null,null,"Windex Glass Cleaner, 26 oz.","3.00/2.50","Windex Glass Cleaning Products, any .75/2 (active) Group A-03/19 Print Twice","2.13 ea"]
["***",null,null,null,null,"Windex Glass Cleaner, 26 oz.","3.00/2.50","Windex Glass Cleaner products, any $1/2 (05-05-12) SS-3/25","2.00 ea"]
[]
["***",null,null,null,null,"Buy 2 of these products and receive a $2 coupon valid on your NEXT shopping purchase. NO LIMITS!",null,"$2 coupon will print at checkout valid on your NEXT shopping purchase. Sale prices listed are BEFORE/AFTER $2 coupon. Discount is essentially $1 per item."]
["***",null,null,null,null,"Air Wick Candles, 5.29-6.35 oz.","5.00/4.00","Air Wick Candles, any $2/1 (EXPIRES 04-15-12) SS-3/18"]
["***",null,null,null,null,"Air Wick Freshmatic Mini Refill, 1 ct.","5.00/4.00","Air Wick Freshmatic Compact Refill, any $1.50/1 (EXPIRES 04-15-12) SS-3/18",2.5]
["***",null,null,null,null,"Air Wick Freshmatic Ultra Refill, 6.17 oz.","5.00/4.00","Air Wick Freshmatic Ultra Refill, any $1.50/1 (EXPIRES 04-15-12) SS-3/18",2.5]
["***",null,null,null,null,"Air Wick Scented Oil Refill Twin Pack, 2 ct.","5.00/4.00","Air Wick Scented Oil Refills, any Twin Pack $1/1 or (2) Singles (EXPIRES 04-15-12) SS-3/18",3]
[]
["*****",null,null,null,null,"Buy 2 of these products and receive a $1 coupon valid on your NEXT shopping purchase. NO LIMITS!",null,"$1 coupon will print at checkout valid on your NEXT shopping purchase. Sale prices listed are BEFORE/AFTER $1 coupon. Discount is essentially .50 per item."]
["***",null,null,null,null,"Pledge Multisurface, 9.7-12.5 oz.","4.00/3.50","Pledge Multi Surface Product, any .50/1 (active) Group A-03/19 Print Twice",3]
["***",null,null,null,null,"Pledge Multisurface, Polish or Electronic Cleaner, 9.7-12.5 oz.","4.00/3.50","Pledge Furniture Care Product, any $1.50/2 (active) Group A-03/19 Print Twice","2.75 ea"]
["****",null,null,null,null,"Pledge Multisurface, Polish or Electronic Cleaner, 9.7-12.5 oz.","4.00/3.50","Pledge Furniture Care products, any $2/1 (05-05-12) SS-3/25",1.5]
[]
["*****",null,null,null,null,"Got a list question? Want to check if next week's list is ready? Our listmakers answer questions and post our \"preview\" lists at PYP."]
[]
["****",null,null,null,null,"Albertsons Intermountain/Northwest regions checkout voucher offers",null,"If you have questions about these, or to tell us about one not listed here, use this thread at PYP"]
[null,null,null,null,null,"-AKA \"Catalina\" deals"]
[null,null,null,null,null,"Hint: These deals can be VERY HOT if the item is also on sale, and you use manufacturers coupons when buying them!"]
[]
[]
[]
[]
[]
["*****",null,null,null,null,"Todays date: ","Approx","Item pricing may be slightly different at your local store"]
["toggle 4 and 5 star rows",null,null,null,null,null,"Wal-Mart"]
["Stock up scale",null,null,null,null,"How to use this list","Price","Printable coupons:","Bottom Line"]
[null,null,null,null,null,null,null,"Group A  Group B  Group C"]
[null,null,null,null,null,"Wal-Mart"]
[null,null,null,null,null,"Selected items pricing",null,"Coupon To Use"]
[null,null,null,null,null,"-This list shows what you'll actually pay at Wal-Mart when using certain printable coupons"]
["*****",null,null,null,null,"WALMART COUPON POLICY-",null,"Wal Mart accepts manufacturer, printed and competitor coupons. If coupon value exceeds the price of the item, the excess may be given as cash or applied toward the basket purchase"]
[null,null,null,null,null,null,null,"See the entire coupon policy HERE"]
[]
[null,null,null,null,null,null,null,"See the Walmart thread in this section at PYP for questions and more Walmart info."]
["*****",null,null,null,null,"Product availability can vary by store.",null,"Please also note that some brands are regional and your area may not carry all items on this list. Please be aware of this before you plan your shopping trip."]
[null,null,null,null,null,"Larger Walmart stores are more likely to carry the variety and size found on this list."]
["*****",null,null,null,null,"Wal Mart price check **APPROXIMATE, prices vary by location**",null,"Current manufacturer coupons."]
[null,null,null,null,null,null,null,"You may find these insert coupons in your mailbox or your local newspaper."]
[]
[null,null,null,null,null,null,null,"**SINCE COUPONS ARE REGIONAL, YOU MAY OR MAY NOT HAVE RECEIVED THESE COUPONS LOCALLY. **"]
["****",null,null,null,null,"Baileys Coffee Creamer 16 oz",1.98,"Baileys Coffee Creamers, any, $1/2 (05-06-12) SS-3/4","1.48 ea"]
["****",null,null,null,null,"Kettle Brand Potato Chips 9 oz",2.78,"Kettle Brand Potato Chips, any 4 oz or larger, $1/1 (05-12-12) RP-3/18",1.78]
["****",null,null,null,null,"Louisiana Fish Fry Breading",1.38,"Louisiana Fish Fry Products Breadings, any, $1/2 (06-30-12) SS-3/4",0.88]
["****",null,null,null,null,"Planters Peanuts Sweet and Crunchy Peanuts 10 oz",2.98,"Planters Peanuts, any 4-21.25 oz, $1.50/2 (04-30-12) SS-1/29",2.23]
["****",null,null,null,null,"Birds Eye Steamfresh 12 oz",1.25,"Birds Eye Steamfresh Varieties, any, $1/3 (04-15-12) RP-3/4","0.92 ea"]
["****",null,null,null,null,"Alka Seltzer Original 24 ct",2.98,"Alka-Seltzer Product, any, $1/1 (06-30-12) RP-3/18",1.98]
["*****",null,null,null,null,"Bic Comfort 3 Razors For Men 4 ct",2.88,"Bic Disposable Razor, any EXCLUDING trial size, $2/1 (04-15-12) SS-3/18",0.88]
["****",null,null,null,null,"Bausch and Lomb Ocuvite Eye Vitamins",9.98,"Bausch and Lomb Ocuvite Product, any, $5/1 (05-31-12) SS-3/4",4.9800000000000004]
["****",null,null,null,null,"Bayer Low Dose Aspirin Pain Reliever 32 ct",2.2200000000000002,"Bayer Aspirin Product, any 20 ct or larger, $1/1 (04-30-12) SS-1/29",1.22]
["*****",null,null,null,null,"Colgate Cavity Protection Original Toothpaste 6.4 oz",1.5,"Colgate Toothpaste, any 4 oz or larger, .75/1 (04-14-12) SS-3/25",0.75]
["****",null,null,null,null,"Garnier Shampoo or Conditioner 13 oz",2.96,"Garnier Fructis Shampoo, Conditioner or Treatment, any EXCLUDING trial size, $1/1 (04-15-12) RP-3/4",1.96]
["****",null,null,null,null,"Got2B Styling Gel or Glue 6 to 12 oz",4.72,"Got2b Product, any full size, $3/1 (05-12-12) RP-2/5",1.72]
["*****",null,null,null,null,"Reach Clean Burst Floss 55 yard",0.97,"Reach Floss Product, any, $1/1 (05-31-12) RP-3/4","FREE"]
["FREE"]
["****",null,null,null,null,"Suave Deodorant 2.6 oz",1.72,"Suave Deodorant Product, any EXCLUDING trial and travel size, .75/1 (04-15-12) RP-3/18",0.97]
["****",null,null,null,null,"Suave Naturals Shampoo or Conditioner 15 oz",0.94,"Suave Naturals, Suave Men, or Suave Kids Body Wash Products, any EXCLUDING trial and travel size, Buy 2 Get 1 FREE (04-15-12) RP-3/18","0.63 ea"]
["****",null,null,null,null,"Suave Skin Therapy Body Lotion 18 oz",2.87,"Suave Body Lotion Product, any EXCLUDING trial and travel size, $1/1 (04-15-12) RP-3/18",1.87]
["****",null,null,null,null,"Vaseline Lotion 10 oz",2.97,"Vaseline Lotion, 10 oz, $1/1 (04-22-12) RP-3/25",1.97]
["****",null,null,null,null,"Fur Reals Toy",7.97,"Furreal Friends Snuggimals Pet or Dizzy Dancers Pet, any, $2/1 (04-15-12) Playsaver-3/25",5.97]
[]
["*****",null,null,null,null,"Wal Mart price check **APPROXIMATE, prices vary by location**",null,"Current Group A coupons (Coupons Inc)"]
[null,null,null,null,null,null,null,"Remember, you can print each coupon 2 times (To buy each item twice.)"]
["****",null,null,null,null,"County Crock Vegetable Oil Spread 15 oz",2.1800000000000002,"Country Crock Spread, any excluding Honey or Cinnamon flavored $1/1 (active) Group A-02/21",1.18]
["***",null,null,null,null,"Crunchmaster Crackers 4.5 oz",2.58,"Crunchmaster Crackers, any .75/1 (active) Group A-03/18",1.83]
["****",null,null,null,null,"Haribo Gummy Bears 5 oz",1.08,"Haribo Product, any 4 oz or larger .30/1 (active) Group A-04/09",0.78]
["***",null,null,null,null,"Hinode Dry Rice 5 lb Bag",4.37,"Hinode Dry Rice Bag, any 1 to 5 lb bag .55/1 (active) Group A-01/30",3.82]
["***",null,null,null,null,"Truvia Natural Sweetener 40 ct",3.68,"Truvia Natural Sweetener or Truvia Baking Blend with Sugar, any .75/1 (active) Group A-03/18",2.93]
["****",null,null,null,null,"Huberts Lemonade",1.68,"Huberts Lemonade, any .75/1 (active) Group A-12/08",0.93]
["****",null,null,null,null,"Huberts Lemonade",1.68,"Huberts Lemonade, any B1 G1 FREE (active) Group A-12/08","0.84 ea"]
["***",null,null,null,null,"Bridgford Frozen Monkey Bread 16 oz",2.98,"Bridgford Frozen Rolls, Bread Dough or Monkey Bread, any .55/1 (active) Group A-03/16",2.4300000000000002]
["***",null,null,null,null,"Jose Ole 16 oz",5.49,"Jose Ole Item, any 16 oz or larger $1/1 (active) Group A-04/01",4.49]
["*****",null,null,null,null,"Alka Seltzer Plus Original 24 ct",2.98,"Alka Seltzer Plus Product, any $2/1 (active) Group A-03/22",0.98]
["***",null,null,null,null,"Citracal Slow Release 1200 Supplement 80 ct",10.92,"Citracal Calcium Gummies or Slow Release 1200 product, any, $2/1 (active) Group A-03/06",8.92]
["***",null,null,null,null,"Claritin Childrens Non Drowsy 2 oz",5.97,"Claritin Childrens Non-Drowsy Allergy Product, any 4 oz $2/1 (active) Group A-03/12",3.97]
["***",null,null,null,null,"Claritin Non-Drowsy Allergy Medicine 30 ct",17.88,"Claritin Non-Drowsy Allergy Product, any $4/1 (active) Group A-03/07",13.88]
["***",null,null,null,null,"Colgate Total Advanced 5.8 oz",2.96,"Colgate Total Advanced Toothpaste $1/1 (active) Group A-03/12",1.96]
["***",null,null,null,null,"Eucerin Body Lotion Everyday Protection 13.5 oz",7.87,"Eucerin Product, any 13.5 oz or larger $2/1 (active) Group A-02/09",5.87]
["***",null,null,null,null,"Emetrol Nausea Liquid Medicine Cherry Flavor 4 oz",6.87,"Emetrol for Nausea, any $1.50/1 (active) Group A-03/07",5.37]
["****",null,null,null,null,"Garnier Fructis Shampoo or Conditioner 13 oz",2.96,"Garnier Fructis Shampoo or Conditioner, any excluding trial or travel sizes $1/1 (active) Group A-04/09",1.96]
["***",null,null,null,null,"Glade Carpet and Room Odor Eliminator 32 oz",1.98,"Glade Carpet and Room Odor Eliminator, any .55/1 (active) Group A-03/12",1.43]
["*****",null,null,null,null,"Glade PlugIns Scented Oil Warmers",1.38,"Glade PlugIns Scented Oil Warmer, any $1/1 (active) Group A-03/12",0.38]
["***",null,null,null,null,"Glade Sense and Spray Refill",2.98,"Glade Sense and Spray Refills, any $1/2 (active) Group A-03/12","2.48 ea"]
["***",null,null,null,null,"Glade Sense and Spray Kit",7.98,"Glade Sense and Spray Starter Kit, any $3/1 (active) Group A-03/12",4.9800000000000004]
["***",null,null,null,null,"Nicorette White Ice 2mg Coated Gum 20 ct",9.98,"Nicorette Gum, any 20 ct $1/1 (active) Group A-11/29",8.98]
["***",null,null,null,null,"Polident 3 Minute Tablets 40 ct",3.12,"Polident Product, any $1/1 (active) Group A-03/09",2.12]
["***",null,null,null,null,"Right Guard Total 5 Anti-Perspirant Deodorant",3.32,"RIght Guard Anti-Perspirant, Deodorant or Body Wash, $2/2 (active) Group A-03/13",2.3199999999999998]
["***",null,null,null,null,"Slo-Niacin Tablets 100 ct",12.94,"Slo-Niacin Product, any $3/1 (active) Group A-03/02",11.94]
["***",null,null,null,null,"Pledge Furniture Care Wipes 24 ct",3.37,"Pledge Furniture Care Product, any $1.50/2 (active) Group A-03/19","2.62 ea"]
["***",null,null,null,null,"Pledge Multi Surface Floor Cleaner 27 oz",4.47,"Pledge or Armstrong Floor Cleaner, any $1/1 (active) Group A-03/19",3.47]
["***",null,null,null,null,"Pledge Multi Surface Wipes 25 ct",3.88,"Pledge Multi Surface Product, any .50/1 (active) Group A-03/19",3.38]
["****",null,null,null,null,"Scrubbing Bubbles Antibacterial Bathroom Cleaner 22 oz",2.4700000000000002,"Scrubbing Bubbles Bathroom Cleaners, any $1/2 (active) Group A-03/19",1.97]
["****",null,null,null,null,"Scrubbing Bubbles Fantastik 22 oz",1.97,"Scrubbing Bubbles Fantastik All Purpose Cleaner, any .50/1 (active) Group A-03/19",1.47]
["***",null,null,null,null,"Scrubbing Bubbles Mega Shower Foamer 20 oz",3.47,"Scrubbing Bubbles Mega Shower Foamer, any $1/2 (active) Group A-03/19",2.97]
["***",null,null,null,null,"Scrubbing Bubbles Toilet Gel Cleaner 1.34 oz",3.47,"Scrubbing Bubbles Toilet Cleaning Gel, any .75/1 (active) Group A-03/19",2.72]
["***",null,null,null,null,"Scrubbing Bubbles Vanish Toilet Bowl Dropins 4 ct",3.97,"Scrubbing Bubbles Vanish Continuous Clean Drop-Ins, any .55/1 (active) Group A-03/19",3.42]
["***",null,null,null,null,"Shout Color Catcher 24 ct",3.88,"Shout Color Catcher, any .75/2 (active) Group A-03/19","3.51 ea"]
["***",null,null,null,null,"Wisk Deep Clean Liquid Laundry Detergent 50 oz",5.37,"Wisk Deep Clean Laundry Detergent, any 45 oz or larger $1/1 (active) Group A-04/09",4.37]
["***",null,null,null,null,"Windex Glass Cleaner Original 32 oz",2.4700000000000002,"Windex Glass Cleaning Products, any .75/2 (active) Group A-03/19","2.10 ea"]
["***",null,null,null,null,"Windex Multi Surface 32 oz",2.87,"Windex Multi-Surface Products, any $1/2 (active) Group A-03/19","2.37 ea"]
["***",null,null,null,null,"Goodnites Underwear 35 ct",19.77,"Goodnites Underwear, any Jumbo pack or larger $2/1 (active) Group A-02/03",17.77]
["***",null,null,null,null,"Huggies Little Movers Slip-On Diapers",22.94,"Huggies Little Movers Slip-On Diapers, any $3/2 (active) Group A-03/11","21.44 ea"]
["****",null,null,null,null,"Pampers Wipes 72 ct",1.97,"Pampers Wipes, any 60 ct or larger .75/1 (active) Group A-03/02",1.22]
["***",null,null,null,null,"Pampers Cruisers 20 ct",9.4700000000000006,"Pampers Cruisers or Baby Dry Diapers, any excluding trial or travel sizes $1.50/1 (active) Group A-03/02",7.97]
["***",null,null,null,null,"Pampers Swaddlers 76 ct",19.77,"Pampers Swaddlers or Swaddlers Sensitive Diapers, any excluding trial or travel size $1.50/1 (active) Group A-03/02",18.27]
["***",null,null,null,null,"Glad Trash Bags 13 Gallon 26 ct",5.17,"Glad Trash Bags, any 13 gallon $2/2 (active) Group A-03/18","4.17 ea"]
["***",null,null,null,null,"Glad Trash Bags Quick Tie 30 Gallon 40 ct",7.48,"Glad 30-Gallon or Larger Trash Bags, any $1/1 (active) Group A-03/18",6.48]
["***",null,null,null,null,"Jonny Cat Litter 20 lbs",3.64,"Jonny Cat Litter, any $1/1 20 lbs or (2) 10 lbs (active) Group A-03/08",2.64]
[]
["*****",null,null,null,null,"Wal Mart price check **APPROXIMATE, prices vary by location**",null,"Current Group B coupons (Smartsource)"]
[null,null,null,null,null,null,null,"Remember, you can print each coupon 2 times (To buy each item twice.)"]
["****",null,null,null,null,"Challenge Whipped Butter 8 oz",1.82,"Challenge Butter, any .55/1 (active) Group B-10/05",1.27]
["***",null,null,null,null,"Pillsbury Crescent Dinner Rolls 8 oz",1.98,"Pillsbury Crescent Dinner Rolls, any .40/3 (active) Group B-03/02","1.85 ea"]
["***",null,null,null,null,"Yoplait Light with Granola Yogurt 6 oz 2 pk",2.2799999999999998,"Yoplait Yogurt Light Yogurt with Granola, any package .75/1 (active) Group B-04/02",1.53]
["***",null,null,null,null,"Bob Evans Refrigerated Side Dishes 20 to 24 oz",1.75,"Bob Evans Refrigerated Side Dish, any .35/1 (active) Group B-10/07",1.4]
["***",null,null,null,null,"Yoplait Yogurt",0.6,"Yoplait Yogurt cups, any variety including Original, Light, Thick and Creamy or Whips .40/6 (active) Group B-03/02","0.53 ea"]
["****",null,null,null,null,"C and H Pure Cane White Sugar Granulated 2 lbs",1.84,"C and H Sugar Products, any 2 lbs or larger $1/2 (active) Group B-11/23","1.37 ea"]
["***",null,null,null,null,"General Mills Chex Honey Nut Cereal",3.12,"General Mills Basic 4, Chex (any), fiber One (any), Honey Nut clusters, Oatmeal Crisp (any), Raisin Nut Bran, Total (any) or Wheaties (any), $1/2 (active) Group B-03/02","2.62 ea"]
["***",null,null,null,null,"General Mills Kix Cereal 12 oz",2.94,"General Mills Kix Cereal, any .75/1 (active) Group B-04/02",2.19]
["***",null,null,null,null,"General Mills Trix Cereal 14.8 oz",3.38,"General Mills Trix Cereal, any .50/1 (active) Group B-04/02",2.88]
["***",null,null,null,null,"Nabisco Cheese Nips Crackers 12 oz",1.68,"Nabisco Crackers, any 9 to 16 oz $1/2 (active) Group B-01/12",1.18]
["***",null,null,null,null,"Pillsbury Cinnamon Rolls with Icing 7.3 oz",1.52,"Pillsbury Sweet Rolls or Grands Sweet Rolls, any .40/2 (active) Group B-03/02","1.32 ea"]
["***",null,null,null,null,"Pillsbury Create n Bake Cookies 16.5 oz",2.5,"Pillsbury Refrigerated Cookie Dough, any .75/2 (active) Group B-03/02","2.13 ea"]
["***",null,null,null,null,"Truvia Natural Sweetener 40 ct",3.68,"Truvia Natural Sweeterner or Truvia Baking Blend with Sugar, any .75/1 (active) Group B-03/15",2.93]
["***",null,null,null,null,"ACT Mouthwash 18 oz",3.46,"ACT Mouthwash or Mouthrinse, any 16.9 oz or larger $1/1 (active) Group B-03/06",2.46]
["***",null,null,null,null,"Allegra Allergy 24 hr Relief 30 ct",17.96,"Allegra Allergy 30 ct or higher, Allegra-D 24 hr 10 ct or higher or Allegra-D 12 hr 20 ct or higher $4/1 (active) Group B-03/18",13.96]
["***",null,null,null,null,"Allegra Allergy 24 hr Relief 5 ct",5.94,"Allegra Allergy 5, 12 or 15 ct, Childrens Allegra, Allegra-D 24 hr 5 ct or Allegra-D 12 hr 10 ct $2/1 (active) Group B-03/18",3.94]
["***",null,null,null,null,"Xenadrine Results 60 ct",17.97,"Xenadrine Weight Loss Product, any $5/1 (active) Group B-03/10",12.97]
[]
["*****",null,null,null,null,"Wal Mart price check **APPROXIMATE, prices vary by location**",null,"Current Group C coupons (Redplum)"]
[null,null,null,null,null,null,null,"Remember, you can print each coupon 2 times (To buy each item twice.)"]
["***",null,null,null,null,"Bridgford Monkey Bread 16 oz",2.98,"Bridgford Frozen Rolls, Bread Dough or Monkey Bread, any .50/1 (active) Group C-04/01",2.48]
["***",null,null,null,null,"Advil Childrens Fever Reducer Pain Reliever Grape Flavor 4 oz",4.7699999999999996,"Advil Childrens Product, any $2/1 (active) Group C-04/01",2.77]
["***",null,null,null,null,"Advil Congestion Relief 10 ct",5.98,"Advil Congestion Relief Product, any $2/1 (active) Group C-03/25",3.98]
["***",null,null,null,null,"Advil PM 20 ct",4.43,"Advil PM, any 16 ct or larger $1/1 (active) Group C-04/01",3.43]
["***",null,null,null,null,"Advil Ibuprofen 24 ct",3.48,"Advil, any 20 ct or larger $1/1 (active) Group C-04/01",2.48]
["***",null,null,null,null,"Garnier Fructis Style 2 to 8.5 oz",3.47,"Garnier Fructis Style Product, any excluding trial size $1/1 (active) Group C-04/01",2.4700000000000002]
["***",null,null,null,null,"Garnier Nutritioniste Moisture Rescue Cream 1.7 oz",6.97,"Garnier Moisturizer, any $2/1 (active) Group C-03/12",4.97]
["***",null,null,null,null,"Ester C 90 ct",7.44,"Ester C product, any, $2/1 (active) Group C-03/05",5.44]
["***",null,null,null,null,"LOreal Paris Go 360 Deep Clean Face Cleanser 6 oz",4.37,"LOreal Paris Skincare Product, any excluding trial size $1/1 (active) Group C-02/19",3.37]
["***",null,null,null,null,"Met Rx Big 100 Bars 4 pk",6.94,"Met-Rx Big 100 Bars, any $2/2 (active) Group C-04/01","5.94 ea"]
["***",null,null,null,null,"Fiber Choice 90 ct Tablets",9.8699999999999992,"Fiber Choice, any 90 ct $2/1 (active) Group C-03/25",7.87]
["*****",null,null,null,null,"Robitussin To Go Cold Medicine",1,"Robitussin product, any $1/1 (active) Group C-03/12","FREE"]
["FREE"]
["***",null,null,null,null,"All Liquid Laundry Detergent 50 oz 32 laods",4.97,"All Mighty Pacs or All Liquid Laundry Detergent, any 24 loads or larger $1/1 (active) Group C-04/01",3.97]
[]
["*****",null,null,null,null,"Wal Mart price check **APPROXIMATE, prices vary by location**",null,"Current Coupon Network coupons (By Catalina)"]
[null,null,null,null,null,null,null,"Remember, you can print each coupon 2 times (To buy each item twice.)"]
["***",null,null,null,null,"Pillsbury Crescent Dinner Rolls",2.5,"Pillsbury Crescent Dinner Rolls, any, .40/3 (active) This Link-03/07","2.37 ea"]
["***",null,null,null,null,"Pillsbury Orange Flavor Sweet Rolls 13.9 oz",1.98,"Pillsbury Sweet Rolls or Grands Sweet Rolls, any, .40/2 (active) This Link-03/07","1.78 ea"]
["***",null,null,null,null,"Yoplait Yogurt Cups 6 oz",0.6,"Yoplait Yogurt cups, any variety including Original, Light, Thick and Creamy or Whips , .50/8 (active) This Link-02/01","0.54 ea"]
["***",null,null,null,null,"Uncle Bens Ready Rice Long Grain and Wild Rice 8.8 oz",1.84,"Uncle Bens Long Grain and Wild Rice, any .55/2 (active) This Link-03/20","1.57 ea"]
["***",null,null,null,null,"Nestle Miniatures Assorted Candy 40 oz",8.98,"Nestle Miniatures Bags Candy, any 19.75 to 40 oz $2/2 (active) This Link-04/10",7.98]
["***",null,null,null,null,"Wonka Laffy Taffy Candy 18.7 oz",4.28,"Wonka Candy, any 12 oz or larger $1.25/1 (active) This Link-04/10",3.03]
["***",null,null,null,null,"Ester C 90 ct",7.44,"Ester C products, any $1.75/2 (active) This Link-03/26",6.57]
["***",null,null,null,null,"Glade Plugins Scented Oil Twin Pack",4.88,"Glade PlugIns Scented Oil Twin Refill $1.25/1 or (2) Single Refills, any, (active) This Link-03/22",3.63]
["***",null,null,null,null,"Glucerna Multi-Pack Bars 4 pk",4.28,"Glucerna Multi-Pack Bars or Shakes, any $1.25/2 (active) This Link-01/05",3.66]
["****",null,null,null,null,"Listerine Zero Mouthwash 1.5 liter",3.52,"Listerine Zero Mouthwash, any 1.5 liter $1.85/1 (active) This Link-04/06",1.67]
["***",null,null,null,null,"Listerine Zero Mouthwash 1.5 liter",3.52,"Listerine Zero Mouthwash, any 1.5 liter $3/2 (active) This Link-04/06","2.02 ea"]
["***",null,null,null,null,"Natures Bounty Coral Calcium Plus 1000 Mg 120 ct",8.94,"Natures Bounty Vitamins or Supplements, any $0.75/1 (active) This Link-12/12",7.34]
["***",null,null,null,null,"Stopain Extra Strength Pain Relief 3 oz",8.76,"Stopain Product, any, MUST FOLLOW LINK AND LIKE ON FACEBOK TO GET COUPON VALUE $2.25/1 (active) This Link-03/20",6.51]
["***",null,null,null,null,"Zantac Acid Reducer 30 ct",7.57,"Zantac Product, any 24 ct or larger MUST WATCH VIDEO TO GET COUPON VALUE $4/1 (active) This Link-03/22",3.57]
["***",null,null,null,null,"Avent BPA Free 4 oz Feeding Bottles 3 pk",15.67,"Avent BPA-Free Baby Bottles, any Multi-Pack $3/1 (active) This Link-01/31",12.67]
[]
["*****",null,null,null,null,"Wal Mart price check **APPROXIMATE, prices vary by location**",null,"Current printable manufacturer coupons. ."]
[null,null,null,null,null,null,null,"Note - Some of these links require you to register first."]
["*****",null,null,null,null,"8th Continent Soymilk Carton",2.56,"8th Continent Soymilk, any carton FACEBOOK COUPON (enter lookin good sweepstakes) $2/1 (active) This Link-04/03",0.56000000000000005]
["***",null,null,null,null,"Blue Diamond Almond Breeze Milk 86 oz",3.98,"Blue Diamond Almond Breeze Almond Milk, any .55/1 (active) This Link-01/28",3.43]
["***",null,null,null,null,"Carnation Evaporated Canned Milk",1,"Carnation Evaporated Milk, any .50/2 (active) This Link-04/11","0.75 ea"]
["***",null,null,null,null,"Goya Rice 3.5 oz",2.1800000000000002,"Goya Rice Mixes, any $1/2 (active) This Link-08/21","1.68 ea"]
["****",null,null,null,null,"Goya Low Sodium Beans 15.5 oz",1.22,"Goya Low Sodium Beans, any 15.5 oz or larger $1/4 (active) This Link-08/21","0.97 ea"]
["****",null,null,null,null,"Fisher Boy Fish Sticks 48 ct",3.25,"Fisher Boy Product, any .75/1 (active) This Link-06/17",2.5]
["***",null,null,null,null,"Weight Watchers Smart Ones 9 oz",1.98,"Weight Watchers Smart Ones Products, any $1/5 (active) This Link-06/28","1.78 ea"]
["***",null,null,null,null,"AmLactin Moisturizing body lotion 7.9 oz",11.97,"AmLactin Moisturizing Lotion, any $5/1 (active) This Link-05/14",6.97]
["*****",null,null,null,null,"Aquafresh Extreme Clean Toothpaste .8 oz travel size",0.97,"Aquafresh Extreme Clean Toothpaste, any $1/1 (active) This Link-09/01","FREE +"]
["FREE",null,null,null,null,null,null,"Per Walmarts coupon policy, you will either receive cash back or the overage will be applied to your purchase"]
["***",null,null,null,null,"Aquafresh Training Toothpaste 1.5 oz",2.68,"Aquafresh Training Toothpaste for Kids .75/1 (active) This Link-02/19",1.93]
["***",null,null,null,null,"Aquafresh Training Toothpaste 1.5 oz",2.68,"Aquafresh Training Toothbrush .50/1 (active) This Link-02/19",2.1800000000000002]
["***",null,null,null,null,"Benefiber Powder The Clear Choice 2.80 oz",5.98,"Benefiber Product, any $2/1 (active) This Link-05/18",3.98]
["***",null,null,null,null,"Beano Tablets 30 ct",4.96,"Beano Product, any $1/1 (active) This Link-11/05",3.96]
["****",null,null,null,null,"Dr. Scholls Massaging Gel Insoles",5.86,"Dr. Scholls Massaging Gel insoles, any $2/1 (active) This Link-02/04",3.86]
["****",null,null,null,null,"Excedrin Extra Strength 24 ct",2.92,"Excedrin Extra Strength, any 20 ct or larger $1/1 (active) This Link-05/26",1.92]
["***",null,null,null,null,"Hawaiian Tropic Lime Coolada After Sun Moisturizer 16 oz",6.97,"Hawaiian Tropic Sun Care Product, any 4 oz or larger excluding lip balm $1/1 (active) This Link-08/21",5.97]
["***",null,null,null,null,"Kiss Salon Results",5.37,"Kiss Artificial Nails, any FACEBOOK COUPON $1/1 (active) This Link-09/24",4.37]
["*****",null,null,null,null,"K-Y Gel 2 oz",2.84,"K-Y Products, any excluding trial sizes $2/1 (active) This Link-06/17",0.84]
["****",null,null,null,null,"K-Y Yours+Mine",14.98,"K-Y Intense, Kissable Sensations, Yours+Mine or Intrigue products, any $5/1 (active) This Link-06/17",9.98]
["*****",null,null,null,null,"Just For Men Haircolor",6.97,"Qualifies for: MAIL IN REBATE, Just for Men Haircolor or Color Gel Product, Get $9.50 Mail-In Rebate with purchase - Expires 12/31/12 (active) This Link-10/22","FREE"]
["*****",null,null,null,null,"Palmers Cocoa Butter Facial Soap",2.17,"Palmers Cocoa Butter Facial Care, any $2/1 (active) This Link-10/22",0.17]
["*****",null,null,null,null,"Pure Protein Bar",1.1599999999999999,"Pure Protein Product, any $1/1 (active) This Link-07/26",0.16]
["***",null,null,null,null,"Rembrandt Intense Stain Whitening Mint Toothpaste 3.5 oz",6.97,"Rembrandt Toothpaste or Rinse, any $2/1 (active) This Link-03/17",4.97]
["***",null,null,null,null,"Rembrandt 2 Hour Whitening Kit",18.62,"Rembrandt 2-Hour Whitening Kit, any $5/1 (active) This Link-03/17",13.62]
["***",null,null,null,null,"Theraflu Warming Cold Relief Syrup 8.3 oz",4.97,"Theraflu Warming Syrup or Warming Caplets, any $2/1 (active) This Link-09/23",2.97]
["***",null,null,null,null,"Tylenol Precise Cream or Patch",5.97,"Tylenol Precise $2/1 This Link",3.97]
["****",null,null,null,null,"Visine AC Eyedrops 1/2 fl oz",3.62,"Visine-A $2/1 (active) This Link-03/22",1.62]
["***",null,null,null,null,"Biz Powder Detergent 60 oz",4.97,"Biz Stain fighter product, any $2/1 (active) This Link-05/18",2.97]
[]
["*****",null,null,null,null,"Looking to buy something online? Try the PYP Screaming Deals Online forum."]
[]
["...Type other items and notes here..."]

{"sheet":"FinalPriceList","index":2,"n_rows":2309,"n_cols":11,"rows_kept":2309,"cut":false,"hidden":false,"merged":[[2303,1,2303,5],[2304,1,2304,5],[2305,1,2305,9],[2306,1,2306,5],[2307,1,2307,9],[2308,1,2308,5],[2286,1,2286,5],[2287,1,2287,5],[2288,1,2288,5],[2289,1,2289,5],[2290,1,2290,5],[2291,1,2291,5],[2292,1,2292,5],[2293,1,2293,5],[2294,1,2294,5],[2295,1,2295,5],[2296,1,2296,5],[2297,1,2297,5],[2298,1,2298,5],[2299,1,2299,5],[2300,1,2300,5],[2301,1,2301,5],[2302,1,2302,5],[2270,1,2270,5],[2271,1,2271,5],[2272,1,2272,5],[2273,1,2273,9],[2274,1,2275,5],[2274,6,2275,6],[2274,7,2275,7],[2274,9,2275,9],[2276,1,2276,5],[2277,1,2277,5],[2278,1,2278,5],[2279,1,2279,5],[2280,1,2280,5],[2281,1,2281,5],[2282,1,2282,5],[2283,1,2283,5],[2284,1,2284,5],[2284,6,2285,6],[2284,7,2285,7],[2284,9,2285,9],[2285,1,2285,5],[2255,1,2255,9],[2256,1,2257,5],[2256,6,2257,6],[2256,7,2257,7],[2256,9,2257,9],[2258,1,2258,5],[2259,1,2259,5],[2260,1,2260,5],[2261,1,2261,5],[2262,1,2262,5],[2263,1,2263,5],[2264,1,2264,5],[2265,1,2265,5],[2266,1,2266,5],[2267,1,2267,5],[2268,1,2268,5],[2269,1,2269,5],[2242,1,2242,5],[2243,1,2243,5],[2244,1,2244,5],[2245,1,2245,5],[2246,1,2246,5],[2247,1,2247,5],[2248,1,2248,5],[2249,1,2249,5],[2250,1,2250,5],[2251,1,2251,5],[2252,1,2252,5],[2252,6,2253,6],[2252,7,2253,7],[2252,8,2253,8],[2252,9,2253,9],[2253,1,2253,5],[2254,1,2254,5],[2227,1,2227,5],[2228,1,2228,5],[2229,1,2229,5],[2230,1,2230,5],[2231,1,2231,5],[2232,1,2232,5],[2233,1,2233,5],[2234,1,2234,5],[2235,1,2235,5],[2236,1,2236,5],[2237,1,2237,5],[2238,1,2238,9],[2239,1,2240,5],[2239,6,2240,6],[2239,7,2240,7],[2239,9,2240,9],[2241,1,2241,5],[2212,1,2212,5],[2213,1,2213,5],[2214,1,2214,5],[2215,1,2215,5],[2216,1,2216,5],[2217,1,2217,5],[2218,1,2218,9],[2219,1,2220,5],[2219,6,2220,6],[2219,7,2220,7],[2219,9,2220,9],[2221,1,2221,5],[2222,1,2222,5],[2223,1,2223,5],[2224,1,2224,5],[2225,1,2225,5],[2226,1,2226,5],[2193,1,2193,5],[2194,1,2194,5],[2195,1,2195,5],[2196,1,2196,5],[2197,1,2197,5],[2198,1,2198,5],[2199,1,2199,5],[2200,1,2200,5],[2201,1,2201,5],[2202,1,2202,5],[2203,1,2203,5],[2204,1,2204,5],[2205,1,2205,5],[2207,1,2207,5],[2209,1,2209,5],[2210,1,2210,5],[2211,1,2211,5],[1970,7,1972,7],[1970,8,1972,8],[1970,9,1972,9],[1982,1,1984,5],[1982,7,1984,7],[1982,8,1984,8],[1982,9,1984,9],[1990,1,1991,5],[1990,6,1991,6],[1990,7,1991,7],[1990,9,1991,9],[1998,1,1998,5],[2000,1,2000,5],[2001,1,2001,5],[2002,1,2002,5],[2003,1,2003,5],[2004,1,2004,5],[1764,1,1764,5],[1765,1,1765,5],[1766,1,1766,5],[1767,1,1767,5],[1769,1,1769,5],[1770,1,1770,5],[1782,1,1782,5],[1783,1,1783,5],[1830,1,1830,5],[1831,1,1831,5],[1843,1,1843,5],[1844,1,1844,5],[1845,1,1845,5],[1846,1,1846,5],[1863,1,1863,5],[1864,1,1864,5],[1865,1,1865,5],[1622,7,1624,7],[1622,8,1624,8],[1622,9,1624,9],[1625,1,1629,5],[1625,7,1629,7],[1625,8,1629,8],[1625,9,1629,9],[1633,1,1633,5],[1634,1,1634,5],[1638,1,1638,5],[1639,1,1639,5],[1652,1,1652,5],[1653,1,1653,5],[1660,1,1660,5],[1661,1,1661,5],[1721,1,1721,5],[1722,1,1722,5],[1521,7,1522,7],[1521,8,1522,8],[1521,9,1522,9],[1523,1,1524,5],[1523,7,1524,7],[1523,8,1524,8],[1523,9,1524,9],[1583,1,1583,5],[1584,1,1584,5],[1585,1,1585,5],[1586,1,1586,5],[1587,1,1587,5],[1588,1,1588,5],[1590,1,1590,5],[1596,1,1597,5],[1596,6,1597,6],[1596,7,1597,7],[1596,9,1597,9],[1446,7,1447,7],[1446,8,1447,8],[1446,9,1447,9],[1448,1,1449,5],[1448,7,1449,7],[1448,8,1449,8],[1448,9,1449,9],[1450,1,1450,9],[1451,1,1451,5],[1452,1,1452,5],[1453,1,1453,5],[1454,1,1454,5],[1455,1,1455,5],[1456,1,1456,5],[1458,1,1458,5],[1467,1,1467,5],[1468,1,1468,5],[1429,7,1430,7],[1429,8,1430,8],[1429,9,1430,9],[1431,1,1432,5],[1431,7,1432,7],[1431,8,1432,8],[1431,9,1432,9],[1433,1,1434,5],[1433,7,1434,7],[1433,8,1434,8],[1433,9,1434,9],[1435,1,1436,5],[1435,7,1436,7],[1435,8,1436,8],[1435,9,1436,9],[1437,1,1438,5],[1437,7,1438,7],[1437,8,1438,8],[1437,9,1438,9],[1419,7,1420,7],[1419,8,1420,8],[1419,9,1420,9],[1421,1,1422,5],[1421,7,1422,7],[1421,8,1422,8],[1421,9,1422,9],[1423,1,1424,5],[1423,7,1424,7],[1423,8,1424,8],[1423,9,1424,9],[1425,1,1426,5],[1425,7,1426,7],[1425,8,1426,8],[1425,9,1426,9],[1427,1,1428,5],[1427,7,1428,7],[1427,8,1428,8],[1427,9,1428,9],[1409,7,1410,7],[1409,8,1410,8],[1409,9,1410,9],[1411,1,1412,5],[1411,7,1412,7],[1411,8,1412,8],[1411,9,1412,9],[1413,1,1414,5],[1413,7,1414,7],[1413,8,1414,8],[1413,9,1414,9],[1415,1,1416,5],[1415,7,1416,7],[1415,8,1416,8],[1415,9,1416,9],[1417,1,1418,5],[1417,7,1418,7],[1417,8,1418,8],[1417,9,1418,9],[1398,7,1399,7],[1398,8,1399,8],[1398,9,1399,9],[1400,1,1401,5],[1400,7,1401,7],[1400,8,1401,8],[1400,9,1401,9],[1402,1,1404,5],[1402,7,1404,7],[1402,8,1404,8],[1402,9,1404,9],[1405,1,1406,5],[1405,7,1406,7],[1405,8,1406,8],[1405,9,1406,9],[1407,1,1408,5],[1407,7,1408,7],[1407,8,1408,8],[1407,9,1408,9],[1387,7,1388,7],[1387,8,1388,8],[1387,9,1388,9],[1389,1,1390,5],[1389,7,1390,7],[1389,8,1390,8],[1389,9,1390,9],[1391,1,1392,5],[1391,7,1392,7],[1391,8,1392,8],[1391,9,1392,9],[1393,1,1394,5],[1393,7,1394,7],[1393,8,1394,8],[1393,9,1394,9],[1395,1,1396,5],[1395,7,1396,7],[1395,8,1396,8],[1395,9,1396,9],[1377,1,1378,5],[1377,7,1378,7],[1377,8,1378,8],[1377,9,1378,9],[1379,1,1380,5],[1379,7,1380,7],[1379,8,1380,8],[1379,9,1380,9],[1381,1,1382,5],[1381,7,1382,7],[1381,8,1382,8],[1381,9,1382,9],[1383,1,1384,5],[1383,7,1384,7],[1383,8,1384,8],[1383,9,1384,9],[1385,1,1386,5],[1385,7,1386,7],[1385,8,1386,8],[1385,9,1386,9],[1361,7,1362,7],[1361,8,1362,8],[1361,9,1362,9],[1363,1,1364,5],[1363,7,1364,7],[1363,8,1364,8],[1363,9,1364,9],[1365,1,1366,5],[1365,7,1366,7],[1365,8,1366,8],[1365,9,1366,9],[1367,1,1368,5],[1367,7,1368,7],[1367,8,1368,8],[1367,9,1368,9],[1369,1,1370,5],[1369,7,1370,7],[1369,8,1370,8],[1369,9,1370,9],[1351,7,1352,7],[1351,8,1352,8],[1351,9,1352,9],[1353,1,1354,5],[1353,7,1354,7],[1353,8,1354,8],[1353,9,1354,9],[1355,1,1356,5],[1355,7,1356,7],[1355,8,1356,8],[1355,9,1356,9],[1357,1,1358,5],[1357,7,1358,7],[1357,8,1358,8],[1357,9,1358,9],[1359,1,1360,5],[1359,7,1360,7],[1359,8,1360,8],[1359,9,1360,9],[1341,8,1342,8],[1341,9,1342,9],[1343,1,1344,5],[1343,7,1344,7],[1343,8,1344,8],[1343,9,1344,9],[1345,1,1346,5],[1345,7,1346,7],[1345,8,1346,8],[1345,9,1346,9],[1347,1,1348,5],[1347,7,1348,7],[1347,8,1348,8],[1347,9,1348,9],[1349,1,1350,5],[1349,7,1350,7],[1349,8,1350,8],[1349,9,1350,9],[1323,7,1324,7],[1323,8,1324,8],[1323,9,1324,9],[1325,1,1326,5],[1325,7,1326,7],[1325,8,1326,8],[1325,9,1326,9],[1327,1,1328,5],[1327,7,1328,7],[1327,8,1328,8],[1327,9,1328,9],[1329,1,1331,5],[1329,7,1331,7],[1329,8,1331,8],[1329,9,1331,9],[1332,1,1333,5],[1332,7,1333,7],[1332,8,1333,8],[1332,9,1333,9],[1312,7,1313,7],[1312,8,1313,8],[1312,9,1313,9],[1314,1,1315,5],[1314,7,1315,7],[1314,8,1315,8],[1314,9,1315,9],[1316,1,1317,5],[1316,7,1317,7],[1316,8,1317,8],[1316,9,1317,9],[1318,1,1320,5],[1318,7,1320,7],[1318,8,1320,8],[1318,9,1320,9],[1321,1,1322,5],[1321,7,1322,7],[1321,8,1322,8],[1321,9,1322,9],[1071,7,1072,7],[1071,8,1072,8],[1071,9,1072,9],[1073,1,1073,9],[1089,1,1089,9],[1091,1,1091,9],[1094,1,1094,5],[1095,1,1095,5],[1096,1,1096,5],[1097,1,1097,5],[1098,1,1098,5],[1099,1,1099,5],[1101,1,1101,5],[1159,1,1159,9],[1161,1,1161,9],[1169,1,1169,5],[1171,1,1171,5],[1061,7,1062,7],[1061,8,1062,8],[1061,9,1062,9],[1063,1,1064,5],[1063,7,1064,7],[1063,8,1064,8],[1063,9,1064,9],[1065,1,1066,5],[1065,7,1066,7],[1065,8,1066,8],[1065,9,1066,9],[1067,1,1068,5],[1067,7,1068,7],[1067,8,1068,8],[1067,9,1068,9],[1069,1,1070,5],[1069,7,1070,7],[1069,8,1070,8],[1069,9,1070,9],[1049,7,1052,7],[1049,8,1052,8],[1049,9,1052,9],[1053,1,1054,5],[1053,7,1054,7],[1053,8,1054,8],[1053,9,1054,9],[1055,1,1056,5],[1055,7,1056,7],[1055,8,1056,8],[1055,9,1056,9],[1057,1,1058,5],[1057,7,1058,7],[1057,8,1058,8],[1057,9,1058,9],[1059,1,1060,5],[1059,7,1060,7],[1059,8,1060,8],[1059,9,1060,9],[1039,7,1040,7],[1039,8,1040,8],[1039,9,1040,9],[1041,1,1042,5],[1041,7,1042,7],[1041,8,1042,8],[1041,9,1042,9],[1043,1,1044,5],[1043,7,1044,7],[1043,8,1044,8],[1043,9,1044,9],[1045,1,1046,5],[1045,7,1046,7],[1045,8,1046,8],[1045,9,1046,9],[1047,1,1048,5],[1047,7,1048,7],[1047,8,1048,8],[1047,9,1048,9],[1027,8,1028,8],[1027,9,1028,9],[1029,1,1030,5],[1029,7,1030,7],[1029,8,1030,8],[1029,9,1030,9],[1031,1,1032,5],[1031,7,1032,7],[1031,8,1032,8],[1031,9,1032,9],[1033,1,1036,5],[1033,7,1036,7],[1033,8,1036,8],[1033,9,1036,9],[1037,1,1038,5],[1037,7,1038,7],[1037,8,1038,8],[1037,9,1038,9],[999,7,1000,7],[999,8,1000,8],[999,9,1000,9],[1001,1,1002,5],[1001,7,1002,7],[1001,8,1002,8],[1001,9,1002,9],[1003,1,1004,5],[1003,7,1004,7],[1003,8,1004,8],[1003,9,1004,9],[1005,1,1007,5],[1005,7,1007,7],[1005,8,1007,8],[1005,9,1007,9],[1008,8,1009,8],[1010,1,1011,5],[1010,7,1011,7],[1010,8,1011,8],[1010,9,1011,9],[989,7,990,7],[989,8,990,8],[989,9,990,9],[991,1,992,5],[991,7,992,7],[991,8,992,8],[991,9,992,9],[993,1,994,5],[993,7,994,7],[993,8,994,8],[993,9,994,9],[995,1,996,5],[995,7,996,7],[995,8,996,8],[995,9,996,9],[997,1,998,5],[997,7,998,7],[997,8,998,8],[997,9,998,9],[978,7,980,7],[978,8,980,8],[978,9,980,9],[981,1,982,5],[981,7,982,7],[981,8,982,8],[981,9,982,9],[983,1,984,5],[983,7,984,7],[983,8,984,8],[983,9,984,9],[985,1,986,5],[985,7,986,7],[985,8,986,8],[985,9,986,9],[987,1,988,5],[987,7,988,7],[987,8,988,8],[987,9,988,9],[967,7,968,7],[967,8,968,8],[967,9,968,9],[969,1,971,5],[969,7,971,7],[969,8,971,8],[969,9,971,9],[972,1,973,5],[972,7,973,7],[972,8,973,8],[972,9,973,9],[974,1,975,5],[974,7,975,7],[974,8,975,8],[974,9,975,9],[976,1,977,5],[976,7,977,7],[976,8,977,8],[976,9,977,9],[955,7,957,7],[955,8,957,8],[955,9,957,9],[958,1,959,5],[958,7,959,7],[958,8,959,8],[958,9,959,9],[960,1,962,5],[960,7,962,7],[960,8,962,8],[960,9,962,9],[963,1,964,5],[963,7,964,7],[963,8,964,8],[963,9,964,9],[965,1,966,5],[965,7,966,7],[965,8,966,8],[965,9,966,9],[939,1,943,5],[939,6,943,6],[939,7,943,7],[939,9,943,9],[944,1,944,9],[945,1,948,5],[945,6,948,6],[945,7,948,7],[945,9,948,9],[949,1,949,9],[951,1,952,5],[951,7,952,7],[951,8,952,8],[951,9,952,9],[953,1,954,5],[953,7,954,7],[953,8,954,8],[953,9,954,9],[894,7,895,7],[894,9,895,9],[898,1,898,5],[899,1,899,5],[900,1,900,5],[901,1,901,5],[903,1,903,5],[904,1,904,5],[905,1,905,5],[906,1,906,5],[907,1,907,5],[908,1,908,5],[909,1,909,5],[910,1,910,5],[911,1,911,5],[912,1,912,5],[913,1,913,5],[869,1,869,5],[870,1,870,5],[871,1,871,5],[872,1,872,5],[873,1,873,5],[874,1,874,5],[876,1,876,5],[877,1,877,5],[878,1,878,5],[879,1,879,5],[880,1,880,5],[881,1,881,5],[882,1,882,5],[883,1,883,5],[885,1,885,5],[886,1,886,5],[887,1,887,5],[833,1,833,5],[834,1,834,5],[835,1,835,5],[836,1,836,5],[837,1,837,5],[838,1,838,5],[839,1,839,5],[840,1,840,5],[841,1,841,5],[842,1,842,5],[844,1,844,5],[845,1,845,5],[846,1,846,5],[847,1,847,5],[849,1,849,5],[850,1,850,5],[851,1,851,5],[780,7,782,7],[780,8,782,8],[780,9,782,9],[783,1,785,5],[783,7,785,7],[783,8,785,8],[783,9,785,9],[786,1,788,5],[786,7,788,7],[786,8,788,8],[786,9,788,9],[800,1,803,5],[800,7,803,7],[800,8,803,8],[800,9,803,9],[804,1,807,5],[804,7,807,7],[804,8,807,8],[804,9,807,9],[746,1,746,5],[747,1,750,5],[747,7,750,7],[747,8,750,8],[747,9,750,9],[751,1,754,5],[751,7,754,7],[751,8,754,8],[751,9,754,9],[755,1,755,5],[756,1,759,5],[756,7,759,7],[756,8,759,8],[756,9,759,9],[760,1,762,5],[760,7,762,7],[760,8,762,8],[760,9,762,9],[707,1,709,5],[707,6,709,6],[707,7,709,7],[707,9,709,9],[710,1,710,9],[711,1,713,5],[711,7,713,7],[711,8,713,8],[711,9,713,9],[714,1,714,5],[715,1,715,9],[716,8,718,8],[719,1,719,5],[720,1,720,9],[724,1,724,5],[725,1,725,5],[726,1,726,5],[676,9,677,9],[678,1,678,5],[679,1,679,9],[680,1,682,5],[680,7,682,7],[680,8,682,8],[680,9,682,9],[684,1,684,9],[685,1,687,5],[685,7,687,7],[685,8,687,8],[685,9,687,9],[692,1,694,5],[692,7,694,7],[692,8,694,8],[692,9,694,9],[698,1,698,9],[621,9,623,9],[624,1,624,9],[626,1,628,5],[626,7,628,7],[626,8,628,8],[626,9,628,9],[629,1,629,9],[630,1,633,5],[630,7,633,7],[630,9,633,9],[634,1,634,9],[635,1,637,5],[635,7,637,7],[635,8,637,8],[635,9,637,9],[639,1,639,9],[640,1,642,5],[640,7,642,7],[640,8,642,8],[640,9,642,9],[592,1,594,5],[592,7,594,7],[592,8,594,8],[592,9,594,9],[595,1,597,5],[595,7,597,7],[595,8,597,8],[595,9,597,9],[598,1,600,5],[598,7,600,7],[598,8,600,8],[598,9,600,9],[601,1,603,5],[601,7,603,7],[601,8,603,8],[601,9,603,9],[604,1,604,9],[564,1,564,5],[565,1,565,9],[566,1,566,5],[567,1,567,5],[568,1,568,5],[568,6,569,6],[569,1,569,5],[570,1,570,5],[571,1,571,9],[572,1,572,5],[573,1,575,5],[573,7,575,7],[573,8,575,8],[573,9,575,9],[576,1,578,5],[576,7,578,7],[576,8,578,8],[576,9,578,9],[508,1,508,5],[509,1,509,5],[510,1,510,5],[511,1,511,5],[512,1,512,5],[513,1,513,5],[514,1,514,5],[515,1,515,5],[516,1,516,5],[518,1,518,5],[519,1,519,5],[520,1,520,5],[521,1,521,5],[523,1,523,5],[524,1,524,5],[525,1,525,5],[526,1,526,5],[461,1,461,5],[462,1,462,5],[463,1,463,5],[464,1,464,9],[465,1,466,5],[465,7,466,7],[465,8,466,8],[465,9,466,9],[467,1,467,5],[468,1,468,5],[469,1,469,9],[470,1,470,5],[471,1,472,5],[471,7,472,7],[471,8,472,8],[471,9,472,9],[473,1,473,5],[437,1,438,5],[437,7,438,7],[437,8,438,8],[437,9,438,9],[439,1,440,5],[439,7,440,7],[439,8,440,8],[439,9,440,9],[441,1,441,9],[442,1,444,5],[442,7,444,7],[442,8,444,8],[442,9,444,9],[446,1,446,5],[447,1,447,5],[448,1,448,5],[449,1,449,5],[362,1,364,5],[362,7,364,7],[362,8,364,8],[362,9,364,9],[365,1,365,9],[366,1,366,5],[367,1,369,5],[367,7,369,7],[367,8,369,8],[367,9,369,9],[370,8,372,8],[373,1,373,9],[374,1,374,5],[375,1,377,5],[375,7,377,7],[375,8,377,8],[375,9,377,9],[335,9,337,9],[338,1,340,5],[338,7,340,7],[338,8,340,8],[338,9,340,9],[341,1,341,9],[342,1,342,5],[343,1,345,5],[343,7,345,7],[343,8,345,8],[343,9,345,9],[346,1,348,5],[346,7,348,7],[346,8,348,8],[346,9,348,9],[349,1,349,9],[350,1,350,5],[296,9,298,9],[299,1,299,5],[300,1,300,5],[301,1,301,5],[302,8,305,8],[306,1,306,5],[307,1,309,5],[307,6,309,6],[307,7,309,7],[307,9,309,9],[310,1,314,5],[310,7,314,7],[310,9,314,9],[315,1,315,5],[316,1,316,5],[317,1,318,5],[317,7,318,7],[317,8,318,8],[317,9,318,9],[280,7,281,7],[280,8,281,8],[280,9,281,9],[282,1,282,5],[283,1,284,5],[283,7,284,7],[283,8,284,8],[283,9,284,9],[285,1,286,5],[285,7,286,7],[285,8,286,8],[285,9,286,9],[287,1,288,5],[287,7,288,7],[287,8,288,8],[287,9,288,9],[289,1,290,5],[289,7,290,7],[289,8,290,8],[289,9,290,9],[257,8,258,8],[257,9,258,9],[259,1,259,5],[263,1,264,5],[263,7,264,7],[263,8,264,8],[263,9,264,9],[265,1,266,5],[265,7,266,7],[265,8,266,8],[265,9,266,9],[267,1,267,5],[268,1,269,5],[268,7,269,7],[268,8,269,8],[268,9,269,9],[270,1,271,5],[270,7,271,7],[270,8,271,8],[270,9,271,9],[226,9,229,9],[230,1,233,5],[230,7,233,7],[230,9,233,9],[234,1,236,5],[234,7,236,7],[234,9,236,9],[237,1,240,5],[237,7,240,7],[237,9,240,9],[241,1,243,5],[241,7,243,7],[241,9,243,9],[244,1,246,5],[244,7,246,7],[244,9,246,9],[247,1,247,9],[187,9,189,9],[190,1,192,5],[190,7,192,7],[190,9,192,9],[193,1,195,5],[193,7,195,7],[193,9,195,9],[196,1,198,5],[196,7,198,7],[196,9,198,9],[199,1,201,5],[199,7,201,7],[199,9,201,9],[202,1,205,5],[202,7,205,7],[202,9,205,9],[206,1,213,5],[206,7,213,7],[206,9,213,9],[13,1,13,5],[14,1,14,5],[15,1,15,5],[16,1,16,5],[17,1,17,5],[18,1,18,5],[6,1,7,9],[6,10,7,10],[0,1,0,10],[1,1,1,10],[2,1,2,10],[3,1,3,10],[4,1,4,10]],"merged_total":2692,"flags":["merged_cut"]}
[null,"USE \"PLAN MODE\" TO QUICKLY CUSTOMIZE AND PRINT YOUR PLANNED GROCERY LIST:"]
[null,"-The START button activates \"PLAN MODE\", enabling you to click and highlight lines you want to include onto your PLANNED GROCERY LIST."]
[null,"-Click the SHRINK button to hide everything not highlighted.  Be careful what you hide, you may need that info. (If you click UNSHRINK, you can adjust without starting over!)"]
[]
[null,"**TIME SAVER- You can highlight all the **** (4 star) and ***** (5 star EXTREME or ******) items. Just click START, then click the little red star above the words \"Stock Up Scale\"."]
[]
[null,null,null,null,null,null,null,null,null,null,"Activate reset Toggle gray rows "]
[]
[null,"*",null,null,null,null,"Become an instructor"]
[]
[null,"*****",null,null,null,null,"Todays date: ","Sale","We are not affiliated with this store.  The store's ad is the only OFFICIAL authority"]
[null,"toggle 4 and 5 star rows",null,null,null,null,null,"Price"]
[null,"Stock up scale",null,null,null,null,"How to use this list",null,"Printable coupons:","Bottom line"]
[null,null,null,null,null,null,null,null,"Group A  Group B  Group C  Singles"]
["Store","Deal Scale",null,null,null,null,"Item","Sale Price","Coupon","Bottom Line"]
[{"$f":"IF(G16=\"How to use this list\",G18,A15)","v":"Store"},null,null,null,null,null,null,null,"Coupon Index"]
[{"$f":"IF(G17=\"How to use this list\",G19,A16)","v":"Store"},null,null,null,null,null,"Current list"]
["Store",null,null,null,null,null,"-This list is valid during the dates listed below"]
["Store","*****",null,null,null,null,"Valid Dates: 04-11 through 04-17",null,"This list is made by Rebecca, a Grocerysmarts/PYP affiliated instructor. She answers list questions at this thread at PYP."]
["Store","****",null,null,null,null,"Apples, Fuji, organic","1.49 lb",null,"1.49 lb"]
["Store","****",null,null,null,null,"Apples, Jazz or Gala",".89 lb",null,".89 lb"]
["Store","***",null,null,null,null,"Asparagus","2.99 lb",null,"2.99 lb"]
["Store","***",null,null,null,null,"Artichokes",2.5,null,2.5]
["Store","***",null,null,null,null,"Blackberries, 6 oz",2.99,null,2.99]
["Store","***",null,null,null,null,"Cantaloupe",".49 lb",null,".49 lb"]
["Store","***",null,null,null,null,"Carrots, 2 lb bag",0.99,null,0.99]
["Store","***",null,null,null,null,"Celery",0.99,null,0.99]
["Store","***",null,null,null,null,"Dole Salad Kits, 8-13 oz",2.99,null,2.99]
["Store","***",null,null,null,null,"Fresh Selections Salad Kit, 8-13 oz",2.99,null,2.99]
["Store","***",null,null,null,null,"Grapes, Red, Seedless","2.49 lb",null,"2.49 lb"]
["Store","***",null,null,null,null,"Grape Tomatoes, organic, pint",2.5,null,2.5]
["Store","***",null,null,null,null,"Nature Sweet Sunburst or Cherry Tomatoes, 10.5 oz",3,null,3]
["Store","***",null,null,null,null,"Oranges, Navel, 8 lb",5.99,null,5.99]
["Store","***",null,null,null,null,"Pears,Bartlett, Anjou or Bosc",".99 lb",null,".99 lb"]
["Store","***",null,null,null,null,"Peppers, Red, Yellow or Orange",1,null,1]
["Store","****",null,null,null,null,"Tomatoes, Roma",".79 lb",null,".79 lb"]
["Store","***",null,null,null,null,"Watermelon, seedless",".49 lb",null,".49 lb"]
["Store","***",null,null,null,null,"Beef - Ribeye Steaks, bone in, super value packs","5.99 lb",null,"5.99 lb"]
["Store","***",null,null,null,null,"Beef - Rump or Sirloin Tip Roast","3.99 lb",null,"3.99 lb"]
["Store","***",null,null,null,null,"Beef - Stew Meat, boneless","3.49 lb",null,"3.49 lb"]
["Store","***",null,null,null,null,"Chicken - Smiths Boneless, Skinless Breasts, Tenders or Thighs, super value pack","1.99 lb",null,"1.99 lb"]
["Store","***",null,null,null,null,"Ground Round - Private Selection Angus, 85%","2.99 lb",null,"2.99 lb"]
["Store","***",null,null,null,null,"Pork - Center Cut Chops, boneless, super value pack","2.99 lb",null,"2.99 lb"]
["Store","***",null,null,null,null,"Pork - Center Cut Loin Chops, super value pack","2.59 lb",null,"2.59 lb"]
["Store","***",null,null,null,null,"Pork - Loin Back Ribs","3.99 lb",null,"3.99 lb"]
["Store","***",null,null,null,null,"Pork - Loin Chops, bone in","1.99 lb",null,"1.99 lb"]
["Store","***",null,null,null,null,"Seafood - Catfish Fillets, fresh, farm raised","5.99 lb",null,"5.99 lb"]
["Store","***",null,null,null,null,"Seafood - Cocktail Shrimp, asst, sold in 2 lb bag","6.99 lb",null,"6.99 lb"]
["Store","***",null,null,null,null,"Seafood - Kroger Breaded Shrimp or Calamari Rings, 8-20 oz frozen","buy one get one ******",null,"buy one get one ******"]
["Store","***",null,null,null,null,"Seafood - Kroger Salmon or Cod Fillets, 2.5 lb frozen",9.99,null,9.99]
["Store","***",null,null,null,null,"Seafood - Tilapia Fillets, fresh, farm raised","5.99 lb",null,"5.99 lb"]
["Store","***",null,null,null,null,"Kraft Cheese, 7-8 oz",1.67,null,1.67]
["Store","****",null,null,null,null,"Kroger Cheese, 32 oz",5.99,"Cheese, $1/2 lbs (active) Group A-03/26 Print Twice!",4.99]
["Store","***",null,null,null,null,"Kroger Cottage Cheese, 24 oz",2,null,2]
["Store","***",null,null,null,null,"Kroger Dip, 24 oz",2,null,2]
["Store","***",null,null,null,null,"Kroger Singles, 12 ct",1,null,1]
["Store","***",null,null,null,null,"Kroger Sour Cream, 24 oz",2,null,2]
["Store","***",null,null,null,null,"Lifeway Kefir, 32 oz",2.99,null,2.99]
["Store","*****",null,null,null,null,"Mountain Dairy Milk, gallon",2.39,"Milk, .75/1 gallon (active) Group A-03/26 Print Twice!",1.64]
["Store","***",null,null,null,null,"Oikos Greek Yogurt, 5.3 oz",1,null,1]
["Store","***",null,null,null,null,"Simple Truth Organic Soymilk, half gallon",2.5,null,2.5]
["Store","***",null,null,null,null,"Yoplait Yogurt, 4-6 oz",0.6,"Yoplait Yogurt cups, any variety including Original, Light, Thick and Creamy or Whips .40/6 (05-05-12) SS-3/11",".53 ea"]
["Store","***",null,null,null,null,"Yoplait Lactose-****** Yogurt, 4-6 oz",0.6,"Yoplait Lactose-****** Yogurt cups, any flavor .20/1 (05-05-12) SS-3/11",0.4]
["Store","***",null,null,null,null,"Yoplait Yogurt, 4-6 oz",0.6,"Yoplait Yogurt cups, any variety including Original, Light, Thick and Creamy or Whips .40/6 (active) Group B-03/02 Print Twice!",".53 ea"]
["Store","***",null,null,null,null,"Yoplait Yogurt, 4-6 oz",0.6,"Yoplait Yogurt cups, any variety including Original, Light, Thick and Creamy or Whips, .50/8 (active) This Link-03/07 Print Twice!",".54 ea"]
["Store","***",null,null,null,null,"Ball Park Beef Franks, 14-16 oz",3.49,null,3.49]
["Store","***",null,null,null,null,"Ball Park Meat Franks, 16 oz","buy one get one ******",null,"buy one get one ******"]
["Store","***",null,null,null,null,"Hillshire Farms Smoked Sausage, 13-14 oz",2.5,"Hillshire Farm Lunchmeat or Smoked Sausage Products, Buy 2 Get 1 Hillshire Farm Grilled Chicken Breast ****** (active) This Link-04/09","2.50+"]
["Store","****",null,null,null,null,"Hillshire Farms Smoked Sausage, 13-14 oz",2.5,"Smiths CARD DOWNLOAD - Hillshire Farm Smoked Sausage Products, any - Expires 5/31 - This can NOT be combined with manufacturer coupons $1/2 (active) This Link-04/09","2.00 ea"]
["Store","***",null,null,null,null,"Kroger Bacon, 24 oz",5.99,null,5.99]
["Store","***",null,null,null,null,"Kroger Bratwurst, 18 oz",3.88,null,3.88]
["Store","***",null,null,null,null,"Kroger Canadian Bacon, 5 oz",2.5,null,2.5]
["Store","***",null,null,null,null,"Kroger Italian Sausage, 18 oz",3.88,null,3.88]
["Store","***",null,null,null,null,"Oscar Mayer Bologna or Cotto Salami, 16 oz",2.5,null,2.5]
["Store","***",null,null,null,null,"Oscar Mayer Lunchables, 6.7-10.8 oz",2.5,null,2.5]
["Store","***",null,null,null,null,"Oscar Mayer Turkey Bacon, 12 oz",2.5,null,2.5]
["Store","***",null,null,null,null,"7up, 2 liter",1.33,null,1.33]
["Store","***",null,null,null,null,"Arrowhead Water, 24 ct",3.49,null,3.49]
["Store","****",null,null,null,null,"Coke, 2 liter",1,null,1]
["Store","***",null,null,null,null,"Coke, 20 pk",6.5,"Extra Promo: Buy 2, save $2","5.50 ea"]
[{"$f":"IF(G81=\"How to use this list\",G83,A80)","v":"Store"},"***",null,null,null,null,"Pepsi, 2 liter",1.33,null,1.33]
["Store","***",null,null,null,null,"Pepsi 20 pk",5.99,"Extra Promo: Buy 2, save $2","4.99 ea"]
["Store","*****",null,null,null,null,"V8 36-46 oz",1.99,"V8 100 Percent Vegetable Juice, any 46 oz or larger $1/2 (active) This Link-04/02","1.49 ea"]
["Store","****",null,null,null,null,"V8 V Fusion, 36-46 oz",1.99,null,1.99]
["Store","****",null,null,null,null,"Balance Bar, 1.76 oz",0.99,"Balance Bar Singles, any 1.76 oz FACEBOOK COUPON $1.10/3 (active) This Link-03/11",".62 ea"]
["Store","***",null,null,null,null,"Cheez it Crackers, 9.75-14 oz",2.4900000000000002,"Sunshine Cheez-It Baked Snack Crackers, any .70/1 (active) This Link-03/23",1.79]
["Store","****",null,null,null,null,"Doritos, 11-11.5 oz",3,"Extra Promo: Buy 3, save $3","2.00 ea"]
["Store","****",null,null,null,null,"Flipz Pretzels, 5 oz",1,null,1]
["Store","*****",null,null,null,null,"Jolly Time Popcorn, 3-4 ct",1,"Jolly Time Microwave Popcorn, any boxes $1/2 (active) This Link-05/23",".50 ea"]
["Store","***",null,null,null,null,"Kelloggs Cereal, 11-17 oz",1.99,"Kelloggs Cereal, any 8.7 oz or larger $1/3 (active) Group A-04/03 Print Twice!","1.66 ea"]
["Store","***",null,null,null,null,"Kelloggs Cereal, 11-17 oz",1.99,"Kelloggs Cereals, any flavor 10 oz. or larger $1/3 ( Expires 04-15-12) RP-3/4","1.66 ea"]
["Store","***",null,null,null,null,"Kettle Baked Potato Chips, 4 oz",1.67,null,1.67]
["Store","***",null,null,null,null,"Kings Hawaiian Rolls, 12 ct",2.5,"Kings Hawaiian Dinner Rolls, any variety 12 packs $1/2 or (1) 24-pack (05-31-12) RP-4/1","2.00 ea"]
["Store","***",null,null,null,null,"Kroger Coffee, 26-34.5 oz",6.99,null,6.99]
["Store","***",null,null,null,null,"Moms Best Naturals Cereal, 11.5-16.5 oz",2,"Moms Best Naturals Cereal, any .75/2 (active) This Link-03/26","1.63 ea"]
["Store","***",null,null,null,null,"Nutri Grain Cereal Bars, 5-10 ct",2.4900000000000002,null,2.4900000000000002]
["Store","***",null,null,null,null,"Private Selection Coffee, 10-12 oz",6.99,null,6.99]
["Store","***",null,null,null,null,"Special K Bars, 5-10 ct",2.4900000000000002,"Kelloggs Special K Bars or FiberPlus Chewy Bars, any 5 ct or larger $1/2 (active) Group A-04/03 Print Twice!","1.99 ea"]
["Store","***",null,null,null,null,"Cool Classics Fun Daze Sundaes, 4 ct or Ice Cream Sammies, 12-16 ct",2.5,null,2.5]
["Store","***",null,null,null,null,"Eggo Waffles or Pancakes, 6-10 ct",2,null,2]
["Store","****",null,null,null,null,"Freschetta Pizza, 9.4-30.6 oz",4.49,"Freschetta Multi-Serve Pizzas, any $1.50/2 (06-30-12) SS-3/4","3.74 ea"]
["Store","***",null,null,null,null,"Haagen Dazs Ice Cream, 3.6 oz",1,null,1]
["Store","***",null,null,null,null,"Healthy Choice Entrees, 9.5-10.8 oz",2.25,"Healthy Choice Complete Meals, any $1/3 (active) This Link-01/21","1.92 ea"]
["Store","***",null,null,null,null,"Healthy Choice 100% Natural Entrees (If this variety is included)",2.25,"Healthy Choice 100% Natural Entrees, any $1/2 (active) This Link-01/21","1.75 ea"]
["Store","***",null,null,null,null,"Healthy Choice Frozen Traditional Classics or Modern Classics (If this variety is included)",2.25,"Healthy Choice Frozen Traditional Classics or Modern Classics, any $1/2 (05-05-12) SS-3/25","1.75 ea"]
["Store","***",null,null,null,null,"Hot or Lean Pockets, 2-4 ct",2,null,2]
["Store","****",null,null,null,null,"Kashi Steam Meal, 9-10 oz",2.99,"Smiths CARD DOWNLOAD - Kashi Steam Meal, any - Expires 5/30 - This can NOT be combined with manufacturer coupons $1/1 (active) This Link-04/09",1.99]
["Store","****",null,null,null,null,"Kashi Steam Meal, 9-10 oz",2.99,"Kashi Steam Meal, any $1/1 (active) Group A-04/01 Print Twice!",1.99]
["Store","***",null,null,null,null,"Kroger Deluxe Sherbet, 16 oz",1,null,1]
["Store","***",null,null,null,null,"Marie Callenders Entrees, 8.5-19 oz",2.25,"Marie Callenders Single Serve Frozen Meals, any $1/3 (active) This Link-01/21","1.92 ea"]
["Store","***",null,null,null,null,"Michelinas Entrees, 4-9.5 oz",0.88,null,0.88]
["Store","***",null,null,null,null,"Private Selection Ice Cream, 48 oz",3.99,null,3.99]
["Store","***",null,null,null,null,"Red Baron Pizza or Pan Pasta, 9.4-30.6 oz",4.49,null,4.49]
["Store","***",null,null,null,null,"Tyson Anytizers, 22-32 oz",6.99,"Tyson Anytizers snacks, any bag $1/1 (06-08-12) SS-3/4 AND (04-22-12) SS-1/22",5.99]
["Store","***",null,null,null,null,"Tyson Chicken, 22-32 oz",6.99,"Tyson Chicken Nuggets, any bag .75/1 (05-31-12) SS-2/12",6.24]
["Store","***",null,null,null,null,"Weight Watchers Frozen Treats, 4-12 ct",3.99,null,3.99]
["Store","***",null,null,null,null,"Colgate Toothbrush, 1-2 ct",2.99,"Colgate Adult or Kids Manual Toothbrush, any excluding Colgate Plus and Colgate Extra Clean .40/1 (Expires 04-14-12) SS-3/25",2.59]
["Store","***",null,null,null,null,"Colgate Optic White Toothpaste, 4-5.8 oz",2.99,"Colgate Optic White Toothpaste 4 oz $1/1 (active) Group C-04/07 Print Twice!",1.99]
["Store","***",null,null,null,null,"Colgate Toothpaste, 4-5.8 oz",2.99,"Colgate Toothpaste, any 4 oz. or larger .75/1 (Expires 04-14-12) SS-3/25",2.2400000000000002]
["Store","***",null,null,null,null,"Colgate Total Advanced Toothpaste (If this variety is included)",2.99,"Colgate Total Advanced Toothpaste, any 4 oz or larger $1/1 (active) Group A-04/04 Print Twice!",1.99]
["Store","***",null,null,null,null,"Cottonelle, 12 double rolls",6.49,"Smiths CARD DOWNLOAD - Cottonelle Toilet Paper 12 pk - Expires 8/1 - This can NOT be combined with manufacturer coupons $1/1 (active) This Link-04/09",5.49]
["Store","***",null,null,null,null,"Emergen C, 30 ct",7.99,null,7.99]
["Store","*****",null,null,null,null,"Kroger Acetaminophen, 500 ct",5,null,5]
["Store","*****",null,null,null,null,"Kroger Ibuprofen, 500 ct",5,null,5]
["Store","***",null,null,null,null,"LOreal Cosmetics","20% off",null,"20% off"]
["Store","****",null,null,null,null,"LOreal Colour Riche Lipcolour or Nail Colour","20% off","LOreal Colour Riche Lipcolour or Nail Colour, any $1/1 (05-20-12) RP-3/25","unknown"]
["Store","****",null,null,null,null,"LOreal Paris Face Cosmetic product","20% off","LOreal Paris Face Cosmetic product, any excluding Magic Perfecting Base .17 oz. mini size $2/1 (04-29-12) RP-3/4 AND (Expires 04-15-12) RP-2/19","unknown"]
["Store","****",null,null,null,null,"LOreal Paris Eyeliner or Eye Shadow","20% off","LOreal Paris Eyeliner or Eye Shadow, any $1/1 (05-20-12) RP-3/25","unknown"]
["Store","****",null,null,null,null,"LOreal Paris Eye product","20% off","LOreal Paris Eye product, any $1/1 (05-20-12) RP-3/25","unknown"]
["Store","****",null,null,null,null,"Lady Speed Stick Deodorant, 2.3-3.5 oz",2,"Speed Stick Antiperspirant/Deodorant or Lady Speed Stick Antiperspirant/Deodorant, any excluding 2 oz, 1.4 oz, and .5 oz sizes $1/1 (Expires 04-14-12) SS-3/25",1]
["Store","****",null,null,null,null,"Nature Made CoQ10","50% off","Nature Made CoQ10 $2/1 (active) This Link-03/18","unknown"]
["Store","****",null,null,null,null,"Nature Made Fish Oil","50% off","Nature Made Fish Oil, any $1/1 (active) This Link-03/18","unknown"]
["Store","****",null,null,null,null,"Nature Made Vitamins","50% off","Nature Made Product, any $1/1 (active) This Link-03/18","unknown"]
["Store","****",null,null,null,null,"Nature Made Vitamin B","50% off","Nature Made Vitamin B, any $1/1 (active) This Link-03/18","unknown"]
["Store","****",null,null,null,null,"Nature Made Vitamin D","50% off","Nature Made Vitamin D Nature Made Vitamin D, any $1/1 (active) This Link-03/18","unknown"]
["Store","*****",null,null,null,null,"Purex, 26 ct packs",2.99,"Purex UltraPacks Detergent, excludes trial size $1/1 (04-21-12) RP-3/11",1.99]
["Store","*****",null,null,null,null,"Purex Crystals, 28 oz or larger (If this variety is included)",2.99,"Purex Crystals, any 28 oz or larger bottle $1/1 (active) Group A-03/28 Print Twice!",1.99]
["Store","****",null,null,null,null,"Purex Liquid Detergent",2.99,"Purex Liquid Detergent, excludes trial size .50/1 (04-21-12) RP-3/11",2.4900000000000002]
["Store","***",null,null,null,null,"Seventh Generation Laundry Detergent, 50-100 oz",11.99,null,11.99]
["Store","***",null,null,null,null,"Snuggle Fabric Softener, 32-40 loads or 70-80 ct sheets",2.99,"Snuggle Fabric Softener Liquid or Dryer Sheets, any .50/1 (Expires 04-15-12) RP-3/4",2.4900000000000002]
["Store","****",null,null,null,null,"Speed Stick Deodorant, 2.3-3.5 oz",2,"Speed Stick Antiperspirant/Deodorant or Lady Speed Stick Antiperspirant/Deodorant, any excluding 2 oz, 1.4 oz, and .5 oz sizes $1/1 (Expires 04-14-12) SS-3/25",1]
["Store","***",null,null,null,null,"Viva, 6 double rolls",6.49,"Viva Paper Towels .50/2 Big Roll packages or any (1) 2-pack (active) This Link-05/14","6.24 ea"]
["Store"]
["Store","*****",null,null,null,null,"Grill Night Promo: Buy $20 of participating products, get $5 off"]
[{"$f":"IF(G145=\"How to use this list\",G147,A144)","v":"Store"},"****",null,null,null,null,"Bushs Best Baked Beans, 21-28 oz",1.67,null,"varies"]
["Store","*****",null,null,null,null,"Heinz Ketchup, 32-40 oz",1.88,null,"varies"]
["Store","***",null,null,null,null,"Kingsford Charcoal, 15.7-16.6 lb bag",7.99,null,"varies"]
["Store","****",null,null,null,null,"Kraft Miracle Whip or Mayo, 30 oz",3.49,"Kraft Mayo or Miracle Whip Dressing products, any .75/2 (04-22-12) SS-3/25","varies"]
["Store","***",null,null,null,null,"Pepsi, 6 pk, 24 oz",3.5,null,"varies"]
["Store","***",null,null,null,null,"Ruffles Potato Chips, 8.5-9.5 oz",3,null,"varies"]
["Store","***",null,null,null,null,"Rold Gold Pretzels, 7-16 oz",3,null,"varies"]
["Store"]
["Store","*****",null,null,null,null,"Grill Night Promo: Buy $10 of participating products, get $2 off"]
["Store","***",null,null,null,null,"Bushs Best Baked Beans, 21-28 oz",1.67,null,"varies"]
["Store","****",null,null,null,null,"Heinz Ketchup, 32-40 oz",1.88,null,"varies"]
["Store","***",null,null,null,null,"Kingsford Charcoal, 15.7-16.6 lb bag",7.99,null,"varies"]
["Store","***",null,null,null,null,"Kraft Miracle Whip or Mayo, 30 oz",3.49,"Kraft Mayo or Miracle Whip Dressing products, any .75/2 (04-22-12) SS-3/25","varies"]
["Store","***",null,null,null,null,"Pepsi, 6 pk, 24 oz",3.5,null,"varies"]
["Store","***",null,null,null,null,"Ruffles Potato Chips, 8.5-9.5 oz",3,null,"varies"]
["Store","***",null,null,null,null,"Rold Gold Pretzels, 7-16 oz",3,null,"varies"]
["Store"]
["Store","*****",null,null,null,null,"Got a list question? Want to check if next week's list is ready? Our listmakers answer questions and post our \"preview\" lists at PYP."]
["Store"]
["Store","****",null,null,null,null,"If you have questions about these, or to tell us about one not listed here, use this thread at PYP",null,"Hint: These deals can be VERY HOT if the item is also on sale, and you use manufacturers coupons when buying them!"]
["Store",null,null,null,null,null,null,null,"Smiths checkout voucher offers"]
["Store",null,null,null,null,null,null,null,"-AKA \"Catalina\" deals"]
["Store","****",null,null,null,null,"California Pizza Kitchen",null,"Buy (2) get $1 voucher"]
["Store",null,null,null,null,null,null,null,"Buy (3) get $2 voucher"]
["Store",null,null,null,null,null,"Expires: 3/18/12 ",null,"Buy (4)+ get $3 voucher"]
["Store",null,null,null,null,null,null,null,"on your next shopping trip"]
["Store","****",null,null,null,null,"Canine Carry Outs Dog Snacks",null,"Buy (2) get .75 voucher"]
["Store",null,null,null,null,null,null,null,"on your next shopping trip"]
["Store",null,null,null,null,null,"Expires: 3/18/12 "]
["Store","****",null,null,null,null,"Chex Mix or Chex 100 Calorie Snack 4.5 oz or more",null,"Buy (3) get $1 voucher"]
["Store",null,null,null,null,null,null,null,"Buy (4) get $2 voucher"]
["Store",null,null,null,null,null,"Expires: 3/18/12 ",null,"Buy (5)+ get $3 voucher"]
["Store",null,null,null,null,null,null,null,"on your next shopping trip"]
["Store","****",null,null,null,null,"Coffee-Mate Creamer, 32 oz",null,"Buy (2) get $1.25 voucher"]
["Store",null,null,null,null,null,null,null,"on your next shopping trip"]
["Store",null,null,null,null,null,"Expires: 3/4/12"]
["Store","****",null,null,null,null,"Cottonelle 12 pack Toilet Paper",null,"Buy (2) get $2 voucher"]
["Store",null,null,null,null,null,null,null,"Buy (3) get $3 voucher"]
["Store",null,null,null,null,null,"Expires: 3/4/12 ",null,"on your next shopping trip"]
["Store","****",null,null,null,null,"Dole Fruit Bowls, Gels, Parfaits, or Crisps",null,"Buy (3) get .50 voucher"]
["Store",null,null,null,null,null,null,null,"Buy (4) get .75 voucher"]
["Store",null,null,null,null,null,"Expires: 3/18/12 ",null,"Buy (5)+ get $1 voucher"]
["Store",null,null,null,null,null,null,null,"on your next shopping trip"]
["Store","****",null,null,null,null,"Dole Mandarin Oranges",null,"Buy (4)+ get .75 voucher"]
["Store",null,null,null,null,null,null,null,"on your next shopping trip"]
["Store",null,null,null,null,null,"Expires: 3/18/12"]
["Store","****",null,null,null,null,"Dole Pineapple, 20 oz cans",null,"Buy (4)+ get .75 voucher"]
["Store",null,null,null,null,null,null,null,"on your next shopping trip"]
["Store",null,null,null,null,null,"Expires: 3/18/12"]
["Store","****",null,null,null,null,"Dole Pineapple, 8 oz cans",null,"Buy (4)+ get .50 voucher"]
["Store",null,null,null,null,null,null,null,"on your next shopping trip"]
["Store",null,null,null,null,null,"Expires: 3/18/12"]
["Store","****",null,null,null,null,"Dole Real Fruit Bites (Pineapple, Mango or Apple)",null,"Buy (2)+ get $1 voucher"]
["Store",null,null,null,null,null,null,null,"on your next shopping trip"]
["Store",null,null,null,null,null,"Expires: 3/18/12"]
["Store","****",null,null,null,null,"Dole Tropical Fruit Cans",null,"Buy (4)+ get $1 voucher"]
["Store",null,null,null,null,null,null,null,"on your next shopping trip"]
["Store",null,null,null,null,null,"Expires: 3/18/12 "]
["Store","****",null,null,null,null,"Fiber One Chewy Bars, Fiber One 90 Calorie Chewy Bars, or Fiber One 90 Calorie Brownies",null,"Buy (3) get $1 voucher"]
["Store",null,null,null,null,null,null,null,"Buy (4) get $2 voucher"]
["Store",null,null,null,null,null,"Expires: 3/14/12",null,"Buy (5)+ get $3 voucher"]
["Store",null,null,null,null,null,null,null,"on your next shopping trip"]
["Store","****",null,null,null,null,"Gortons Products 6.3 – 24.5 oz",null,"Buy ($10) get $2 voucher"]
["Store",null,null,null,null,null,"Van De Kamp 18 – 24.6 oz",null,"Buy ($15) get $3 voucher"]
[{"$f":"IF(G209=\"How to use this list\",G211,A208)","v":"Store"},null,null,null,null,null,"MorningStar Farms Products 8 – 9.5oz",null,"Buy ($20) get $5 voucher"]
["Store",null,null,null,null,null,"Stouffers Macaroni and Cheese 40 oz",null,"on your next shopping trip"]
["Store",null,null,null,null,null,"Ore-Ida Products 19 – 32 oz"]
["Store",null,null,null,null,null,"Birds Eye Vegetables 10 – 16 oz"]
["Store"]
["Store",null,null,null,null,null,"Expires: 3/10/12"]
["Store","****",null,null,null,null,"Listerine Pocketpaks, 72 ct or more",null,"Buy (2) get $2 voucher"]
["Store",null,null,null,null,null,null,null,"Buy (3) get $4.00 voucher"]
["Store",null,null,null,null,null,"Expires: 3/18/12 ",null,"Buy (4)+ get $4 voucher"]
["Store",null,null,null,null,null,null,null,"on your next shopping trip"]
["Store","****",null,null,null,null,"Nature Valley Granola Bars (6 ct or more), Nature Valley Granola Nut Clusters or Nature Valley Granola Thins",null,"Buy (3) get $1 voucher"]
["Store",null,null,null,null,null,null,null,"Buy (4) get $2.00 voucher"]
["Store",null,null,null,null,null,"Expires: 3/18/12 ",null,"Buy (5)+ get $3 voucher"]
["Store",null,null,null,null,null,null,null,"on your next shopping trip"]
["Store","****",null,null,null,null,"Post Pebbles Cereal or Treats, 6 oz or more",null,"Buy (3) get $2 voucher"]
["Store",null,null,null,null,null,null,null,"Buy (4) get $3.00 voucher"]
["Store",null,null,null,null,null,"Expires: 3/25/12",null,"Buy (5)+ get $4 voucher"]
["Store",null,null,null,null,null,null,null,"on your next shopping trip"]
["Store","****",null,null,null,null,"Rembrandt Kits, Paste, or Rinse",null,"Buy ($7) get $2 voucher"]
["Store",null,null,null,null,null,null,null,"Buy ($15) get $4 voucher"]
["Store",null,null,null,null,null,"Expires: 3/18/12",null,"Buy ($25)+ get $8 voucher"]
["Store",null,null,null,null,null,null,null,"on your next shopping trip"]
["Store","****",null,null,null,null,"Right Guard Total Defense 5 Products",null,"Buy (2) get $1 voucher"]
["Store",null,null,null,null,null,null,null,"Buy (3) get $2 voucher"]
["Store",null,null,null,null,null,"Expires: 3/18/12 ",null,"Buy (4)+ get $4 voucher"]
["Store",null,null,null,null,null,null,null,"on your next shopping trip"]
["Store","****",null,null,null,null,"Swanson Canned Chicken",null,"Buy (2) get $1 voucher"]
["Store",null,null,null,null,null,null,null,"Buy (3)+ get $1.50 voucher"]
["Store",null,null,null,null,null,"Expires: 3/18/12 ",null,"on your next shopping trip"]
["Store","****",null,null,null,null,"Tasters Choice Coffee or Nescafe Clasico Coffee",null,"Buy (2) get $1 voucher"]
["Store",null,null,null,null,null,null,null,"Buy (3) get $2.00 voucher"]
["Store",null,null,null,null,null,"Expires: 3/18/12 ",null,"Buy (4)+ get $3 voucher"]
["Store",null,null,null,null,null,null,null,"on your next shopping trip"]
["Store","****",null,null,null,null,"Viactiv Soft Chews",null,"Buy (1) get $3 voucher"]
["Store",null,null,null,null,null,null,null,"on your next shopping trip"]
["Store",null,null,null,null,null,"Expires: 3/18/12"]
["Store","****",null,null,null,null,"Yoplait Trix Yogurt Multipacks",null,"Buy (2)+ get $1 voucher"]
["Store",null,null,null,null,null,null,null,"on your next shopping trip"]
["Store",null,null,null,null,null,"Expires: 3/14/12 "]
["Store"]
["Store","*****",null,null,null,null,"Todays date: ","Sale","We are not affiliated with this store.  The store's ad is the only OFFICIAL authority"]
["Store","toggle 4 and 5 star rows",null,null,null,null,null,"Price"]
["Walgreens","Stock up scale",null,null,null,null,"How to use this list",null,"Printable coupons:","Bottom line"]
["Walgreens",null,null,null,null,null,null,null,"Group A  Group B  Group C  Singles"]
["Walgreens",null,null,null,null,null,"Walgreens"]
["Walgreens",null,null,null,null,null,null,null,"Coupon Index"]
["Walgreens",null,null,null,null,null,"Current list"]
["Walgreens",null,null,null,null,null,"-This list is valid during the dates listed below"]
["Walgreens","*****",null,null,null,null,"Valid Dates: 4/8 - 4/14",null,"This list is made by Aimee. She answers list questions in this thread at PYP."]
["Walgreens","*****",null,null,null,null,"Questions on Walgreens coupon policy and how the Register Rewards work?",null,"See the Walgreens Coupon Policy on their website This Link"]
["Walgreens",null,null,null,null,null,"See FAQ's Here"]
["Walgreens","*****",null,null,null,null,"Walgreens Pharmacy - Transfer a prescription and receive a ****** $25 Walgreens Card - Expires 4-30-12",null,"With in-ad store coupon"]
["Walgreens","***",null,null,null,null,"Oscar Mayer Ready to Serve Bacon 15 slices","2 for 5.00",null,2.5]
["Walgreens",null,null,null,null,null,"Limit 4"]
["Walgreens",null,null,null,null,null,"First item will ring up $2.59, second item will ring up $2.41"]
["Walgreens","***",null,null,null,null,"Dasani Water 16.9 oz 24 pk",3.99,null,3.99]
["Walgreens",null,null,null,null,null,"Limit 3"]
["Walgreens","***",null,null,null,null,"Dunkin Donuts Coffee 12 oz",7.49,"Dunkin Donuts Coffee, any 11 oz. or larger bag $1/1 (06-30-12) RP-4/1",6.49]
["Walgreens",null,null,null,null,null,"Limit 2"]
["Walgreens","***",null,null,null,null,"Folgers Coffee 33.9 oz, Special Roast or Gourmet Supreme 27.8 oz or Decaf 22.6 oz",8.99,"Folgers Coffee Products, any $1/2 (04-30-12) RP-3/25",8.49]
["Walgreens","***",null,null,null,null,"Folgers Instant Coffee 8 oz Classic Roast or Decaf",4.99,null,4.99]
["Walgreens",null,null,null,null,null,"Limit 2"]
["Walgreens","***",null,null,null,null,"Lipton Green Tea 12 pk 16.9 oz",4.99,"With in-ad store coupon",4.99]
["Walgreens",null,null,null,null,null,"Limit 3"]
[{"$f":"IF(G273=\"How to use this list\",G275,A272)","v":"Walgreens"},"***",null,null,null,null,"Pepsi 12 pk products","3 for 12.00",null,4]
["Walgreens",null,null,null,null,null,"Limit 3"]
["Walgreens",null,null,null,null,null,"First and second items will ring up $4.49, third item will ring up $3.02"]
["Walgreens","****",null,null,null,null,"Pepsi 2 liter products","4 for 5.00",null,1.25]
["Walgreens",null,null,null,null,null,"First, second and third items will ring up $1.49, fourth item will ring up $0.53"]
["Walgreens","*****",null,null,null,null,"Pepsi Next 12 pk",2.99,"STORE COUPON, Walgreens, Pepsi Next 12 pk (You can also find this coupon in the Savings Book in-store) (4-28-12) $1/1 (active) This Link-04/03",1.99]
["Walgreens","***",null,null,null,null,"Vitamin or Smart Water 20 or 23.7 oz",1,"With in-ad store coupon",1]
["Walgreens",null,null,null,null,null,"Limit 3"]
["Walgreens","***",null,null,null,null,"Hellmanns Mayonnaise 22 or 30 oz",3.49,"With in-ad store coupon",3.49]
["Walgreens",null,null,null,null,null,"Limit 3"]
["Walgreens","****",null,null,null,null,"Hersheys Candy Bar Singles 1.4 to 2.5 oz",0.59,null,0.59]
["Walgreens","****",null,null,null,null,"Kelloggs Pop-Tarts 8 pk","3 for 5.00","Kelloggs Pop-Tarts or Pop-Tarts Mini Crisps, any 6 ct or larger $1/3 (active) Group A-04/03 Print it twice",1.34]
["Walgreens",null,null,null,null,null,"First and second items will ring up $1.99, third item will ring up $1.02"]
["Walgreens","****",null,null,null,null,"Kelloggs Pop-Tarts 8 pk","3 for 5.00","Kelloggs Pop-Tarts Toaster Pastries, any flavor 8 ct. or larger $1/3 (04-15-12) RP-3/4",1.34]
["Walgreens",null,null,null,null,null,"First and second items will ring up $1.99, third item will ring up $1.02"]
["Walgreens","****",null,null,null,null,"Nice or Walgreens Candy 1.75 to 9.5 oz",0.69,"With in-ad store coupon",0.69]
["Walgreens",null,null,null,null,null,"Limit 3"]
["Walgreens","***",null,null,null,null,"Progresso Soup 18.5 or 19 oz","4 for 5.00","Progresso Soups, any flavor cans $1/4 (04-21-12) SS-2/26",1]
["Walgreens",null,null,null,null,null,"Must buy 4 to receive discount"]
["Walgreens","***",null,null,null,null,"Ragu Pasta Sauce 16 to 24 oz",2,"With in-ad store coupon",2]
["Walgreens",null,null,null,null,null,"Limit 4"]
["Walgreens","***",null,null,null,null,"Walgreens Sweetener 100 packets",0.99,null,0.99]
["Walgreens","****",null,null,null,null,"Wrigleys Orbit Gum 14 piece",0.69,"With in-ad store coupon",0.69]
["Walgreens",null,null,null,null,null,"Limit 6"]
["Walgreens","***",null,null,null,null,"DiGiorno Pizza 12 in","2 for 11.00",null,5.5]
["Walgreens",null,null,null,null,null,"Limit 4"]
["Walgreens",null,null,null,null,null,"First item will ring up $5.99, second item will ring up $5.01"]
["Walgreens","***",null,null,null,null,"Aleve Pain Relief 100 ct Caplets or Tablets",7.99,"Aleve Product, any 80 ct or larger (excludes Aleve-D) $2/1 (active) Group A-04/03 Print it twice",5.99]
["Walgreens","***",null,null,null,null,"Aleve Pain Relief 100 ct Caplets or Tablets",7.99,"Aleve product, any 20ct. or larger excluding Aleve-D products $1/1 (06-30-12) SS-3/18",6.99]
["Walgreens","***",null,null,null,null,"Banana Boat Sun or After-Sun Care",6.99,null,65.989999999999995]
["Walgreens","***",null,null,null,null,"Eucerin Lotion or Skin Care","2 for 11.69","Eucerin Product, any 13.5 oz or larger $2/1 (active) Group A-02/09 Print it twice",3.85]
["Walgreens"]
["Walgreens",null,null,null,null,null,"Ad says B1 G1 50% off"]
["Walgreens",null,null,null,null,null,"Our price check- 13.5 oz - Reg $7.79"]
["Walgreens","***",null,null,null,null,"Hawaiian Tropic Sun or After-Sun Care",6.99,"Hawaiian Tropic Sun Care Product, any 4 oz or larger excluding lip balm $1/1 (active) This Link-08/21",5.99]
["Walgreens","***",null,null,null,null,"John Frieda Precision Foam Hair Colour",11.99,"Extra Promo: John Frieda Shampoo or Conditioner 8.45 oz ****** with purchase (6.49 value)","9.99 +"]
["Walgreens"]
["Walgreens",null,null,null,null,null,null,null,"John Frieda Precision foam Colour Product, any $2/1 (04-28-12) SS-3/4"]
["Walgreens","***",null,null,null,null,"LOreal Preference Hair Color",7.99,"With in-ad store coupon",5.99]
["Walgreens",null,null,null,null,null,"Limit 3"]
["Walgreens",null,null,null,null,null,null,null,"Also use manufacturer coupon: LOreal Preference, any shade $2/1 (05-13-12) RP-3/18"]
["Walgreens"]
["Walgreens",null,null,null,null,null,null,null,"Walgreens allows you to use a manufacturers coupon AND Store coupon on the same purchase"]
["Walgreens","***",null,null,null,null,"Refresh or Refresh Optive Eye Care 2 pk .5 oz ea or 50 pk .01 oz ea",10.99,null,10.99]
["Walgreens","***",null,null,null,null,"Sensodyne Toothpaste 4 oz",4.99,"STORE COUPON, Walgreens, Sensodyne Toothpaste 4 oz (You can also find this coupon in the Savings Book in-store) (4-28-12) $1/1 (active) This Link-04/03",3.99]
["Walgreens","***",null,null,null,null,"Splat Hair Color Kits",6.99,"With in-ad store coupon",6.99]
["Walgreens",null,null,null,null,null,"Limit 3"]
["Walgreens","****",null,null,null,null,"Ajax Dish Liquid 16 oz",0.89,"With in-ad store coupon",0.89]
["Walgreens",null,null,null,null,null,"Limit 3"]
["Walgreens","***",null,null,null,null,"Hefty One Zip Bags - ******zer 13 pk or Storage 17 or 22 pk",3.49,"Hefty One Zip Bags Buy 1 Get 1 ****** in-ad store coupon",1.75]
["Walgreens",null,null,null,null,null,"Limit 4"]
["Walgreens","****",null,null,null,null,"Kleenex Facial Tissue 24, 70 or 100 sheets",0.99,"Kleenex Facial Tissue, any Packs or Boxes .30/3 (04-22-12) SS-3/11",0.89]
["Walgreens","***",null,null,null,null,"Pampers Cruisers Super Pack Diapers",24.99,"http://print.coupons.com/alink.asp?go=12812dl8910",22.99]
["Walgreens","***",null,null,null,null,"Pampers Cruisers Super Pack Diapers",24.99,"Pampers Diapers or Pants $1/2 Bags or (1) Box, excludes trial/travel size (04-30-12) PG-4/1",23.99]
["Walgreens","***",null,null,null,null,"Pampers Wipes 192 or 216 pk",24.99,"Pampers Wipes 60 ct or larger, excludes trial/travel size .50/1 (04-30-12) PG-4/1",24.49]
["Walgreens","***",null,null,null,null,"Pampers Wipes 192 or 216 pk",5.99,"http://print.coupons.com/alink.asp?go=12812dl8910",5.24]
["Walgreens","***",null,null,null,null,"Walgreens Baby Wipes 64 to 78 pk",1.99,null,1.99]
["Walgreens","***",null,null,null,null,"Walgreens Premium Diapers, Sleep Pants or Training Pants Jumbo Pack",5.99,null,5.99]
["Walgreens"]
["Walgreens","*****",null,null,null,null,"The following group of items are Buy 1 Get 1 50% off - MIX AND MATCH"]
["Walgreens","***",null,null,null,null,"Revlon Colorstay Pressed Powder","2 for 14.99","Revlon Face product, any $2/1 (05-06-12) SS-4/1",5.5]
["Walgreens"]
["Walgreens",null,null,null,null,null,"Our price check - Reg $9.99"]
["Walgreens","*****",null,null,null,null,"Revlon Emery Boards 10 ct","2 for 2.24","Revlon Beauty Tool $1/1 (04-30-12) SS-4/1",0.12]
[{"$f":"IF(G337=\"How to use this list\",G339,A336)","v":"Walgreens"}]
["Walgreens",null,null,null,null,null,"Our price check - Reg $1.49"]
["Walgreens","***",null,null,null,null,"Revlon Luxurious Color Diamond Lust Eye Shadow","2 for 7.49","Revlon Color Cosmetic, any $1/1 (05-06-12) SS-4/1 AND (04-15-12) SS-3/11",2.75]
["Walgreens"]
["Walgreens",null,null,null,null,null,"Our price check - Reg $4.99"]
["Walgreens"]
["Walgreens","***",null,null,null,null,"The following group of items are Buy 1 Get 1 50% off - MIX AND MATCH"]
["Walgreens","***",null,null,null,null,"Aussie Shampoo or Conditioner 8 to 13.5 oz","2 for 6.74",null,3.37]
["Walgreens"]
["Walgreens",null,null,null,null,null,"Our price check - Reg $4.49"]
["Walgreens","***",null,null,null,null,"Herbal Essences Shampoo or Conditioner or Herbal Essences or Aussie Stylers 8 to 13.5 oz","2 for 5.99","Herbal Essences or Aussie products, excludes trial/travel size $1/2 (04-30-12) PG-4/1",2.5]
["Walgreens"]
["Walgreens",null,null,null,null,null,"Our price check - Reg $3.99"]
["Walgreens"]
["Walgreens","*****",null,null,null,null,"The following group of items are Buy 1 Get 1 50% off - MIX AND MATCH"]
["Walgreens","***",null,null,null,null,"Clairol Gray Solution Hair Color","2 for 17.24","Clairol Hair Color, excludes trial/travel size $1/1 (04-30-12) PG-4/1",7.62]
["Walgreens"]
["Walgreens",null,null,null,null,null,"Our price check - Reg $11.49"]
["Walgreens","****",null,null,null,null,"Clairol Nice n Easy Hair Color","2 for 10.19","Clairol Hair Color, excludes trial/travel size Citrucal product, any $2/1 (04-30-12) SS-3/18",3.1]
["Walgreens"]
["Walgreens",null,null,null,null,null,"Our price check - Reg $6.79"]
["Walgreens"]
["Walgreens","*****",null,null,null,null,"The following group of items are Buy 1 Get 1 50% off - MIX AND MATCH"]
["Walgreens","***",null,null,null,null,"Sally Hansen Diamond Strength Polish","2 for 7.49",null,3.75]
["Walgreens"]
["Walgreens",null,null,null,null,null,"Our price check - Reg $4.99"]
["Walgreens","****",null,null,null,null,"Sally Hansen Moisturetwists 2-in-1 Primer Color Lipcolor","2 for 7.49","Sally Hansen Lip Product, any $2/1 (active) Group A-03/06 Print it twice",1.75]
["Walgreens"]
["Walgreens",null,null,null,null,null,"Our price check - Reg $4.99"]
["Walgreens"]
["Walgreens","***",null,null,null,null,"The following group of items are Buy 1 Get 1 50% off - MIX AND MATCH"]
["Walgreens","***",null,null,null,null,"Always Radiant Maxi Pads 12 or 16 pk","2 for 8.24","Always Infinity, 12 ct. or higher including Always Radiant Infinity $1/1 (04-30-12) PG-4/1",3.12]
["Walgreens"]
["Walgreens",null,null,null,null,null,"Our price check - Reg $5.49"]
["Walgreens","***",null,null,null,null,"Tampax Radiant Tampons 16 pk","2 for 8.24","Tampax Pearl, Tampax Pearl Compak, or Tampax Radiant 16 ct. or higher $1/1 (04-30-12) PG-4/1",3.12]
["Walgreens"]
["Walgreens",null,null,null,null,null,"Our price check - Reg $5.49"]
["Walgreens"]
["Walgreens","***",null,null,null,null,"The following group of items are Buy 1 Get 1 50% off - MIX AND MATCH"]
["Walgreens","***",null,null,null,null,"Bausch and Lomb Ocuvite Eye Care 50 to 240 ct","2 for 25.49","Bausch and Lomb Ocuvite Product, any $5/1 (04-30-12) SS-2/12",7.75]
["Walgreens"]
["Walgreens",null,null,null,null,null,"Our price check - Reg $16.99"]
["Walgreens","***",null,null,null,null,"Bausch and Lomb PreserVision Eye Care 60 ct","2 for 29.99",null,15]
["Walgreens"]
["Walgreens",null,null,null,null,null,"Our price check - Reg $19.99"]
["Walgreens","***",null,null,null,null,"Schiff MegaRed 60 ct","2 for 35.99",null,18]
["Walgreens"]
["Walgreens",null,null,null,null,null,"Our price check - Reg $23.99"]
["Walgreens","***",null,null,null,null,"Schiff Move ****** 80 to 120 ct","2 for 44.99","Schiff Move ****** Product, any $5/1 (04-30-12) JohnsonsSS-1/8",17.5]
["Walgreens"]
["Walgreens",null,null,null,null,null,"Our price check - Reg $29.99"]
["Walgreens"]
["Walgreens","*****",null,null,null,null,"The following group of items are Buy 1 Get 1 ****** - MIX AND MATCH",null,"Walgreens allows you to use 1 coupon on EACH item on a B1 G1 ****** sale"]
["Walgreens","*****",null,null,null,null,"Summers Eve Cleansing Cloths 16 pk or Douche 2 to 4 pk","2 for 2.99","Summers Eve Products, any $2/2 (active) This Link-04/06",0.5]
["Walgreens"]
["Walgreens",null,null,null,null,null,"Our price check - Reg $2.99"]
["Walgreens"]
["Walgreens","*****",null,null,null,null,"The following group of items are Buy 1 Get 1 ****** - MIX AND MATCH",null,"Walgreens allows you to use 1 coupon on EACH item on a B1 G1 ****** sale"]
["Walgreens","****",null,null,null,null,"Nature Made B-1 100 mg 100 ct","2 for 5.99","Nature Made Vitamin B, any $1/1 (active) This Link-03/18",2]
["Walgreens"]
["Walgreens",null,null,null,null,null,"Our price check - Reg $5.99"]
["Walgreens","****",null,null,null,null,"Nature Made D3 400 IU 100 ct","2 for 4.99","Nature Made Vitamin D, any $1/1 (active) This Link-03/18",1.5]
["Walgreens"]
["Walgreens",null,null,null,null,null,"Our price check - Reg $4.99"]
[{"$f":"IF(G401=\"How to use this list\",G403,A400)","v":"Walgreens"},"****",null,null,null,null,"Nature Made Potassium Gluconate 550 mg 100 ct","2 for 4.99","Nature Made Product, any $1/1 (active) This Link-09/05",1.5]
["Walgreens"]
["Walgreens",null,null,null,null,null,"Our price check - Reg $4.99"]
["Walgreens"]
["Walgreens","***",null,null,null,null,"The following group of items are Buy 1 Get 1 ****** - MIX AND MATCH",null,"Walgreens allows you to use 1 coupon on EACH item on a B1 G1 ****** sale"]
["Walgreens","***",null,null,null,null,"Riesen Candy 2.75 to 5.5 oz","2 for 2.49",null,1.25]
["Walgreens","***",null,null,null,null,"Toffifay Candy 2.75 to 5.5 oz","2 for 2.49",null,1.25]
["Walgreens","***",null,null,null,null,"Werthers Candy 2.75 to 5.5 oz","2 for 2.49",null,1.25]
["Walgreens"]
["Walgreens","***",null,null,null,null,"The following group of items must be purchased in groups of 2 to receive discount."]
["Walgreens",null,null,null,null,null,"Limit 4"]
["Walgreens",null,null,null,null,null,"First item will ring up $2.99, second item will ring up $1.01"]
["Walgreens","***",null,null,null,null,"Godiva Chocolate Bar 3.5 oz","2 for 4.00",null,2]
["Walgreens","***",null,null,null,null,"Lindt Chocolate Bar 3.5 oz","2 for 4.00",null,2]
["Walgreens","***",null,null,null,null,"Werthers Chocolate Bar 3.5 oz","2 for 4.00",null,2]
["Walgreens"]
["Walgreens","***",null,null,null,null,"The following group of items have a COMBINED LIMIT OF 4 TOTAL, MIX OR MATCH"]
["Walgreens","***",null,null,null,null,"Hersheys Miniatures or Kisses Candy 19.75 oz",3.99,"Hersheys Kisses, Reeses, Hersheys Miniatures, Hersheys Eggs Cadbury or Whoppers bags candy, any 8 oz. or larger $2/3 (EXPIRES 04-08-12) SS-3/25",3.32]
["Walgreens","***",null,null,null,null,"M and Ms Candy 19.2 oz",3.99,null,3.99]
["Walgreens"]
["Walgreens","***",null,null,null,null,"The following group of items have a COMBINED LIMIT OF 4 TOTAL, MIX OR MATCH",null,"With in-ad store coupon"]
["Walgreens","***",null,null,null,null,"Degree Antiperspirant/Deodorant 2.6 to 3 oz",1.99,null,1.99]
["Walgreens","***",null,null,null,null,"Dove Antiperspirant/Deodorant 2.6 to 3 oz",1.99,null,1.99]
["Walgreens"]
["Walgreens","***",null,null,null,null,"The following group of items have a COMBINED LIMIT OF 3 TOTAL, MIX OR MATCH"]
["Walgreens","***",null,null,null,null,"Breyers Ice Cream 48 oz",2.99,null,2.99]
["Walgreens","***",null,null,null,null,"Magnum Ice Cream Bars 3 pk",2.99,null,2.99]
["Walgreens","***",null,null,null,null,"Reeses Ice Cream Cups 6 pk",2.99,null,2.99]
["Walgreens"]
["Walgreens","*****",null,null,null,null,"REGISTER REWARDS:"]
["Walgreens",null,null,null,null,null,"The following items will earn you a voucher good on your next shopping purchase."]
["Walgreens","***",null,null,null,null,"All Laundry Detergent 84 or 96 loads",11.99,"Receive a $1.00 voucher with purchase",9.99]
["Walgreens",null,null,null,null,null,"Limit 1 voucher"]
["Walgreens",null,null,null,null,null,null,null,"Manufacturers coupon- All Mighty Pacs or All Liquid Laundry Detergent, any 24 loads or larger $1/1 (active) Group C-04/01 Print it twice"]
["Walgreens","***",null,null,null,null,"All Laundry Detergent 84 or 96 loads",11.99,"Receive a $1.00 voucher with purchase",9.99]
["Walgreens",null,null,null,null,null,"Limit 1 voucher"]
["Walgreens",null,null,null,null,null,null,null,"Manufacturers coupon- All Mighty Pacs or All Liquid Laundry Detergent, any 24 loads or larger $1/1 (04-15-12) RP-3/4 AND (06-02-12) RP-4/1"]
["Walgreens","****",null,null,null,null,"Reach Total Care Toothbrush",2.99,"Receive a $2.00 voucher with purchase",0.99]
["Walgreens",null,null,null,null,null,"Limit 1 voucher"]
["Walgreens","***",null,null,null,null,"Similac Infant Formula 22.5 to 23.2 oz",24.99,"Receive a $2.00 voucher with purchase",22.99]
["Walgreens",null,null,null,null,null,"Limit 1 voucher"]
["Walgreens"]
["Walgreens","*****",null,null,null,null,"Buy 4 of these products and receive a $3.00 voucher good on your next shopping purchase.",null,"Sale is essentially a $0.75 off discount on each item. Sale price indicated is BEFORE/AFTER voucher is calculated."]
["Walgreens",null,null,null,null,null,"Limit 1 voucher"]
["Walgreens",null,null,null,null,null,"First, second and third items will ring up $2.99, fourth item will ring up $1.03"]
["Walgreens","****",null,null,null,null,"Cheez-It Crackers 9 oz","2.50/1.75","Sunshine Cheez-It Baked Snack Crackers, any .70/1 (active) This Link-03/23",1.05]
["Walgreens","****",null,null,null,null,"Keebler Club Crackers 11.5 to 16 oz","2.50/1.75","Keebler Club Crackers, any .70/1 (active) Group A-04/01 Print it twice",1.05]
["Walgreens","***",null,null,null,null,"Kelloggs Nutri-Grain Bars 8 pk","2.50/1.75",null,1.75]
["Walgreens","***",null,null,null,null,"Kelloggs Rice Krispies Treats 8 pk","2.50/1.75",null,1.75]
["Walgreens","****",null,null,null,null,"Kelloggs Special K Bars 5 or 6 pk","2.50/1.75","Kelloggs Special K Bars or FiberPlus Chewy Bars, any 5 ct or larger $1/2 (active) Group A-04/03 Print it twice",1.25]
["Walgreens","****",null,null,null,null,"Kelloggs Special K Cracker Crisps 4 oz","2.50/1.75","Kelloggs Special K Cracker Chips, any 4 oz or larger .70/1 (active) Group A-04/03 Print it twice",1.05]
["Walgreens"]
["Walgreens","*****",null,null,null,null,"Buy 1 of these products and receive a $1.50 voucher good on your next shopping purchase.",null,"Sale is essentially a $1.50 off discount on each item. Sale price indicated is BEFORE/AFTER voucher is calculated."]
["Walgreens",null,null,null,null,null,"Limit 1 voucher "]
["Walgreens","****",null,null,null,null,"Finish Tabs or Gelpacs 20 pk","3.99/2.49","Finish Powerball Tabs or Gelpacs, any .75/1 (04-15-12) SS-3/11",1.74]
["Walgreens","***",null,null,null,null,"Jet-Dry Rinse 8.45 oz","3.99/2.49","Finish Jet-Dry Rinse Agent or Drying Agent, any .50/1 (05-06-12) SS-3/11",1.99]
["Walgreens"]
["Walgreens","*****",null,null,null,null,"Buy 2 of these products and receive a $1.00 voucher good on your next shopping purchase.",null,"Sale is essentially a $0.50 off discount on each item. Sale price indicated is BEFORE/AFTER voucher is calculated."]
["Walgreens",null,null,null,null,null,"Limit 1 voucher"]
["Walgreens",null,null,null,null,null,"First item will ring up $3.19, second item will ring up $2.81"]
["Walgreens","***",null,null,null,null,"Glade Carpet and Room Deodorizer 32 oz","3.00/2.50",null,2.5]
["Walgreens","***",null,null,null,null,"Glade Decor Scents Refills 2 pk","3.00/2.50",null,2.5]
["Walgreens","****",null,null,null,null,"Glade Decor Scents Warmer","3.00/2.50","Glade Decor Scents holder, any $1/1 or (2) refill packs (05-05-12) SS-3/25",1.5]
["Walgreens","***",null,null,null,null,"Glade Relaxing Moments Spray 9.7 oz","3.00/2.50","Glade Premium Room Spray, any 9.7 oz. .55/1 (05-05-12) SS-3/25",1.95]
[{"$f":"IF(G465=\"How to use this list\",G467,A464)","v":"Walgreens"}]
["Walgreens","***",null,null,null,null,"Buy 1 of these products and receive a $3.00 voucher good on your next shopping purchase.",null,"Sale is essentially a $3.00 off discount on each item. Sale price indicated is BEFORE/AFTER voucher is calculated."]
["Walgreens",null,null,null,null,null,"Limit 1 voucher "]
["Walgreens","***",null,null,null,null,"Schick Intuition Razor System or 3 or 4 pk Cartridges","8.99/5.99",null,5.99]
["Walgreens","***",null,null,null,null,"Schick Quattro Razor System or 3 or 4 pk Cartridges","8.99/5.99",null,5.99]
["Walgreens"]
["Walgreens","*****",null,null,null,null,"Buy $10 of these products and receive a $2 voucher good on your next shopping purchase.",null,"Sale is essentially a 20% off discount on each item. Sale price indicated is BEFORE/AFTER voucher is calculated. Use the 'before' price to reach $10."]
["Walgreens","***",null,null,null,null,"Nice Bath Tissue 12 rolls","2 for 10.00/4.00",null,4]
["Walgreens",null,null,null,null,null,"First item will ring up $5.49, second item will ring up $4.51"]
["Walgreens","***",null,null,null,null,"Nice Honey 32 oz","5.00/4.00",null,4]
["Walgreens","***",null,null,null,null,"Nice Paper Towels 6 rolls","2 for 10.00/4.00",null,4]
["Walgreens",null,null,null,null,null,"First item will ring up $5.49, second item will ring up $4.51"]
["Walgreens","***",null,null,null,null,"Nice Peanut Butter 18 oz","2 for 5.00/2.00",null,2]
["Walgreens",null,null,null,null,null,"First item will ring up $2.99, second item will ring up $2.01"]
["Walgreens","****",null,null,null,null,"Nice Tableware - Plastic Cups 16 pk, Designer Bowls 24 pk or Designer Plates 24 to 48 pk","2 for 3.00/1.20",null,1.2]
["Walgreens",null,null,null,null,null,"First item will ring up $1.79, second item will ring up $1.21"]
["Walgreens","***",null,null,null,null,"Nice Trash Bags 18 to 80 pk, 13 to 55 gal","5.00/4.00",null,4]
["Walgreens"]
["Walgreens","*****",null,null,null,null,"Monthly Register Reward Deals",null,"Valid thru 4/28"]
["Walgreens","****",null,null,null,null,"Gillette Venus with Olay Razor",8.99,"Receive a $4.00 voucher with purchase",2.99]
["Walgreens",null,null,null,null,null,"Limit 1 voucher"]
["Walgreens",null,null,null,null,null,null,null,"Manufacturers coupon- Gillette Venus Razor, Refill or Disposable, excludes trial/travel size $2/1 (04-30-12) PG-4/1"]
["Walgreens","*****",null,null,null,null,"Luster Toothpaste 2.6 or 8 oz",4.99,"Receive a $4.00 voucher with purchase",0.24]
["Walgreens",null,null,null,null,null,"Limit 1 voucher"]
["Walgreens",null,null,null,null,null,"Note - $4.99 sale price this week only, $5.99 after that",null,"Manufacturers coupon- Luster White7 Toothpaste, any .75/1 (04-30-12) SS-3/18"]
["Walgreens"]
["Walgreens","*****",null,null,null,null,"Got a list question? Want to check if next week's list is ready? Our listmakers answer questions and post our \"preview\" lists at PYP."]
["Walgreens"]
["Walgreens","*****",null,null,null,null,"Todays date: ","Sale","We are not affiliated with this store.  The store's ad is the only OFFICIAL authority"]
["Walgreens","toggle 4 and 5 star rows",null,null,null,null,null,"Price"]
["Rite Aid","Stock up scale",null,null,null,null,"How to use this list",null,"Printable coupons:","Bottom line"]
["Rite Aid",null,null,null,null,null,null,null,"Group A  Group B  Group C  Singles"]
["Rite Aid",null,null,null,null,null,"Rite Aid"]
["Rite Aid",null,null,null,null,null,"Current list",null,"Coupon Index"]
["Rite Aid",null,null,null,null,null,"-This list is valid during the dates listed below"]
["Rite Aid","*****",null,null,null,null,"Valid Dates: 4/8 - 4/14",null,"Rite Aid coupon policy-"]
["Rite Aid",null,null,null,null,null,null,null,"Rite Aid will accept a Manufacturers coupon from a Rite Aid source (The Ad or online Video Values) -IN ADDITION TO- a Manufacturers coupon from another source -this means YOU CAN USE 2 MANUFACTURERS COUPONS for the same purchase!"]
["Rite Aid",null,null,null,null,null,"This list is made by Jen. See the Rite Aid thread in this section at PYP for questions and more Rite-Aid info. ALL RITE AID DEALS REQUIRE THAT YOU HAVE A RITE AID LOYALTY CARD"]
["Rite Aid",null,null,null,null,null,null,null,"If an Item is listed as B1 G1 ****** in the RITE AID Ad, only the PAID item can have a coupon applied to it. This is a recent change."]
["Rite Aid",null,null,null,null,null,"Rite Aid limits the purchase of any particular item to 4 per household. Ask your store manager if you wish further clarification, stores may vary."]
["Rite Aid","***",null,null,null,null,"Altoids 0.37-0.76 oz",0.99,null,0.99]
["Rite Aid","***",null,null,null,null,"Dove Miniatures 8.5-9.5 oz",2.99,null,2.99]
["Rite Aid","***",null,null,null,null,"Hersheys Bliss 8.6-9.6 oz",2.99,"STORE COUPON, Rite Aid, Hersheys Bliss Chocolates, any bags (You can only print ONE of these, Rite Aid will let you use this IN ADDITION to another manufacturers coupon for the same purchase!) Print by 4/28 (expires 5/12) $1/2 (active) This Link-04/03",2.4900000000000002]
["Rite Aid","***",null,null,null,null,"Hersheys Miniatures, Nuggets, Drops, Pieces or Minis 8-12 oz",2.99,null,2.99]
["Rite Aid","****",null,null,null,null,"Kelloggs Frosted Mini-Wheats16-20 oz",2.37,"Kelloggs Frosted Mini-Wheats Cereal, any $1/2 (active) This Link-03/18",1.87]
["Rite Aid","****",null,null,null,null,"Kelloggs Raisin Bran 16-20 oz",2.37,"Kellogs Raisin Bran or Smart Start Cereal, any 14.7 oz or larger $1/2 (active) Group A-04/03 Print it twice",1.87]
["Rite Aid","***",null,null,null,null,"Kelloggs Nutri-Grain Bars 8 ct",2.37,null,2.37]
["Rite Aid","****",null,null,null,null,"Kelloggs Pop Tarts 8 ct",1.99,"Kelloggs Pop-Tarts or Pop-Tarts Mini Crisps, any 6 ct or larger $1/3 (active) Group A-04/03 Print it twice",1.67]
["Rite Aid","****",null,null,null,null,"Kelloggs Rice Krispies, Frosted Flakes, Froot Loops, Apple Jacks, Corn Pops, or Raisin Bran 8.7-16.5 oz",1.99,"Kelloggs Cereal, any 8.7 oz or larger $1/3 (active) Group A-04/03 Print it twice",1.67]
["Rite Aid","***",null,null,null,null,"Kelloggs Rice Krispy Treats 8 ct",1.99,null,1.99]
["Rite Aid","***",null,null,null,null,"M and Ms 9.9-12.6 oz",2.99,null,2.99]
["Rite Aid","****",null,null,null,null,"Mentos UP2U Gum 14-15 ct",0.99,"Mentos UP2U Gum, any packs $1/2 (05-25-12) SS-3/25",0.5]
["Rite Aid","***",null,null,null,null,"Orbit Mist Gum 14-15 ct",0.99,null,0.99]
["Rite Aid","***",null,null,null,null,"Reeses Pieces 15 oz",2.99,null,2.99]
["Rite Aid","***",null,null,null,null,"Stride Shift, Spark, or Shawn White Gum 14-15 ct",0.99,null,0.99]
["Rite Aid","***",null,null,null,null,"Tic Tacs 1 oz",0.99,null,0.99]
["Rite Aid","***",null,null,null,null,"Trident Xtra Care or Layers Gum 14-15 ct",0.99,null,0.99]
["Rite Aid","***",null,null,null,null,"Wrigleys 5 Gum 14-15 ct",0.99,null,0.99]
["Rite Aid","****",null,null,null,null,"Allegra Allergy Relief 15 ct Tablets",11.99,"Allegra, any excluding Allegra-D and Childrens Allegra $7/1 EXPIRES (04-08-12) SS-4/1",4.99]
["Rite Aid","***",null,null,null,null,"Allegra Allergy Relief 15 ct Tablets",11.99,"Allegra Allergy 30 ct or higher, Allegra-D 24 hr 10 ct or higher or Allegra-D 12 hr 20 ct or higher $4/1 (active) Group B-03/18 Print it twice",7.99]
["Rite Aid","***",null,null,null,null,"Allegra -D Allergy 10 ct",11.99,"Allegra Allergy 5, 12 or 15 ct, Childrens Allegra, Allegra-D 24 hr 5 ct or Allegra-D 12 hr 10 ct $2/1 (active) Group B-03/18 Print it twice",9.99]
["Rite Aid","***",null,null,null,null,"Always Maxi Pads 20-48 Ct",5.99,"Always Pads, Clean or Feminine Cleansing Cloths, excludes trial/travel size .50/1 (04-30-12) PG-4/1",5.49]
["Rite Aid","***",null,null,null,null,"Always Panti-liners 68-80 ct",5.99,"Always Pantiliners, 30 ct. or higher .50/1 (04-30-12) PG-4/1",5.49]
["Rite Aid","****",null,null,null,null,"Children's Advil Liquid 0.5oz or Tablets 24ct",4.99,"Advil Childrens Product, any $2/1 (active) Group C-04/01 Print it twice",2.99]
[{"$f":"IF(G529=\"How to use this list\",G531,A528)","v":"Rite Aid"},"***",null,null,null,null,"CoverGirl Blast Eye or Blast Lip",7.99,"CoverGirl product, excludes trial/travel size $1/1 (04-30-12) PG-4/1",6.99]
["Rite Aid","****",null,null,null,null,"Dimetapp Liquid 4 oz",4.99,"Dimetapp Childrens Product, any $2/1 (active) This Link-03/18",2.99]
["Rite Aid","***",null,null,null,null,"Downy Fabric Softener Liquid 41-51 oz or sheets 90 ct",5.97,"Tide, Downy, Bounce or Tide Stain Release, excludes Tide PODS and trial/travel size .50/1 (04-30-12) PG-4/1",5.47]
["Rite Aid","***",null,null,null,null,"Olay Complete Facial Care",9.99,null,9.99]
["Rite Aid","****",null,null,null,null,"Robitussin Liquid 4oz",4.99,"Robitussin product, any $2/1 (active) This Link-03/28",2.99]
["Rite Aid","***",null,null,null,null,"Tampax Tampons 40 ct",5.99,"Tampax, 18 ct. or higher .50/1 (04-30-12) PG-4/1",5.49]
["Rite Aid","***",null,null,null,null,"Tide Landry Detergent 50 oz 24-32 loads",5.97,"Tide, Downy, Bounce or Tide Stain Release, excludes Tide PODS and trial/travel size $1/2 (04-30-12) PG-4/1",5.47]
["Rite Aid","***",null,null,null,null,"Tide Stain Release 18 ct",5.97,"Tide, Downy, Bounce or Tide Stain Release, excludes Tide PODS and trial/travel size $2/3 (04-30-12) PG-4/1",5.3]
["Rite Aid","***",null,null,null,null,"Clorox Clean-Up 32 oz",3.99,null,3.99]
["Rite Aid","***",null,null,null,null,"Liquid Plumr 17-20 oz",3.99,null,3.99]
["Rite Aid","****",null,null,null,null,"Lysol No-Touch Kitchen System",6.99,"Lysol No-Touch Kitchen System Starter Kit, any $3/1 (05-01-12) SS-3/18",3.99]
["Rite Aid","****",null,null,null,null,"Pledge Furniture Polish or Multi-Surface Spray 9.7 oz",3.99,"Pledge Furniture Care products, any $2/1 (05-05-12) SS-3/25",1.99]
["Rite Aid","***",null,null,null,null,"Scrubbing Bubbles Mega Foamer 28 oz",3.99,"Scrubbing Bubbles Bathroom Cleaners, any $2/2 (06-30-12) SS-3/11",2.99]
["Rite Aid","***",null,null,null,null,"Bounty Basic Paper Towels 8 pk",6.99,"Bounty Basic Towels, 6-roll ct. or larger $1/1 (04-30-12) PG-4/1",5.99]
["Rite Aid","***",null,null,null,null,"Charmin Basic Bathroom Tissue 12 pk",6.99,"Charmin, excludes trial/travel size .25/1 (04-30-12) PG-4/1",6.74]
["Rite Aid","***",null,null,null,null,"Glad Trash Bags Drawstring 13 gal 22 ct, 30 gal 18 ct, or quick-tie 13 gal 35 ct, 30 gal 27 ct",4.49,"Glad Trash Bags, any 13 gallon $2/2 (active) Group A-03/18 Print it twice",3.49]
["Rite Aid","***",null,null,null,null,"Kleenex Family Size 240 ct, Pocket Paks 8 pk, or Cool Touch 50 ct",2.19,"Kleenex Facial Tissue, any Packs or Boxes .30/3 (04-22-12) SS-3/11",2.09]
["Rite Aid","***",null,null,null,null,"Scott Bathroom Tissue 12 ct",7.97,"Scott Bath Tissue, any $1/8 or more rolls (04-22-12) SS-3/11",6.97]
["Rite Aid","***",null,null,null,null,"Scott Mega Roll Paper Towels 8 ct",7.97,"Scott Towels, any $1/4 or more rolls (05-06-12) SS-3/25",6.97]
["Rite Aid","***",null,null,null,null,"Huggies Little Movers Big Pack Diapers",19.989999999999998,"Huggies Little Movers Slip-On Diapers, any $3/2 (active) Group A-03/11 Print it twice",17.489999999999998]
["Rite Aid","***",null,null,null,null,"Huggies Snug and Dry Big Pack Diapers",19.989999999999998,"Huggies Diapers, any $1/1 (04-14-12) SS-3/18",18.989999999999998]
["Rite Aid"]
["Rite Aid","***",null,null,null,null,"The following group of items must be purchased in groups of 4 to receive discount."]
["Rite Aid","***",null,null,null,null,"Cheez-its 4.5 oz",1.25,null,1.25]
["Rite Aid","***",null,null,null,null,"Combos Snacks 7 oz",1.25,null,1.25]
["Rite Aid","***",null,null,null,null,"Lays Stax 5.5-5.75 oz",1.25,null,1.25]
["Rite Aid","***",null,null,null,null,"Nabisco Cookies or Crackers 3.5-8 oz",1.25,null,1.25]
["Rite Aid","***",null,null,null,null,"TGI Fridays Snacks 5.5 oz",1.25,null,1.25]
["Rite Aid"]
["Rite Aid","*****",null,null,null,null,"The following group of items must be purchased in groups of 2 to receive discount."]
["Rite Aid","***",null,null,null,null,"Natural Harvest Trail Mix 4 oz",2,null,2]
["Rite Aid","***",null,null,null,null,"New York Style Bagel Crisps 6 oz",2,null,2]
["Rite Aid","***",null,null,null,null,"Old Wisconsin Beef Bites 4 oz",2,null,2]
["Rite Aid","****",null,null,null,null,"Planters Trail Mix 6 oz",2,"Planters Peanuts, any variety 4 oz. - 21.25 oz. sizes only $1.50/2 (04-30-12) SS-1/29",1.25]
["Rite Aid"]
["Rite Aid","***",null,null,null,null,"The following group of items must be purchased in groups of 2 to receive discount."]
["Rite Aid","***",null,null,null,null,"Claritin Allergy Relief 30 ct",15,"Claritin Non-Drowsy Allergy Product, any 24 ct or larger $4/1 (active) Group A-03/07 Print it twice",11]
["Rite Aid"]
["Rite Aid","*****",null,null,null,null,"The following group of items must be purchased in groups of 5 to receive discount."]
["Rite Aid","***",null,null,null,null,"Glade Aerosol 9 oz",1,null,1]
["Rite Aid","*****",null,null,null,null,"Glade Plug-Ins Scented Oil Warmer",1,"Glade PlugIns Scented Oil warmer, any $1/1 (05-05-12) SS-3/25","******"]
["Rite Aid","******"]
["Rite Aid","***",null,null,null,null,"Rite-Aid Home Erase Away Cleaning Pads",1,null,1]
["Rite Aid"]
["Rite Aid","*****",null,null,null,null,"The following group of items are BUY 1, GET 1 ******"]
["Rite Aid","***",null,null,null,null,"Sundown Fish Oil 60 ct","2 for 11.29","Sundown Naturals Vitamin or Supplement Product, any $1/1 (active) Group C-03/18 AND (active) Group A-04/03 Print it twice","5.15 ea"]
["Rite Aid"]
["Rite Aid",null,null,null,null,null,"Our price check- Reg $ 11.29"]
["Rite Aid","*****",null,null,null,null,"Sundown Vitamin D 100 ct","2 for 3.79","Sundown Naturals Vitamin or Supplement product, any $1/1 (04-17-12) RP-3/18","1.40 ea"]
["Rite Aid"]
["Rite Aid",null,null,null,null,null,"Our price check- Reg $ 3.79"]
["Rite Aid"]
["Rite Aid","*****",null,null,null,null,"The following group of items are BUY 1, GET 1 ******"]
["Rite Aid","***",null,null,null,null,"Nature Made Calcium 500mg 130ct","2 for 10.99",null,"5.50 ea"]
["Rite Aid"]
["Rite Aid",null,null,null,null,null,"Our price check- Reg $10.99"]
["Rite Aid","***",null,null,null,null,"Nature Made Multi-Complete Vitamin 60ct","2 for 11.99","Nature Made Product, any $1/1 (active) This Link-03/18","5.50 ea"]
["Rite Aid"]
["Rite Aid",null,null,null,null,null,"Our price check- Reg $11.99"]
["Rite Aid","****",null,null,null,null,"Nature Made Vitamin B-12 100ct","2 for 8.99","STORE COUPON, Rite Aid, Nature Made Vitamin B Item (You can only print ONE of these, Rite Aid will let you use this IN ADDITION to another manufacturers coupon for the same purchase!) Print by 4/28 (expires 5/12) $2/1 (active) This Link-04/03","3.00 ea"]
["Rite Aid"]
["Rite Aid",null,null,null,null,null,"Our price check- Reg $8.99",null,"Also use manufacturers coupon: Nature Made Vitamin B, any $1/1 (active) This Link-03/18"]
["Rite Aid"]
["Rite Aid","***",null,null,null,null,"The following group of items are BUY 1, GET 1 ******"]
[{"$f":"IF(G593=\"How to use this list\",G595,A592)","v":"Rite Aid"},"***",null,null,null,null,"Move-****** 20-30 ct + 30 ct","2 for 29.99","Schiff Move ****** Product, any $5/1 (04-30-12) KensSS-1/8","12.50 ea"]
["Rite Aid"]
["Rite Aid",null,null,null,null,null,"Our price check- Reg $29.99"]
["Rite Aid","***",null,null,null,null,"Schiff Glucosamine 150 ct","2 for 19.99",null,"10.00 ea"]
["Rite Aid"]
["Rite Aid",null,null,null,null,null,"Our price check- Reg $ 19.99"]
["Rite Aid","***",null,null,null,null,"Schiff Mega D-3 90 ct","2 for 19.99","Schiff Mega-D3, any $1/1 (active) Group A-03/18 Print it twice","9.50 ea"]
["Rite Aid"]
["Rite Aid",null,null,null,null,null,"Our price check- Reg $19.99"]
["Rite Aid","***",null,null,null,null,"Schiff MegaRed 50-68 ct","2 for 32.99","Schiff MegaRed Product, any $2/1 (05-31-12) SS-2/5","16.00 ea"]
["Rite Aid"]
["Rite Aid",null,null,null,null,null,"Our price check- Reg $32.99"]
["Rite Aid"]
["Rite Aid","*****",null,null,null,null,"The following group of items are BUY 1, GET 1 ****** - MIX OR MATCH"]
["Rite Aid","****",null,null,null,null,"Ajax Dish Liquid 16 oz","2 for 1.89",null,"0.95 ea"]
["Rite Aid"]
["Rite Aid",null,null,null,null,null,"Our price check- Reg $1.89"]
["Rite Aid","***",null,null,null,null,"Finish Automatic Dishwasher Detergent Powerball Tabs or Gelpacs 20 ct","2 for 6.49","Finish Powerball or Gelpacs Dishwasher detergent .50/1 (active) This Link-01/28","3.00 ea"]
["Rite Aid"]
["Rite Aid",null,null,null,null,null,"Our price check- Reg $6.49"]
["Rite Aid","***",null,null,null,null,"Finish Automatic Dishwasher Detergent Powerball Tabs or Gelpacs 20 ct","2 for 6.49","Finish Powerball Tabs or Gelpacs, any .75/1 (04-15-12) SS-3/11","2.87ea"]
["Rite Aid"]
["Rite Aid",null,null,null,null,null,"Our price check- Reg $6.49"]
["Rite Aid","****",null,null,null,null,"Finish Automatic Dishwasher Detergent Quantum Powerball 10 ct","2 for 3.99","Finish Quantum Automatic Dishwasher detergent .75/1 (active) This Link-04/02","1.62 ea"]
["Rite Aid"]
["Rite Aid",null,null,null,null,null,"Our price check- Reg $3.99"]
["Rite Aid","****",null,null,null,null,"Finish Automatic Dishwasher Detergent Quantum Powerball 10 ct","2 for 3.99","Finish Quantum Automatic Dishwasher detergent, any .75/1 (active) This Link-03/18","1.50 ea"]
["Rite Aid"]
["Rite Aid",null,null,null,null,null,"Our price check- Reg $3.99"]
["Rite Aid","****",null,null,null,null,"Finish Automatic Dishwasher Detergent Quantum Powerball 10 ct","2 for 3.99","Finish Quantum, any $1/1 (04-15-12) SS-3/11","1.50 ea"]
["Rite Aid"]
["Rite Aid",null,null,null,null,null,"Our price check- Reg $3.99"]
["Rite Aid"]
["Rite Aid","***",null,null,null,null,"The following group of items are BUY 1, GET 1 ****** - MIX OR MATCH"]
["Rite Aid","***",null,null,null,null,"Osteo-Bi-Flex 30 ct","2 for 19.99","Osteo Bi-Flex Caplets, Softgels or Powder, any $3/1 (active) Group A-04/03 Print it twice","8.50 ea"]
["Rite Aid"]
["Rite Aid",null,null,null,null,null,"Our price check- Reg $19.99"]
["Rite Aid"]
["Rite Aid","*****",null,null,null,null,"Rite Aid +UP REWARDS",null,"Sale Price listed is BEFORE/AFTER the value of the Reward."]
["Rite Aid",null,null,null,null,null,"Purchase the items shown and get a store credit toward your next shopping visit, or A Rebate Check!"]
["Rite Aid",null,null,null,null,null,null,null,"+Up Rewards are very similar to Catalina Vouchers, but they are in the form of A BAR CODE ON THE BOTTOM OF YOUR ACTUAL RECEIPTS."]
["Rite Aid",null,null,null,null,null,"BUY THE QUANTITY INDICATED, MIX OR MATCH."]
["Rite Aid"]
["Rite Aid","***",null,null,null,null,"$1 Reward, Buy 2 items",null,"Sale price listed is Before/After calculating a .50 discount (1.00 divided by 2 items = .50 each)"]
["Rite Aid"]
["Rite Aid",null,null,null,null,null,"LIMIT 2 rewards per household."]
["Rite Aid","***",null,null,null,null,"9 Lives Cat Food 4 ct 5.5 oz cans","1.50/1.00",null,1]
["Rite Aid"]
["Rite Aid","***",null,null,null,null,"$1.00 Reward, Buy 1 item",null,"Sale price listed is Before/After calculating a 1.00 discount"]
["Rite Aid"]
["Rite Aid",null,null,null,null,null,"LIMIT 2 reward per household."]
["Rite Aid","***",null,null,null,null,"GE Light Bulbs Soft White 4pk or Long Life 2pk","2.99/1.99",null,1.99]
["Rite Aid"]
["Rite Aid","*****",null,null,null,null,"$1.00 Reward, Buy 1 item",null,"Sale price listed is Before/After calculating a 1.00 discount"]
["Rite Aid"]
["Rite Aid",null,null,null,null,null,"LIMIT 2 rewards per household."]
["Rite Aid","****",null,null,null,null,"Listerine Mouthwash 1 liter","3.99/2.99","Listerine Antiseptic Mouthwash, any 1 L or larger $1/1 (active) This Link-02/10",1.99]
["Rite Aid","***",null,null,null,null,"Listerine Toothpaste 4.2 oz","3.99/2.99",null,2.99]
["Rite Aid","***",null,null,null,null,"Reach Floss 200 yds","3.99/2.99",null,2.99]
["Rite Aid","***",null,null,null,null,"Reach Toothbrushes by Design 2ct","3.99/2.99",null,2.99]
["Rite Aid"]
["Rite Aid","***",null,null,null,null,"$1.00 Reward, Buy 2 items",null,"Sale price listed is Before/After calculating a 0.50 discount (1.00 divided by 2 items = 0.50 each)"]
["Rite Aid"]
["Rite Aid",null,null,null,null,null,"LIMIT 2 rewards per household."]
[{"$f":"IF(G657=\"How to use this list\",G659,A656)","v":"Rite Aid"},"***",null,null,null,null,"Rite-Aid Cashew Halves or Mixed Nuts 8-10 oz","3.50/3.00",null,3]
["Rite Aid","***",null,null,null,null,"Rite-Aid Prune Juice 64 oz","3.50/3.00",null,3]
["Rite Aid","***",null,null,null,null,"Rite-Aid Prunes 18 oz","3.50/3.00",null,3]
["Rite Aid"]
["Rite Aid","***",null,null,null,null,"$1.00 Reward, Buy 2 items",null,"Sale price listed is Before/After calculating a 1.00 discount (1.00 divided by 2 items = .50 each)"]
["Rite Aid"]
["Rite Aid",null,null,null,null,null,"LIMIT 3 rewards per household."]
["Rite Aid","***",null,null,null,null,"Crisco Vegetable Oil 32oz","3.00/2.50",null,2.5]
["Rite Aid","***",null,null,null,null,"Hungry Jack Syrup 27.6oz","3.00/2.50",null,2.5]
["Rite Aid","***",null,null,null,null,"Jif Peanut Butter 18oz","3.00/2.50",null,2.5]
["Rite Aid","***",null,null,null,null,"Smuckers Strawberry Squeeze Jam 20oz","3.00/2.50",null,2.5]
["Rite Aid"]
["Rite Aid","*****",null,null,null,null,"$2.00 Reward, Buy 1 item",null,"Sale price listed is Before/After calculating a 2.00 discount"]
["Rite Aid"]
["Rite Aid",null,null,null,null,null,"LIMIT 2 rewards per household."]
["Rite Aid","****",null,null,null,null,"Marc Anthony Shampoo, Conditioner or Stylers","3.99/1.99",null,1.99]
["Rite Aid"]
["Rite Aid","*****",null,null,null,null,"$2.00 Reward, Buy 1 item",null,"Sale price listed is Before/After calculating a 2.00 discount"]
["Rite Aid"]
["Rite Aid",null,null,null,null,null,"LIMIT 4 rewards per household."]
["Rite Aid","*****",null,null,null,null,"Bic Twin Select Silky Touch Disposable Razor 10ct","2.99/0.99","Bic Disposable Razor, any excluding trial size $2/1 (04-15-12) SS-3/18","******"]
["Rite Aid","******"]
["Rite Aid","****",null,null,null,null,"Eos Shave Cream 7oz","2.99/0.99",null,0.99]
["Rite Aid"]
["Rite Aid","***",null,null,null,null,"$2.00 Reward, Buy 1 item",null,"Sale price listed is Before/After calculating a 2.00 discount"]
["Rite Aid"]
["Rite Aid",null,null,null,null,null,"LIMIT 2 rewards per household."]
["Rite Aid","***",null,null,null,null,"Luvs Family Pack Diapers","16.99/14.99",null,14.99]
["Rite Aid"]
["Rite Aid","***",null,null,null,null,"$2.00 Reward, Buy 2 items",null,"Sale price listed is Before/After calculating a 1.00 discount (2.00 divided by 2 items = 1.00 each)"]
["Rite Aid"]
["Rite Aid",null,null,null,null,null,"LIMIT 2 rewards per household."]
["Rite Aid","***",null,null,null,null,"Lays Potato Chips 10-10.5 oz","3.00/2.00",null,2]
["Rite Aid","***",null,null,null,null,"Tostitos 9-11 oz","3.00/2.00",null,2]
["Rite Aid","***",null,null,null,null,"Tostitos Queso Dip 15 oz","3.00/2.00",null,2]
["Rite Aid"]
["Rite Aid","*****",null,null,null,null,"$2.00 Reward, Buy 1 item",null,"Sale price listed is Before/After calculating a 2.00 discount"]
["Rite Aid"]
["Rite Aid",null,null,null,null,null,"LIMIT 3 rewards per household."]
["Rite Aid","****",null,null,null,null,"Always Panti-liners 64 Ct","3.99/1.99","Always Pantiliners, 30 ct. or higher .50/1 (04-30-12) PG-4/1",1.49]
["Rite Aid","*****",null,null,null,null,"Always Radiant Infinity Maxi pads 12-16 ct","3.99/1.99","Always Infinity, 12 ct. or higher including Always Radiant Infinity $1/1 (04-30-12) PG-4/1",0.99]
["Rite Aid","*****",null,null,null,null,"Tampax Radiant Tampons 16 ct","3.99/1.99","Tampax Pearl, Tampax Pearl Compak, or Tampax Radiant 16 ct. or higher $1/1 (04-30-12) PG-4/1",0.99]
["Rite Aid"]
["Rite Aid","***",null,null,null,null,"$2.00 Reward, Buy 1 items",null,"Sale price listed is Before/After calculating a 2.00 discount"]
["Rite Aid"]
["Rite Aid",null,null,null,null,null,"LIMIT 1 rewards per household."]
["Rite Aid","***",null,null,null,null,"Duracell Coppertop Batteries AAA or AA 8 pk, C or D 4 pk, or 9V 2 ok","6.99/4.99","Duracell CopperTop, Ultra Power, Ultra Photo Lithium or Specialty Batteries, excludes trial/travel size .75/1 (04-30-12) PG-4/1",4.24]
["Rite Aid"]
["Rite Aid","***",null,null,null,null,"$2.00 Reward, Buy 2 items",null,"Sale price listed is Before/After calculating a 1.00 discount (2.00 divided by 2 items = 1.00 each)"]
["Rite Aid"]
["Rite Aid",null,null,null,null,null,"LIMIT 4 rewards per household."]
["Rite Aid","***",null,null,null,null,"Tugaboos Jumbo Pack Diapers","7.50/6.50","Also Qualifies for Single Check Rebate $3 When You Buy 2.",5]
["Rite Aid"]
["Rite Aid",null,null,null,null,null,null,null,"SINGLE CHECK REBATES may be redeemed at Rite aid.com"]
["Rite Aid"]
["Rite Aid","*****",null,null,null,null,"$2.00 Reward, Buy 4 items",null,"Sale price listed is Before/After calculating a 0.50 discount (2.00 divided by 4 items = 0.50 each)"]
["Rite Aid"]
["Rite Aid",null,null,null,null,null,"LIMIT 2 rewards per household."]
["Rite Aid","****",null,null,null,null,"Pepsi and Pepsi Products 12 pk 12 oz Cans","3.00/2.50",null,2.5]
["Rite Aid"]
["Rite Aid","***",null,null,null,null,"$3.00 Reward, Buy 1 item",null,"Sale price listed is Before/After calculating a 3.00 discount"]
["Rite Aid"]
["Rite Aid",null,null,null,null,null,"LIMIT 3 rewards per household."]
["Rite Aid","***",null,null,null,null,"Prilosec OTC 28ct","18.99/15.99","Prilosec OTC product $1/1 (04-30-12) PG-4/1",14.99]
[{"$f":"IF(G721=\"How to use this list\",G723,A720)","v":"Rite Aid"}]
["Rite Aid","*****",null,null,null,null,"$3.00 Reward, Buy 2 items",null,"Sale price listed is Before/After calculating a 1.50 discount (3.00 divided by 2 items = 1.50 each)"]
["Rite Aid"]
["Rite Aid",null,null,null,null,null,"LIMIT 4 rewards per household."]
["Rite Aid","*****",null,null,null,null,"Care****** Pantiliners 36-60ct or Ultra 16ct","3.00/1.50","Care****** product, any $1/1 (04-30-12) SS-3/18",0.5]
["Rite Aid","*****",null,null,null,null,"OB Tampons 18ct","3.00/1.50","OB Product, any excluding trial size .75/1 (active) Group A-03/23 Print it twice",0.75]
["Rite Aid","*****",null,null,null,null,"Stay****** Sanitary Protection Pads 14-24ct","3.00/1.50","Stay****** products, any $2/2 (04-30-12) SS-3/18",0.5]
["Rite Aid","*****",null,null,null,null,"Stay****** Sanitary Protection Pads 14-24ct","3.00/1.50","Stay****** Product, any excluding trial sizes $1/1 (active) Group A-04/03 Print it twice",0.5]
["Rite Aid"]
["Rite Aid","*****",null,null,null,null,"$10 Reward, Buy $25 of participating items",null,"Sale price listed is Before/After calculating a 40% discount (10.00 divided by 25.00 = 40%)"]
["Rite Aid"]
["Rite Aid",null,null,null,null,null,"LIMIT 2 rewards per household.",null,"Use the 'Before' price to reach $25"]
["Rite Aid","***",null,null,null,null,"Advil Liqui-Gels 160ct","13.99/8.39","Advil, any 20 ct. or larger $1/1 (06-30-12) RP-4/1",7.39]
["Rite Aid","***",null,null,null,null,"Advil PM 120ct","13.99/8.39","AdvilPM, any 4ct. or larger $1/1 (06-09-12) RP-3/11",7.39]
["Rite Aid","***",null,null,null,null,"Advil Tablets or Caplets 200ct","13.99/8.39","Advil, any 20 ct or larger $1/1 (active) Group C-04/01 Print it twice",7.39]
["Rite Aid","***",null,null,null,null,"Kaz Heating Pad","19.99/12.00","Kaz Heating Pad $3/1 in-ad store coupon",9]
["Rite Aid"]
["Rite Aid",null,null,null,null,null,"Our price check- Reg $19.99"]
["Rite Aid","***",null,null,null,null,"Aleve Pain Relievers 100 ct","2 for 14.99/8.99","Aleve Product, any 80 ct or larger (excludes Aleve-D) $2/1 (active) Group A-04/03 Print it twice","2.50 ea"]
["Rite Aid",null,null,null,null,null,"Ad says B1 G1 50% OFF"]
["Rite Aid"]
["Rite Aid",null,null,null,null,null,"Our price check- Reg $9.99"]
["Rite Aid","***",null,null,null,null,"Bayer Pain Relievers 100 ct","2 for 14.99/8.99","Bayer Aspirin Product, any 20ct or larger $1/1 (04-30-12) SS-1/29 AND (06-30-12) SS-3/18","3.00 ea"]
["Rite Aid",null,null,null,null,null,"Ad says B1 G1 50% OFF"]
["Rite Aid"]
["Rite Aid",null,null,null,null,null,"Our price check- Reg $9.99"]
["Rite Aid","****",null,null,null,null,"Rite-Aid Childrens Acetaminophen 4 oz","3.99/2.39",null,2.39]
["Rite Aid","***",null,null,null,null,"Rite-Aid Adult Acetaminophen 100 Ct","2 for 7.99/4.79",null,"2.40 ea"]
["Rite Aid",null,null,null,null,null,"Ad says B1 G1 ******"]
["Rite Aid"]
["Rite Aid",null,null,null,null,null,"Our price check- Reg $7.99"]
["Rite Aid","***",null,null,null,null,"Rite-Aid Asprin 100 Ct","2 for 7.49/4.50",null,"2.40 ea"]
["Rite Aid",null,null,null,null,null,"Ad says B1 G1 ******"]
["Rite Aid"]
["Rite Aid",null,null,null,null,null,"Our price check- Reg $7.49"]
["Rite Aid","****",null,null,null,null,"Rite-Aid Childrens Ibuprofen 4 oz","3.99/2.39",null,2.39]
["Rite Aid","***",null,null,null,null,"Rite-Aid Ibuprofen 100 Ct","2 for 7.99/4.79",null,"2.40 ea"]
["Rite Aid",null,null,null,null,null,"Ad says B1 G1 ******"]
["Rite Aid"]
["Rite Aid",null,null,null,null,null,"Our price check- Reg $7.99"]
["Rite Aid","****",null,null,null,null,"Vicks Thermometers","11.99/7.19","Vicks Thermometer $3/1 in-ad store coupon",4.1900000000000004]
["Rite Aid"]
["Rite Aid",null,null,null,null,null,"Our price check- Reg $11.99"]
["Rite Aid","***",null,null,null,null,"Rite-Aid Naproxen Sodium 100 Ct","2 for 7.99/4.79",null,"2.40 ea"]
["Rite Aid",null,null,null,null,null,"Ad says B1 G1 ******"]
["Rite Aid"]
["Rite Aid",null,null,null,null,null,"Our price check- Reg $7.99"]
["Rite Aid","*****",null,null,null,null,"ThermaCare Heat Wraps 2-3ct","5.99/3.59","ThermaCare HeatWraps, any 2 ct or larger $3/1 (active) This Link-03/28",0.59]
["Rite Aid","****",null,null,null,null,"LOreal Feria Hair Color","9.99/5.99","LOreal Feria Hair Color $2/1 in-ad store coupon",3.99]
["Rite Aid"]
["Rite Aid","*****",null,null,null,null,"$10 Reward, Buy $25 of participating items",null,"Sale price listed is Before/After calculating a 40% discount (10.00 divided by 25.00 = 40%)"]
["Rite Aid"]
["Rite Aid",null,null,null,null,null,"LIMIT 4 rewards per household.",null,"Use the 'Before' price to reach $25"]
["Rite Aid","***",null,null,null,null,"LOreal Age Perfect and Revitalift Skin Care","11.99/7.19",null,7.19]
["Rite Aid","***",null,null,null,null,"LOreal EverCreme, EverPure, EverStrong or EverSleek Hair Care","7.99/4.79","LOreal EverCreme, EverSleek, EverPure, EverStrong Shampoo or Conditioner, any $1/1 (05-06-12) RP-3/11",3.79]
["Rite Aid"]
["Rite Aid",null,null,null,null,null,"Our price check- Shampoo or Conditioner- Reg $7.99"]
["Rite Aid","*****",null,null,null,null,"LOreal Sublime Mousse Hair Color","8.99/5.39","LOreal Sublime Mousse Hair Color $3/1 in-ad store coupon",1.39]
["Rite Aid"]
["Rite Aid",null,null,null,null,null,null,null,"Also use manufacturer coupon: LOreal Sublime Mousse haircolor, any $2/1 (05-06-12) RP-3/11"]
["Rite Aid","****",null,null,null,null,"LOreal Preference Hair color","7.99/4.79","LOreal Preference, any shade $2/1 (05-13-12) RP-3/18",2.79]
["Rite Aid"]
["Rite Aid",null,null,null,null,null,"Our price check- Reg $7.99"]
["Rite Aid","****",null,null,null,null,"LOreal Preference Hair color","7.99/4.79","LOreal Preference, any shade $2/1 (04-08-12) SS-2/12",2.79]
[{"$f":"IF(G785=\"How to use this list\",G787,A784)","v":"Rite Aid"}]
["Rite Aid",null,null,null,null,null,"Our price check- Reg $7.99"]
["Rite Aid","****",null,null,null,null,"LOreal Excellence Hair color","7.99/4.79","LOreal Excellence or Excellence to-Go shades, any $4/2 (05-20-12) RP-3/25",2.79]
["Rite Aid"]
["Rite Aid",null,null,null,null,null,"Our price check- Reg $7.99"]
["Rite Aid","****",null,null,null,null,"LOreal Excellence Hair color","7.99/4.79","LOreal Excellence or Excellence to-Go shade, any $1/1 (05-20-12) RP-3/25",3.79]
["Rite Aid"]
["Rite Aid",null,null,null,null,null,"Our price check- Reg $7.99"]
["Rite Aid","***",null,null,null,null,"LOreal True Match Foundation","7.99/4.79",null,4.79]
["Rite Aid","****",null,null,null,null,"LOreal Colour Riche Lip","5.99/3.59","LOreal Colour Riche Lipcolour or Nail Colour, any $1/1 (05-20-12) RP-3/25",2.59]
["Rite Aid","****",null,null,null,null,"LOreal Voluminous Mascara","5.99/3.59","LOreal Paris Eye product, any $1/1 (05-20-12) RP-3/25",2.59]
["Rite Aid","***",null,null,null,null,"LOreal Voluminous Mascara and Colour Riche Lip","5.99/3.59",null,3.59]
["Rite Aid"]
["Rite Aid","*****",null,null,null,null,"$10 Reward, Buy $20 of participating items",null,"Sale price listed is Before/After calculating a 50% discount (10.00 divided by 20.00 = 50%)"]
["Rite Aid"]
["Rite Aid",null,null,null,null,null,"LIMIT 1 reward per household.",null,"Use the 'Before' price to reach $20"]
["Rite Aid","****",null,null,null,null,"Colgate Sensitive Pro Relief Toothpaste 4oz","2 for 6.29/3.15","Colgate Toothpaste, any 4 oz. or larger .75/1 (04-14-12) SS-3/25","1.20 ea"]
["Rite Aid",null,null,null,null,null,"Ad says B1 G1 ******"]
["Rite Aid"]
["Rite Aid",null,null,null,null,null,"Our price check- Reg $6.29"]
["Rite Aid","****",null,null,null,null,"Colgate Power Toothbrush","2 for 7.49/3.75",null,"1.88 ea"]
["Rite Aid",null,null,null,null,null,"Ad says B1 G1 ******"]
["Rite Aid"]
["Rite Aid",null,null,null,null,null,"Our price check- Reg $7.49"]
["Rite Aid","*****",null,null,null,null,"Colgate Manual Toothbrush 2 pk","2 for 3.79/1.90","Colgate Adult or Kids Manual Toothbrush, any excluding Colgate Plus and Colgate Extra Clean .40/1 (04-14-12) SS-3/25","0.75 ea"]
["Rite Aid",null,null,null,null,null,"Ad says B1 G1 ******"]
["Rite Aid"]
["Rite Aid",null,null,null,null,null,"Our price check- Reg $3.79"]
["Rite Aid","*****",null,null,null,null,"Colgate Any Multipack Toothpaste","2 for 6.49/3.25","Colgate Toothpaste, any 4 oz. or larger .75/1 (04-14-12) SS-3/25","1.25 ea"]
["Rite Aid",null,null,null,null,null,"Ad says B1 G1 ******"]
["Rite Aid"]
["Rite Aid",null,null,null,null,null,"Our price check- Maxfresh 6 oz twin pack- Reg $6.49"]
["Rite Aid"]
["Rite Aid","*****",null,null,null,null,"Got a list question? Want to check if next week's list is ready? Our listmakers answer questions and post our \"preview\" lists at PYP."]
["Rite Aid"]
["Rite Aid","*****",null,null,null,null,"Todays date: ","Sale","We are not affiliated with this store.  The store's ad is the only OFFICIAL authority"]
["Rite Aid","toggle 4 and 5 star rows",null,null,null,null,null,"Price"]
["Fresh Market","Stock up scale",null,null,null,null,"How to use this list",null,"Printable coupons:","Bottom line"]
["Fresh Market",null,null,null,null,null,null,null,"Group A  Group B  Group C  Singles"]
["Fresh Market",null,null,null,null,null,"Fresh Market"]
["Fresh Market",null,null,null,null,null,null,null,"Coupon Index"]
["Fresh Market",null,null,null,null,null,"Current list"]
["Fresh Market",null,null,null,null,null,"-This list is valid during the dates listed below"]
["Fresh Market","*****",null,null,null,null,"Valid Dates: 4/11 through 4/17",null,"This list is made by Misti. She answers list questions in this thread at PYP."]
["Fresh Market","***",null,null,null,null,"Bell Peppers, Green",".50 ea",null,".50 ea"]
["Fresh Market","*****",null,null,null,null,"Broccoli",".69 lb",null,".69 lb"]
["Fresh Market","*****",null,null,null,null,"Cauliflower",".69 lb",null,".69 lb"]
["Fresh Market","***",null,null,null,null,"Cucumbers",".50 ea",null,".50 ea"]
["Fresh Market","***",null,null,null,null,"Dole Salad, 9 oz. Classic Romaine or 11 oz. Just Lettuce",1.49,null,1.49]
["Fresh Market","****",null,null,null,null,"Kiwi",".33 ea",null,".33 ea"]
["Fresh Market","***",null,null,null,null,"Mushrooms, 8 oz. Cello Wrapped Sliced or Whole Crimini",2.5,null,2.5]
["Fresh Market","***",null,null,null,null,"Pears, Red, Bosc or Danjou","1.29 lb",null,"1.29 lb"]
["Fresh Market","***",null,null,null,null,"Pom Wonderful Pistachios, 8 oz.",3.99,"Wonderful Pistachios, 5 oz. packages or larger $1/2 (06-30-12) SS-3/18","3.49 ea"]
["Fresh Market","***",null,null,null,null,"Squash, Zucchini or Yellow",".69 lb",null,".69 lb"]
["Fresh Market","***",null,null,null,null,"Strawberries, 2 lb.",4.99,null,4.99]
["Fresh Market","***",null,null,null,null,"Tomatoes, Cluster","1.39 lb",null,"1.39 lb"]
["Fresh Market","***",null,null,null,null,"Beef - Chuck Roast, boneless","2.99 lb",null,"2.99 lb"]
["Fresh Market","***",null,null,null,null,"Beef - Round Steaks, Full Cut boneless","3.79 lb",null,"3.79 lb"]
["Fresh Market","***",null,null,null,null,"Beef - Top Sirloin Steaks, boneless","4.99 lb",null,"4.99 lb"]
["Fresh Market","***",null,null,null,null,"Beef - Tri Tip Steaks or Roast, boneless","6.99 lb",null,"6.99 lb"]
["Fresh Market","***",null,null,null,null,"Chicken - Boneless Skinless Breast Tenders","2.49 lb",null,"2.49 lb"]
["Fresh Market","***",null,null,null,null,"Chicken - Drums or Thighs","1.19 lb",null,"1.19 lb"]
["Fresh Market","***",null,null,null,null,"Pork - Country Style Ribs, bone-in","1.99 lb",null,"1.99 lb"]
["Fresh Market","***",null,null,null,null,"Pork - Loin Chops, boneless","2.49 lb",null,"2.49 lb"]
[{"$f":"IF(G849=\"How to use this list\",G851,A848)","v":"Fresh Market"},"***",null,null,null,null,"Pork - St. Louis Style Ribs","2.99 lb",null,"2.99 lb"]
["Fresh Market","***",null,null,null,null,"Pork - Tenderloins","3.99 lb",null,"3.99 lb"]
["Fresh Market","***",null,null,null,null,"Turkey - Jennie-O 85% Lean Ground","3.49 lb",null,"3.49 lb"]
["Fresh Market","***",null,null,null,null,"Chobani Greek Yogurt, 32 oz. Plain or Vanilla",4.99,null,4.99]
["Fresh Market","*****",null,null,null,null,"ShurSaving Milk, gallon 1%, 2% or Skim",2.39,"Milk, any brand gallon White or Chocolate excluding Soy Milk .75/1 or (2) half gallons (active) Group A-12/01 Print Twice",1.64]
["Fresh Market","****",null,null,null,null,"Sunny D, 64 oz.",0.99,null,0.99]
["Fresh Market","****",null,null,null,null,"Western Family Cottage Cheese, 16 oz.",1.19,null,1.19]
["Fresh Market","***",null,null,null,null,"Western Family Jumbos Biscuits, 16 oz.",1.25,null,1.25]
["Fresh Market","***",null,null,null,null,"Western Family Orange Juice, 89 oz.",2.99,null,2.99]
["Fresh Market","***",null,null,null,null,"Western Family Yogurt, 32 oz. assorted",2,null,2]
["Fresh Market","***",null,null,null,null,"Bar S Bologna, 16 oz. Classic, thick or chicken",1.29,null,1.29]
["Fresh Market","***",null,null,null,null,"Bar S Ham or Turkey Breast, 16 oz.",3.49,null,3.49]
["Fresh Market","***",null,null,null,null,"Bar S Sliced Bacon, 16 oz. assorted",3.59,null,3.59]
["Fresh Market","***",null,null,null,null,"Farmland Sausage, 14 oz. Polska Kielbasa or Original Smoked",2.5,null,2.5]
["Fresh Market","****",null,null,null,null,"Micellis String Cheese, 12 oz.",1.99,null,1.99]
["Fresh Market","***",null,null,null,null,"Oscar Mayer Lunchables, 3.4-4.5 oz.",1.5,null,1.5]
["Fresh Market","***",null,null,null,null,"Tillamook Sliced Cheese, 12 oz.",3.99,null,3.99]
["Fresh Market","***",null,null,null,null,"Western Family Individually Wrapped Cheese Slices, 12 oz.",1.79,null,1.79]
["Fresh Market","***",null,null,null,null,"Western Family Jumbo Franks, 1 lb.",1.19,null,1.19]
["Fresh Market","****",null,null,null,null,"Arrowhead Spring Water, 24 pk. half liter bottles",2.99,null,2.99]
["Fresh Market","***",null,null,null,null,"Coke Products, 2 liter bottle",1.33,null,1.33]
["Fresh Market","***",null,null,null,null,"Coke Products, 20 pk. cans","2 for $13","Use in-ad store coupon: 2 for $11 with coupon and purchase of 2.","5.50 ea"]
["Fresh Market","*****",null,null,null,null,"Fuze, 18.5 oz. bottles",1,"Use in-ad store coupon: 10 for $5 with coupon and purchase of 10.",".50 ea"]
["Fresh Market","***",null,null,null,null,"Langers Juice Cocktails, 64 oz. Cranberry or Pomegranate",2.5,null,2.5]
["Fresh Market","***",null,null,null,null,"Lipton Naturals, 20 oz. bottles",1,null,1]
["Fresh Market","****",null,null,null,null,"Pepsi Next, 12 pk. cans",2.99,null,2.99]
["Fresh Market","****",null,null,null,null,"Pepsi Next, 2 liter bottle",0.99,null,0.99]
["Fresh Market","***",null,null,null,null,"Pepsi, 7-Up or A and W Products, 6 pk. 24 oz. bottles or 12 pk. cans",4.67,null,4.67]
["Fresh Market","***",null,null,null,null,"Powerade Sports Drinks, 32 oz. assorted",0.79,null,0.79]
["Fresh Market","***",null,null,null,null,"Sobe Lifewater, 20 oz. bottles",1,null,1]
["Fresh Market","***",null,null,null,null,"Ball Park Hamburger or Hot Dog Buns, 8 ct.",2,null,2]
["Fresh Market","***",null,null,null,null,"Black Forest Fruit Snacks, 25.2 oz.",4.99,null,4.99]
["Fresh Market","****",null,null,null,null,"Crystal Light On the Go Drink Mixes, 7-10 ct.",2,"Crystal Light Drink Mix products, any $1/2 (04-30-12) SS-3/18","1.50 ea"]
["Fresh Market","***",null,null,null,null,"Doritos, 10.5-11.5 oz.",2.99,null,2.99]
["Fresh Market","***",null,null,null,null,"Fritos or Cheetos, 9-10.5 oz.",2.5,null,2.5]
["Fresh Market","***",null,null,null,null,"Grandma Sycamores Bread, 24 oz. White or Wheat",2,null,2]
["Fresh Market","***",null,null,null,null,"Hatch Green Chiles, 4 oz. chopped or diced",1.25,null,1.25]
["Fresh Market","***",null,null,null,null,"Kelloggs Fruit Snacks, 8 oz.",1.67,null,1.67]
["Fresh Market","***",null,null,null,null,"Kelloggs Nutri-Grain Bars, 7.8-10.4 oz.",2.5,"Kelloggs Nutri-Grain Cereal Bars, any flavor 8 ct. or larger $1/2 (06-10-12) RP-4/15","2.00 ea"]
["Fresh Market","***",null,null,null,null,"La Choy Bi-Packs, 42-43.5 oz.",3,null,3]
["Fresh Market","***",null,null,null,null,"La Victoria Salsa, 16 oz.",2.29,null,2.29]
["Fresh Market","***",null,null,null,null,"La Victoria Taco Sauce, 15 oz. Mild or Medium",2.29,null,2.29]
["Fresh Market","*****",null,null,null,null,"Las Palmas Enchilada Sauce or Red Chile Sauce, 28 oz. can",2,"Las Palmas Product, any $1/1 (active) This Link-10/08",1]
["Fresh Market","***",null,null,null,null,"Lays Chips, 10-10.5 oz.",2.5,null,2.5]
["Fresh Market","***",null,null,null,null,"Minute Rice, 14 oz. Brown or Long Grain White",1.99,"Minute Rice Product, any .50/1 (04-30-12) PurinaRP-1/29",1.49]
["Fresh Market","***",null,null,null,null,"Nabisco Cheese Nips, 10.5-12 oz.",1.5,null,1.5]
["Fresh Market","*****",null,null,null,null,"Pompeian Olive Oil, 68 oz. Extra Virgin",14.99,"Use in-ad store coupon: $9.99 with coupon.",8.99]
["Fresh Market",null,null,null,null,null,null,null,"Also use manufacturers coupon: Pompeian Olive Oil or OlivExtra Plus, any size or variety $1/1 (active) This Link-01/01"]
["Fresh Market","***",null,null,null,null,"Post Cereal, 11-20 oz. Fruity or Cocoa Pebbles, Honeycomb or Raisin Bran",1.99,null,1.99]
["Fresh Market","***",null,null,null,null,"Taco Bell Bold and Creamy Sauce, 8 oz. Chipotle or Spicy Ranchero",1.5,null,1.5]
["Fresh Market","***",null,null,null,null,"Taco Bell Taco Shells, 12 ct.",1.25,null,1.25]
["Fresh Market","***",null,null,null,null,"Tostitos Tortilla Chips, 9-13 oz.",2.99,null,2.99]
["Fresh Market","****",null,null,null,null,"Western Family Bread, 24 oz. Buttermilk White Roundtop, Cracked Wheat or Golden Split top",1.25,null,1.25]
["Fresh Market","***",null,null,null,null,"Western Family Chow Mein or Rice Noodles, 6 oz. bag",1,null,1]
["Fresh Market","****",null,null,null,null,"Western Family Mexican Style Tomato Sauce, 8 oz.",0.33,null,0.33]
["Fresh Market","***",null,null,null,null,"Wonder Classic Bread, 20 oz.",2,null,2]
["Fresh Market","***",null,null,null,null,"Lean Cuisine Frozen Entrees, 5.25-11.5 oz. assorted","6 for $15","Use in-ad store coupon: Get (1) Skinny Cow 4-12 ct. Cones, Bars or Sandwiches and (1) Nestle 6 pk. Fruit Flavored Water ****** when you buy (6) Lean Cuisine Frozen Entrees.","2.50 ea"]
["Fresh Market","***",null,null,null,null,"Ore-Ida Potatoes, 19-32 oz. Onion Rings, Steam n Mash, Tator Tots, Fries or Hashbrowns",2.99,null,2.99]
["Fresh Market","***",null,null,null,null,"Pace Juice or Fruit Bars, 6-12 ct.",3,null,3]
["Fresh Market","***",null,null,null,null,"PictSweet Vegetables, 8-12 oz. Deluxe or Seasoned",1.5,null,1.5]
["Fresh Market","***",null,null,null,null,"Purely Asian Entrees, 22-24 oz. assorted",5,"Purely Asian Entree, any $1.50/1 (05-31-12) SS-3/4",3.5]
["Fresh Market","***",null,null,null,null,"Rhodes Warm N Serve Rolls, 6-9 ct. pan",2,"Rhodes Bread or Rolls, any .55/1 (05-20-12) RP-3/25",1.45]
["Fresh Market","***",null,null,null,null,"Stouffers Frozen Meals, 6-12.7 oz.",2.69,null,2.69]
["Fresh Market","***",null,null,null,null,"Tillamook Ice Cream, 1.75 qt.",3.5,null,3.5]
[{"$f":"IF(G913=\"How to use this list\",G915,A912)","v":"Fresh Market"},"***",null,null,null,null,"Tombstone Pizza, 12 inch",3.99,null,3.99]
["Fresh Market","***",null,null,null,null,"Western Family Burritos, 5 oz.",0.33,null,0.33]
["Fresh Market","***",null,null,null,null,"Western Family Chicken, 26 oz. Dino Nuggets or Popcorn",4.99,null,4.99]
["Fresh Market","***",null,null,null,null,"Western Family Ice Cream or Sherbet, 5 quart",6.99,null,6.99]
["Fresh Market","***",null,null,null,null,"Western Family Pizza Bites, 20 oz. Pepperoni or Combination",2.99,null,2.99]
["Fresh Market","****",null,null,null,null,"Aim Toothpaste, 4.8-6 oz. assorted",1,null,1]
["Fresh Market","***",null,null,null,null,"Allegra Allergy Relief, 15 ct. 24 Hour",11.99,"Allegra Allergy 5, 12 or 15 ct, Childrens Allegra, Allegra-D 24 hr 5 ct or Allegra-D 12 hr 10 ct $2/1 (active) Group B-03/18 Print Twice",9.99]
["Fresh Market","****",null,null,null,null,"Barbasol or Pure Silk Shaving Cream, 9.5-11 oz. assorted",1,null,1]
["Fresh Market","***",null,null,null,null,"Coppertone Sun Screen Spray, 2 pk. 6 oz.",12.88,"Coppertone Sun Care, any excluding lip balm and trial sizes $1/1 (active) This Link-02/04",11.88]
["Fresh Market","***",null,null,null,null,"Finish Powerball Tabs, 32 ct.",5.99,"Finish Powerball Tabs or Gelpacs, any .75/1 (04-15-12) SS-3/11",5.24]
["Fresh Market","***",null,null,null,null,"Finish Powerball Tabs, 32 ct.",5.99,"Finish Powerball or Gelpacs Dishwasher detergent .50/1 (active) This Link-04/02",5.49]
["Fresh Market","***",null,null,null,null,"Glad ******zer or Storage Bags, 30-50 ct. Gallon or Quart",2.99,"Glad Food Storage Products, any $1/2 (active) This Link-08/21","2.49 ea"]
["Fresh Market","***",null,null,null,null,"Huggies Diapers, 15-50 ct.",9.99,"Huggies Diapers, any $1/1 (EXPIRES 04-14-12) SS-3/18",8.99]
["Fresh Market","***",null,null,null,null,"Huggies Pull-Ups, 15-50 ct.",9.99,"Pull-Ups Training Pants, any Jumbo Pack or larger $2/1 (EXPIRES 04-14-12) SS-3/18",7.99]
["Fresh Market","***",null,null,null,null,"Kleenex Facial Tissue, 50-164 ct.",1.5,"Kleenex Facial Tissue, any Packs or Boxes .30/3 (04-22-12) SS-3/11","1.40 ea"]
["Fresh Market","***",null,null,null,null,"Suave Shampoo or Conditioner, 15 oz.",0.88,null,0.88]
["Fresh Market","***",null,null,null,null,"U by Kotex Feminine Hygiene Products, 18 ct. Tampons, 14-60 ct. Maxis or Liners",4,"U by Kotex products, any $1/1 (05-05-12) SS-3/25",3]
["Fresh Market","***",null,null,null,null,"Western Family Feminine Products, 14-24 ct. Pads or 46-64 ct. Liners",1.99,null,1.99]
["Fresh Market","***",null,null,null,null,"Western Family Hair Gel, 20 oz. assorted",1,null,1]
["Fresh Market","****",null,null,null,null,"Western Family Hydrogen Peroxide, 16 oz.",0.5,null,0.5]
["Fresh Market","***",null,null,null,null,"Western Family Isopropyl Alcohol, 16 oz.",1,null,1]
["Fresh Market","***",null,null,null,null,"Western Family Laundry Detergent, 30 lb. Regular or With Bleach",6.99,null,6.99]
["Fresh Market","****",null,null,null,null,"Western Family Mouth Rinse, 1 liter bottle",1,null,1]
["Fresh Market","****",null,null,null,null,"Western Family Petal Soft Bath Tissue, 36 Roll Advantage Pack or 18 Big Pack",6.99,null,6.99]
["Fresh Market","****",null,null,null,null,"Western Family White Paper Towels, 15 Roll Mega Pack",6.99,null,6.99]
["Fresh Market","***",null,null,null,null,"Wisk Liquid Laundry Detergent, 100 oz.",7.99,"Wisk Laundry Detergent, any 45 oz. or larger $2/1 (05-06-12) RP-3/25",5.99]
["Fresh Market"]
["Fresh Market","***",null,null,null,null,"First Aid Coupon",8,"Use in-ad store coupon: Get all this for $8.00","8.00"]
["Fresh Market",null,null,null,null,null,null,null,"- (1) Western Family 10-60 ct. Bandages"]
["Fresh Market",null,null,null,null,null,null,null,"- (1) Western Family 1 oz. Triple Antibiotic Ointment"]
["Fresh Market",null,null,null,null,null,null,null,"- (1) 1 oz. Hydro-Cortizone Cream"]
["Fresh Market",null,null,null,null,null,null,null,"- (1) 40 ct. Alcohol or Hydrogen Peroxide Wipes"]
["Fresh Market"]
["Fresh Market","***",null,null,null,null,"Lasagna Meal Deal",9.99,"Use in-ad store coupon: Get all this for $9.99","9.99"]
["Fresh Market",null,null,null,null,null,null,null,"- (1) Western Family 96 oz. Lasagna with Meat Sauce"]
["Fresh Market",null,null,null,null,null,null,null,"- (1) Western Family 10 oz. Frozen Italian Style Garlic Bread"]
["Fresh Market",null,null,null,null,null,null,null,"- (1) Western Family 12 oz. Steam-Its Vegetables"]
["Fresh Market"]
["Fresh Market","*****",null,null,null,null,"Case Lot Sale!"]
["Fresh Market","***",null,null,null,null,"Angel Soft Bathroom Tissue, 24 roll white",5.99,null,5.99]
["Fresh Market",null,null,null,null,null,"Case of 24 - $23.96"]
["Fresh Market","***",null,null,null,null,"Banquet Frozen Dinners, 4.66-10.25 oz. Value Menu",1,null,1]
["Fresh Market",null,null,null,null,null,"Case of 12 - $12.00"]
["Fresh Market","****",null,null,null,null,"Campbells SpaghettiOs or Spaghetti, 14.75-15 oz. Original",0.79,null,0.79]
["Fresh Market",null,null,null,null,null,"Case of 24 - $18.96"]
["Fresh Market",null,null,null,null,null,"Case of 12 - $9.48"]
["Fresh Market","***",null,null,null,null,"Campbells Tomato or Chicken Noodle Soup, 10.75 oz.",0.69,"Campbells Condensed Chicken Noodle and Tomato Soups, any .40/4 (EXPIRES 04-15-12) SS-2/12",".59 ea"]
["Fresh Market",null,null,null,null,null,"Case of 48 - $33.12"]
["Fresh Market","***",null,null,null,null,"DaVinci Pasta, 16 oz. assorted",0.99,null,0.99]
["Fresh Market",null,null,null,null,null,"Case of 12 - $11.88"]
["Fresh Market",null,null,null,null,null,"Case of 20: $19.80"]
["Fresh Market","****",null,null,null,null,"Dinty Moore Beef Stew, 15 oz. can",0.99,null,0.99]
["Fresh Market",null,null,null,null,null,"Case of 12 - $11.88"]
["Fresh Market","****",null,null,null,null,"Geisha Chunk Light Tuna, 5 oz.",0.59,null,0.59]
["Fresh Market",null,null,null,null,null,"Case of 24 - $14.16"]
["Fresh Market","***",null,null,null,null,"Gold Medal Flour, 10 lb. All Purpose or Unbleached",4.99,null,4.99]
["Fresh Market",null,null,null,null,null,"Case of 4 - $19.96"]
["Fresh Market","****",null,null,null,null,"Hormel Spam Luncheon Meat, 12 oz. assorted",2,null,2]
["Fresh Market",null,null,null,null,null,"Case of 24 - $48.00"]
["Fresh Market",null,null,null,null,null,"Case of 12 - $24.00"]
["Fresh Market","***",null,null,null,null,"Hunts Pasta Sauce, 24-26.5 oz. assorted",1,null,1]
["Fresh Market",null,null,null,null,null,"Case of 12 - $12.00"]
["Fresh Market","***",null,null,null,null,"Kraft Macaroni and Cheese, 5 pk. 7.25 oz.",3.99,null,3.99]
["Fresh Market",null,null,null,null,null,"Case of 5 - $19.95"]
[{"$f":"IF(G977=\"How to use this list\",G979,A976)","v":"Fresh Market"},"****",null,null,null,null,"Langers 100% Apple Juice, 64 oz.",1.5,null,1.5]
["Fresh Market",null,null,null,null,null,"Case of 8 - $12.00"]
["Fresh Market","***",null,null,null,null,"Libbys Vienna Sausage, 5 oz. Original or Chicken",0.69,null,0.69]
["Fresh Market",null,null,null,null,null,"Case of 24 - $16.56"]
["Fresh Market",null,null,null,null,null,"Case of 48 - $33.12"]
["Fresh Market","****",null,null,null,null,"Maruchan Ramen Noodles Instant Lunch, 2.25 oz. cup",0.25,null,0.25]
["Fresh Market",null,null,null,null,null,"Case of 12 - $3.00"]
["Fresh Market","***",null,null,null,null,"Ragu Pasta Sauce, 23.9-24 oz. Traditional Garden, Meat, Onion Garlic, Mushroom, Parmesan or 7 Herb",1.25,null,1.25]
["Fresh Market",null,null,null,null,null,"Case of 12 - $15.00"]
["Fresh Market","***",null,null,null,null,"ShurSaving Chunk White Chicken, 5 oz. in water",1,null,1]
["Fresh Market",null,null,null,null,null,"Case of 12 - $12.00"]
["Fresh Market","***",null,null,null,null,"ShurSaving Granulated Sugar, 4 lb. bag",1.99,null,1.99]
["Fresh Market",null,null,null,null,null,"Case of 10 - $19.90"]
["Fresh Market","****",null,null,null,null,"ShurSaving Pears or Peaches, 29 oz. can",0.99,null,0.99]
["Fresh Market",null,null,null,null,null,"Case of 12 - $11.88"]
["Fresh Market","***",null,null,null,null,"Sparkle Paper Towels, 6 Big Rolls or 8 Roll Pick A Size",5.99,null,5.99]
["Fresh Market",null,null,null,null,null,"Case of 24 - $23.96"]
["Fresh Market","***",null,null,null,null,"Taco Bell Refried Beans, 16 oz. Regular or Fat ******",0.79,null,0.79]
["Fresh Market",null,null,null,null,null,"Case of 12 - $9.48"]
["Fresh Market","****",null,null,null,null,"Top Ramen Noodles, 3 oz. assorted",0.15,null,0.15]
["Fresh Market",null,null,null,null,null,"Case of 24 - $3.60"]
["Fresh Market","***",null,null,null,null,"Tree Top Growers Best Apple Cider, 10 oz. Organic",0.5,null,0.5]
["Fresh Market",null,null,null,null,null,"Case of 24 - $12.00"]
["Fresh Market","***",null,null,null,null,"Western Family 100% Juice, 46 oz. Tomato or Vegetable",1.67,null,1.67]
["Fresh Market",null,null,null,null,null,"Case of 12 - $20.00"]
["Fresh Market","****",null,null,null,null,"Western Family Apple Sauce, 15 oz. Original",0.59,null,0.59]
["Fresh Market",null,null,null,null,null,"Case of 24 - $14.16"]
["Fresh Market","***",null,null,null,null,"Western Family Beef Stew, 24 oz. can",2,null,2]
["Fresh Market",null,null,null,null,null,"Case of 12 - $24.00 "]
["Fresh Market","***",null,null,null,null,"Western Family Cake Mix, 18.25-18.5 oz.",1,null,1]
["Fresh Market",null,null,null,null,null,"Case of 12 - $12.00"]
["Fresh Market",null,null,null,null,null,"Case of 24 - $24.00"]
["Fresh Market","****",null,null,null,null,"Western Family Canned Fruit, 15-15.25 oz. assorted can",0.79,null,0.79]
["Fresh Market",null,null,null,null,null,"Case of 24 - $18.96"]
["Fresh Market","***",null,null,null,null,"Western Family Cereal, 28-32 oz. bag assorted",3,null,3]
["Fresh Market",null,null,null,null,null,"Case of 8 - $24.00"]
["Fresh Market","***",null,null,null,null,"Western Family Chicken Noodle or Tomato Soup, 10.5-10.75 oz.",0.5,null,0.5]
["Fresh Market",null,null,null,null,null,"Case of 24: $12.00"]
["Fresh Market","***",null,null,null,null,"Western Family Chili Con Carne, 15 oz. With Beans",1,null,1]
["Fresh Market",null,null,null,null,null,"Case of 24 - $24.00"]
["Fresh Market","****",null,null,null,null,"Western Family Chocolate Chips, 11.5-12 oz. Real Milk or Semi-Sweet",1.67,null,1.67]
["Fresh Market",null,null,null,null,null,"Case of 24 - $40.00"]
["Fresh Market","***",null,null,null,null,"Western Family Cream Soup, 10.5 oz. Chicken or Mushroom",0.59,null,0.59]
["Fresh Market",null,null,null,null,null,"Case of 24 - $14.16"]
["Fresh Market","***",null,null,null,null,"Western Family Diced or Whole Green Chiles, 4 oz.",0.5,null,0.5]
["Fresh Market",null,null,null,null,null,"Case of 24 - $12.00"]
["Fresh Market","****",null,null,null,null,"Western Family Dressing or Seasoning Mixes, .6-1.38 oz. Envelopes",0.33,null,0.33]
["Fresh Market",null,null,null,null,null,"Case of 24 - $8.00"]
["Fresh Market","***",null,null,null,null,"Western Family Evaporated Milk, 12 oz.",1,null,1]
["Fresh Market",null,null,null,null,null,"Case of 12 - $12.00"]
["Fresh Market",null,null,null,null,null,"Case of 24 - $24.00"]
["Fresh Market","***",null,null,null,null,"Western Family Frozen Orange Juice, 12 oz. assorted",1.25,null,1.25]
["Fresh Market",null,null,null,null,null,"Case of 24 - $30.00"]
["Fresh Market","***",null,null,null,null,"Western Family Fruit Snacks, 6 ct.",1,null,1]
["Fresh Market",null,null,null,null,null,"Case of 12 - $12.00"]
["Fresh Market","***",null,null,null,null,"Western Family Instant Oatmeal, 10 ct. assorted",1.67,null,1.67]
["Fresh Market",null,null,null,null,null,"Case of 12 - $20.00"]
["Fresh Market","***",null,null,null,null,"Western Family Ketchup, 24 oz. Regular or 20 oz. Upside Down Bottle",1,null,1]
["Fresh Market",null,null,null,null,null,"Case of 24 - $24.00"]
["Fresh Market",null,null,null,null,null,"Case of 16 - $16.00"]
["Fresh Market",null,null,null,null,null,"Case of 12 - $12.00"]
["Fresh Market","****",null,null,null,null,"Western Family Liquid Bleach, 96 oz. Regular Scent",1,null,1]
["Fresh Market",null,null,null,null,null,"Case of 6 - $6.00"]
["Fresh Market","***",null,null,null,null,"Western Family Macaroni and Cheese, 5.5 oz. Spiral or 7.25 oz. Original",0.39,null,0.39]
[{"$f":"IF(G1041=\"How to use this list\",G1043,A1040)","v":"Fresh Market"},null,null,null,null,null,"Case of 24 - $9.36"]
["Fresh Market","***",null,null,null,null,"Western Family Mandarin Oranges, 10.5-11 oz. can",0.59,null,0.59]
["Fresh Market",null,null,null,null,null,"Case of 24 - $14.16"]
["Fresh Market","***",null,null,null,null,"Western Family Mushrooms, 4 oz. Stems and Pieces",0.59,null,0.59]
["Fresh Market",null,null,null,null,null,"Case of 24 - $12.00"]
["Fresh Market","***",null,null,null,null,"Western Family Oatmeal, 42 oz. Quick or Old Fashioned",2,null,1.99]
["Fresh Market",null,null,null,null,null,"Case of 12 - $24.00"]
["Fresh Market","***",null,null,null,null,"Western Family Pasta, 48 oz. Elbow Macaroni, Thin or Long Spaghetti",3,null,2.99]
["Fresh Market",null,null,null,null,null,"Case of 8 - $24.00"]
["Fresh Market","***",null,null,null,null,"Western Family Pineapple, 20 oz. can",1,null,1]
["Fresh Market",null,null,null,null,null,"Case of 24 - $24.00"]
["Fresh Market",null,null,null,null,null,"Case of 16 - $16.00"]
["Fresh Market",null,null,null,null,null,"Case of 12 - $12.00"]
["Fresh Market","****",null,null,null,null,"Western Family Refried Beans, 16 oz. assorted",0.69,null,0.69]
["Fresh Market",null,null,null,null,null,"Case of 24 - $16.56"]
["Fresh Market","***",null,null,null,null,"Western Family Saltine Crackers, 16 oz. assorted",1.67,null,1.67]
["Fresh Market",null,null,null,null,null,"Case of 12 - $20.00"]
["Fresh Market","***",null,null,null,null,"Western Family Skillet Meals, 4.66-10.25 oz. assorted",1,null,0.99]
["Fresh Market",null,null,null,null,null,"Case of 12 - $12.00"]
["Fresh Market","***",null,null,null,null,"Western Family Sloppy Joe Sauce, 26.5 oz.",1.25,null,1.25]
["Fresh Market",null,null,null,null,null,"Case of 12 - $15.00"]
["Fresh Market","***",null,null,null,null,"Western Family Solid White Albacore Tuna, 5 oz.",1.25,null,1.25]
["Fresh Market",null,null,null,null,null,"Case of 24 - $30.00"]
["Fresh Market","****",null,null,null,null,"Western Family Specialty Beans, 15 oz. assorted",0.5,null,0.5]
["Fresh Market",null,null,null,null,null,"Case of 24 - $12.00"]
["Fresh Market","***",null,null,null,null,"Western Family Sweetened Condensed Milk, 14 oz.",1.67,null,1.67]
["Fresh Market",null,null,null,null,null,"Case of 24 - $40.00"]
["Fresh Market","*****",null,null,null,null,"Western Family Tomato Sauce, 8 oz. Regular or No Salt",0.33,null,0.33]
["Fresh Market",null,null,null,null,null,"Case of 48 - $16.00"]
["Fresh Market","****",null,null,null,null,"Western Family Vegetables, 11-15.25 oz. can Corn, Green Beans or Hominy",0.5,null,0.5]
["Fresh Market",null,null,null,null,null,"Case of 24 - $12.00"]
["Fresh Market","***",null,null,null,null,"Western Family Waterchestnuts, 8 oz. sliced or whole",0.5,null,0.5]
["Fresh Market",null,null,null,null,null,"Case of 24 - $12.00"]
["Fresh Market"]
["Fresh Market","***",null,null,null,null,"Food Storage Sale!"]
["Fresh Market","***",null,null,null,null,"Blue Storage Water Drum, 55 gallon",39.99,null,39.99]
["Fresh Market","***",null,null,null,null,"Hot Pockets, 12 pk. Ham and Cheese or Pepperoni Pizza",9.99,null,9.99]
["Fresh Market","***",null,null,null,null,"Krusteaz Buttermilk Pancake Mix, 10 lb. bag",6.99,null,6.99]
["Fresh Market","***",null,null,null,null,"Mrs. Butterworths Pancake Syrup, 2 pk. 64 oz.",6.99,null,6.99]
["Fresh Market","****",null,null,null,null,"Storage Pail with Lid, 5 gallon",3.99,null,3.99]
["Fresh Market","***",null,null,null,null,"Western Family Clover Honey, 80 oz.",11.99,null,11.99]
["Fresh Market","***",null,null,null,null,"Western Family Cooking Oil, 128 oz.",8.99,null,8.99]
["Fresh Market","***",null,null,null,null,"Western Family Dry Black Beans, 20 lb. bag",19.989999999999998,null,19.989999999999998]
["Fresh Market","***",null,null,null,null,"Western Family Dry Pinto Beans, 20 lb. bag",19.989999999999998,null,19.989999999999998]
["Fresh Market","****",null,null,null,null,"Western Family Flour, 25 lb. bag All Purpose Bleached or Unbleached",9.99,null,9.99]
["Fresh Market","***",null,null,null,null,"Western Family Granulated Sugar, 25 lb. bag",12.99,null,12.99]
["Fresh Market","***",null,null,null,null,"Western Family Instant Nonfat Dry Milk, makes 8 quarts",6.99,null,6.99]
["Fresh Market","***",null,null,null,null,"Western Family Long Grain Enriched Rice, 20 lb. bag",11.99,null,11.99]
["Fresh Market","***",null,null,null,null,"Western Family Medium Grain Enriched Rice, 20 lb. bag",12.99,null,12.99]
["Fresh Market"]
["Fresh Market","*****",null,null,null,null,"Got a list question? Want to check if next week's list is ready? Our listmakers answer questions and post our \"preview\" lists at PYP."]
["Fresh Market"]
["Fresh Market","*****",null,null,null,null,"Todays date: ","Sale","We are not affiliated with this store.  The store's ad is the only OFFICIAL authority"]
["Fresh Market","toggle 4 and 5 star rows",null,null,null,null,null,"Price"]
["Harmons","Stock up scale",null,null,null,null,"How to use this list",null,"Printable coupons:","Bottom line"]
["Harmons",null,null,null,null,null,null,null,"Group A  Group B  Group C  Singles"]
["Harmons",null,null,null,null,null,"Harmons"]
["Harmons",null,null,null,null,null,"Current list",null,"Coupon Index"]
["Harmons",null,null,null,null,null,"-This list is valid during the dates listed below"]
["Harmons","*****",null,null,null,null,"Valid Dates: 04/09 through 04/15",null,"This list is made by Rebecca. She answers list questions in this thread at PYP."]
["Harmons","***",null,null,null,null,"Apples, Gala, organic","1.78 lb",null,"1.78 lb"]
["Harmons","****",null,null,null,null,"Ataulfo Mangos",0.68,null,0.68]
["Harmons","***",null,null,null,null,"Avocados, large",1.5,null,1.5]
["Harmons","*****",null,null,null,null,"Broccoli",".68 lb",null,".68 lb"]
[{"$f":"IF(G1105=\"How to use this list\",G1107,A1104)","v":"Harmons"},"*****",null,null,null,null,"Cauliflower",".68 lb",null,".68 lb"]
["Harmons","***",null,null,null,null,"Dole Spinach 9 oz. Bag",1.98,null,1.98]
["Harmons","***",null,null,null,null,"Earthbound Farms Celery Hearts, organic",1.98,null,1.98]
["Harmons","***",null,null,null,null,"Earthbound Organic Salad Blends",2.98,null,2.98]
["Harmons","***",null,null,null,null,"Grapes","1.68 lb",null,"1.68 lb"]
["Harmons","***",null,null,null,null,"Grape Tomatoes, 10 oz",1.48,null,1.48]
["Harmons","***",null,null,null,null,"Kiwi, organic",0.48,null,0.48]
["Harmons","***",null,null,null,null,"Mushrooms, 8 oz",1.98,null,1.98]
["Harmons","***",null,null,null,null,"Oranges, Navel",".78 lb",null,".78 lb"]
["Harmons","****",null,null,null,null,"Zucchini",".68 lb",null,".68 lb"]
["Harmons","***",null,null,null,null,"Beef - Cross Rib Roast","3.49 lb",null,"3.49 lb"]
["Harmons","***",null,null,null,null,"Seafood - Sockeye Salmon, wild caught","9.99 lb",null,"9.99 lb"]
["Harmons","***",null,null,null,null,"Turkey Breasts Boneless, Skinless Hand Trimmed, Turkey - Boneless, Skinless, Recipe Ready","3.99 lb",null,"3.99 lb"]
["Harmons","*****",null,null,null,null,"Maid o Clover Gallon Milk",2.39,"Milk, gallon, .75/1 (active) Group A-03/26 Print Twice!",1.64]
["Harmons","****",null,null,null,null,"Cascade Fresh Yogurt Assorted Varieties 6 Ounce",0.5,null,0.5]
["Harmons","***",null,null,null,null,"Hormel Entrees Beef, Pork, Turkey or Meat Loaf, 17 Ounce",5.99,"Hormel Refrigerated Entrees, any $1/1 ( Expires 04-09-12) SS-2/12",4.99]
["Harmons","***",null,null,null,null,"Hormel Entrees Beef, Pork, Turkey or Meat Loaf, 17 Ounce",5.99,"Hormel Refrigerated Entree, any $1/1 (active) This Link-10/05",4.99]
["Harmons","***",null,null,null,null,"Kozy Shack Pudding 22 oz. Tubs or 4-6 Pack Assorted Varieties",2.5,null,2.5]
["Harmons","****",null,null,null,null,"Lloyds Barbeque Chicken, Beef, Pork or Honey Chicken 18 Ounce",3.99,"Lloyds Barbeque product, any $1/1 (Expires 04-09-12) SS-2/12",2.99]
["Harmons","***",null,null,null,null,"Dole Juice Assorted Varieties 59 Ounce",2.5,null,2.5]
["Harmons","***",null,null,null,null,"Dasani Water .5 Liter Bottles 24 Pack",3.99,null,3.99]
["Harmons","****",null,null,null,null,"Pepsi Next Soda Pop 12 Pack 12 Ounce",2.99,null,2.99]
["Harmons","***",null,null,null,null,"American Licorice Jumbo Red Vines 16 Ounce",1.5,null,1.5]
["Harmons","***",null,null,null,null,"Great Grains Bread White or Wheat Split Top, 22.5 oz.",1.5,null,1.5]
["Harmons","***",null,null,null,null,"Hersheys Chocolate Syrup Assorted Varieties 24 Ounce",2,null,2]
["Harmons","*****",null,null,null,null,"Malt-O-Meal Cereals 11 oz. Frosted Flakes or 12 oz. Frosted Mini Spooners",1,"Malt O Meal, $1/2 (active) THIS LINK",".50 ea"]
["Harmons","****",null,null,null,null,"Nabisco Cheese Nips Assorted Varieties 10-12 Ounce",1.67,"Nabisco Crackers, any 9 to 16 oz $1/2 (active) Group B-01/12 Print Twice!","1.17 ea"]
["Harmons","***",null,null,null,null,"Nutella Hazelnut Spread 13 Ounce",3,null,3]
["Harmons","****",null,null,null,null,"Pompeian Olive Oil With Canola, 48 oz. or Extra Virgin, 32 oz",4.99,"Pompeian Olive Oil or OlivExtra Plus, any size or variety $1/1 (active) This Link-01/01",3.99]
["Harmons","***",null,null,null,null,"Post Cereals Marshmallow Pebbles 10.75 oz., Waffle Crisp 11.5 oz., Golden Crisp 14.75 oz., Cocoa Pebbles 11 oz., Fruity Pebbles 11 oz., Honeycomb 12.5 oz., Alpha Bits 11.5 oz. or Raisin Bran 20 oz.",2,null,2]
["Harmons","***",null,null,null,null,"Quaker Cereals Assorted Life, Capn Crunch or Oatmeal Squares Cereal 12-14.5 Ounce",2,null,2]
["Harmons","***",null,null,null,null,"Quaker Granola Bars Assorted Varieties 6.7 Ounce",2.25,"Quaker Chewy Granola, Quaker Chewy Dipps Granola or Quaker Chewy Smashbar Bars, 6 ct. or larger boxes .75/2 (04-28-12) RP-3/18","1.88 ea"]
["Harmons","****",null,null,null,null,"Quaker Yogurt Granola Bars",2.25,"Quaker Yogurt Granola Bars, any .75/1 (04-21-12) RP-3/11",1.5]
["Harmons","***",null,null,null,null,"Simply Organic Spices, Select 0.75-2.99 oz",2.99,null,2.99]
["Harmons","***",null,null,null,null,"Wonder Classic Bread 20 Ounce",1.99,null,1.99]
["Harmons","****",null,null,null,null,"Zatarains Rice Mixes Assorted Varieties 6-8 Ounce",1,null,1]
["Harmons","***",null,null,null,null,"Bertolli Frozen Entrees Assorted Varieties 24 Ounce",5.99,null,5.99]
["Harmons","*****",null,null,null,null,"Blue Bunny Ice Cream, 56 oz",3.5,"Blue Bunny Novelty Carton, any $1/1 (active) This Link-04/06",2.5]
["Harmons","****",null,null,null,null,"Freschetta Pizza Assorted Varieties 16.44-30.63 Ounce",3.99,"Freschetta Multi-Serve Pizzas, any $1.50/2 (06-30-12) SS-3/4","3.24 ea"]
["Harmons","****",null,null,null,null,"Marie Callenders Dinners Assorted Varieties 10-21 Ounce",2,"Marie Callenders Single Serve Frozen Meals, any $1/3 (active) This Link-01/21","1.67 ea"]
["Harmons","***",null,null,null,null,"Michelinas Frozen Dinners Assorted Varieties 4-9 Ounce",1,null,1]
["Harmons","***",null,null,null,null,"Pace Fruit Bars Assorted Varieties 6 Count or 36 Ounce",2.5,null,2.5]
["Harmons","***",null,null,null,null,"Polar Treat Ice Cream, 4.5 Quart",5.99,null,5.99]
["Harmons","***",null,null,null,null,"Red Baron Pizza Assorted Varieties 16.44-30.63 Ounce",3.99,null,3.99]
["Harmons","****",null,null,null,null,"Stouffers Family Size Entrees Assorted Varieties 53-57 Ounce",7.99,"Stouffers multi-serve entree, any 28-96 oz. $2/1 (04-30-12) PurinaRP-1/29",5.99]
["Harmons","***",null,null,null,null,"Tombstone Pizza Assorted 12 inch",3.99,null,3.99]
["Harmons","***",null,null,null,null,"409 Cleaner Select Varieties 30-48 Ounce",3,null,3]
["Harmons","***",null,null,null,null,"Aquafresh Toothpaste Select Varieties 6-6.4 Ounce",1,null,1]
["Harmons","***",null,null,null,null,"Cascade Dishwasher Detergent Assorted Varieties 120 Ounce",6.99,"Cascade, excludes trial/travel size .25/1 (04-30-12) PG-4/1",6.74]
["Harmons","***",null,null,null,null,"Clorox, Select Varieties 30-48 Ounce",3,null,3]
["Harmons","***",null,null,null,null,"Joy Dish Soap Assorted Varieties 30 Ounce",2.5,null,2.5]
["Harmons","***",null,null,null,null,"Pine Sol Select Varieties 30-48 Ounce",3,"Pine-Sol Product, any - Write a review to get coupon .50/1 (active) This Link-07/26",2.5]
["Harmons","*****",null,null,null,null,"Purell Jelly Wrap Assorted Va",1,"Purrell Jelly Wrap Carriers $1/3 (active) Group A-03/26 Print Twice!",".67 ea"]
["Harmons","***",null,null,null,null,"Quilted Northern Bath Tissue 18 Double Roll Package",9.99,null,9.99]
["Harmons","***",null,null,null,null,"Simple Face Care Select Varieties 4.2-6.7 oz. or 25 ct.","20% off","Simple Skincare Product, any excluding trial and travel sizes $2/1 (04-22-12) SS-3/25","unknown"]
["Harmons"]
["Harmons","*****",null,null,null,null,"Got a list question? Want to check if next week's list is ready? Our listmakers answer questions and post our \"preview\" lists at PYP."]
["Harmons"]
["Harmons","*****",null,null,null,null,"Todays date: ","Sale","We are not affiliated with this store.  The store's ad is the only OFFICIAL authority"]
["Harmons","toggle 4 and 5 star rows",null,null,null,null,null,"Price"]
["Maceys","Stock up scale",null,null,null,null,"How to use this list",null,"Printable coupons:","Bottom line"]
["Maceys",null,null,null,null,null,null,null,"Group A  Group B  Group C  Singles"]
["Maceys",null,null,null,null,null,"Maceys"]
["Maceys",null,null,null,null,null,null,null,"Coupon Index"]
[{"$f":"IF(G1169=\"How to use this list\",G1171,A1168)","v":"Maceys"},null,null,null,null,null,"Current list"]
["Maceys",null,null,null,null,null,"-This list is valid during the dates listed below"]
["Maceys","*****",null,null,null,null,"Valid Dates: 4/11 - 4/17",null,"This list is made by Misti. She answers list questions in this thread at PYP."]
["Maceys","****",null,null,null,null,"Avocados, Small",".69 ea",null,".69 ea"]
["Maceys","***",null,null,null,null,"Bell Peppers, Green",".50 ea",null,".50 ea"]
["Maceys","***",null,null,null,null,"Carrots, 2 lb. cello bag",0.99,null,0.99]
["Maceys","***",null,null,null,null,"Celery, Extra Large",".89 ea",null,".89 ea"]
["Maceys","***",null,null,null,null,"Cucumbers",".50 ea",null,".50 ea"]
["Maceys","****",null,null,null,null,"Dole Salads, 9 oz. Classic Romaine or Just Lettuce",1.39,null,1.39]
["Maceys","***",null,null,null,null,"Green Onions, Organic bunch",".59 ea",null,".59 ea"]
["Maceys","***",null,null,null,null,"Onions, 3 lb. bag Yellow",1.49,null,1.49]
["Maceys","****",null,null,null,null,"Oranges, Large Navel",".69 lb",null,".69 lb"]
["Maceys","***",null,null,null,null,"Squash, Zucchini or Yellow",".69 lb",null,".69 lb"]
["Maceys","*****",null,null,null,null,"Tomatoes, Extra Large Roma",".59 lb",null,".59 lb"]
["Maceys","***",null,null,null,null,"Beef - Quarter Pound Patties, 5 lb. box",15.99,null,15.99]
["Maceys","***",null,null,null,null,"Beef - Short Ribs, bone-in","3.79 lb",null,"3.79 lb"]
["Maceys","***",null,null,null,null,"Beef - Sirloin Tip Oven Roast, boneless","2.99 lb",null,"2.99 lb"]
["Maceys","***",null,null,null,null,"Chicken - Gold n Plump Boneless Skinless Stir Fry, Tenders or Breasts, 14-15 oz.",4,"Gold n Plump All Natural Chicken, any $1/1 (active) This Link-08/21",3]
["Maceys","***",null,null,null,null,"Pork - Shoulder Butt Roast","1.99 lb",null,"1.99 lb"]
["Maceys","***",null,null,null,null,"Pork - St. Louis Style Ribs","3.29 lb",null,"3.29 lb"]
["Maceys","***",null,null,null,null,"Cream o Weber Sour Cream, 24 oz.",1.99,null,1.99]
["Maceys","***",null,null,null,null,"I Cant Believe Its Not Butter, 15 oz. tubs, 2 pk. 8 oz. tubs or 8 oz. sprays",2.99,"I Cant Believe Its Not Butter Product, any $1.25/1 (active) Group A-02/21 Print Twice",1.74]
["Maceys","***",null,null,null,null,"Natural Directions Almondmilk or Soy Milk, 64 oz. Original or Vanilla",2.19,null,2.19]
["Maceys","****",null,null,null,null,"Sunny D, 64 oz.",0.99,null,0.99]
["Maceys","****",null,null,null,null,"Western Family Cottage Cheese, 16 oz.",1.19,null,1.19]
["Maceys","***",null,null,null,null,"Western Family Jumbos Biscuits, 16 oz. assorted",1.25,null,1.25]
["Maceys","***",null,null,null,null,"Western Family Orange Juice, 89 oz. assorted",2.99,null,2.99]
["Maceys","***",null,null,null,null,"Western Family Yogurt, 32 oz. assorted",2,null,2]
["Maceys","***",null,null,null,null,"Bar S Bologna, 16 oz. Classic, thick or chicken",1.29,null,1.29]
["Maceys","***",null,null,null,null,"Bar S Ham or Turkey Breast, 16 oz. assorted",3.49,null,3.49]
["Maceys","***",null,null,null,null,"Bar S Sliced Bacon, 16 oz. assorted",3.59,null,3.59]
["Maceys","***",null,null,null,null,"Farmland Sausage, 14 oz. Polska Kielbasa or Original Smoked",2.5,null,2.5]
["Maceys","***",null,null,null,null,"Hormel Fully Cooked Entrees, 17 oz. assorted",5.49,null,5.49]
["Maceys","***",null,null,null,null,"Johnsonville Breakfast Sausage, 12 oz.",2.99,"Johnsonville Breakfast Sausage Links or Patties .75/1 (05-31-12) SS-2/5",2.2400000000000002]
["Maceys","****",null,null,null,null,"Micellis String Cheese, 12 oz.",1.99,null,1.99]
["Maceys","***",null,null,null,null,"Western Family Individually Wrapped Cheese Slices, 12 oz.",1.79,null,1.79]
["Maceys","***",null,null,null,null,"Western Family Jumbo Franks, 1 lb.",1.19,null,1.19]
["Maceys","***",null,null,null,null,"Arrowhead Spring Water, 24 pk. half liter bottles",3.99,null,3.99]
["Maceys","***",null,null,null,null,"Coke Products, 2 liter bottle",1.34,null,1.34]
["Maceys","***",null,null,null,null,"Coke Products, 20 pk. cans","2 for $13","Use in-ad store coupon: 2 for $11 with coupon and purchase of 2.","5.50 ea"]
["Maceys","*****",null,null,null,null,"Fuze, 18.5 oz. bottles",1,"Use in-ad vendor coupon: 10 for $5 with coupon and purchase of 10.",".50 ea"]
["Maceys","***",null,null,null,null,"Juicy Juice, 8 pk. 6.75 oz. assorted",2.99,null,2.99]
["Maceys","***",null,null,null,null,"Nestle Fruit Flavored Water, 6 pk. Raspberry Splash, Acai Grape or Wild Berry",3.49,null,3.49]
["Maceys","***",null,null,null,null,"Nestle Spring Water, 24 pk. half liter bottles",3.99,null,3.99]
["Maceys","****",null,null,null,null,"Pepsi Next, 12 pk. cans",2.99,null,2.99]
["Maceys","****",null,null,null,null,"Pepsi Next, 2 liter bottles",0.99,null,0.99]
["Maceys","***",null,null,null,null,"Pepsi, 7-Up or A and W Products, 12 pk. cans or 6 pk. 24 oz. bottles",4.33,null,4.33]
["Maceys","***",null,null,null,null,"Powerade Sports Drinks, 32 oz. assorted",0.79,null,0.79]
["Maceys","****",null,null,null,null,"Shasta Soda Pop, 24 pk. cans",3.99,null,3.99]
["Maceys","***",null,null,null,null,"Ball Park Hamburger or Hot Dog Buns, 8 ct.",2,null,2]
["Maceys","***",null,null,null,null,"Clover Club Potato Chips, 8-10 oz. assorted",2,null,2]
["Maceys","****",null,null,null,null,"Crystal Light On the Go Drink Mixes, 7-10 ct.",1.99,"Crystal Light Drink Mix products, any $1/2 (04-30-12) SS-3/18","1.49 ea"]
["Maceys","***",null,null,null,null,"Del Monte Fruit Cups, 4 pk.",2.5,null,2.5]
["Maceys","***",null,null,null,null,"Don Julio Tortilla Chips, 9 oz. assorted",0.99,null,0.99]
["Maceys","***",null,null,null,null,"Doritos, 10-11.5 oz.",2.99,null,2.99]
["Maceys","***",null,null,null,null,"Fritos or Cheetos, 9-10.5 oz.",2.5,null,2.5]
["Maceys","***",null,null,null,null,"Grandma Sycamores Bread, 24 oz. White or Wheat",2,null,2]
["Maceys","***",null,null,null,null,"Kelloggs Cereal, 11-17 oz. Froot Loops, Apple Jacks, Frosted Flakes, Chocolate or Double Chocolate Krave",3,"Look for ****** Milk offer with on package coupon","2.67 ea"]
["Maceys",null,null,null,null,null,null,null,"Kelloggs Cereal, any 8.7 oz or larger $1/3 (active) Group A-04/03 Print Twice"]
["Maceys","***",null,null,null,null,"Kelloggs Cereal, 11-17 oz. Froot Loops, Apple Jacks, Frosted Flakes, Chocolate or Double Chocolate Krave",3,"Look for ****** Milk offer with on package coupon","2.67 ea"]
["Maceys",null,null,null,null,null,null,null,"Kelloggs Cereals, any flavor 10 oz. or larger $1/3 (04-15-12) RP-3/4"]
["Maceys","***",null,null,null,null,"Kelloggs Cereal, 11-17 oz. Chocolate or Double Chocolate Krave",3,"Look for ****** Milk offer with on package coupon","2.67 ea"]
["Maceys",null,null,null,null,null,null,null,"Kelloggs Krave Cereal, any .50/1 (active) This Link-03/18"]
["Maceys","***",null,null,null,null,"Kelloggs Cereal, 11-17 oz. Chocolate or Double Chocolate Krave",3,"Look for ****** Milk offer with on package coupon","2.50 ea"]
[{"$f":"IF(G1233=\"How to use this list\",G1235,A1232)","v":"Maceys"},null,null,null,null,null,null,null,"Kelloggs Krave, Raisin Bran Cinnamon Almond, Crunchy Nut Caramel Nut and/or Frosted Mini Wheats Little Bites Cinnamon Roll Cereal, any 11 oz. or larger $1/2 (05-13-12) RP-4/1"]
["Maceys","***",null,null,null,null,"Kelloggs Cereal, 11-17 oz. Chocolate or Double Chocolate Krave",3,"Look for ****** Milk offer with on package coupon",2.2999999999999998]
["Maceys",null,null,null,null,null,null,null,"Kelloggs Krave, Raisin Bran Cinnamon Almond, Crunchy Nut Caramel Nut or Frosted Mini Wheats Little Bites Cinnamon Roll Cereal, any 11 oz. or larger .70/1 (05-13-12) RP-4/1"]
["Maceys","***",null,null,null,null,"Kelloggs Fruit Snacks, 8 oz.",1.67,null,1.67]
["Maceys","***",null,null,null,null,"Kelloggs Nutri-Grain Bar, 7.8-10.4 oz. assorted",2.5,null,2.5]
["Maceys","***",null,null,null,null,"Kraft Macaroni and Cheese, 5 pk.",3.5,null,3.5]
["Maceys","***",null,null,null,null,"Kraft Miracle Whip or Mayo, 30 oz.",2.99,"Kraft Mayo or Miracle Whip Dressing products, any .75/2 (04-22-12) SS-3/25","2.62 ea"]
["Maceys","***",null,null,null,null,"La Choy Bi-Packs, 42-43.5 oz. assorted",3,null,3]
["Maceys","***",null,null,null,null,"La Victoria Salsa, 16 oz. assorted",2.29,null,2.29]
["Maceys","***",null,null,null,null,"La Victoria Taco Sauce, 15 oz. Mild or Medium",2.29,null,2.29]
["Maceys","*****",null,null,null,null,"Las Palmas Enchilada Sauce or Red Chile Sauce, 28 oz. can",2,"Las Palmas Product, any $1/1 (active) This Link-10/08",1]
["Maceys","***",null,null,null,null,"Mothers Cookies, 14 oz. bag",2.5,null,2.5]
["Maceys","***",null,null,null,null,"Mrs. Butterworths Original Syrup, 2 pk. 64 oz.",6.99,null,6.99]
["Maceys","***",null,null,null,null,"Nabisco Cheese Nips, 10.5-12 oz.",1.5,null,1.5]
["Maceys","***",null,null,null,null,"Nestle Nesquik, 16-21.8 oz.",4.49,null,4.49]
["Maceys","*****",null,null,null,null,"Pompeian Extra Virgin Olive Oil, 68 oz.",14.99,"Use in-ad store coupon: $9.99 with coupon.",8.99]
["Maceys",null,null,null,null,null,null,null,"Also use manufacturers coupon: Pompeian Olive Oil or OlivExtra Plus, any size or variety $1/1 (active) This Link-01/01"]
["Maceys","***",null,null,null,null,"Post Honey Bunches of Oats, 48 oz. Double Pack Box Roasted Almond or Honey Roasted",5.99,null,5.99]
["Maceys","***",null,null,null,null,"Quaker Cereal, 10.5-14.5 oz. Honey Graham Ohs, Life, Oatmeal Squares, Whole Hearts or Capn Crunch",2.5,null,2.5]
["Maceys","***",null,null,null,null,"Rold Gold, 7-16 oz.",2.5,null,2.5]
["Maceys","***",null,null,null,null,"Santitas Tortilla Chips, 11 oz. assorted",1.88,null,1.88]
["Maceys","***",null,null,null,null,"Sara Lee English Muffins, 6 ct.",2.5,null,2.5]
["Maceys","***",null,null,null,null,"ShurSaving Granulated Sugar, 4 lb. bag",2,null,2]
["Maceys","***",null,null,null,null,"Simply Asia Stir-Fry Sauce, 3.98-4.43 oz. assorted",1.5,null,1.5]
["Maceys","***",null,null,null,null,"Snyders Pretzels, 9-10 oz. Rods, Snaps or Sticks",2.29,null,2.29]
["Maceys","***",null,null,null,null,"Taco Bell Bold and Creamy Sauce, 8 oz. Chipotle or Spicy Ranchero",1.5,null,1.5]
["Maceys","***",null,null,null,null,"Taco Bell Taco Shells, 12 ct.",1.25,null,1.25]
["Maceys","***",null,null,null,null,"Tostitos Tortilla Chips, 9-13 oz.",2.99,null,2.99]
["Maceys","****",null,null,null,null,"Western Family Bread, 24 oz. Buttermilk White Roundtop, Cracked Wheat or Golden Split Top",1.25,null,1.25]
["Maceys","***",null,null,null,null,"Western Family Chow Mein or Rice Noodles, 6 oz. bag",1,null,1]
["Maceys","***",null,null,null,null,"Western Family Cooking Oil, 128 oz. assorted",8.99,null,8.99]
["Maceys","****",null,null,null,null,"Western Family Mixes, .6-1.38 oz. Envelope Ranch, Onion or Italian Dressing or Seasoning Mixes",0.33,null,0.33]
["Maceys","***",null,null,null,null,"Western Family Saltine Crackers, 16 oz. assorted",1.5,null,1.5]
["Maceys","***",null,null,null,null,"Wonder Classic White Bread, 20 oz.",2,null,2]
["Maceys","***",null,null,null,null,"Banquet Frozen Dinners, 4.66-10.25 oz. Value Menu",1,null,1]
["Maceys","***",null,null,null,null,"Hot Pockets, 12 pk. Ham and cheese or Pepperoni Pizza",10.99,null,10.99]
["Maceys","***",null,null,null,null,"Lean Cuisine Frozen Entrees, 5.25-11.5 oz. assorted","6 for $15","Use in-ad store coupon: Get (1) Skinny Cow 4-12 ct. Cones, Bars or Sandwiches and (1) Nestle 6 pk. Fruit Flavored Water ****** when you buy (6) Lean Cuisine Frozen Entrees.","2.50 ea"]
["Maceys","***",null,null,null,null,"Pace Fruit or Juice Bars, 6-12 ct.",3,null,3]
["Maceys","***",null,null,null,null,"PictSweet Vegetables, 8-12 oz. Deluxe or Seasoned",1.5,null,1.5]
["Maceys","***",null,null,null,null,"Rhodes Warm N Serve Rolls, 6-9 ct. pan",2,"Rhodes Bread or Rolls, any .55/1 (05-20-12) RP-3/25",1.45]
["Maceys","***",null,null,null,null,"Stouffers Frozen Meals, 6-12.7 oz.",2.69,"Stouffers Entrees or French Bread Pizzas, any $1.10/5 (active) This Link-04/07","2.47 ea"]
["Maceys","***",null,null,null,null,"Tillamook Ice Cream, 1.75 qt.",3.99,null,3.99]
["Maceys","***",null,null,null,null,"Tombstone Pizza, 12 inch",3.99,null,3.99]
["Maceys","***",null,null,null,null,"Western Family Ice Cream or Sherbet, 56 oz. squares",2.5,null,2.5]
["Maceys","***",null,null,null,null,"Western Family Pizza Bites, 20 oz. Pepperoni or Combination",2.99,null,2.99]
["Maceys","****",null,null,null,null,"Aim Toothpaste, 4.8-6 oz. assorted",1,null,1]
["Maceys","***",null,null,null,null,"Allegra Allergy Relief, 15 ct. 24 Hour",11.99,"Allegra Allergy 5, 12 or 15 ct, Childrens Allegra, Allegra-D 24 hr 5 ct or Allegra-D 12 hr 10 ct $2/1 (active) Group B-03/18 Print Twice",9.99]
["Maceys","***",null,null,null,null,"Allegra Allergy Relief, 30 ct. Tablets",11.99,"Allegra Allergy 30 ct or higher, Allegra-D 24 hr 10 ct or higher or Allegra-D 12 hr 20 ct or higher $4/1 (active) Group B-03/18 Print Twice",7.99]
["Maceys","****",null,null,null,null,"Aquafresh Toothpaste, 6-6.4 oz. assorted",0.79,null,0.79]
["Maceys","****",null,null,null,null,"Barbasol or Pure Silk Shaving Cream, 9.5-11 oz.",1,null,1]
["Maceys","***",null,null,null,null,"Huggies Diapers, 15-50 ct.",9.99,"Huggies Diapers, any $1/1 (EXPIRES 04-14-12) SS-3/18",8.99]
["Maceys","***",null,null,null,null,"Huggies Pull-Ups, 15-50 ct.",9.99,"Pull-Ups Training Pants, any Jumbo Pack or larger $2/1 (EXPIRES 04-14-12) SS-3/18",7.99]
["Maceys","***",null,null,null,null,"Huggies Wipes, 64-72 ct.",2.4900000000000002,"Huggies Baby Wipes, any 56 ct. or larger .50/1 (04-28-12) SS-4/1",1.99]
["Maceys","****",null,null,null,null,"Ivory Soap Bars, 10 pk.",3.5,"Ivory Bar, Body Wash or Safeguard Bars, excludes trial/travel size $1/2 (04-30-12) PG-4/1","3.00 ea"]
["Maceys","***",null,null,null,null,"Johnson and Johnson Band-Aids, 10-80 ct.",2,null,2]
["Maceys","***",null,null,null,null,"Neosporin, .5 oz, 7.7 mL or 1 ct. On the Go",3.99,"Neosporin product, any excluding trial sizes $1/1 (EXPIRES 04-15-12) SS-2/26",2.99]
["Maceys","****",null,null,null,null,"Soffs Baby Wipes Refill, 80 ct.",0.69,null,0.69]
["Maceys","***",null,null,null,null,"Suave Shampoo or Conditioner, 15 oz. assorted",0.88,null,0.88]
["Maceys","***",null,null,null,null,"U by Kotex Feminine Hygiene Products, 18 ct. Tampons, 14-60 ct. Maxis or Liners",4,"U by Kotex products, any $1/1 (05-05-12) SS-3/25",3]
["Maceys","****",null,null,null,null,"Western Family AA Batteries, 24 pk.",5,null,5]
["Maceys","***",null,null,null,null,"Western Family Feminine Products, 14-24 ct. Pads or 46-64 ct. Liners",1.99,null,1.99]
["Maceys","***",null,null,null,null,"Western Family Hair Gel, 20 oz.",1,null,1]
["Maceys","****",null,null,null,null,"Western Family Hydrogen Peroxide, 16 oz.",0.5,null,0.5]
["Maceys","***",null,null,null,null,"Western Family Laundry Detergent, 30 lb. Regular or With Bleach",6.99,null,6.99]
[{"$f":"IF(G1297=\"How to use this list\",G1299,A1296)","v":"Maceys"},"***",null,null,null,null,"Western Family Mouth Rinse, 1 liter bottle",1.25,null,1.25]
["Maceys","****",null,null,null,null,"Western Family Petal Soft Bath Tissue, 36 Roll Advantage Pack or 18 Big Pack",6.49,null,6.49]
["Maceys","****",null,null,null,null,"Western Family White Paper Towels, 15 Roll Mega Pack",6.49,null,6.49]
["Maceys"]
["Maceys","*****",null,null,null,null,"Dessert Meal Deal",5,"Use in-ad store coupon: Get all this for $5.00","5.00"]
["Maceys",null,null,null,null,null,null,null,"- (1) Western Family 56 oz. Ice Cream or Sherbet"]
["Maceys",null,null,null,null,null,null,null,"- (1) Western Family 18.25-18.5 oz. Cake Mix"]
["Maceys",null,null,null,null,null,null,null,"- (1) Western Family 16 oz. Ready to Spread Frosting"]
["Maceys"]
["Maceys","***",null,null,null,null,"In-ad store coupon: .69 each when you buy 10. $1.29 each without."]
["Maceys","****",null,null,null,null,"Amp, 16 oz. cans",0.69,null,0.69]
["Maceys","****",null,null,null,null,"Lipton, 20 oz. bottle",0.69,null,0.69]
["Maceys","****",null,null,null,null,"Pepsi, 20 oz. bottle",0.69,null,0.69]
["Maceys","****",null,null,null,null,"Sobe or Sobe Lifewater, 20 oz. bottles",0.69,null,0.69]
["Maceys"]
["Maceys","*****",null,null,null,null,"Case Lot Sale!"]
["Maceys","****",null,null,null,null,"Campbells Spaghettios or Spaghetti, 14.75-15 oz. Original",0.79,null,0.79]
["Maceys",null,null,null,null,null,"Case of 24 - $18.96"]
["Maceys","*****",null,null,null,null,"Campbells Spaghettios, 26 oz. can original",0.88,null,0.88]
["Maceys",null,null,null,null,null,"Case of 12 - $10.56"]
["Maceys","***",null,null,null,null,"Campbells Tomato or Chicken Noodle Soup, 10.75 oz.",0.59,"Campbells Condensed Chicken Noodle and Tomato Soups, any .40/4 (EXPIRES 04-15-12) SS-2/12",".49 ea"]
["Maceys",null,null,null,null,null,"Case of 48 - $28.32"]
["Maceys","***",null,null,null,null,"DaVinci Pasta, 16 oz. assorted",0.99,null,0.99]
["Maceys",null,null,null,null,null,"Case of 20 - $19.80"]
["Maceys",null,null,null,null,null,"Case of 12 - $11.88"]
["Maceys","*****",null,null,null,null,"Dinty Moore Beef Stew, 24 oz.",1.25,null,1.25]
["Maceys",null,null,null,null,null,"Case of 12 - $15.00"]
["Maceys","***",null,null,null,null,"Geisha Chunk Light Tuna, 5 oz.",0.69,null,0.69]
["Maceys",null,null,null,null,null,"Case of 24 - $16.56"]
["Maceys","***",null,null,null,null,"Gold Medal Flour, 10 lb. All Purpose or Unbleached",4.99,null,4.99]
["Maceys",null,null,null,null,null,"Case of 4 - $19.96"]
["Maceys","***",null,null,null,null,"Hatch Green Chiles, 4 oz. chopped or diced",1.25,null,1.25]
["Maceys",null,null,null,null,null,"Case of 24 - $30.00"]
["Maceys","****",null,null,null,null,"Hormel Spam Luncheon Meat, 12 oz.",2,null,2]
["Maceys",null,null,null,null,null,"Case of 12 - $24.00"]
["Maceys",null,null,null,null,null,"Case of 24 - $48.00"]
["Maceys","****",null,null,null,null,"Hunts Spaghetti Sauce, 24-26.5 oz. assorted",0.88,null,0.88]
["Maceys",null,null,null,null,null,"Case of 12 - $10.56"]
["Maceys","***",null,null,null,null,"Krusteaz Buttermilk Pancake Mix, 10 lb. bag",6.99,null,6.99]
["Maceys",null,null,null,null,null,"Case of 4 - $27.96"]
["Maceys","***",null,null,null,null,"Libbys Vienna Sausage, 5 oz. Original or Chicken",0.69,null,0.69]
["Maceys",null,null,null,null,null,"Case of 24 - $16.56"]
["Maceys",null,null,null,null,null,"Case of 48 - $33.12"]
["Maceys","***",null,null,null,null,"Maruchan Ramen Noodles Instant Lunch, 2.25 oz. cup",0.33,null,0.33]
["Maceys",null,null,null,null,null,"Case of 12 - $3.96"]
["Maceys","***",null,null,null,null,"Minute Rice, 14 oz. Brown or Long Grain White",1.99,null,1.99]
["Maceys",null,null,null,null,null,"Case of 12 - $23.88"]
["Maceys","***",null,null,null,null,"Quaker Granola Bars, 6.5-7.4 oz. assorted",2.29,"Quaker Chewy Granola, Quaker Chewy Dipps Granola or Quaker Chewy Smashbar Bars, 6 ct. or larger boxes .75/2 (04-28-12) RP-3/18","1.92 ea"]
["Maceys",null,null,null,null,null,"Case of 12 - $27.48"]
["Maceys","***",null,null,null,null,"Quaker Soft Baked Bars, 6.5-7.4 oz.",2.29,null,2.29]
["Maceys",null,null,null,null,null,"Case of 12 - $27.48"]
["Maceys","***",null,null,null,null,"ShurSaving Chunk White Chicken, 5 oz. in water",0.88,null,0.88]
["Maceys",null,null,null,null,null,"Case of 12 - $10.56"]
["Maceys","****",null,null,null,null,"ShurSaving Pears or Peaches, 29 oz. can",0.99,null,0.99]
["Maceys",null,null,null,null,null,"Case of 12 - $11.88"]
["Maceys","***",null,null,null,null,"Taco Bell Refried Beans, 16 oz. Regular or Fat ******",0.79,null,0.79]
["Maceys",null,null,null,null,null,"Case of 12 - $9.48"]
["Maceys","***",null,null,null,null,"Top Ramen Noodles, 3 oz. assorted",0.2,null,0.2]
["Maceys",null,null,null,null,null,"Case of 24 - $4.80"]
["Maceys","***",null,null,null,null,"Western Family 100% Apple Juice or Cider, 96 oz.",2.5,null,2.5]
["Maceys",null,null,null,null,null,"Case of 6 - $15.00"]
["Maceys","***",null,null,null,null,"Western Family 100% Juice, 46 oz. Tomato or Vegetable",1.67,null,1.67]
["Maceys",null,null,null,null,null,"Case of 12 - $20.00"]
["Maceys","****",null,null,null,null,"Western Family Apple Sauce, 15 oz. Original",0.59,null,0.59]
[{"$f":"IF(G1361=\"How to use this list\",G1363,A1360)","v":"Maceys"},null,null,null,null,null,"Case of 24 - $14.16"]
["Maceys","***",null,null,null,null,"Western Family Beef Stew, 24 oz. can",2.19,null,2.19]
["Maceys",null,null,null,null,null,"Case of 12 - $26.28 "]
["Maceys","***",null,null,null,null,"Western Family Brownie Mixes, 19.8-21.5 oz.",1.25,null,1.25]
["Maceys",null,null,null,null,null,"Case of 12 - $15.00"]
["Maceys","***",null,null,null,null,"Western Family Buttermilk Pancake Mix, 7 lb. bag",5.49,null,5.49]
["Maceys",null,null,null,null,null,"Case of 6 - $32.94"]
["Maceys","***",null,null,null,null,"Western Family Cake Mix, 18.25-18.5 oz.",0.99,null,0.99]
["Maceys",null,null,null,null,null,"Case of 12 - $11.88"]
["Maceys","****",null,null,null,null,"Western Family Canned Fruit, 15-15.25 oz. assorted can",0.79,null,0.79]
["Maceys",null,null,null,null,null,"Case of 24 - $18.96"]
["Maceys","***",null,null,null,null,"Western Family Canned Vegetables, 11-15.25 oz. Cream, No Salt or Whole Supersweet Corn, No Salt Beans, Golden or White Hominy",0.69,null,0.69]
["Maceys",null,null,null,null,null,"Case of 24 - $16.56"]
["Maceys","***",null,null,null,null,"Western Family Cereal, 28-32 oz. bag",2.99,null,2.99]
["Maceys",null,null,null,null,null,"Case of 8 - $23.92"]
["Maceys","***",null,null,null,null,"Western Family Chicken Noodle or Tomato Soup, 10.5-10.75 oz.",0.5,null,0.5]
["Maceys",null,null,null,null,null,"Case of 24: $12.00"]
["Maceys","***",null,null,null,null,"Western Family Chili Con Carne, 15 oz. can",0.88,null,0.88]
["Maceys",null,null,null,null,null,"Case of 24 - $21.12"]
["Maceys","****",null,null,null,null,"Western Family Chocolate Chips, 11.5-12 oz. Real Milk or Semi-Sweet",1.67,null,1.67]
["Maceys",null,null,null,null,null,"Case of 24 - $40.00"]
["Maceys","***",null,null,null,null,"Western Family Clover Honey, 80 oz.",11.99,null,11.99]
["Maceys",null,null,null,null,null,"Case of 6 - $71.94"]
["Maceys","****",null,null,null,null,"Western Family Concord Grape Jelly, 32 oz.",1.5,null,1.5]
["Maceys",null,null,null,null,null,"Case of 12 - $18.00"]
["Maceys","***",null,null,null,null,"Western Family Cream Soup, 10.5 oz. Chicken or Mushroom",0.59,null,0.59]
["Maceys",null,null,null,null,null,"Case of 24 - $14.16"]
["Maceys","***",null,null,null,null,"Western Family Diced or Whole Green Chiles, 4 oz.",0.5,null,0.5]
["Maceys",null,null,null,null,null,"Case of 24 - $12.00"]
["Maceys","****",null,null,null,null,"Western Family Diced Tomatoes, 14.5 oz. assorted can",0.5,null,0.5]
["Maceys",null,null,null,null,null,"Case of 24 - $12.00"]
["Maceys","****",null,null,null,null,"Western Family Evaporated Milk, 12 oz.",0.89,null,0.89]
["Maceys",null,null,null,null,null,"Case of 24 - $21.36"]
["Maceys","****",null,null,null,null,"Western Family Frozen Orange Juice, 12 oz. assorted",1.19,null,1.19]
["Maceys",null,null,null,null,null,"Case of 24 - $28.56"]
["Maceys","***",null,null,null,null,"Western Family Fruit Snacks, 6 ct.",0.99,null,0.99]
["Maceys",null,null,null,null,null,"Case of 12 - $11.88"]
["Maceys","***",null,null,null,null,"Western Family Ice Cream or Sherbet, 56 oz. squares",2.5,null,2.5]
["Maceys","***",null,null,null,null,"Western Family Instant Nonfat Dry Milk, makes 8 quarts",6.99,null,6.99]
["Maceys",null,null,null,null,null,"Case of 12 - $83.88"]
["Maceys","***",null,null,null,null,"Western Family Instant Oatmeal, 10 ct. assorted",1.67,null,1.67]
["Maceys",null,null,null,null,null,"Case of 12 - $20.00"]
["Maceys","****",null,null,null,null,"Western Family Ketchup, 24 oz. Regular or 20 oz. Upside Down Bottle",0.88,null,0.88]
["Maceys",null,null,null,null,null,"Case of 12 - $10.56"]
["Maceys",null,null,null,null,null,"Case of 16 - $14.08"]
["Maceys","****",null,null,null,null,"Western Family Macaroni and Cheese, 5.5 oz. Spiral or 7.25 oz. Original",0.33,null,0.33]
["Maceys",null,null,null,null,null,"Case of 24 - $7.92"]
["Maceys","****",null,null,null,null,"Western Family Mandarin Oranges, 10.5-11 oz. can",0.5,null,0.5]
["Maceys",null,null,null,null,null,"Case of 24 - $12.00"]
["Maceys","****",null,null,null,null,"Western Family Mexican Style Tomato Sauce, 8 oz.",0.33,null,0.33]
["Maceys",null,null,null,null,null,"Case of 24 - $7.92"]
["Maceys","****",null,null,null,null,"Western Family Microwaveable Easy Sides, 4.3-4.5 oz. assorted",0.59,null,0.59]
["Maceys",null,null,null,null,null,"Case of 12 - $7.08"]
["Maceys","****",null,null,null,null,"Western Family Mushrooms, 4 oz. Diced or Whole",0.5,null,0.5]
["Maceys",null,null,null,null,null,"Case of 24 - $12.00"]
["Maceys","***",null,null,null,null,"Western Family Oatmeal, 42 oz. Quick or Old Fashioned",1.99,null,1.99]
["Maceys",null,null,null,null,null,"Case of 12 - $23.88"]
["Maceys","****",null,null,null,null,"Western Family Pancake Syrup, 128 oz. Original",5.49,null,5.49]
["Maceys",null,null,null,null,null,"Case of 4 - $21.96"]
["Maceys","***",null,null,null,null,"Western Family Pasta, 48 oz. Elbow Macaroni, Thin or Long Spaghetti",2.99,null,2.99]
["Maceys",null,null,null,null,null,"Case of 8 - $23.92"]
["Maceys","***",null,null,null,null,"Western Family Peanut Butter, 18 oz. Creamy, Chunky or Reduced Fat",2.5,null,2.5]
["Maceys",null,null,null,null,null,"Case of 12 - $30.00"]
["Maceys","***",null,null,null,null,"Western Family Pineapple, 20 oz. can",0.99,null,0.99]
[{"$f":"IF(G1425=\"How to use this list\",G1427,A1424)","v":"Maceys"},null,null,null,null,null,"Case of 24 - $23.76"]
["Maceys","***",null,null,null,null,"Western Family Premium Chunk Chicken Breast, 10 oz. can",2.5,null,2.5]
["Maceys",null,null,null,null,null,"Case of 12 - $30.00"]
["Maceys","***",null,null,null,null,"Western Family Ready to Spread Frosting, 16 oz. assorted",1.59,null,1.59]
["Maceys",null,null,null,null,null,"Case of 12 - $19.08"]
["Maceys","****",null,null,null,null,"Western Family Refried Beans, 15-16 oz. assorted",0.5,null,0.5]
["Maceys",null,null,null,null,null,"Case of 24 - $12.00"]
["Maceys","***",null,null,null,null,"Western Family Skillet Meals, 5.5-7.3 oz. assorted",0.99,null,0.99]
["Maceys",null,null,null,null,null,"Case of 12 - $11.88"]
["Maceys","***",null,null,null,null,"Western Family Sloppy Joe Sauce, 26.5 oz.",1.25,null,1.25]
["Maceys",null,null,null,null,null,"Case of 12 - $15.00"]
["Maceys","****",null,null,null,null,"Western Family Solid White Albacore Tuna, 5 oz.",0.99,null,0.99]
["Maceys",null,null,null,null,null,"Case of 24 - $23.76"]
["Maceys","***",null,null,null,null,"Western Family Spaghetti Rings, 15 oz. Plain",0.59,null,0.59]
["Maceys",null,null,null,null,null,"Case of 24 - $14.16"]
["Maceys","****",null,null,null,null,"Western Family Specialty Beans, 15-16 oz. assorted",0.5,null,0.5]
["Maceys",null,null,null,null,null,"Case of 24 - $12.00"]
["Maceys","****",null,null,null,null,"Western Family Spring Water, 24 pk. half liter bottles",2.5,null,2.5]
["Maceys","***",null,null,null,null,"Western Family Sweetened Condensed Milk, 14 oz. can",1.5,null,1.5]
["Maceys",null,null,null,null,null,"Case of 24 - $36.00"]
["Maceys","*****",null,null,null,null,"Western Family Tomato Sauce, 8 oz. Regular or No Salt",0.33,null,0.33]
["Maceys",null,null,null,null,null,"Case of 48 - $15.84"]
["Maceys","****",null,null,null,null,"Western Family Vegetables, 14.5-15.25 oz. can Whole Kernel or Sweet Crisp Corn, Cut or French Cut Green Beans",0.5,null,0.5]
["Maceys",null,null,null,null,null,"Case of 24 - $12.00"]
["Maceys","****",null,null,null,null,"Western Family Waterchestnuts, 8 oz. sliced or whole",0.44,null,0.44]
["Maceys",null,null,null,null,null,"Case of 24 - $10.56"]
["Maceys"]
["Maceys","*****",null,null,null,null,"Long Term Storage Sale!"]
["Maceys","***",null,null,null,null,"Augason Farms 100% Instant Nonfat Country Fresh Dry Milk, 29 oz.",8.49,null,8.49]
["Maceys","***",null,null,null,null,"Augason Farms Beef Vegetarian Meat Substitute, 37 oz.",8.49,null,8.49]
["Maceys","***",null,null,null,null,"Augason Farms Blueberries, 12 oz.",22.99,null,22.99]
["Maceys","***",null,null,null,null,"Augason Farms Butter Powder, 36 oz.",14.99,null,14.99]
["Maceys","***",null,null,null,null,"Augason Farms Buttermilk Biscuit Mix, 46 oz.",5.99,null,5.99]
["Maceys","***",null,null,null,null,"Augason Farms Buttermilk Pancake Mix, 52 oz.",5.99,null,5.99]
["Maceys","***",null,null,null,null,"Augason Farms Cheese Blend Powder, 52 oz.",13.99,null,13.99]
["Maceys","***",null,null,null,null,"Augason Farms Cheesy Broccoli Soup Mix, 54 oz.",13.99,null,13.99]
["Maceys","***",null,null,null,null,"Augason Farms Chopped Onions, 23 oz.",7.99,null,7.99]
["Maceys","***",null,null,null,null,"Augason Farms Creamy Potato Soup Mix, 58 oz.",10.99,null,10.99]
["Maceys","***",null,null,null,null,"Augason Farms Dehydrated Apple Slices, 19.2 oz.",10.99,null,10.99]
["Maceys","***",null,null,null,null,"Augason Farms Dehydrated Potato Shreds, 23 oz. can",6.49,null,6.49]
["Maceys","***",null,null,null,null,"Augason Farms Dehydrated Potato Slices, 20 oz.",5.99,null,5.99]
["Maceys","***",null,null,null,null,"Augason Farms Dough Enhancer, 15 oz.",2.4900000000000002,null,2.4900000000000002]
["Maceys","***",null,null,null,null,"Augason Farms ******ze Dried Sweet Corn, 16 oz.",11.99,null,11.99]
["Maceys","****",null,null,null,null,"Augason Farms Gulf Pacific Brown Rice, 20 lb. bag",9.99,null,9.99]
["Maceys","****",null,null,null,null,"Augason Farms Hard Wheat, 45 lb. Red or White",19.989999999999998,null,19.989999999999998]
["Maceys","*****",null,null,null,null,"Augason Farms Hard Wheat, 50 lb. bag Red or White Wheat",14.99,null,14.99]
["Maceys","***",null,null,null,null,"Augason Farms Honey Powder, 48 oz.",9.99,null,9.99]
["Maceys","***",null,null,null,null,"Augason Farms Honey Wheat Bread and Roll Mix , 58 oz.",5.99,null,5.99]
["Maceys","***",null,null,null,null,"Augason Farms Morning Moos Chocolate Milk Alternative, 71 oz.",10.99,null,10.99]
["Maceys","***",null,null,null,null,"Augason Farms Morning Moos Milk Alternative, 56 oz.",9.99,null,9.99]
["Maceys","***",null,null,null,null,"Augason Farms Potato Gems, 48 oz. can",9.99,null,9.99]
["Maceys","***",null,null,null,null,"Augason Farms Red and Green Bell Peppers, 20 oz.",10.99,null,10.99]
["Maceys","***",null,null,null,null,"Augason Farms Rolled Oats, 23 lb. Regular or Quick",17.989999999999998,null,17.989999999999998]
["Maceys","*****",null,null,null,null,"Augason Farms Rolled Oats, 50 lb. bag Regular or Quick",22.99,null,22.99]
["Maceys","***",null,null,null,null,"Augason Farms Scrambled Egg Mix, 36 oz.",17.989999999999998,null,17.989999999999998]
["Maceys","***",null,null,null,null,"Augason Farms Sliced Bananas, 34 oz.",7.99,null,7.99]
["Maceys","***",null,null,null,null,"Augason Farms Sliced Strawberries, 6.4 oz. ******ze Dried",14.99,null,14.99]
["Maceys","***",null,null,null,null,"Augason Farms Spiff-E-Whip Dessert Topping, 20 oz.",5.29,null,5.29]
["Maceys","***",null,null,null,null,"Augason Farms Super Nutty Granola, 48 oz.",12.99,null,12.99]
["Maceys","***",null,null,null,null,"Augason Farms Vegetable Stew Blend, 33 oz.",10.99,null,10.99]
["Maceys","***",null,null,null,null,"Augason Farms Vital Wheat Gluten, 15 oz.",2.99,null,2.99]
["Maceys","***",null,null,null,null,"Augason Farms Whole Eggs, 33 oz.",13.99,null,13.99]
["Maceys","***",null,null,null,null,"Blue Storage Water Drum, 15 gallon",24.99,null,24.99]
["Maceys","***",null,null,null,null,"Blue Storage Water Drum, 55 gallon",34.99,null,34.99]
[{"$f":"IF(G1489=\"How to use this list\",G1491,A1488)","v":"Maceys"},"****",null,null,null,null,"Food Storage Pail with Lid, 5 gallon",3.5,null,3.5]
["Maceys","****",null,null,null,null,"Water Storage Jug, 5 gallon",3.5,null,3.5]
["Maceys","***",null,null,null,null,"Western Family Dry Black Beans, 20 lb. bag",19.989999999999998,null,19.989999999999998]
["Maceys","***",null,null,null,null,"Western Family Dry Pinto Beans, 20 lb. bag",19.989999999999998,null,19.989999999999998]
["Maceys","****",null,null,null,null,"Western Family Flour, 25 lb. bag All Purpose Bleached or Unbleached",9.99,null,9.99]
["Maceys","***",null,null,null,null,"Western Family Granulated Sugar, 25 lb. bag",13.88,null,13.88]
["Maceys","***",null,null,null,null,"Western Family Long Grain Enriched Rice, 20 lb. bag",9.99,null,9.99]
["Maceys","***",null,null,null,null,"Western Family Medium Grain Enriched Rice, 20 lb. bag",12.99,null,12.99]
["Maceys"]
["Maceys","*****",null,null,null,null,"Got a list question? Want to check if next week's list is ready? Our listmakers answer questions and post our \"preview\" lists at PYP."]
["Maceys"]
["Maceys","*****",null,null,null,null,"Todays date: ","Sale","We are not affiliated with this store.  The store's ad is the only OFFICIAL authority"]
["Maceys","toggle 4 and 5 star rows",null,null,null,null,null,"Price"]
["Reams","Stock up scale",null,null,null,null,"How to use this list",null,"Printable coupons:","Bottom line"]
["Reams",null,null,null,null,null,null,null,"Group A  Group B  Group C  Singles"]
["Reams",null,null,null,null,null,"Reams"]
["Reams",null,null,null,null,null,null,null,"Coupon Index"]
["Reams",null,null,null,null,null,"Current list"]
["Reams",null,null,null,null,null,"-This list is valid during the dates listed below"]
["Reams","*****",null,null,null,null,"Valid Dates: 4/10 - 4/16",null,"This list is made by Misti. She answers list questions in this thread at PYP."]
["Reams","***",null,null,null,null,"Bananas",".44 lb",null,".44 lb"]
["Reams","****",null,null,null,null,"Bell Peppers, green",".39 ea",null,".39 ea"]
["Reams","*****",null,null,null,null,"Broccoli Crowns",".69 lb",null,".69 lb"]
["Reams","***",null,null,null,null,"Cauliflower",".69 lb",null,".69 lb"]
["Reams","****",null,null,null,null,"Celery, large",".39 lb",null,".39 lb"]
["Reams","***",null,null,null,null,"Dole Classic Romaine, 9 oz.",1.49,null,1.49]
["Reams","***",null,null,null,null,"Grapes, Black Seedless","1.99 lb",null,"1.99 lb"]
["Reams","*****",null,null,null,null,"Mangos",".50 ea",null,".50 ea"]
["Reams","***",null,null,null,null,"Onions",".79 lb",null,".79 lb"]
["Reams","****",null,null,null,null,"Pears, Red",".79 lb",null,".79 lb"]
["Reams","***",null,null,null,null,"Zucchini Squash",".49 lb",null,".49 lb"]
["Reams","***",null,null,null,null,"Beef - 93% Lean Ground","2.99 lb",null,"2.99 lb"]
["Reams","***",null,null,null,null,"Beef - Sirloin Tip, boneless sold whole in the bag","2.89 lb",null,"2.89 lb"]
["Reams","*****",null,null,null,null,"Chicken - Boneless Skinless Breasts, 20 lb. case frozen","1.69 lb",null,33.799999999999997]
["Reams",null,null,null,null,null,"No Rainchecks"]
["Reams","****",null,null,null,null,"Chicken - Breaded Patties, 10 lb. case fully cooked","1.39 lb",null,13.9]
["Reams",null,null,null,null,null,"No Rainchecks"]
["Reams","****",null,null,null,null,"Chicken - Leg Quarters, fresh Family Pack",".79 lb",null,".79 lb"]
["Reams","****",null,null,null,null,"Pork - Picnic Roast",".99 lb",null,".99 lb"]
["Reams","****",null,null,null,null,"Seafood - Tilapia Fillets, 10 lb. case frozen","2.49 lb",null,24.9]
["Reams","****",null,null,null,null,"I Cant Believe Its Not Butter, 15 oz. Spreads or 8 oz. Spray",2.79,"I Cant Believe Its Not Butter Product, any $1.25/1 (active) Group A-02/21 Print Twice",1.54]
["Reams","***",null,null,null,null,"Nestle Coffee-Mate Flavored Creamers, 32 oz. assorted",2.99,"Nestle Coffee-Mate Creamers, any liquid or powder .55/1 (active) This Link-02/20",2.44]
["Reams","***",null,null,null,null,"Nestle Coffee-Mate Flavored Creamers, 32 oz. assorted",2.99,"Nestle Coffee-Mate Creamers, any liquid or powder .75/2 (active) This Link-02/20","2.62 ea"]
["Reams","***",null,null,null,null,"Nestle Nesquick Flavored Milk, 16 oz. assorted",1.25,null,1.25]
["Reams","***",null,null,null,null,"Western Family Orange Juice, 64 oz. chilled",1.88,null,1.88]
["Reams","***",null,null,null,null,"Kraft American Singles, 10.7-12 oz.",2.99,null,2.99]
["Reams","***",null,null,null,null,"Kraft Shredded Cheese, 8 oz.",2.99,null,2.99]
["Reams","***",null,null,null,null,"Oscar Mayer Bologna or Salami, 16 oz.",1.99,null,1.99]
["Reams","***",null,null,null,null,"Oscar Mayer Lunchables, 4.5 oz.",1.39,null,1.39]
["Reams","***",null,null,null,null,"Oscar Mayer Shaved Turkey or Ham, 16 oz.",3.49,null,3.49]
["Reams","*****",null,null,null,null,"Three Blend Shredded Cheese, 5 lb. bag Mozzarella/Cheddar/Monterey Jack",10.95,null,10.95]
["Reams","*****",null,null,null,null,"Fuze Drinks, 16.9 oz.",1,"Extra Promo: 10 for $5 when you buy 10 in a single transaction.",".50 ea"]
["Reams","***",null,null,null,null,"Kool-Aid Bursts Drinks, 6 ct.",0.89,null,0.89]
["Reams","***",null,null,null,null,"Pepsi and Mountain Dew Products, 12 pk. cans","4.33 ea",null,"4.33 ea"]
["Reams","***",null,null,null,null,"Pepsi and Mountain Dew Products, 2 liter bottles",1.25,null,1.25]
["Reams","****",null,null,null,null,"Pepsi Next, 12 pk. cans",2.99,null,2.99]
["Reams","****",null,null,null,null,"Pepsi Next, 2 liter bottle",0.99,null,0.99]
["Reams","***",null,null,null,null,"Powerade Sports Drinks, 32 oz. bottles",0.79,null,0.79]
["Reams","***",null,null,null,null,"Sobe Juice or Life Water, 20 oz. assorted",0.99,null,0.99]
["Reams","****",null,null,null,null,"Crystal Light On the Go Drink Mixes, 7-10 ct.",2,"Crystal Light Drink Mix products, any $1/2 (04-30-12) SS-3/18","1.50 ea"]
["Reams","***",null,null,null,null,"Del Monte Fruit Cups, 4 pk.",2.4900000000000002,null,2.4900000000000002]
["Reams","***",null,null,null,null,"Doritos Tortilla Chips, 11-11.5 oz. assorted",3,null,3]
["Reams","***",null,null,null,null,"Jiffy Baking Mix, 40 oz.",2.59,null,2.59]
["Reams","***",null,null,null,null,"Jiffy Corn Muffin or Pizza Crust Mix, 6.5-8.5 oz.",0.5,null,0.5]
[{"$f":"IF(G1553=\"How to use this list\",G1555,A1552)","v":"Reams"},"***",null,null,null,null,"Jiffy Muffin Mixes, 7 oz. assorted",0.69,null,0.69]
["Reams","***",null,null,null,null,"Kelloggs Cereals, 17 oz. Frosted Flakes, 12.2 oz. Apple Jacks, 12.2 oz. Froot Loops, 12 oz. Rice Krispies, 11 oz. Krave",2.99,"Kelloggs Cereal, any 8.7 oz or larger $1/3 (active) Group A-04/03 Print Twice","2.66 ea"]
["Reams","***",null,null,null,null,"Kelloggs Cereals, 17 oz. Frosted Flakes, 12.2 oz. Apple Jacks, 12.2 oz. Froot Loops, 12 oz. Rice Krispies, 11 oz. Krave",2.99,"Kelloggs Cereals, any flavor 10 oz. or larger $1/3 (EXPIRES 04-15-12) RP-3/4","2.66 ea"]
["Reams","***",null,null,null,null,"Kelloggs Cereals, 11 oz. Krave",2.99,"Kelloggs Krave Cereal, any .50/1 (active) This Link-03/18",2.4900000000000002]
["Reams","***",null,null,null,null,"Kelloggs Cereals, 11 oz. Krave",2.99,"Kelloggs Krave, Raisin Bran Cinnamon Almond, Crunchy Nut Caramel Nut and/or Frosted Mini Wheats Little Bites Cinnamon Roll Cereal, any 11 oz. or larger $1/2 (05-13-12) RP-4/1","2.49 ea"]
["Reams","***",null,null,null,null,"Kelloggs Cereals, 11 oz. Krave",2.99,"Kelloggs Krave, Raisin Bran Cinnamon Almond, Crunchy Nut Caramel Nut or Frosted Mini Wheats Little Bites Cinnamon Roll Cereal, any 11 oz. or larger .70/1 (05-13-12) RP-4/1",2.29]
["Reams","****",null,null,null,null,"Kelloggs Fruit Snacks, 9 oz. assorted",1.5,null,1.5]
["Reams","***",null,null,null,null,"Kelloggs Nutri-Grain or Fusion Bars, 7-10.4 oz. assorted",2.5,null,2.5]
["Reams","****",null,null,null,null,"Kraft Homestyle Macaroni Dinners, 12-15 oz.",1.99,"Kraft Homestyle Macaroni and Cheese Dinner, any .75/1 (05-01-12) SS-4/1",1.24]
["Reams","***",null,null,null,null,"La Choy Chow Mein Dinners, 42 oz. bi-Pack",2.98,null,2.98]
["Reams","***",null,null,null,null,"Lays Kettle Cooked Potato Chips, 8.5 oz.",2.5,null,2.5]
["Reams","***",null,null,null,null,"Lays Potato Chips, 10-10.5 oz.",2.5,null,2.5]
["Reams","***",null,null,null,null,"Mothers Bagged Cookies, 14 oz. assorted",2.5,null,2.5]
["Reams","***",null,null,null,null,"Nissin Souper Meals, Bowl Noodles or Chow Mein Bowls, 3-4 oz.",0.89,null,0.89]
["Reams","***",null,null,null,null,"Nissin Top Ramen Noodles, 3 oz.",0.2,null,0.2]
["Reams","*****",null,null,null,null,"Pompeian Olive Oil, 16 oz. Classic, Extra Virgin and Extra Light",3.99,"Pompeian Olive Oil or OlivExtra Plus, any size or variety $1/1 (active) This Link-01/01",2.99]
["Reams","*****",null,null,null,null,"Pompeian Vinegars, 16 oz. Red Wine, White Wine or Plus Pomegranate",1.59,"Pompeian Vinegar, any size or variety .50/1 (active) This Link-01/01",1.0900000000000001]
["Reams","***",null,null,null,null,"Post Cereals, 11.5 oz. Waffle Crisp, 14.7 oz. Golden Crisp, 12.5 oz. Honeycomb, 11.5 oz. Alpha-Bits, 20 oz. Raisin Bran, or 11 oz. Fruity/Cocoa Pebbles",2.5,null,2.5]
["Reams","***",null,null,null,null,"Rold Gold Pretzels, 8-16 oz. assorted",2.5,null,2.5]
["Reams","***",null,null,null,null,"Sara Lee Bread, 20 oz. Classic White or Wheat or Iron Kids",2,null,2]
["Reams","***",null,null,null,null,"Sara Lee Wide Pan Breads, 24 oz.",2.29,null,2.29]
["Reams","****",null,null,null,null,"Taco Bell Refried Beans, 16 oz. can",0.69,null,0.69]
["Reams","***",null,null,null,null,"Taco Bell Taco Shells, 4.5 oz.",1.29,null,1.29]
["Reams","***",null,null,null,null,"Velveeta Skillets Dinners, 12-15 oz.",1.99,null,1.99]
["Reams","***",null,null,null,null,"Vlasic Pickles, 46 oz. Whole Dill",2.5,null,2.5]
["Reams","****",null,null,null,null,"Western Family Easy Sides Pasta Side Dishes, 4.5 oz.",0.5,null,0.5]
["Reams","***",null,null,null,null,"DiGiorno Smalls Pizzas",2.99,null,2.99]
["Reams","***",null,null,null,null,"Dreyers Fruit Bars, 6-12 ct. assorted",3,"Dreyers Fruit Bars, any $1/2 (05-31-12) SS-4/1","2.50 ea"]
["Reams","***",null,null,null,null,"Krusteaz Frozen Waffles, Pancakes or French Toast Sticks, 7-19 oz.",2.29,null,2.29]
["Reams","***",null,null,null,null,"Meadow Gold Fudge, Dream or Root Beer Bars, 6 ct.",2,null,2]
["Reams","***",null,null,null,null,"Russells Ice Cream, half gallon",3.5,null,3.5]
["Reams","***",null,null,null,null,"Tombstone Pizzas, Original or Double Top",3.99,null,3.99]
["Reams","***",null,null,null,null,"Tonys Original Crust Pizzas",2,null,2]
["Reams","***",null,null,null,null,"Western Family Lasagna, 96 oz. Family Size",8.99,null,8.99]
["Reams","***",null,null,null,null,"Aquafresh Toothpaste, X-Fresh, Tartar or Original",1.19,null,1.19]
["Reams","***",null,null,null,null,"Banana Boat Sun Care, assorted Ultra Mist and Sport",7.99,null,7.99]
["Reams","***",null,null,null,null,"Blistex Lip Balm, Complete Moisture or Five Star",1.69,null,1.69]
["Reams","***",null,null,null,null,"Bounce Fabric Softener, 2 month bar",3.79,"Bounce, excludes trial/travel size .50/1 (04-30-12) SS-3/11",3.29]
["Reams","***",null,null,null,null,"Bounce Fabric Softener, 2 month bar",3.79,"Tide, Downy, Bounce or Tide Stain Release, excludes Tide PODS and trial/travel size $2/3 (04-30-12) PG-4/1","2.62 ea"]
["Reams","***",null,null,null,null,"Bounty Paper Towels, 8 roll pack",9.99,null,9.99]
["Reams","***",null,null,null,null,"Charmin Bathroom Tissue, 12 pk. double roll",7.99,"Charmin, excludes trial/travel size .25/1 (04-30-12) PG-4/1",7.74]
["Reams","***",null,null,null,null,"Edge Shaving Gel",2.5,"Edge Shave Gel, any 7 oz. or larger .55/1 (05-06-12) SS-3/25",1.95]
["Reams","***",null,null,null,null,"Head and Shoulders, 23.7 oz. assorted",6.99,"Head and Shoulders Product, Buy 1 Get 1 ****** up to $9.99, excludes trial/travel size (04-30-12) PG-4/1","3.50 ea"]
["Reams","***",null,null,null,null,"Luvs Diapers, 80-180 ct. Big Pack",17.989999999999998,null,17.989999999999998]
["Reams","***",null,null,null,null,"Old Spice Body Wash, 18 oz. assorted",3.59,"Old Spice Deodorant, Buy 1 Get $1.00 off one Old Spice Body Wash, excludes trial/travel size (04-30-12) PG-4/1",3.59]
["Reams",null,null,null,null,null,null,null,"NOTE: You must buy BOTH products to use this coupon."]
["Reams","***",null,null,null,null,"Pantene, 24.4 oz. assorted",6.99,"Pantene Products, excludes trial/travel size $1/2 (04-30-12) PG-4/1","6.49 ea"]
["Reams","***",null,null,null,null,"Skintimate Shaving Gel",2.5,"Skintimate Shave Gel, any excluding 2.75 oz. cans .55/1 (05-06-12) SS-3/25",1.95]
["Reams","***",null,null,null,null,"Tide Laundry Detergent, 150 oz.",18.989999999999998,"Tide Detergent, excludes Tide PODS and trial/travel size .50/1 (04-30-12) SS-3/11",18.489999999999998]
["Reams","***",null,null,null,null,"Tide Laundry Detergent, 150 oz.",18.989999999999998,"Tide, Downy, Bounce or Tide Stain Release, excludes Tide PODS and trial/travel size $1/2 (04-30-12) PG-4/1","18.49 ea"]
["Reams","***",null,null,null,null,"Tide Laundry Detergent, 150 oz.",18.989999999999998,"Tide, Downy, Bounce or Tide Stain Release, excludes Tide PODS and trial/travel size .50/1 (04-30-12) PG-4/1",18.489999999999998]
["Reams","***",null,null,null,null,"Western Family Speed 3 Razors, 4 plus 2 Bonus Pack",2.69,null,2.69]
["Reams","***",null,null,null,null,"Zyrtec 24 Hour Allergy Relief, 40 ct. Total bonus pack",15,"Zyrtec Products, any 24 ct. or larger $8/2 (04-30-12) RP-4/1","11.00 ea"]
["Reams","***",null,null,null,null,"Zyrtec 24 Hour Allergy Relief, 40 ct. Total bonus pack",15,"Zyrtec Products, any 24 ct. or larger $4/1 (04-30-12) RP-4/1",11]
["Reams"]
["Reams","*****",null,null,null,null,"Meal Deal",5,"Use in-ad store coupon: Get all this for $8.99",8.99]
["Reams",null,null,null,null,null,null,null,"- (1) Western Family 96 oz. Lasagna"]
["Reams",null,null,null,null,null,null,null,"- (1) French Bread"]
["Reams",null,null,null,null,null,null,null,"- (1) 2-liter Pepsi products"]
["Reams"]
["Reams","*****",null,null,null,null,"Got a list question? Want to check if next week's list is ready? Our listmakers answer questions and post our \"preview\" lists at PYP."]
["Reams"]
["Reams","*****",null,null,null,null,"Todays date: ","Sale","We are not affiliated with this store.  The store's ad is the only OFFICIAL authority"]
["Reams","toggle 4 and 5 star rows",null,null,null,null,null,"Price"]
[{"$f":"IF(G1617=\"How to use this list\",G1619,A1616)","v":"Associated Foods"},"Stock up scale",null,null,null,null,"How to use this list",null,"Printable coupons:","Bottom line"]
["Associated Foods",null,null,null,null,null,null,null,"Group A  Group B  Group C  Singles"]
["Associated Foods",null,null,null,null,null,"Associated Foods"]
["Associated Foods",null,null,null,null,null,"\"Early Ad\" Stores",null,"Coupon Index"]
["Associated Foods",null,null,null,null,null,"Current list"]
["Associated Foods",null,null,null,null,null,"-This list is valid during the dates listed below"]
["Associated Foods","*****",null,null,null,null,"\"Early\" ads (run Monday - Saturday)",null,"This list is made by Misti. She answers list questions in this thread at PYP."]
["Associated Foods"]
["Associated Foods",null,null,null,null,null,"Valid Dates: 4/9 - 4/14"]
["Associated Foods","*****",null,null,null,null,"PLEASE NOTE: This list is created from the Lees ad."]
["Associated Foods"]
["Associated Foods",null,null,null,null,null,"IT IS NOT GUARANTEED TO BE ACCURATE FOR EVERY ASSOCIATED FOOD STORE."]
["Associated Foods"]
["Associated Foods",null,null,null,null,null,"Each stores ad is the final authority on sale pricing."]
["Associated Foods","****",null,null,null,null,"Apples, Large Golden Delicious, Jonagold, Braeburn or Cameo",".99 lb",null,".99 lb"]
["Associated Foods","***",null,null,null,null,"Avocados, Organic",".99 ea",null,".99 ea"]
["Associated Foods","***",null,null,null,null,"Bell Peppers, Green",".50 ea",null,".50 ea"]
["Associated Foods","****",null,null,null,null,"Cilantro, bunch",".39 ea",null,".39 ea"]
["Associated Foods","***",null,null,null,null,"Clementine Mandarins, 3 lb. bag",4.99,null,4.99]
["Associated Foods","***",null,null,null,null,"Cucumbers",".50 ea",null,".50 ea"]
["Associated Foods","***",null,null,null,null,"Dole Salads, 9 oz. Classic Romaine or 11 oz. Just Lettuce",1.69,null,1.69]
["Associated Foods","***",null,null,null,null,"Grapes, Red or Black Seedless","1.99 lb",null,"1.99 lb"]
["Associated Foods","****",null,null,null,null,"Green Onions, bunch",".39 ea",null,".39 ea"]
["Associated Foods","*****",null,null,null,null,"Mangos",".50 ea",null,".50 ea"]
["Associated Foods","****",null,null,null,null,"Oranges, Navel",".49 lb",null,".49 lb"]
["Associated Foods","***",null,null,null,null,"Potatoes, Baker",".59 lb",null,".59 lb"]
["Associated Foods","****",null,null,null,null,"Radishes, bunch",".39 ea",null,".39 ea"]
["Associated Foods","***",null,null,null,null,"Spinach, bunch",".99 ea",null,".99 ea"]
["Associated Foods","*****",null,null,null,null,"Tomatoes, Extra Large Roma",".69 lb",null,".69 lb"]
["Associated Foods","****",null,null,null,null,"I Cant Believe Its Not Butter, 15 oz. tubs, 2 pk. 8 oz. tubs or 8 oz. spray",2.88,"I Cant Believe Its Not Butter Product, any $1.25/1 (active) Group A-02/21 Print Twice",1.63]
["Associated Foods","***",null,null,null,null,"Natural Directions Almondmilk or Soy Milk, 64 oz. Original or Vanilla",2.19,null,2.19]
["Associated Foods","****",null,null,null,null,"Sunny D, 64 oz.",0.99,null,0.99]
["Associated Foods","****",null,null,null,null,"Western Family Cottage Cheese, 16 oz.",1.19,null,1.19]
["Associated Foods","***",null,null,null,null,"Western Family Jumbos Biscuits, 16 oz.",1.25,null,1.25]
["Associated Foods","***",null,null,null,null,"Western Family Orange Juice, 89 oz. assorted",2.99,null,2.99]
["Associated Foods","***",null,null,null,null,"Western Family Yogurt, 32 oz. assorted",2,null,2]
["Associated Foods","***",null,null,null,null,"Bar S Bologna, 16 oz. Classic, Thick or Chicken",1.29,null,1.29]
["Associated Foods","***",null,null,null,null,"Bar S Ham or Turkey Breast, 16 oz.",3.49,null,3.49]
["Associated Foods","****",null,null,null,null,"Dailys Big Buy Bacon, 1 lb.",1.89,null,1.89]
["Associated Foods","***",null,null,null,null,"Johnsonville Breakfast Sausage Links, 12 oz.",2.99,"Johnsonville Breakfast Sausage Links or Patties .75/1 (05-31-12) SS-2/5",2.2400000000000002]
["Associated Foods","****",null,null,null,null,"Micellis String Cheese, 12 oz.",1.99,null,1.99]
["Associated Foods","***",null,null,null,null,"Tyson Fully Cooked Entrees, 17 oz.",5.49,null,5.49]
["Associated Foods","***",null,null,null,null,"Western Family Individually Wrapped Cheese Slices, 12 oz.",1.79,null,1.79]
["Associated Foods","***",null,null,null,null,"Western Family Jumbo Franks, 1 lb.",1.19,null,1.19]
["Associated Foods","***",null,null,null,null,"Arrowhead Spring Water, 24 pk. half liter bottles",4.49,null,4.49]
["Associated Foods","***",null,null,null,null,"Coke Products, 2 liter bottle",1.34,null,1.34]
["Associated Foods","***",null,null,null,null,"Coke Products, 20 pk. cans","2 for $13","Use in-ad vendor coupon: 2 for $11 with coupon and purchase of 2.","5.50 ea"]
["Associated Foods","*****",null,null,null,null,"Fuze, 18.5 oz. bottles",1,"Use in-ad vendor coupon: 10 for $5 with coupon and purchase of 10.",".50 ea"]
["Associated Foods","***",null,null,null,null,"Langers Juice Cocktails, 64 oz. Cranberry or Pomegranate",2.5,null,2.5]
["Associated Foods","***",null,null,null,null,"Nestle Pure Life Spring Water, 24 pk. half liter bottles",4.49,null,4.49]
["Associated Foods","****",null,null,null,null,"Pepsi Next, 12 pk. cans",2.99,null,2.99]
["Associated Foods","****",null,null,null,null,"Pepsi Next, 2 liter bottles",0.99,null,0.99]
["Associated Foods","***",null,null,null,null,"Pepsi, 7-Up or A and W Products, 12 pk. cans","3 for $14",null,"4.67 ea"]
["Associated Foods","***",null,null,null,null,"Powerade Sports Drinks, 32 oz. assorted",0.79,null,0.79]
["Associated Foods","***",null,null,null,null,"Sobe Lifewater, 20 oz. bottle",1,null,1]
["Associated Foods","***",null,null,null,null,"Western Family 100% Apple Juice or Cider, 96 oz.",2.5,null,2.5]
["Associated Foods","***",null,null,null,null,"Aunt Jemima Pancake Mix, 32 oz.",2.4900000000000002,null,2.4900000000000002]
["Associated Foods","***",null,null,null,null,"Aunt Jemima Syrup, 24 oz.",2.4900000000000002,null,2.4900000000000002]
["Associated Foods","****",null,null,null,null,"Crystal Light On the Go Drink Mixes, 7-10 ct.",1.99,"Crystal Light Drink Mix products, any $1/2 (04-30-12) SS-3/18","1.49 ea"]
["Associated Foods","***",null,null,null,null,"DaVinci Pasta, 16 oz. assorted",0.99,null,0.99]
["Associated Foods","***",null,null,null,null,"Doritos, 11-11.5 oz.",2.99,null,2.99]
["Associated Foods","***",null,null,null,null,"Grandma Sycamores Bread, 24 oz. White or Wheat",2,null,2]
["Associated Foods","***",null,null,null,null,"Hatch Green Chiles, 4 oz. Chopped or Diced",1.25,null,1.25]
["Associated Foods","***",null,null,null,null,"Jolly Time Microwave Popcorn, 2-4 pk.",1.67,"Jolly Time Microwave Popcorn, any boxes $1/2 (active) This Link-05/23","1.17 ea"]
[{"$f":"IF(G1681=\"How to use this list\",G1683,A1680)","v":"Associated Foods"},"***",null,null,null,null,"Kelloggs Cereals, 11-17 oz. Froot Loops, Apple Jacks, Frosted Flakes, Chocolate or Double Chocolate Krave",3,"Kelloggs Cereal, any 8.7 oz or larger $1/3 (active) Group A-04/03 Print Twice","2.67 ea"]
["Associated Foods","***",null,null,null,null,"Kelloggs Cereals, 11-17 oz. Froot Loops, Apple Jacks, Frosted Flakes, Chocolate or Double Chocolate Krave",3,"Kelloggs Cereals, any flavor 10 oz. or larger $1/3 (04-15-12) RP-3/4","2.67 ea"]
["Associated Foods","***",null,null,null,null,"Kelloggs Cereals, 11-17 oz. Chocolate or Double Chocolate Krave",3,"Kelloggs Krave Cereal, any .50/1 (active) This Link-03/18",2.5]
["Associated Foods","***",null,null,null,null,"Kelloggs Cereals, 11-17 oz. Chocolate or Double Chocolate Krave",3,"Kelloggs Krave, Raisin Bran Cinnamon Almond, Crunchy Nut Caramel Nut and/or Frosted Mini Wheats Little Bites Cinnamon Roll Cereal, any 11 oz. or larger $1/2 (05-13-12) RP-4/1","2.50 ea"]
["Associated Foods","***",null,null,null,null,"Kelloggs Cereals, 11-17 oz. Chocolate or Double Chocolate Krave",3,"Kelloggs Krave, Raisin Bran Cinnamon Almond, Crunchy Nut Caramel Nut or Frosted Mini Wheats Little Bites Cinnamon Roll Cereal, any 11 oz. or larger .70/1 (05-13-12) RP-4/1",3.3]
["Associated Foods","***",null,null,null,null,"Kelloggs Fruit Snacks, 8oz.",1.67,null,1.67]
["Associated Foods","***",null,null,null,null,"Kelloggs Nutri-Grain Bar, 7.8-10.4 oz. assorted",2.5,null,2.5]
["Associated Foods","***",null,null,null,null,"Kraft Miracle Whip or Mayo, 30 oz. Original",2.99,"Kraft Mayo or Miracle Whip Dressing products, any .75/2 (04-22-12) SS-3/25","2.62 ea"]
["Associated Foods","***",null,null,null,null,"La Choy Bi-Packs, 42-43.5 oz.",3,null,3]
["Associated Foods","***",null,null,null,null,"La Victoria Salsa, 16 oz.",2.29,null,2.29]
["Associated Foods","***",null,null,null,null,"La Victoria Taco Sauce, 15 oz.",2.29,null,2.29]
["Associated Foods","*****",null,null,null,null,"Las Palmas Enchilada Sauce, 28 oz.",2,"Las Palmas Product, any $1/1 (active) This Link-10/08",1]
["Associated Foods","***",null,null,null,null,"Lays Potato Chips, 10-10.5 oz.",2.5,null,2.5]
["Associated Foods","***",null,null,null,null,"Minute Rice, 14 oz. Brown or Long Grain White",1.99,"Minute Rice Product, any .50/1 (04-30-12) PurinaRP-1/29",1.49]
["Associated Foods","***",null,null,null,null,"Mothers Cookies, 14 oz. bag",2.5,null,2.5]
["Associated Foods","***",null,null,null,null,"Nabisco Cheese Nips, 10.5-12 oz.",1.5,null,1.5]
["Associated Foods","***",null,null,null,null,"Quaker Cereal, 10.5-14.5 oz. Honey Graham Ohs, Life, Oatmeal Squares, Whole Hearts or Capn Crunch",2,null,2]
["Associated Foods","***",null,null,null,null,"Quaker Snack Bars, 6.5-7.4 oz. Chewy, Chewy Dipps",2.29,"Quaker Chewy Granola, Quaker Chewy Dipps Granola or Quaker Chewy Smashbar Bars, 6 ct. or larger boxes .75/2 (04-28-12) RP-3/18","1.92 ea"]
["Associated Foods","***",null,null,null,null,"Quaker Snack Bars, 6.5-7.4 oz. Soft Baked",2.29,null,2.29]
["Associated Foods","***",null,null,null,null,"Rold Gold, 7-16 oz.",2.5,null,2.5]
["Associated Foods","***",null,null,null,null,"Taco Bell Bold and Creamy Sauce, 8 oz.",1.5,null,1.5]
["Associated Foods","***",null,null,null,null,"Taco Bell Refried Beans, 16 oz.",0.79,null,0.79]
["Associated Foods","***",null,null,null,null,"Taco Bell Taco Shells, 12 ct.",1.25,null,1.25]
["Associated Foods","***",null,null,null,null,"Tostitos Tortilla Chips, 9-13 oz.",2.99,null,2.99]
["Associated Foods","****",null,null,null,null,"Western Family Bread, 24 oz. Buttermilk White Roundtop, Cracked Wheat or Golden Split Top",1.25,null,1.25]
["Associated Foods","***",null,null,null,null,"Western Family Brownie Mixes, 19.8-21.5 oz. Chewy, Classic or Dark Chocolate",1.49,null,1.49]
["Associated Foods","****",null,null,null,null,"Western Family Easy Sides, 4.3-4.5 oz. Microwaveable",0.59,null,0.59]
["Associated Foods","***",null,null,null,null,"Western Family Grape Jelly, 32 oz.",1.88,null,1.88]
["Associated Foods","***",null,null,null,null,"Western Family Peanut butter, 18 oz. Creamy, Chunky or Reduced Fat",2.4900000000000002,null,2.4900000000000002]
["Associated Foods","***",null,null,null,null,"Western Family Premium Chunk Chicken Breast, 10 oz.",2.5,null,2.5]
["Associated Foods","*****",null,null,null,null,"Western Family Tomato Sauce, 8 oz.",0.33,null,0.33]
["Associated Foods","***",null,null,null,null,"Wonder Classic White Bread, 20 oz.",2,null,2]
["Associated Foods","***",null,null,null,null,"Farr Ice Cream, 4 qt. pail",5.99,null,5.99]
["Associated Foods","***",null,null,null,null,"PictSweet Vegetables, 8-12 oz. Deluxe or Seasoned",1.5,null,1.5]
["Associated Foods","***",null,null,null,null,"Rhodes Warm N Serve Rolls, 6-9 ct. pan",2,"Rhodes Bread or Rolls, any .55/1 (05-20-12) RP-3/25",1.45]
["Associated Foods","***",null,null,null,null,"Stouffers Frozen Meals, 6-12.7 oz.",2.69,"Stouffers Entrees or French Bread Pizzas, any $1.10/5 (active) This Link-04/07 Print Twice","2.47 ea"]
["Associated Foods","***",null,null,null,null,"Tillamook Ice Cream, 1.75 qt.",3.99,null,3.99]
["Associated Foods","***",null,null,null,null,"Tombstone Pizza, 12 inch",3.99,null,3.99]
["Associated Foods","***",null,null,null,null,"Western Family Burritos, 5 oz.",0.33,null,0.33]
["Associated Foods","***",null,null,null,null,"Western Family Chicken, 26 oz. Frozen Dino Nuggets or Popcorn",4.99,null,4.99]
["Associated Foods","***",null,null,null,null,"Western Family Crunchy Fillets or Fish Sticks, 19-24 oz.",3.99,null,3.99]
["Associated Foods","***",null,null,null,null,"Allegra Allergy Relief, 30 ct. Tablets",11.99,"Allegra Allergy 30 ct or higher, Allegra-D 24 hr 10 ct or higher or Allegra-D 12 hr 20 ct or higher $4/1 (active) Group B-03/18 Print Twice",7.99]
["Associated Foods","***",null,null,null,null,"Allegra Allergy Relief, 15 ct. 24 Hour",11.99,"Allegra Allergy 5, 12 or 15 ct, Childrens Allegra, Allegra-D 24 hr 5 ct or Allegra-D 12 hr 10 ct $2/1 (active) Group B-03/18 Print Twice",9.99]
["Associated Foods","****",null,null,null,null,"Aquafresh Toothpaste, 6-6.4 oz. assorted",0.88,null,0.88]
["Associated Foods","***",null,null,null,null,"Band-Aid Bandages, 10-80 ct.",2,null,2]
["Associated Foods","***",null,null,null,null,"Coppertone Sunscreen, 6-8 oz. Babys or Kids",8.8800000000000008,"Coppertone Sun Care, any excluding lip balm and trial sizes $1/1 (active) This Link-02/04",7.88]
["Associated Foods","***",null,null,null,null,"Cottonelle Bathroom Tissue, 12 Double Roll Clean Care or Ultra",6.99,null,6.99]
["Associated Foods","***",null,null,null,null,"Edge Shaving Cream, 7-10 oz.",1.88,"Edge Shave Gel, any 7 oz. or larger .55/1 (05-06-12) SS-3/25",1.33]
["Associated Foods","***",null,null,null,null,"Finish Powerball Tabs, 32 ct.",4.99,"Finish Powerball Tabs or Gelpacs, any .75/1 (04-15-12) SS-3/11",4.24]
["Associated Foods","***",null,null,null,null,"Finish Powerball Tabs, 32 ct.",4.99,"Finish Powerball or Gelpacs Dishwasher detergent .50/1 (active) This Link-04/02",4.49]
["Associated Foods","***",null,null,null,null,"Glad ******zer or Storage Bags, 30-50 ct. gallon or quart",2.99,"Glad Food Storage Products, any $1/2 (active) This Link-08/21","2.49 ea"]
["Associated Foods","***",null,null,null,null,"Huggies Diapers, 15-50 ct.",9.85,"Huggies Diapers, any $1/1 (04-14-12) SS-3/18",8.85]
["Associated Foods","***",null,null,null,null,"Huggies Wipes, 64-72 ct.",2.4900000000000002,"Huggies Baby Wipes, any 56 ct. or larger .50/1 (04-28-12) SS-4/1",1.99]
["Associated Foods","***",null,null,null,null,"Kleenex Facial Tissue, 50-184 ct.",1.5,"Kleenex Facial Tissue, any Packs or Boxes .30/3 (04-22-12) SS-3/11","1.40 ea"]
["Associated Foods","***",null,null,null,null,"Skintimate Shaving Cream, 7-10 oz.",1.88,"Skintimate Shave Gel, any excluding 2.75 oz. cans .55/1 (05-06-12) SS-3/25",1.33]
["Associated Foods","***",null,null,null,null,"Western Family Feminine Products, 14-24 ct. Pads or 46-64 ct. Liners",1.99,null,1.99]
["Associated Foods","***",null,null,null,null,"Western Family Light Bulbs, 4 pk.",1.79,null,1.79]
["Associated Foods","***",null,null,null,null,"Wisk Liquid Laundry Detergent, 100 oz.",7.99,"Wisk Laundry Detergent, any 45 oz. or larger $2/1 (05-06-12) RP-3/25",5.99]
["Associated Foods"]
["Associated Foods","*****",null,null,null,null,"Dessert Special",5,"Use in-ad vendor coupon: Get all this for $5.00","5.00"]
["Associated Foods",null,null,null,null,null,null,null,"- (1) Western Family 56 oz. Ice Cream or Sherbet"]
["Associated Foods",null,null,null,null,null,null,null,"- (1) Western Family 18.25-18.5 oz. Cake Mix"]
["Associated Foods",null,null,null,null,null,null,null,"- (1) Western Family 16 oz. Ready to Spread Frosting"]
["Associated Foods"]
[{"$f":"IF(G1745=\"How to use this list\",G1747,A1744)","v":"Associated Foods"},"*****",null,null,null,null,"Got a list question? Want to check if next week's list is ready? Our listmakers answer questions and post our \"preview\" lists at PYP."]
["Associated Foods"]
["Associated Foods","*****",null,null,null,null,"Todays date: ","Sale","We are not affiliated with this store.  The store's ad is the only OFFICIAL authority"]
["Associated Foods","toggle 4 and 5 star rows",null,null,null,null,null,"Price"]
["Associated Foods","Stock up scale",null,null,null,null,"How to use this list",null,"Printable coupons:","Bottom line"]
["Associated Foods",null,null,null,null,null,null,null,"Group A  Group B  Group C  Singles"]
["Associated Foods",null,null,null,null,null,"Associated Foods"]
["Associated Foods",null,null,null,null,null,"\"Late Ad\" Stores",null,"Coupon Index"]
["Associated Foods",null,null,null,null,null,"Current list"]
["Associated Foods",null,null,null,null,null,"-This list is valid during the dates listed below"]
["Associated Foods","*****",null,null,null,null,"Late ads (run Wednesday - Tuesday)",null,"This list is made by Misti. She answers list questions in this thread at PYP."]
["Associated Foods"]
["Associated Foods",null,null,null,null,null,"Valid Dates: 4/11 - 4/17"]
["Associated Foods","*****",null,null,null,null,"PLEASE NOTE: This list is created from the Lees ad."]
["Associated Foods"]
["Associated Foods",null,null,null,null,null,"IT IS NOT GUARANTEED TO BE ACCURATE FOR EVERY ASSOCIATED FOOD STORE."]
["Associated Foods"]
["Associated Foods",null,null,null,null,null,"Each stores ad is the final authority on sale pricing."]
["Associated Foods","****",null,null,null,null,"Apples, Large Golden Delicious, Jonagold, Braeburn or Cameo",".99 lb",null,".99 lb"]
["Associated Foods","***",null,null,null,null,"Avocados, Organic",".99 ea",null,".99 ea"]
["Associated Foods","***",null,null,null,null,"Bell Peppers, Green",".50 ea",null,".50 ea"]
["Associated Foods","****",null,null,null,null,"Cilantro, bunch",".39 ea",null,".39 ea"]
["Associated Foods","***",null,null,null,null,"Clementine Mandarins, 3 lb. bag",4.99,null,4.99]
["Associated Foods","***",null,null,null,null,"Cucumbers",".50 ea",null,".50 ea"]
["Associated Foods","***",null,null,null,null,"Dole Salads, 9 oz. Classic Romaine or 11 oz. Just Lettuce",1.69,null,1.69]
["Associated Foods","***",null,null,null,null,"Grapes, Red or Black Seedless","1.99 lb",null,"1.99 lb"]
["Associated Foods","****",null,null,null,null,"Green Onions, bunch",".39 ea",null,".39 ea"]
["Associated Foods","*****",null,null,null,null,"Mangos",".50 ea",null,".50 ea"]
["Associated Foods","****",null,null,null,null,"Oranges, Navel",".49 lb",null,".49 lb"]
["Associated Foods","***",null,null,null,null,"Potatoes, Baker",".59 lb",null,".59 lb"]
["Associated Foods","****",null,null,null,null,"Radishes, bunch",".39 ea",null,".39 ea"]
["Associated Foods","***",null,null,null,null,"Spinach, bunch",".99 ea",null,".99 ea"]
["Associated Foods","*****",null,null,null,null,"Tomatoes, Extra Large Roma",".69 lb",null,".69 lb"]
["Associated Foods","****",null,null,null,null,"I Cant Believe Its Not Butter, 15 oz. tubs, 2 pk. 8 oz. tubs or 8 oz. spray",2.88,"I Cant Believe Its Not Butter Product, any $1.25/1 (active) Group A-02/21 Print Twice",1.63]
["Associated Foods","***",null,null,null,null,"Natural Directions Almondmilk or Soy Milk, 64 oz. Original or Vanilla",2.19,null,2.19]
["Associated Foods","****",null,null,null,null,"Sunny D, 64 oz.",0.99,null,0.99]
["Associated Foods","****",null,null,null,null,"Western Family Cottage Cheese, 16 oz.",1.19,null,1.19]
["Associated Foods","***",null,null,null,null,"Western Family Jumbos Biscuits, 16 oz.",1.25,null,1.25]
["Associated Foods","***",null,null,null,null,"Western Family Orange Juice, 89 oz. assorted",2.99,null,2.99]
["Associated Foods","***",null,null,null,null,"Western Family Yogurt, 32 oz. assorted",2,null,2]
["Associated Foods","***",null,null,null,null,"Bar S Bologna, 16 oz. Classic, Thick or Chicken",1.29,null,1.29]
["Associated Foods","***",null,null,null,null,"Bar S Ham or Turkey Breast, 16 oz.",3.49,null,3.49]
["Associated Foods","****",null,null,null,null,"Dailys Big Buy Bacon, 1 lb.",1.89,null,1.89]
["Associated Foods","***",null,null,null,null,"Johnsonville Breakfast Sausage Links, 12 oz.",2.99,"Johnsonville Breakfast Sausage Links or Patties .75/1 (05-31-12) SS-2/5",2.2400000000000002]
["Associated Foods","****",null,null,null,null,"Micellis String Cheese, 12 oz.",1.99,null,1.99]
["Associated Foods","***",null,null,null,null,"Tyson Fully Cooked Entrees, 17 oz.",5.49,null,5.49]
["Associated Foods","***",null,null,null,null,"Western Family Individually Wrapped Cheese Slices, 12 oz.",1.79,null,1.79]
["Associated Foods","***",null,null,null,null,"Western Family Jumbo Franks, 1 lb.",1.19,null,1.19]
["Associated Foods","***",null,null,null,null,"Arrowhead Spring Water, 24 pk. half liter bottles",4.49,null,4.49]
["Associated Foods","***",null,null,null,null,"Coke Products, 2 liter bottle",1.34,null,1.34]
["Associated Foods","***",null,null,null,null,"Coke Products, 20 pk. cans","2 for $13","Use in-ad vendor coupon: 2 for $11 with coupon and purchase of 2.","5.50 ea"]
["Associated Foods","*****",null,null,null,null,"Fuze, 18.5 oz. bottles",1,"Use in-ad vendor coupon: 10 for $5 with coupon and purchase of 10.",".50 ea"]
["Associated Foods","***",null,null,null,null,"Langers Juice Cocktails, 64 oz. Cranberry or Pomegranate",2.5,null,2.5]
["Associated Foods","***",null,null,null,null,"Nestle Pure Life Spring Water, 24 pk. half liter bottles",4.49,null,4.49]
["Associated Foods","****",null,null,null,null,"Pepsi Next, 12 pk. cans",2.99,null,2.99]
["Associated Foods","****",null,null,null,null,"Pepsi Next, 2 liter bottles",0.99,null,0.99]
["Associated Foods","***",null,null,null,null,"Pepsi, 7-Up or A and W Products, 12 pk. cans","3 for $14",null,"4.67 ea"]
["Associated Foods","***",null,null,null,null,"Powerade Sports Drinks, 32 oz. assorted",0.79,null,0.79]
["Associated Foods","***",null,null,null,null,"Sobe Lifewater, 20 oz. bottle",1,null,1]
["Associated Foods","***",null,null,null,null,"Western Family 100% Apple Juice or Cider, 96 oz.",2.5,null,2.5]
["Associated Foods","***",null,null,null,null,"Aunt Jemima Pancake Mix, 32 oz.",2.4900000000000002,null,2.4900000000000002]
["Associated Foods","***",null,null,null,null,"Aunt Jemima Syrup, 24 oz.",2.4900000000000002,null,2.4900000000000002]
["Associated Foods","****",null,null,null,null,"Crystal Light On the Go Drink Mixes, 7-10 ct.",1.99,"Crystal Light Drink Mix products, any $1/2 (04-30-12) SS-3/18","1.49 ea"]
["Associated Foods","***",null,null,null,null,"DaVinci Pasta, 16 oz. assorted",0.99,null,0.99]
[{"$f":"IF(G1809=\"How to use this list\",G1811,A1808)","v":"Associated Foods"},"***",null,null,null,null,"Doritos, 11-11.5 oz.",2.99,null,2.99]
["Associated Foods","***",null,null,null,null,"Grandma Sycamores Bread, 24 oz. White or Wheat",2,null,2]
["Associated Foods","***",null,null,null,null,"Hatch Green Chiles, 4 oz. Chopped or Diced",1.25,null,1.25]
["Associated Foods","***",null,null,null,null,"Jolly Time Microwave Popcorn, 2-4 pk.",1.67,"Jolly Time Microwave Popcorn, any boxes $1/2 (active) This Link-05/23","1.17 ea"]
["Associated Foods","***",null,null,null,null,"Kelloggs Cereals, 11-17 oz. Froot Loops, Apple Jacks, Frosted Flakes, Chocolate or Double Chocolate Krave",3,"Kelloggs Cereal, any 8.7 oz or larger $1/3 (active) Group A-04/03 Print Twice","2.67 ea"]
["Associated Foods","***",null,null,null,null,"Kelloggs Cereals, 11-17 oz. Froot Loops, Apple Jacks, Frosted Flakes, Chocolate or Double Chocolate Krave",3,"Kelloggs Cereals, any flavor 10 oz. or larger $1/3 (EXPIRES 04-15-12) RP-3/4","2.67 ea"]
["Associated Foods","***",null,null,null,null,"Kelloggs Cereals, 11-17 oz. Chocolate or Double Chocolate Krave",3,"Kelloggs Krave Cereal, any .50/1 (active) This Link-03/18",2.5]
["Associated Foods","***",null,null,null,null,"Kelloggs Cereals, 11-17 oz. Chocolate or Double Chocolate Krave",3,"Kelloggs Krave, Raisin Bran Cinnamon Almond, Crunchy Nut Caramel Nut and/or Frosted Mini Wheats Little Bites Cinnamon Roll Cereal, any 11 oz. or larger $1/2 (05-13-12) RP-4/1","2.50 ea"]
["Associated Foods","***",null,null,null,null,"Kelloggs Cereals, 11-17 oz. Chocolate or Double Chocolate Krave",3,"Kelloggs Krave, Raisin Bran Cinnamon Almond, Crunchy Nut Caramel Nut or Frosted Mini Wheats Little Bites Cinnamon Roll Cereal, any 11 oz. or larger .70/1 (05-13-12) RP-4/1",3.3]
["Associated Foods","***",null,null,null,null,"Kelloggs Fruit Snacks, 8oz.",1.67,null,1.67]
["Associated Foods","***",null,null,null,null,"Kelloggs Nutri-Grain Bar, 7.8-10.4 oz. assorted",2.5,null,2.5]
["Associated Foods","***",null,null,null,null,"Kraft Miracle Whip or Mayo, 30 oz. Original",2.99,"Kraft Mayo or Miracle Whip Dressing products, any .75/2 (04-22-12) SS-3/25","2.62 ea"]
["Associated Foods","***",null,null,null,null,"La Choy Bi-Packs, 42-43.5 oz.",3,null,3]
["Associated Foods","***",null,null,null,null,"La Victoria Salsa, 16 oz.",2.29,null,2.29]
["Associated Foods","***",null,null,null,null,"La Victoria Taco Sauce, 15 oz.",2.29,null,2.29]
["Associated Foods","*****",null,null,null,null,"Las Palmas Enchilada Sauce, 28 oz.",2,"Las Palmas Product, any $1/1 (active) This Link-10/08",1]
["Associated Foods","***",null,null,null,null,"Lays Potato Chips, 10-10.5 oz.",2.5,null,2.5]
["Associated Foods","***",null,null,null,null,"Minute Rice, 14 oz. Brown or Long Grain White",1.99,"Minute Rice Product, any .50/1 (04-30-12) PurinaRP-1/29",1.49]
["Associated Foods","***",null,null,null,null,"Mothers Cookies, 14 oz. bag",2.5,null,2.5]
["Associated Foods","***",null,null,null,null,"Nabisco Cheese Nips, 10.5-12 oz.",1.5,null,1.5]
["Associated Foods","***",null,null,null,null,"Quaker Cereal, 10.5-14.5 oz. Honey Graham Ohs, Life, Oatmeal Squares, Whole Hearts or Capn Crunch",2,null,2]
["Associated Foods","***",null,null,null,null,"Quaker Snack Bars, 6.5-7.4 oz. Chewy, Chewy Dipps",2.29,"Quaker Chewy Granola, Quaker Chewy Dipps Granola or Quaker Chewy Smashbar Bars, 6 ct. or larger boxes .75/2 (04-28-12) RP-3/18","1.92 ea"]
["Associated Foods","***",null,null,null,null,"Quaker Snack Bars, 6.5-7.4 oz. Soft Baked",2.29,null,2.29]
["Associated Foods","***",null,null,null,null,"Rold Gold, 7-16 oz.",2.5,null,2.5]
["Associated Foods","***",null,null,null,null,"Taco Bell Bold and Creamy Sauce, 8 oz.",1.5,null,1.5]
["Associated Foods","***",null,null,null,null,"Taco Bell Refried Beans, 16 oz.",0.79,null,0.79]
["Associated Foods","***",null,null,null,null,"Taco Bell Taco Shells, 12 ct.",1.25,null,1.25]
["Associated Foods","***",null,null,null,null,"Tostitos Tortilla Chips, 9-13 oz.",2.99,null,2.99]
["Associated Foods","****",null,null,null,null,"Western Family Bread, 24 oz. Buttermilk White Roundtop, Cracked Wheat or Golden Split Top",1.25,null,1.25]
["Associated Foods","***",null,null,null,null,"Western Family Brownie Mixes, 19.8-21.5 oz. Chewy, Classic or Dark Chocolate",1.49,null,1.49]
["Associated Foods","****",null,null,null,null,"Western Family Easy Sides, 4.3-4.5 oz. Microwaveable",0.59,null,0.59]
["Associated Foods","***",null,null,null,null,"Western Family Grape Jelly, 32 oz.",1.88,null,1.88]
["Associated Foods","***",null,null,null,null,"Western Family Peanut butter, 18 oz. Creamy, Chunky or Reduced Fat",2.4900000000000002,null,2.4900000000000002]
["Associated Foods","***",null,null,null,null,"Western Family Premium Chunk Chicken Breast, 10 oz.",2.5,null,2.5]
["Associated Foods","*****",null,null,null,null,"Western Family Tomato Sauce, 8 oz.",0.33,null,0.33]
["Associated Foods","***",null,null,null,null,"Wonder Classic White Bread, 20 oz.",2,null,2]
["Associated Foods","***",null,null,null,null,"Farr Ice Cream, 4 qt. pail",5.99,null,5.99]
["Associated Foods","***",null,null,null,null,"PictSweet Vegetables, 8-12 oz. Deluxe or Seasoned",1.5,null,1.5]
["Associated Foods","***",null,null,null,null,"Rhodes Warm N Serve Rolls, 6-9 ct. pan",2,"Rhodes Bread or Rolls, any .55/1 (05-20-12) RP-3/25",1.45]
["Associated Foods","***",null,null,null,null,"Stouffers Frozen Meals, 6-12.7 oz.",2.69,"Stouffers Entrees or French Bread Pizzas, any $1.10/5 (active) This Link-04/07 Print Twice","2.47 ea"]
["Associated Foods","***",null,null,null,null,"Tillamook Ice Cream, 1.75 qt.",3.99,null,3.99]
["Associated Foods","***",null,null,null,null,"Tombstone Pizza, 12 inch",3.99,null,3.99]
["Associated Foods","***",null,null,null,null,"Western Family Burritos, 5 oz.",0.33,null,0.33]
["Associated Foods","***",null,null,null,null,"Western Family Chicken, 26 oz. Frozen Dino Nuggets or Popcorn",4.99,null,4.99]
["Associated Foods","***",null,null,null,null,"Western Family Crunchy Fillets or Fish Sticks, 19-24 oz.",3.99,null,3.99]
["Associated Foods","***",null,null,null,null,"Allegra Allergy Relief, 30 ct. Tablets",11.99,"Allegra Allergy 30 ct or higher, Allegra-D 24 hr 10 ct or higher or Allegra-D 12 hr 20 ct or higher $4/1 (active) Group B-03/18 Print Twice",7.99]
["Associated Foods","***",null,null,null,null,"Allegra Allergy Relief, 15 ct. 24 Hour",11.99,"Allegra Allergy 5, 12 or 15 ct, Childrens Allegra, Allegra-D 24 hr 5 ct or Allegra-D 12 hr 10 ct $2/1 (active) Group B-03/18 Print Twice",9.99]
["Associated Foods","****",null,null,null,null,"Aquafresh Toothpaste, 6-6.4 oz. assorted",0.88,null,0.88]
["Associated Foods","***",null,null,null,null,"Band-Aid Bandages, 10-80 ct.",2,null,2]
["Associated Foods","***",null,null,null,null,"Coppertone Sunscreen, 6-8 oz. Babys or Kids",8.8800000000000008,"Coppertone Sun Care, any excluding lip balm and trial sizes $1/1 (active) This Link-02/04",7.88]
["Associated Foods","***",null,null,null,null,"Cottonelle Bathroom Tissue, 12 Double Roll Clean Care or Ultra",6.99,null,6.99]
["Associated Foods","***",null,null,null,null,"Edge Shaving Cream, 7-10 oz.",1.88,"Edge Shave Gel, any 7 oz. or larger .55/1 (05-06-12) SS-3/25",1.33]
["Associated Foods","***",null,null,null,null,"Finish Powerball Tabs, 32 ct.",4.99,"Finish Powerball Tabs or Gelpacs, any .75/1 (EXPIRES 04-15-12) SS-3/11",4.24]
["Associated Foods","***",null,null,null,null,"Finish Powerball Tabs, 32 ct.",4.99,"Finish Powerball or Gelpacs Dishwasher detergent .50/1 (active) This Link-04/02",4.49]
["Associated Foods","***",null,null,null,null,"Glad ******zer or Storage Bags, 30-50 ct. gallon or quart",2.99,"Glad Food Storage Products, any $1/2 (active) This Link-08/21","2.49 ea"]
["Associated Foods","***",null,null,null,null,"Huggies Diapers, 15-50 ct.",9.85,"Huggies Diapers, any $1/1 (EXPIRES 04-14-12) SS-3/18",8.85]
["Associated Foods","***",null,null,null,null,"Huggies Wipes, 64-72 ct.",2.4900000000000002,"Huggies Baby Wipes, any 56 ct. or larger .50/1 (04-28-12) SS-4/1",1.99]
["Associated Foods","***",null,null,null,null,"Kleenex Facial Tissue, 50-184 ct.",1.5,"Kleenex Facial Tissue, any Packs or Boxes .30/3 (04-22-12) SS-3/11","1.40 ea"]
["Associated Foods","***",null,null,null,null,"Skintimate Shaving Cream, 7-10 oz.",1.88,"Skintimate Shave Gel, any excluding 2.75 oz. cans .55/1 (05-06-12) SS-3/25",1.33]
["Associated Foods","***",null,null,null,null,"Western Family Feminine Products, 14-24 ct. Pads or 46-64 ct. Liners",1.99,null,1.99]
["Associated Foods","***",null,null,null,null,"Western Family Light Bulbs, 4 pk.",1.79,null,1.79]
["Associated Foods","***",null,null,null,null,"Wisk Liquid Laundry Detergent, 100 oz.",7.99,"Wisk Laundry Detergent, any 45 oz. or larger $2/1 (05-06-12) RP-3/25",5.99]
["Associated Foods"]
["Associated Foods","*****",null,null,null,null,"Dessert Special",5,"Use in-ad vendor coupon: Get all this for $5.00","5.00"]
[{"$f":"IF(G1873=\"How to use this list\",G1875,A1872)","v":"Associated Foods"},null,null,null,null,null,null,null,"- (1) Western Family 56 oz. Ice Cream or Sherbet"]
["Associated Foods",null,null,null,null,null,null,null,"- (1) Western Family 18.25-18.5 oz. Cake Mix"]
["Associated Foods",null,null,null,null,null,null,null,"- (1) Western Family 16 oz. Ready to Spread Frosting"]
["Associated Foods"]
["Associated Foods","*****",null,null,null,null,"Got a list question? Want to check if next week's list is ready? Our listmakers answer questions and post our \"preview\" lists at PYP."]
["Associated Foods"]
["Associated Foods","*****",null,null,null,null,"Todays date: ","Sale","We are not affiliated with this store.  The store's ad is the only OFFICIAL authority"]
["Associated Foods","toggle 4 and 5 star rows",null,null,null,null,null,"Price"]
["Albertsons","Stock up scale",null,null,null,null,"How to use this list",null,"Printable coupons:","Bottom line"]
["Albertsons",null,null,null,null,null,null,null,"Group A  Group B  Group C  Singles"]
["Albertsons",null,null,null,null,null,"Albertsons"]
["Albertsons",null,null,null,null,null,"Current list",null,"Coupon Index"]
["Albertsons",null,null,null,null,null,"-This list is valid during the dates listed below"]
["Albertsons","*****",null,null,null,null,"Valid Dates: 4/11 through 4/17",null,"This list is made by Misti. She answers list questions in this thread at PYP."]
["Albertsons"]
["Albertsons",null,null,null,null,null,"Sale prices are effective at the following locations:"]
["Albertsons",null,null,null,null,null,"915 Redcliffs Dr. Washington UT"]
["Albertsons",null,null,null,null,null,"745 N. Dixie Dr. St. George UT"]
["Albertsons",null,null,null,null,null,"835 S. Bluff St. St. George UT"]
["Albertsons",null,null,null,null,null,"740 N. Main, Tooele UT"]
["Albertsons","*****",null,null,null,null,"Apples, Cameo or Braeburn",".68 lb",null,".68 lb"]
["Albertsons","***",null,null,null,null,"Avocados, Medium Hass",".99 ea",null,".99 ea"]
["Albertsons","***",null,null,null,null,"Blackberries, 6 oz.",1.99,null,1.99]
["Albertsons","***",null,null,null,null,"Broccoli, bunch","1.29 lb",null,"1.29 lb"]
["Albertsons","***",null,null,null,null,"Cantaloupe",".99 lb",null,".99 lb"]
["Albertsons","***",null,null,null,null,"Carrots, 1 lb. Farm Stand Baby Cut",1.69,null,1.69]
["Albertsons","***",null,null,null,null,"Cilantro",".50 ea",null,".50 ea"]
["Albertsons","***",null,null,null,null,"Dole Classic Romaine, Greener Selection, Just Lettuce or Spinach, 9-12 oz. bags",1.88,null,1.88]
["Albertsons","***",null,null,null,null,"Eat Smart Cut Vegetables, 12 oz.",1.5,null,1.5]
["Albertsons","***",null,null,null,null,"Leaf Lettuce, Green Red or Romaine","1.29 ea",null,"1.29 ea"]
["Albertsons","***",null,null,null,null,"Mangos","1.00 ea",null,"1.00 ea"]
["Albertsons","***",null,null,null,null,"Onions, 3 lb. bag Yellow",1.49,null,1.49]
["Albertsons","***",null,null,null,null,"Orange, Medium Navel",".99 lb",null,".99 lb"]
["Albertsons","***",null,null,null,null,"Potatoes, 10 lb. bag Farm Stand Russet",2.99,null,2.99]
["Albertsons","***",null,null,null,null,"Strawberries, 1 lb.",2.5,null,2.5]
["Albertsons","***",null,null,null,null,"Wonderful In-Shell Pistachios, 10 oz.",4.99,"Wonderful Pistachios, 5 oz. packages or larger $1/2 (06-30-12) SS-3/18","4.49 ea"]
["Albertsons","***",null,null,null,null,"Beef - Albertsons 85% Lean Ground, 3 lbs or more","2.99 lb",null,"2.99 lb"]
["Albertsons","***",null,null,null,null,"Beef - Albertsons Petite Sirloin or Tri-Tip Steak, boneless max pak","4.99 lb",null,"4.99 lb"]
["Albertsons","***",null,null,null,null,"Chicken - Albertsons Split Breasts, bone-in","1.79 lb",null,"1.79 lb"]
["Albertsons","****",null,null,null,null,"Chicken - Boneless Skinless Breasts","1.99 lb",null,"1.99 lb"]
["Albertsons","***",null,null,null,null,"Chicken - Chefs Trim Boneless Skinless Thighs","2.49 lb",null,"2.49 lb"]
["Albertsons","***",null,null,null,null,"Pork - Shoulder Roasts, bone-in","2.59 lb",null,"2.59 lb"]
["Albertsons","***",null,null,null,null,"Pork - St. Louis Style Spareribs, previously frozen","3.69 lb",null,"3.69 lb"]
["Albertsons","***",null,null,null,null,"Seafood - Atlantic Salmon Portions, fresh","3.99 ea",null,"3.99 ea"]
["Albertsons","***",null,null,null,null,"Albertsons Cottage Cheese, 24 oz.",3.39,null,3.39]
["Albertsons","***",null,null,null,null,"Blue Diamond Almond Breeze, 64 oz.",3,"Blue Diamond Almond Breeze Almondmilk, any Refrigerated .55/1 (04-30-12) SS-3/18",2.4500000000000002]
["Albertsons","***",null,null,null,null,"Blue Diamond Almond Breeze, 64 oz.",3,"Blue Diamond Almond Breeze Almond Milk, any .55/1 (active) This Link-01/28",2.4500000000000002]
["Albertsons","***",null,null,null,null,"Floridas Natural Orange Juice, 59 oz.",3.29,null,3.29]
["Albertsons","*****",null,null,null,null,"Maid O Clover Milk, gallon 2%, 1% or Fat ******",2.39,"With in-ad store coupon.",1.64]
["Albertsons",null,null,null,null,null,"Limit 2",null,"Also use manufacturers coupon: Milk, any brand gallon White or Chocolate excluding Soy Milk .75/1 or (2) half gallons (active) Group A-12/01 Print Twice"]
["Albertsons",null,null,null,null,null,"3 Days Only! 4/13-4/15!"]
["Albertsons","***",null,null,null,null,"Yoplait Delights Multipack, 4 pk.",2.5,null,2.5]
["Albertsons","***",null,null,null,null,"Yoplait Greek Yogurt Multipack, 4 pk.",2.5,"Yoplait Greek Yogurt 4-pack, any flavor .75/1 (05-05-12) SS-3/11",1.75]
["Albertsons","***",null,null,null,null,"Yoplait Go-Gurt or Kid Trix Yogurt, 6-8 pk.",2.5,"Yoplait products listed, any flavor Go-gurt Yogurt, Kids Cup Yogurt, Trix Multipack Yogurt or Yoplait Splitz Yogurt .75/2 (05-05-12) SS-3/11","2.13 ea"]
["Albertsons","****",null,null,null,null,"Yoplait Greek Yogurt Cups, 6 oz.",1,"Yoplait Greek Yogurt, any flavor cups .50/2 (05-19-12) SS-3/25",".75 ea"]
["Albertsons","***",null,null,null,null,"Yoplait Kids Yogurt Multipack, 4 pk.",2,null,2]
["Albertsons","***",null,null,null,null,"Yoplait Light or Original Multipack, 4 pk.",2,null,2]
["Albertsons","****",null,null,null,null,"Yoplait Light Yogurt with Granola, 2 pk.",2,"Yoplait Yogurt Light Yogurt with Granola, any package .75/1 (active) Group B-04/02 Print Twice",1.25]
["Albertsons","****",null,null,null,null,"Yoplait Light or Greek Yogurt with Granola, 2 pk.",2,"Yoplait Light OR Greek Yogurt with Granola .75/1 (05-19-12) SS-3/25",1.25]
["Albertsons","***",null,null,null,null,"Yoplait Parfait, 2 pk.",2,null,2]
["Albertsons","***",null,null,null,null,"Albertsons Cheese Singles, 10.7-12 oz.",3.49,null,3.49]
["Albertsons","***",null,null,null,null,"Albertsons Chunk or Shredded Cheese, 6-8 oz.",2.99,null,2.99]
["Albertsons","***",null,null,null,null,"Albertsons Ricotta Cheese, 15 oz.",3.49,null,3.49]
["Albertsons","****",null,null,null,null,"Bar-S meat Franks, 16 oz.",0.88,"With in-ad store coupon.",0.88]
[{"$f":"IF(G1937=\"How to use this list\",G1939,A1936)","v":"Albertsons"},null,null,null,null,null,"Limit 4"]
["Albertsons",null,null,null,null,null,"3 Days Only! 4/13-4/15!"]
["Albertsons","***",null,null,null,null,"Bar-S Smoked Sausage, 2.5 lb.",6.99,null,6.99]
["Albertsons","***",null,null,null,null,"Hormel Country Crock Side Dishes, 20-24 oz.",3,"Hormel Country Crock Side Dishes, any .55/1 (active) This Link-10/05",2.4500000000000002]
["Albertsons","***",null,null,null,null,"Hormel Little Sizzlers Breakfast Sausage, 12 oz.",1.67,null,1.67]
["Albertsons","***",null,null,null,null,"Jennie-O Smoked Sausage, 14 oz.",3.79,null,3.79]
["Albertsons","***",null,null,null,null,"Land O Frost Premium Lunchmeat, 16 oz.",4.99,null,4.99]
["Albertsons","***",null,null,null,null,"Albertsons Spring or Purified Water, 24 pk. 16.9 oz. bottles",3.5,null,3.5]
["Albertsons","***",null,null,null,null,"Arrowhead Spring Water, 6 pk. 16.9 oz. bottles or 3 liter bottle",1,null,1]
["Albertsons","***",null,null,null,null,"Coca Cola Soft Drinks, 2 liter bottle",1.25,null,1.25]
["Albertsons","***",null,null,null,null,"Coca Cola Soft Drinks, 20 pk. cans",6.49,"Extra Promo: $5.99 each when you buy 2 in a single transaction","5.99 ea"]
["Albertsons","***",null,null,null,null,"Dasani Water, 24 pk. 16.9 oz. bottles",4,null,4]
["Albertsons","***",null,null,null,null,"Hawaiian Punch Juice, 32 oz.",1,null,1]
["Albertsons","***",null,null,null,null,"Kool Aid Bursts, 6 pk.",1,null,1]
["Albertsons","***",null,null,null,null,"Mi0 Liquid Water Enhancers, 1.62 oz.",3.99,"Mi0 or Mi0 Energy Liquid Water Enhancer, any $1/1 (04-30-12) SS-2/26",2.99]
["Albertsons","****",null,null,null,null,"Nestle Pure Life Water, 24 pk. 16.9 oz. bottles",2.99,"With in-ad store coupon.",2.99]
["Albertsons",null,null,null,null,null,"Limit 2"]
["Albertsons",null,null,null,null,null,"3 Days Only! 4/13-4/15!"]
["Albertsons","****",null,null,null,null,"Pepsi Soft Drinks, 12 pk. cans","2 for $9","Extra Promo: Pepsi Next 12 pk. ****** up to $4.50 when you buy any 2 Pepsi Soft Drink 12 packs.",4.5]
["Albertsons","***",null,null,null,null,"Pepsi Soft Drinks, 2 liter bottle",1.67,null,1.67]
["Albertsons","***",null,null,null,null,"Propel Fitness Water, 24 oz. bottles",1,null,1]
["Albertsons","***",null,null,null,null,"Snapple Tea or Fruit Drink, 16 oz. bottle",1,null,1]
["Albertsons","***",null,null,null,null,"Super Chill Soft Drinks, 12 pk. cans",3.5,null,3.5]
["Albertsons","***",null,null,null,null,"Super Chill Soft Drinks, 2 liter bottle",1,null,1]
["Albertsons","***",null,null,null,null,"Albertsons Apple Sauce, 23-24 oz.",1,null,1]
["Albertsons","***",null,null,null,null,"Albertsons Canned Fruit, 15-15.25 oz.",1.39,null,1.39]
["Albertsons","***",null,null,null,null,"Albertsons Chicken Noodle or Tomato Soup, 10.5-10.75 oz.",1,null,1]
["Albertsons","***",null,null,null,null,"Albertsons Premium Shapes Mac N Cheese, 5.5-7.3 oz.",1,null,1]
["Albertsons","***",null,null,null,null,"Bertolli Extra Virgin or Extra Light Olive Oil, 17 oz.",5.99,null,5.99]
["Albertsons","***",null,null,null,null,"Chef Boyardee Pasta, 14.75-15 oz. can With Meat or 7.5 oz. Microwave",1,null,1]
["Albertsons","***",null,null,null,null,"Chicken of the Sea Premium Chunk Light Tuna, 2.5 oz. pouch",1,null,1]
["Albertsons","***",null,null,null,null,"Dole Mandarin Oranges, 15 oz.",1.5,null,1.5]
["Albertsons","***",null,null,null,null,"Essential Everyday or Albertsons Snacker Crackers, 14.5-16 oz.",2.79,null,2.79]
["Albertsons","***",null,null,null,null,"Essential Everyday Salad Dressing, 16 oz.",2.39,null,2.39]
["Albertsons","***",null,null,null,null,"Essential Everyday Widepan Breads, 24 oz.",1.79,"With in-ad store coupon.",1.79]
["Albertsons",null,null,null,null,null,"Limit 2"]
["Albertsons",null,null,null,null,null,"3 Days Only! 4/13-4/15!"]
["Albertsons","***",null,null,null,null,"Guldens Mustard, 12 oz.",1,null,1]
["Albertsons","***",null,null,null,null,"Hormel Compleats, 10 oz.",2.5,null,2.5]
["Albertsons","***",null,null,null,null,"Hunts Barbecue Sauce, 21.6 oz.",1,null,1]
["Albertsons","***",null,null,null,null,"Hunts Diced Tomatoes or Fire Roasted Diced Tomatoes, 14.5-15 oz.",1,"Hunts Tomatoes, any 11 oz or larger .40/2 (active) This Link-01/23",".80 ea"]
["Albertsons","***",null,null,null,null,"Hunts Ketchup, 24 oz.",1,null,1]
["Albertsons","***",null,null,null,null,"Hunts Pasta Sauce, 24-26.5 oz.",1,null,1]
["Albertsons","***",null,null,null,null,"Idahoan Potatoes, 4-4.1 oz.",1,null,1]
["Albertsons","***",null,null,null,null,"Jif Peanut Butter, 17.3-18 oz.",3.49,null,3.49]
["Albertsons","***",null,null,null,null,"Kelloggs Fruit Snacks, 8 oz.",1.99,null,1.99]
["Albertsons","****",null,null,null,null,"Knorr Rice or Pasta Side Dishes, 3.8-5.8 oz.",0.79,"With in-ad store coupon.",0.79]
["Albertsons",null,null,null,null,null,"Limit 4"]
["Albertsons",null,null,null,null,null,"3 Days Only! 4/13-4/15!"]
["Albertsons","***",null,null,null,null,"Lawrys Seasoning Mixes, .88-1.5 oz.",1,null,1]
["Albertsons","***",null,null,null,null,"Lays Potato Chips, 10-10.5 oz.",3,null,3]
["Albertsons","***",null,null,null,null,"Libbys Vienna Sausage, 5 oz.",1,null,1]
["Albertsons","*****",null,null,null,null,"McCormick Recipe Creations, .23-.46 oz.",1,"McCormick Spice, Herb, Extract or Food Color, any .75/1 (05-06-12) RP-3/25",0.25]
["Albertsons","***",null,null,null,null,"Nabisco Belvita Breakfast Biscuits, 8.8 oz.",2.99,"Nabisco Belvita Breakfast Biscuits $1/1 (04-30-12) SS-2/26",1.99]
["Albertsons","***",null,null,null,null,"Nabisco Belvita Breakfast Biscuits, 8.8 oz.",2.99,"Nabisco Belvita Breakfast Biscuit AND 1 Gallon of Milk, Save $1.00 when you buy BOTH (active) Group A-04/08 Print Twice",2.99]
["Albertsons",null,null,null,null,null,null,null,"NOTE: You must buy BOTH products to use this coupon."]
["Albertsons","***",null,null,null,null,"Rosarita Refried Beans, 16 oz.",1,null,1]
["Albertsons","***",null,null,null,null,"S and W Beans, 15-15.5 oz.",1,null,1]
["Albertsons","***",null,null,null,null,"Seattles Best Coffee, 12 oz.",5.99,null,5.99]
["Albertsons","***",null,null,null,null,"Snyders of Hanover Pounder Pretzels, 16 oz.",2.79,null,2.79]
["Albertsons","***",null,null,null,null,"Star Vinegar, 12 oz.",2.5,null,2.5]
["Albertsons","***",null,null,null,null,"Stride or Trident Multi-pack gum, 3 pk.",2,null,2]
["Albertsons","***",null,null,null,null,"Tostitos Tortilla Chips, 9-13 oz.",3.5,"Extra Promo: Tostitos Salsa or Con Queso or Fritos Chili Cheese Dip, or Lays Dips, 15-15.75 oz. ****** up to $3.49 when you buy any 2 Tostitos Tortilla Chips.",3.5]
["Albertsons","***",null,null,null,null,"Valley Fresh Canned Chicken, 5 oz.",2,null,2]
[{"$f":"IF(G2001=\"How to use this list\",G2003,A2000)","v":"Albertsons"},"***",null,null,null,null,"Wonder Classic Bread, 20 oz.",1.99,null,1.99]
["Albertsons","***",null,null,null,null,"Wrigleys Orbit Single Serve Gum, 14 ct.",1,null,1]
["Albertsons","***",null,null,null,null,"Zatarains Rice, 5.7-8 oz.",1,null,1]
["Albertsons","***",null,null,null,null,"Albertsons French Fries or Potato Rounds, 26-32 oz.",2.79,null,2.79]
["Albertsons","***",null,null,null,null,"Albertsons Ice Cream, 1.5 qt.",3,null,3]
["Albertsons","***",null,null,null,null,"Albertsons Vegetables, 12-16 oz. Frozen or 12 oz. Steamy",1,null,1]
["Albertsons","***",null,null,null,null,"California Pizza Kitchen Crispy Thin Crust, 11.5-17 oz.",5.5,null,5.5]
["Albertsons","***",null,null,null,null,"DiGiorno Original Pizza, 12.6-33.3 oz.",5.5,null,5.5]
["Albertsons","***",null,null,null,null,"Essential Everyday Pasta, 12-16 oz.",1,null,1]
["Albertsons","***",null,null,null,null,"Kashi Steam Meals, 9.5 oz.",3.5,"Kashi Steam Meal, any $1/1 (active) Group A-04/01 Print Twice",2.5]
["Albertsons","***",null,null,null,null,"Michelinas Entrees, 8-9 oz. Authentico, 4.5-7.5 oz. Zapems gourmet, 4.65-9 oz. Lean Gourmet, 8-9 oz. Traditional Recipes",1,null,1]
["Albertsons","***",null,null,null,null,"New York Cheese Toast, 13.5 oz.",3,"New York Brand Frozen Product, any .50/1 (04-30-12) SS-2/5 and (05-15-12) SS-3/11",2.5]
["Albertsons","***",null,null,null,null,"Old Orchard Apple Juice or Cranberry, Apple or Pomegranate Juice Blends, 12 oz. frozen",1.5,null,1.5]
["Albertsons","***",null,null,null,null,"Red Baron Single Serve Pizzas, 10.8-11.6 oz.",3,null,3]
["Albertsons","***",null,null,null,null,"Shoppers Value Pizza, 5.25 oz.",1,null,1]
["Albertsons","***",null,null,null,null,"Stouffers Party Size Entrees, 57-96 oz.",12.99,"Stouffers multi-serve entree, any 28-96 oz. $2/1 (04-30-12) PurinaRP-1/29",10.99]
["Albertsons","****",null,null,null,null,"Aim, Pepsodent or Close Up Toothpaste, 6 oz.",1,null,1]
["Albertsons","***",null,null,null,null,"Allegra 24 Hour Allergy Relief, 15 ct.",11.99,"Allegra Allergy 5, 12 or 15 ct, Childrens Allegra, Allegra-D 24 hr 5 ct or Allegra-D 12 hr 10 ct $2/1 (active) Group B-03/18 Print Twice",9.99]
["Albertsons","***",null,null,null,null,"Aussie or Herbal Essences Shampoo, Conditioner or Styling Products, 5.7-14 oz.",3,"Herbal Essences or Aussie products, excludes trial/travel size $1/2 (04-30-12) PG-4/1","2.50 ea"]
["Albertsons","***",null,null,null,null,"Awesome Paper Towels, 1 ct.",1,null,1]
["Albertsons","***",null,null,null,null,"Bounce Fabric Softener, 80 ct. sheets",3.99,"Bounce, excludes trial/travel size .50/1 (04-30-12) SS-3/11",3.49]
["Albertsons","***",null,null,null,null,"Brawny Paper Towels, 8 Regular Rolls",5.99,"Brawny Paper Towels, any FACEBOOK COUPON $1/1 (active) This Link-03/11",4.99]
["Albertsons","***",null,null,null,null,"Brawny Paper Towels, 8 Regular Rolls",5.99,"Brawny Paper Towels, 2-Roll or larger packs $1/2 (06-04-12) RP-3/4","5.49 ea"]
["Albertsons","***",null,null,null,null,"Colgate Kids Toothpaste, 5-5.2 oz.",2.5,"Colgate Kids Toothpaste, any .50/1 (EXPIRES 04-14-12) SS-3/25",2]
["Albertsons","***",null,null,null,null,"Colgate Total Toothpaste, 5-5.2 oz.",2.5,"Colgate Toothpaste, any 4 oz. or larger .75/1 (EXPIRES 04-14-12) SS-3/25",1.75]
["Albertsons","***",null,null,null,null,"Cottonelle Bath Tissue, 18 ct. Double Roll",9.99,null,9.99]
["Albertsons","***",null,null,null,null,"Dial Basic or Coast Bar or Hand Soap, 3 ct. or 9.4 oz.",1,null,1]
["Albertsons","***",null,null,null,null,"Downy Fabric Softener, 34 or 64 oz.",3.99,"Downy, excludes trial/travel size .50/1 (04-30-12) SS-3/11",3.49]
["Albertsons","***",null,null,null,null,"Downy Unstopables pr Gain Scent Boosters, 13.2 oz.",5.99,"Downy Unstopables or Gain Fireworks, excludes trial/travel size .50/1 (04-30-12) PG-4/1",5.49]
["Albertsons","***",null,null,null,null,"Homelife Liquid Laundry Detergent, 100 oz.",5.99,null,5.99]
["Albertsons","***",null,null,null,null,"Homelife Napkins, 120 ct.",1,null,1]
["Albertsons","***",null,null,null,null,"Homelife Whisper Soft Facial Tissue, 66-160 ct.",1,null,1]
["Albertsons","***",null,null,null,null,"Palmolive Liquid Dish Detergent, 25 oz.",2.5,null,2.5]
["Albertsons","***",null,null,null,null,"Quilted Northern Bath Tissue, 12 ct. Double Roll",5.99,null,5.99]
["Albertsons","***",null,null,null,null,"Shoppers Value Plastic Wrap, 100 sq. ft.",1,null,1]
["Albertsons","****",null,null,null,null,"SpeedStick or Lady SpeedStick, 2.3-3.25 oz.","B1G1 ******","Speed Stick Antiperspirant/Deodorant or Lady Speed Stick Antiperspirant/Deodorant, any excluding 2 oz, 1.4 oz, and .5 oz sizes $1/1 (EXPIRES 04-14-12) SS-3/25","Varies"]
["Albertsons","***",null,null,null,null,"Suavitel Liquid Fabric Softener, 56 oz.",2.4900000000000002,null,2.4900000000000002]
["Albertsons","***",null,null,null,null,"Tide Liquid Laundry Detergent, 50 oz.",4.99,"With in-ad store coupon.","4.49 ea"]
["Albertsons",null,null,null,null,null,"Limit 2",null,"Also use manufacturers coupon: Tide, Downy, Bounce or Tide Stain Release, excludes Tide PODS and trial/travel size $1/2 (04-30-12) PG-4/1"]
["Albertsons",null,null,null,null,null,"3 Days Only! 4/13-4/15!"]
["Albertsons","***",null,null,null,null,"Tide Liquid Laundry Detergent, 50 oz.",4.99,"With in-ad store coupon.",4.49]
["Albertsons",null,null,null,null,null,"Limit 2",null,"Also use manufacturers coupon: Tide Detergent, excludes Tide PODS and trial/travel size .50/1 (04-30-12) SS-3/11"]
["Albertsons",null,null,null,null,null,"3 Days Only! 4/13-4/15!"]
["Albertsons","***",null,null,null,null,"Tide Stain Release, 36 oz. liquid or 18 ct. packs",5.99,"Tide Stain Release, excludes trial/travel size .50/1 (04-30-12) SS-3/11",5.49]
["Albertsons","***",null,null,null,null,"Tide Stain Release, 36 oz. liquid or 18 ct. packs",5.99,"Tide, Downy, Bounce or Tide Stain Release, excludes Tide PODS and trial/travel size .50/1 (04-30-12) PG-4/1",5.49]
["Albertsons","***",null,null,null,null,"Viva Paper Towels, 8 ct. Mega Roll",9.99,"Viva Paper Towels Big Rolls, any .40/1 or more rolls (05-06-12) SS-3/11",9.59]
["Albertsons"]
["Albertsons","*****",null,null,null,null,"Extra Promo: Buy any 10 participating drink products, get 10 Fuze drinks ******!",null,"Sale prices listed are BEFORE/AFTER purchase of 10, receiving 10 Fuze ******. Bottom line price is 20 drink products for $10 or .50 each!"]
["Albertsons","*****",null,null,null,null,"Fuze, 16.9 oz.","1.00/.50",null,0.5]
["Albertsons","*****",null,null,null,null,"Glaceau Smartwater, 1 liter bottle","1.00/.50",null,0.5]
["Albertsons","*****",null,null,null,null,"Glaceau Vitaminwater, 20 oz. bottle","1.00/.50",null,0.5]
["Albertsons","*****",null,null,null,null,"Powerade or Powerade Zero Sports Drink, 32 oz. bottle","1.00/.50",null,0.5]
["Albertsons"]
["Albertsons","*****",null,null,null,null,"Extra Promo: 4 for $6 when you buy 4 in a single transaction. Individual price $2.00 each.",null,"Must buy 4 for sale price."]
["Albertsons","****",null,null,null,null,"Healthy Choice Steaming or Simple Select Entrees, 8.5-9.9 oz.",1.5,null,1.5]
["Albertsons","***",null,null,null,null,"Kid Cuisine, 7.21-10.6 oz.",1.5,null,1.5]
["Albertsons"]
["Albertsons","*****",null,null,null,null,"Kelloggs Promo: $1.99 each when you buy 4 in a single transaction. Individual price $2.99 each.",null,"Must buy 4 for sale price."]
["Albertsons","***",null,null,null,null,"Keebler Granola Fudge Bars, 7.4 oz.",1.99,null,1.99]
["Albertsons","***",null,null,null,null,"Kelloggs Cereals, 15.5-18 oz. Frosted Mini Wheats Bite Size",1.99,"Kelloggs Frosted Mini-Wheats Cereal, any $1/2 (active) This Link-03/18",1.99]
["Albertsons","***",null,null,null,null,"Kelloggs Cereals, 15.5-18 oz. Frosted Mini Wheats Bite Size, 10.8-14.1 oz. Crunchy Nut, 20 oz. Raisin Bran, 14 oz. Frosted Flakes",1.99,"Kelloggs Cereal, any 8.7 oz or larger $1/3 (active) Group A-04/03 Print Twice","1.66 ea"]
["Albertsons","***",null,null,null,null,"Kelloggs Cereals, 15.5-18 oz. Frosted Mini Wheats Bite Size, 10.8-14.1 oz. Crunchy Nut, 20 oz. Raisin Bran, 14 oz. Frosted Flakes",1.99,"Kelloggs Cereals, any flavor 10 oz. or larger $1/3 (EXPIRES 04-15-12) RP-3/4","1.66 ea"]
["Albertsons","****",null,null,null,null,"Kelloggs Cereals, 20 oz. Raisin Bran",1.99,"Kelloggs Raisin Bran or Smart Start Cereal, any 14.7 oz or larger $1/2 (active) Group A-04/03 Print Twice","1.49 ea"]
["Albertsons","***",null,null,null,null,"Kelloggs Pop-Tarts Mini Crisps, 4.86 oz.",1.99,"Kelloggs Pop-Tarts Mini Crisps, any flavor 6 ct. or larger .50/1 (EXPIRES 04-15-12) RP-3/4",1.49]
[{"$f":"IF(G2065=\"How to use this list\",G2067,A2064)","v":"Albertsons"},"*****",null,null,null,null,"Kelloggs Pop-Tarts, 12 ct.",1.99,"Kelloggs Pop-Tarts or Pop-Tarts Mini Crisps, any 6 ct or larger $1/3 (active) Group A-04/03 Print Twice","1.66 ea"]
["Albertsons","*****",null,null,null,null,"Kelloggs Pop-Tarts, 12 ct.",1.99,"Kelloggs Pop-Tarts Toaster Pastries, any flavor 8 ct. or larger $1/3 (EXPIRES 04-15-12) RP-3/4","1.66 ea"]
["Albertsons","***",null,null,null,null,"Kelloggs Rice Krispies Treats, 8 ct.",1.99,null,1.99]
["Albertsons"]
["Albertsons","***",null,null,null,null,"Extra Promo: ****** First Aid Kit, including 15 in valuable coupons, instantly when you buy 3 participating Johnson and Johnson First Aid products in a single transaction.",null,"Limit 1 per transaction."]
["Albertsons","***",null,null,null,null,"Band-Aid Brand Premium Bandages, 10-80 ct.",3.33,null,3.33]
["Albertsons","***",null,null,null,null,"Neosporin Ointment, .5 oz.",3.33,"Neosporin product, any excluding trial sizes $1/1 (EXPIRES 04-15-12) SS-2/26",2.33]
["Albertsons","***",null,null,null,null,"Red Cross Gauze Pads or Tapes, 1-25 ct.","15% off","Johnson and Johnson Red Cross Product AND Neosporin, any, Save $2.00 when you buy BOTH (active) This Link-09/24","Varies"]
["Albertsons","***",null,null,null,null,"Red Cross Gauze Pads or Tapes, 1-25 ct.","15% off","Johnson and Johnson Red Cross Brand Products, any $1.50/2 (active) This Link-09/24","Varies"]
["Albertsons"]
["Albertsons","***",null,null,null,null,"Baby Savings Promo: Save $5 instantly when you buy 2 participating large powder baby formula products in a single transaction.",null,"Sale prices listed are BEFORE/AFTER $5 instant savings. Discount is essentially $2.50 per item."]
["Albertsons","***",null,null,null,null,"Similac Powder Infant Formula, makes 168-169 oz.","24.79/22.29",null,22.29]
["Albertsons","***",null,null,null,null,"Enfamil Powder Formula, makes 161-170 oz.","24.69/22.19",null,22.19]
["Albertsons","***",null,null,null,null,"Gerber Good Start Formula, makes 164-182 oz.","23.99/21.49","Gerber Good Start Powder Formula, any 22 oz or larger $3.25/2 (active) This Link-03/31","19.87 ea"]
["Albertsons"]
["Albertsons","*****",null,null,null,null,"The following items will earn you a checkout coupon for use on your NEXT shopping trip. Coupon issued at checkout for each qualifying purchase. NO LIMITS!",null,"Coupon will print at checkout valid on your NEXT shopping trip."]
["Albertsons",null,null,null,null,null,null,null,"Final prices factor in each checkout coupon, as well as manufacturers coupons listed."]
["Albertsons","***",null,null,null,null,"Bounty Basic Paper Towels, single roll",0.99,"Receive a $1.00 coupon with purchase of 3",".66 ea"]
["Albertsons","***",null,null,null,null,"Glad Trash Bags, 28-35 ct.",4.49,"Receive a .50 coupon with purchase of 1",3.99]
["Albertsons","***",null,null,null,null,"Glad Trash Bags, 28-80 ct.",7.49,"Receive a .50 coupon with purchase of 1",6.99]
["Albertsons","***",null,null,null,null,"Homelife Bleach, 96 oz.",1.89,"Receive a .50 coupon with purchase of 1",1.39]
["Albertsons","***",null,null,null,null,"Homelife Heavy Duty Scrub Sponges, 3 ct.",2.4900000000000002,"Receive a .50 coupon with purchase of 1",1.99]
["Albertsons","*****",null,null,null,null,"Homelife Latex Simply Clean Gloves, 1 pair",1,"Receive a .50 coupon with purchase of 1",0.5]
["Albertsons","****",null,null,null,null,"Libman ******dom Spray Mop, 1 ct.",15.99,"Receive a $2.00 coupon with purchase of 1",13.99]
["Albertsons"]
["Albertsons","***",null,null,null,null,"Buy 2 of these products and receive a $1 coupon valid on your NEXT shopping purchase. NO LIMITS!",null,"$1 coupon will print at checkout valid on your NEXT shopping purchase. Sale prices listed are BEFORE/AFTER $1 coupon. Discount is essentially .50 per item."]
["Albertsons","***",null,null,null,null,"Lysol Cleaners, 24-40 oz.","2.50/2.00","Lysol Products, any .50/2 (active) This Link-03/18","1.75 ea"]
["Albertsons","***",null,null,null,null,"Lysol Neutra Air Fabric Mist, 7 oz.","2.50/2.00","Lysol Neutra Air Aerosol or Fabric Mist .50/1 (active) This Link-02/04",1.5]
["Albertsons","***",null,null,null,null,"Lysol Toilet Cleaners, 24 oz.","2.50/2.00","Lysol Toilet Bowl Cleaners or No Mess Automatic Toilet Bowl Cleaner .50/2 (active) This Link-02/04","1.75 ea"]
["Albertsons","***",null,null,null,null,"Lysol Wipes, 28-35 oz.","2.50/2.00","Lysol Disinfecting or Dual Action Wipes, any .50/1 (active) This Link-02/04",1.5]
["Albertsons"]
["Albertsons","*****",null,null,null,null,"Buy 1 of these products and receive a $2 coupon valid on your NEXT shopping purchase. NO LIMITS!",null,"$2 coupon will print at checkout valid on your NEXT shopping purchase. Sale prices listed are BEFORE/AFTER $2 coupon. Discount is essentially $2 per item."]
["Albertsons","***",null,null,null,null,"Lysol Disinfecting Wipes, 150 ct.","6.99/4.99","Lysol Disinfecting or Dual Action Wipes, any .50/1 (active) This Link-02/04",4.49]
["Albertsons","*****",null,null,null,null,"Lysol No Touch Starter Kit with One Refill, 1 ct.","6.99/4.99","Lysol No-Touch Kitchen System Starter Kit, any $3/1 (05-01-12) SS-3/18",1.99]
["Albertsons","*****",null,null,null,null,"Lysol No Touch Starter Kit with One Refill, 1 ct.","6.99/4.99","Lysol No-Touch Kitchen System Starter Kit .75/1 (active) This Link-02/04",4.24]
["Albertsons"]
["Albertsons","*****",null,null,null,null,"Buy 2 of these products and receive a $1 coupon valid on your NEXT shopping purchase. NO LIMITS!",null,"$1 coupon will print at checkout valid on your NEXT shopping purchase. Sale prices listed are BEFORE/AFTER $1 coupon. Discount is essentially .50 per item."]
["Albertsons","****",null,null,null,null,"Glade Candle, 4 oz.","2.50/2.00","Glade Jar Candles 4 oz, any $1/2 (active) Group A-03/12 Print Twice","1.50 ea"]
["Albertsons","****",null,null,null,null,"Glade Candle, 4 oz.","2.50/2.00","Glade 4 oz. Jar or Scented Oil Candle Products, any $1/2 (05-05-12) SS-3/25","1.50 ea"]
["Albertsons","***",null,null,null,null,"Glade Aerosol, 9.7 oz.","2.50/2.00",null,2]
["Albertsons","***",null,null,null,null,"Glade Plug In Scented Oil Refill, 1 ct.","2.50/2.00","Glade PlugIns Scented Oil Twin Refill $1/1 or (2) Single Refills, any (active) Group A-03/12","1.50 ea"]
["Albertsons","***",null,null,null,null,"Glade Plug In Scented Oil Refill, 1 ct.","2.50/2.00","Glade PlugIns Scented Oil twin refill, any $1/1 or (2) single refills (05-05-12) SS-3/25","1.50 ea"]
["Albertsons"]
["Albertsons","*****",null,null,null,null,"Buy 2 of these products and receive a $1 coupon valid on your NEXT shopping purchase. NO LIMITS!",null,"$1 coupon will print at checkout valid on your NEXT shopping purchase. Sale prices listed are BEFORE/AFTER $1 coupon. Discount is essentially .50 per item."]
["Albertsons","***",null,null,null,null,"Scrubbing Bubbles Aerosol, 22 oz.","3.00/2.50","Scrubbing Bubbles Bathroom Cleaners, any $1/2 (active) Group A-03/19 Print Twice","2.00 ea"]
["Albertsons","****",null,null,null,null,"Scrubbing Bubbles Aerosol, 22 oz.","3.00/2.50","Scrubbing Bubbles Bathroom Cleaners, any $2/2 (06-30-12) SS-3/11","1.50 ea"]
["Albertsons","***",null,null,null,null,"Windex Glass Cleaner, 26 oz.","3.00/2.50","Windex Glass Cleaning Products, any .75/2 (active) Group A-03/19 Print Twice","2.13 ea"]
["Albertsons","***",null,null,null,null,"Windex Glass Cleaner, 26 oz.","3.00/2.50","Windex Glass Cleaner products, any $1/2 (05-05-12) SS-3/25","2.00 ea"]
["Albertsons"]
["Albertsons","***",null,null,null,null,"Buy 2 of these products and receive a $2 coupon valid on your NEXT shopping purchase. NO LIMITS!",null,"$2 coupon will print at checkout valid on your NEXT shopping purchase. Sale prices listed are BEFORE/AFTER $2 coupon. Discount is essentially $1 per item."]
["Albertsons","***",null,null,null,null,"Air Wick Candles, 5.29-6.35 oz.","5.00/4.00","Air Wick Candles, any $2/1 (EXPIRES 04-15-12) SS-3/18"]
["Albertsons","***",null,null,null,null,"Air Wick Freshmatic Mini Refill, 1 ct.","5.00/4.00","Air Wick Freshmatic Compact Refill, any $1.50/1 (EXPIRES 04-15-12) SS-3/18",2.5]
["Albertsons","***",null,null,null,null,"Air Wick Freshmatic Ultra Refill, 6.17 oz.","5.00/4.00","Air Wick Freshmatic Ultra Refill, any $1.50/1 (EXPIRES 04-15-12) SS-3/18",2.5]
["Albertsons","***",null,null,null,null,"Air Wick Scented Oil Refill Twin Pack, 2 ct.","5.00/4.00","Air Wick Scented Oil Refills, any Twin Pack $1/1 or (2) Singles (EXPIRES 04-15-12) SS-3/18",3]
["Albertsons"]
["Albertsons","*****",null,null,null,null,"Buy 2 of these products and receive a $1 coupon valid on your NEXT shopping purchase. NO LIMITS!",null,"$1 coupon will print at checkout valid on your NEXT shopping purchase. Sale prices listed are BEFORE/AFTER $1 coupon. Discount is essentially .50 per item."]
["Albertsons","***",null,null,null,null,"Pledge Multisurface, 9.7-12.5 oz.","4.00/3.50","Pledge Multi Surface Product, any .50/1 (active) Group A-03/19 Print Twice",3]
["Albertsons","***",null,null,null,null,"Pledge Multisurface, Polish or Electronic Cleaner, 9.7-12.5 oz.","4.00/3.50","Pledge Furniture Care Product, any $1.50/2 (active) Group A-03/19 Print Twice","2.75 ea"]
["Albertsons","****",null,null,null,null,"Pledge Multisurface, Polish or Electronic Cleaner, 9.7-12.5 oz.","4.00/3.50","Pledge Furniture Care products, any $2/1 (05-05-12) SS-3/25",1.5]
["Albertsons"]
["Albertsons","*****",null,null,null,null,"Got a list question? Want to check if next week's list is ready? Our listmakers answer questions and post our \"preview\" lists at PYP."]
["Albertsons"]
["Albertsons","****",null,null,null,null,"Albertsons Intermountain/Northwest regions checkout voucher offers",null,"If you have questions about these, or to tell us about one not listed here, use this thread at PYP"]
["Albertsons",null,null,null,null,null,"-AKA \"Catalina\" deals"]
[{"$f":"IF(G2129=\"How to use this list\",G2131,A2128)","v":"Albertsons"},null,null,null,null,null,"Hint: These deals can be VERY HOT if the item is also on sale, and you use manufacturers coupons when buying them!"]
["Albertsons"]
["Albertsons"]
["Albertsons"]
["Albertsons"]
["Albertsons"]
["Albertsons","*****",null,null,null,null,"Todays date: ","Approx","Item pricing may be slightly different at your local store"]
["Albertsons","toggle 4 and 5 star rows",null,null,null,null,null,"Wal-Mart"]
["Wal-Mart","Stock up scale",null,null,null,null,"How to use this list","Price","Printable coupons:","Bottom Line"]
["Wal-Mart",null,null,null,null,null,null,null,"Group A  Group B  Group C"]
["Wal-Mart",null,null,null,null,null,"Wal-Mart"]
["Wal-Mart",null,null,null,null,null,"Selected items pricing",null,"Coupon To Use"]
["Wal-Mart",null,null,null,null,null,"-This list shows what you'll actually pay at Wal-Mart when using certain printable coupons"]
["Wal-Mart","*****",null,null,null,null,"WALMART COUPON POLICY-",null,"Wal Mart accepts manufacturer, printed and competitor coupons. If coupon value exceeds the price of the item, the excess may be given as cash or applied toward the basket purchase"]
["Wal-Mart",null,null,null,null,null,null,null,"See the entire coupon policy HERE"]
["Wal-Mart"]
["Wal-Mart",null,null,null,null,null,null,null,"See the Walmart thread in this section at PYP for questions and more Walmart info."]
["Wal-Mart","*****",null,null,null,null,"Product availability can vary by store.",null,"Please also note that some brands are regional and your area may not carry all items on this list. Please be aware of this before you plan your shopping trip."]
["Wal-Mart",null,null,null,null,null,"Larger Walmart stores are more likely to carry the variety and size found on this list."]
["Wal-Mart","*****",null,null,null,null,"Wal Mart price check **APPROXIMATE, prices vary by location**",null,"Current manufacturer coupons."]
["Wal-Mart",null,null,null,null,null,null,null,"You may find these insert coupons in your mailbox or your local newspaper."]
["Wal-Mart"]
["Wal-Mart",null,null,null,null,null,null,null,"**SINCE COUPONS ARE REGIONAL, YOU MAY OR MAY NOT HAVE RECEIVED THESE COUPONS LOCALLY. **"]
["Wal-Mart","****",null,null,null,null,"Baileys Coffee Creamer 16 oz",1.98,"Baileys Coffee Creamers, any, $1/2 (05-06-12) SS-3/4","1.48 ea"]
["Wal-Mart","****",null,null,null,null,"Kettle Brand Potato Chips 9 oz",2.78,"Kettle Brand Potato Chips, any 4 oz or larger, $1/1 (05-12-12) RP-3/18",1.78]
["Wal-Mart","****",null,null,null,null,"Louisiana Fish Fry Breading",1.38,"Louisiana Fish Fry Products Breadings, any, $1/2 (06-30-12) SS-3/4",0.88]
["Wal-Mart","****",null,null,null,null,"Planters Peanuts Sweet and Crunchy Peanuts 10 oz",2.98,"Planters Peanuts, any 4-21.25 oz, $1.50/2 (04-30-12) SS-1/29",2.23]
["Wal-Mart","****",null,null,null,null,"Birds Eye Steamfresh 12 oz",1.25,"Birds Eye Steamfresh Varieties, any, $1/3 (04-15-12) RP-3/4","0.92 ea"]
["Wal-Mart","****",null,null,null,null,"Alka Seltzer Original 24 ct",2.98,"Alka-Seltzer Product, any, $1/1 (06-30-12) RP-3/18",1.98]
["Wal-Mart","*****",null,null,null,null,"Bic Comfort 3 Razors For Men 4 ct",2.88,"Bic Disposable Razor, any EXCLUDING trial size, $2/1 (04-15-12) SS-3/18",0.88]
["Wal-Mart","****",null,null,null,null,"Bausch and Lomb Ocuvite Eye Vitamins",9.98,"Bausch and Lomb Ocuvite Product, any, $5/1 (05-31-12) SS-3/4",4.9800000000000004]
["Wal-Mart","****",null,null,null,null,"Bayer Low Dose Aspirin Pain Reliever 32 ct",2.2200000000000002,"Bayer Aspirin Product, any 20 ct or larger, $1/1 (04-30-12) SS-1/29",1.22]
["Wal-Mart","*****",null,null,null,null,"Colgate Cavity Protection Original Toothpaste 6.4 oz",1.5,"Colgate Toothpaste, any 4 oz or larger, .75/1 (04-14-12) SS-3/25",0.75]
["Wal-Mart","****",null,null,null,null,"Garnier Shampoo or Conditioner 13 oz",2.96,"Garnier Fructis Shampoo, Conditioner or Treatment, any EXCLUDING trial size, $1/1 (04-15-12) RP-3/4",1.96]
["Wal-Mart","****",null,null,null,null,"Got2B Styling Gel or Glue 6 to 12 oz",4.72,"Got2b Product, any full size, $3/1 (05-12-12) RP-2/5",1.72]
["Wal-Mart","*****",null,null,null,null,"Reach Clean Burst Floss 55 yard",0.97,"Reach Floss Product, any, $1/1 (05-31-12) RP-3/4","******"]
["Wal-Mart","******"]
["Wal-Mart","****",null,null,null,null,"Suave Deodorant 2.6 oz",1.72,"Suave Deodorant Product, any EXCLUDING trial and travel size, .75/1 (04-15-12) RP-3/18",0.97]
["Wal-Mart","****",null,null,null,null,"Suave Naturals Shampoo or Conditioner 15 oz",0.94,"Suave Naturals, Suave Men, or Suave Kids Body Wash Products, any EXCLUDING trial and travel size, Buy 2 Get 1 ****** (04-15-12) RP-3/18","0.63 ea"]
["Wal-Mart","****",null,null,null,null,"Suave Skin Therapy Body Lotion 18 oz",2.87,"Suave Body Lotion Product, any EXCLUDING trial and travel size, $1/1 (04-15-12) RP-3/18",1.87]
["Wal-Mart","****",null,null,null,null,"Vaseline Lotion 10 oz",2.97,"Vaseline Lotion, 10 oz, $1/1 (04-22-12) RP-3/25",1.97]
["Wal-Mart","****",null,null,null,null,"Fur Reals Toy",7.97,"Furreal Friends Snuggimals Pet or Dizzy Dancers Pet, any, $2/1 (04-15-12) Playsaver-3/25",5.97]
["Wal-Mart"]
["Wal-Mart","*****",null,null,null,null,"Wal Mart price check **APPROXIMATE, prices vary by location**",null,"Current Group A coupons (Coupons Inc)"]
["Wal-Mart",null,null,null,null,null,null,null,"Remember, you can print each coupon 2 times (To buy each item twice.)"]
["Wal-Mart","****",null,null,null,null,"County Crock Vegetable Oil Spread 15 oz",2.1800000000000002,"Country Crock Spread, any excluding Honey or Cinnamon flavored $1/1 (active) Group A-02/21",1.18]
["Wal-Mart","***",null,null,null,null,"Crunchmaster Crackers 4.5 oz",2.58,"Crunchmaster Crackers, any .75/1 (active) Group A-03/18",1.83]
["Wal-Mart","****",null,null,null,null,"Haribo Gummy Bears 5 oz",1.08,"Haribo Product, any 4 oz or larger .30/1 (active) Group A-04/09",0.78]
["Wal-Mart","***",null,null,null,null,"Hinode Dry Rice 5 lb Bag",4.37,"Hinode Dry Rice Bag, any 1 to 5 lb bag .55/1 (active) Group A-01/30",3.82]
["Wal-Mart","***",null,null,null,null,"Truvia Natural Sweetener 40 ct",3.68,"Truvia Natural Sweetener or Truvia Baking Blend with Sugar, any .75/1 (active) Group A-03/18",2.93]
["Wal-Mart","****",null,null,null,null,"Huberts Lemonade",1.68,"Huberts Lemonade, any .75/1 (active) Group A-12/08",0.93]
["Wal-Mart","****",null,null,null,null,"Huberts Lemonade",1.68,"Huberts Lemonade, any B1 G1 ****** (active) Group A-12/08","0.84 ea"]
["Wal-Mart","***",null,null,null,null,"Bridgford Frozen Monkey Bread 16 oz",2.98,"Bridgford Frozen Rolls, Bread Dough or Monkey Bread, any .55/1 (active) Group A-03/16",2.4300000000000002]
["Wal-Mart","***",null,null,null,null,"Jose Ole 16 oz",5.49,"Jose Ole Item, any 16 oz or larger $1/1 (active) Group A-04/01",4.49]
["Wal-Mart","*****",null,null,null,null,"Alka Seltzer Plus Original 24 ct",2.98,"Alka Seltzer Plus Product, any $2/1 (active) Group A-03/22",0.98]
["Wal-Mart","***",null,null,null,null,"Citracal Slow Release 1200 Supplement 80 ct",10.92,"Citracal Calcium Gummies or Slow Release 1200 product, any, $2/1 (active) Group A-03/06",8.92]
["Wal-Mart","***",null,null,null,null,"Claritin Childrens Non Drowsy 2 oz",5.97,"Claritin Childrens Non-Drowsy Allergy Product, any 4 oz $2/1 (active) Group A-03/12",3.97]
["Wal-Mart","***",null,null,null,null,"Claritin Non-Drowsy Allergy Medicine 30 ct",17.88,"Claritin Non-Drowsy Allergy Product, any $4/1 (active) Group A-03/07",13.88]
["Wal-Mart","***",null,null,null,null,"Colgate Total Advanced 5.8 oz",2.96,"Colgate Total Advanced Toothpaste $1/1 (active) Group A-03/12",1.96]
["Wal-Mart","***",null,null,null,null,"Eucerin Body Lotion Everyday Protection 13.5 oz",7.87,"Eucerin Product, any 13.5 oz or larger $2/1 (active) Group A-02/09",5.87]
["Wal-Mart","***",null,null,null,null,"Emetrol Nausea Liquid Medicine Cherry Flavor 4 oz",6.87,"Emetrol for Nausea, any $1.50/1 (active) Group A-03/07",5.37]
["Wal-Mart","****",null,null,null,null,"Garnier Fructis Shampoo or Conditioner 13 oz",2.96,"Garnier Fructis Shampoo or Conditioner, any excluding trial or travel sizes $1/1 (active) Group A-04/09",1.96]
["Wal-Mart","***",null,null,null,null,"Glade Carpet and Room Odor Eliminator 32 oz",1.98,"Glade Carpet and Room Odor Eliminator, any .55/1 (active) Group A-03/12",1.43]
["Wal-Mart","*****",null,null,null,null,"Glade PlugIns Scented Oil Warmers",1.38,"Glade PlugIns Scented Oil Warmer, any $1/1 (active) Group A-03/12",0.38]
[{"$f":"IF(G2193=\"How to use this list\",G2195,A2192)","v":"Wal-Mart"},"***",null,null,null,null,"Glade Sense and Spray Refill",2.98,"Glade Sense and Spray Refills, any $1/2 (active) Group A-03/12","2.48 ea"]
["Wal-Mart","***",null,null,null,null,"Glade Sense and Spray Kit",7.98,"Glade Sense and Spray Starter Kit, any $3/1 (active) Group A-03/12",4.9800000000000004]
["Wal-Mart","***",null,null,null,null,"Nicorette White Ice 2mg Coated Gum 20 ct",9.98,"Nicorette Gum, any 20 ct $1/1 (active) Group A-11/29",8.98]
["Wal-Mart","***",null,null,null,null,"Polident 3 Minute Tablets 40 ct",3.12,"Polident Product, any $1/1 (active) Group A-03/09",2.12]
["Wal-Mart","***",null,null,null,null,"Right Guard Total 5 Anti-Perspirant Deodorant",3.32,"RIght Guard Anti-Perspirant, Deodorant or Body Wash, $2/2 (active) Group A-03/13",2.3199999999999998]
["Wal-Mart","***",null,null,null,null,"Slo-Niacin Tablets 100 ct",12.94,"Slo-Niacin Product, any $3/1 (active) Group A-03/02",11.94]
["Wal-Mart","***",null,null,null,null,"Pledge Furniture Care Wipes 24 ct",3.37,"Pledge Furniture Care Product, any $1.50/2 (active) Group A-03/19","2.62 ea"]
["Wal-Mart","***",null,null,null,null,"Pledge Multi Surface Floor Cleaner 27 oz",4.47,"Pledge or Armstrong Floor Cleaner, any $1/1 (active) Group A-03/19",3.47]
["Wal-Mart","***",null,null,null,null,"Pledge Multi Surface Wipes 25 ct",3.88,"Pledge Multi Surface Product, any .50/1 (active) Group A-03/19",3.38]
["Wal-Mart","****",null,null,null,null,"Scrubbing Bubbles Antibacterial Bathroom Cleaner 22 oz",2.4700000000000002,"Scrubbing Bubbles Bathroom Cleaners, any $1/2 (active) Group A-03/19",1.97]
["Wal-Mart","****",null,null,null,null,"Scrubbing Bubbles Fantastik 22 oz",1.97,"Scrubbing Bubbles Fantastik All Purpose Cleaner, any .50/1 (active) Group A-03/19",1.47]
["Wal-Mart","***",null,null,null,null,"Scrubbing Bubbles Mega Shower Foamer 20 oz",3.47,"Scrubbing Bubbles Mega Shower Foamer, any $1/2 (active) Group A-03/19",2.97]
["Wal-Mart","***",null,null,null,null,"Scrubbing Bubbles Toilet Gel Cleaner 1.34 oz",3.47,"Scrubbing Bubbles Toilet Cleaning Gel, any .75/1 (active) Group A-03/19",2.72]
["Wal-Mart","***",null,null,null,null,"Scrubbing Bubbles Vanish Toilet Bowl Dropins 4 ct",3.97,"Scrubbing Bubbles Vanish Continuous Clean Drop-Ins, any .55/1 (active) Group A-03/19",3.42]
["Wal-Mart","***",null,null,null,null,"Shout Color Catcher 24 ct",3.88,"Shout Color Catcher, any .75/2 (active) Group A-03/19","3.51 ea"]
["Wal-Mart","***",null,null,null,null,"Wisk Deep Clean Liquid Laundry Detergent 50 oz",5.37,"Wisk Deep Clean Laundry Detergent, any 45 oz or larger $1/1 (active) Group A-04/09",4.37]
["Wal-Mart","***",null,null,null,null,"Windex Glass Cleaner Original 32 oz",2.4700000000000002,"Windex Glass Cleaning Products, any .75/2 (active) Group A-03/19","2.10 ea"]
["Wal-Mart","***",null,null,null,null,"Windex Multi Surface 32 oz",2.87,"Windex Multi-Surface Products, any $1/2 (active) Group A-03/19","2.37 ea"]
["Wal-Mart","***",null,null,null,null,"Goodnites Underwear 35 ct",19.77,"Goodnites Underwear, any Jumbo pack or larger $2/1 (active) Group A-02/03",17.77]
["Wal-Mart","***",null,null,null,null,"Huggies Little Movers Slip-On Diapers",22.94,"Huggies Little Movers Slip-On Diapers, any $3/2 (active) Group A-03/11","21.44 ea"]
["Wal-Mart","****",null,null,null,null,"Pampers Wipes 72 ct",1.97,"http://print.coupons.com/alink.asp?go=12812dl8910&cid=16902071",1.22]
["Wal-Mart","***",null,null,null,null,"Pampers Cruisers 20 ct",9.4700000000000006,"http://print.coupons.com/alink.asp?go=12812dl8910&cid=16902075",7.97]
["Wal-Mart","***",null,null,null,null,"Pampers Swaddlers 76 ct",19.77,"http://print.coupons.com/alink.asp?go=12812dl8910&cid=16902072",18.27]
["Wal-Mart","***",null,null,null,null,"Glad Trash Bags 13 Gallon 26 ct",5.17,"Glad Trash Bags, any 13 gallon $2/2 (active) Group A-03/18","4.17 ea"]
["Wal-Mart","***",null,null,null,null,"Glad Trash Bags Quick Tie 30 Gallon 40 ct",7.48,"Glad 30-Gallon or Larger Trash Bags, any $1/1 (active) Group A-03/18",6.48]
["Wal-Mart","***",null,null,null,null,"Jonny Cat Litter 20 lbs",3.64,"Jonny Cat Litter, any $1/1 20 lbs or (2) 10 lbs (active) Group A-03/08",2.64]
["Wal-Mart"]
["Wal-Mart","*****",null,null,null,null,"Wal Mart price check **APPROXIMATE, prices vary by location**",null,"Current Group B coupons (Smartsource)"]
["Wal-Mart",null,null,null,null,null,null,null,"Remember, you can print each coupon 2 times (To buy each item twice.)"]
["Wal-Mart","****",null,null,null,null,"Challenge Whipped Butter 8 oz",1.82,"Challenge Butter, any .55/1 (active) Group B-10/05",1.27]
["Wal-Mart","***",null,null,null,null,"Pillsbury Crescent Dinner Rolls 8 oz",1.98,"Pillsbury Crescent Dinner Rolls, any .40/3 (active) Group B-03/02","1.85 ea"]
["Wal-Mart","***",null,null,null,null,"Yoplait Light with Granola Yogurt 6 oz 2 pk",2.2799999999999998,"Yoplait Yogurt Light Yogurt with Granola, any package .75/1 (active) Group B-04/02",1.53]
["Wal-Mart","***",null,null,null,null,"Bob Evans Refrigerated Side Dishes 20 to 24 oz",1.75,"Bob Evans Refrigerated Side Dish, any .35/1 (active) Group B-10/07",1.4]
["Wal-Mart","***",null,null,null,null,"Yoplait Yogurt",0.6,"Yoplait Yogurt cups, any variety including Original, Light, Thick and Creamy or Whips .40/6 (active) Group B-03/02","0.53 ea"]
["Wal-Mart","****",null,null,null,null,"C and H Pure Cane White Sugar Granulated 2 lbs",1.84,"C and H Sugar Products, any 2 lbs or larger $1/2 (active) Group B-11/23","1.37 ea"]
["Wal-Mart","***",null,null,null,null,"General Mills Chex Honey Nut Cereal",3.12,"General Mills Basic 4, Chex (any), fiber One (any), Honey Nut clusters, Oatmeal Crisp (any), Raisin Nut Bran, Total (any) or Wheaties (any), $1/2 (active) Group B-03/02","2.62 ea"]
["Wal-Mart","***",null,null,null,null,"General Mills Kix Cereal 12 oz",2.94,"General Mills Kix Cereal, any .75/1 (active) Group B-04/02",2.19]
["Wal-Mart","***",null,null,null,null,"General Mills Trix Cereal 14.8 oz",3.38,"General Mills Trix Cereal, any .50/1 (active) Group B-04/02",2.88]
["Wal-Mart","***",null,null,null,null,"Nabisco Cheese Nips Crackers 12 oz",1.68,"Nabisco Crackers, any 9 to 16 oz $1/2 (active) Group B-01/12",1.18]
["Wal-Mart","***",null,null,null,null,"Pillsbury Cinnamon Rolls with Icing 7.3 oz",1.52,"Pillsbury Sweet Rolls or Grands Sweet Rolls, any .40/2 (active) Group B-03/02","1.32 ea"]
["Wal-Mart","***",null,null,null,null,"Pillsbury Create n Bake Cookies 16.5 oz",2.5,"Pillsbury Refrigerated Cookie Dough, any .75/2 (active) Group B-03/02","2.13 ea"]
["Wal-Mart","***",null,null,null,null,"Truvia Natural Sweetener 40 ct",3.68,"Truvia Natural Sweeterner or Truvia Baking Blend with Sugar, any .75/1 (active) Group B-03/15",2.93]
["Wal-Mart","***",null,null,null,null,"ACT Mouthwash 18 oz",3.46,"ACT Mouthwash or Mouthrinse, any 16.9 oz or larger $1/1 (active) Group B-03/06",2.46]
["Wal-Mart","***",null,null,null,null,"Allegra Allergy 24 hr Relief 30 ct",17.96,"Allegra Allergy 30 ct or higher, Allegra-D 24 hr 10 ct or higher or Allegra-D 12 hr 20 ct or higher $4/1 (active) Group B-03/18",13.96]
["Wal-Mart","***",null,null,null,null,"Allegra Allergy 24 hr Relief 5 ct",5.94,"Allegra Allergy 5, 12 or 15 ct, Childrens Allegra, Allegra-D 24 hr 5 ct or Allegra-D 12 hr 10 ct $2/1 (active) Group B-03/18",3.94]
["Wal-Mart","***",null,null,null,null,"Xenadrine Results 60 ct",17.97,"Xenadrine Weight Loss Product, any $5/1 (active) Group B-03/10",12.97]
["Wal-Mart"]
["Wal-Mart","*****",null,null,null,null,"Wal Mart price check **APPROXIMATE, prices vary by location**",null,"Current Group C coupons (Redplum)"]
["Wal-Mart",null,null,null,null,null,null,null,"Remember, you can print each coupon 2 times (To buy each item twice.)"]
["Wal-Mart","***",null,null,null,null,"Bridgford Monkey Bread 16 oz",2.98,"Bridgford Frozen Rolls, Bread Dough or Monkey Bread, any .50/1 (active) Group C-04/01",2.48]
["Wal-Mart","***",null,null,null,null,"Advil Childrens Fever Reducer Pain Reliever Grape Flavor 4 oz",4.7699999999999996,"Advil Childrens Product, any $2/1 (active) Group C-04/01",2.77]
["Wal-Mart","***",null,null,null,null,"Advil Congestion Relief 10 ct",5.98,"Advil Congestion Relief Product, any $2/1 (active) Group C-03/25",3.98]
["Wal-Mart","***",null,null,null,null,"Advil PM 20 ct",4.43,"Advil PM, any 16 ct or larger $1/1 (active) Group C-04/01",3.43]
["Wal-Mart","***",null,null,null,null,"Advil Ibuprofen 24 ct",3.48,"Advil, any 20 ct or larger $1/1 (active) Group C-04/01",2.48]
["Wal-Mart","***",null,null,null,null,"Garnier Fructis Style 2 to 8.5 oz",3.47,"Garnier Fructis Style Product, any excluding trial size $1/1 (active) Group C-04/01",2.4700000000000002]
["Wal-Mart","***",null,null,null,null,"Garnier Nutritioniste Moisture Rescue Cream 1.7 oz",6.97,"Garnier Moisturizer, any $2/1 (active) Group C-03/12",4.97]
["Wal-Mart","***",null,null,null,null,"Ester C 90 ct",7.44,"Ester C product, any, $2/1 (active) Group C-03/05",5.44]
["Wal-Mart","***",null,null,null,null,"LOreal Paris Go 360 Deep Clean Face Cleanser 6 oz",4.37,"LOreal Paris Skincare Product, any excluding trial size $1/1 (active) Group C-02/19",3.37]
["Wal-Mart","***",null,null,null,null,"Met Rx Big 100 Bars 4 pk",6.94,"Met-Rx Big 100 Bars, any $2/2 (active) Group C-04/01","5.94 ea"]
["Wal-Mart","***",null,null,null,null,"Fiber Choice 90 ct Tablets",9.8699999999999992,"Fiber Choice, any 90 ct $2/1 (active) Group C-03/25",7.87]
["Wal-Mart","*****",null,null,null,null,"Robitussin To Go Cold Medicine",1,"Robitussin product, any $1/1 (active) Group C-03/12","******"]
["Wal-Mart","******"]
["Wal-Mart","***",null,null,null,null,"All Liquid Laundry Detergent 50 oz 32 laods",4.97,"All Mighty Pacs or All Liquid Laundry Detergent, any 24 loads or larger $1/1 (active) Group C-04/01",3.97]
["Wal-Mart"]
[{"$f":"IF(G2257=\"How to use this list\",G2259,A2256)","v":"Wal-Mart"},"*****",null,null,null,null,"Wal Mart price check **APPROXIMATE, prices vary by location**",null,"Current Coupon Network coupons (By Catalina)"]
["Wal-Mart",null,null,null,null,null,null,null,"Remember, you can print each coupon 2 times (To buy each item twice.)"]
["Wal-Mart","***",null,null,null,null,"Pillsbury Crescent Dinner Rolls",2.5,"Pillsbury Crescent Dinner Rolls, any, .40/3 (active) This Link-03/07","2.37 ea"]
["Wal-Mart","***",null,null,null,null,"Pillsbury Orange Flavor Sweet Rolls 13.9 oz",1.98,"Pillsbury Sweet Rolls or Grands Sweet Rolls, any, .40/2 (active) This Link-03/07","1.78 ea"]
["Wal-Mart","***",null,null,null,null,"Yoplait Yogurt Cups 6 oz",0.6,"Yoplait Yogurt cups, any variety including Original, Light, Thick and Creamy or Whips , .50/8 (active) This Link-02/01","0.54 ea"]
["Wal-Mart","***",null,null,null,null,"Uncle Bens Ready Rice Long Grain and Wild Rice 8.8 oz",1.84,"Uncle Bens Long Grain and Wild Rice, any .55/2 (active) This Link-03/20","1.57 ea"]
["Wal-Mart","***",null,null,null,null,"Nestle Miniatures Assorted Candy 40 oz",8.98,"Nestle Miniatures Bags Candy, any 19.75 to 40 oz $2/2 (active) This Link-04/10",7.98]
["Wal-Mart","***",null,null,null,null,"Wonka Laffy Taffy Candy 18.7 oz",4.28,"Wonka Candy, any 12 oz or larger $1.25/1 (active) This Link-04/10",3.03]
["Wal-Mart","***",null,null,null,null,"Ester C 90 ct",7.44,"Ester C products, any $1.75/2 (active) This Link-03/26",6.57]
["Wal-Mart","***",null,null,null,null,"Glade Plugins Scented Oil Twin Pack",4.88,"Glade PlugIns Scented Oil Twin Refill $1.25/1 or (2) Single Refills, any, (active) This Link-03/22",3.63]
["Wal-Mart","***",null,null,null,null,"Glucerna Multi-Pack Bars 4 pk",4.28,"Glucerna Multi-Pack Bars or Shakes, any $1.25/2 (active) This Link-01/05",3.66]
["Wal-Mart","****",null,null,null,null,"Listerine Zero Mouthwash 1.5 liter",3.52,"Listerine Zero Mouthwash, any 1.5 liter $1.85/1 (active) This Link-04/06",1.67]
["Wal-Mart","***",null,null,null,null,"Listerine Zero Mouthwash 1.5 liter",3.52,"Listerine Zero Mouthwash, any 1.5 liter $3/2 (active) This Link-04/06","2.02 ea"]
["Wal-Mart","***",null,null,null,null,"Natures Bounty Coral Calcium Plus 1000 Mg 120 ct",8.94,"Natures Bounty Vitamins or Supplements, any $0.75/1 (active) This Link-12/12",7.34]
["Wal-Mart","***",null,null,null,null,"Stopain Extra Strength Pain Relief 3 oz",8.76,"Stopain Product, any, MUST FOLLOW LINK AND LIKE ON FACEBOK TO GET COUPON VALUE $2.25/1 (active) This Link-03/20",6.51]
["Wal-Mart","***",null,null,null,null,"Zantac Acid Reducer 30 ct",7.57,"Zantac Product, any 24 ct or larger MUST WATCH VIDEO TO GET COUPON VALUE $4/1 (active) This Link-03/22",3.57]
["Wal-Mart","***",null,null,null,null,"Avent BPA ****** 4 oz Feeding Bottles 3 pk",15.67,"Avent BPA-****** Baby Bottles, any Multi-Pack $3/1 (active) This Link-01/31",12.67]
["Wal-Mart"]
["Wal-Mart","*****",null,null,null,null,"Wal Mart price check **APPROXIMATE, prices vary by location**",null,"Current printable manufacturer coupons. ."]
["Wal-Mart",null,null,null,null,null,null,null,"Note - Some of these links require you to register first."]
["Wal-Mart","*****",null,null,null,null,"8th Continent Soymilk Carton",2.56,"8th Continent Soymilk, any carton FACEBOOK COUPON (enter lookin good sweepstakes) $2/1 (active) This Link-04/03",0.56000000000000005]
["Wal-Mart","***",null,null,null,null,"Blue Diamond Almond Breeze Milk 86 oz",3.98,"Blue Diamond Almond Breeze Almond Milk, any .55/1 (active) This Link-01/28",3.43]
["Wal-Mart","***",null,null,null,null,"Carnation Evaporated Canned Milk",1,"Carnation Evaporated Milk, any .50/2 (active) This Link-04/11","0.75 ea"]
["Wal-Mart","***",null,null,null,null,"Goya Rice 3.5 oz",2.1800000000000002,"Goya Rice Mixes, any $1/2 (active) This Link-08/21","1.68 ea"]
["Wal-Mart","****",null,null,null,null,"Goya Low Sodium Beans 15.5 oz",1.22,"Goya Low Sodium Beans, any 15.5 oz or larger $1/4 (active) This Link-08/21","0.97 ea"]
["Wal-Mart","****",null,null,null,null,"Fisher Boy Fish Sticks 48 ct",3.25,"Fisher Boy Product, any .75/1 (active) This Link-06/17",2.5]
["Wal-Mart","***",null,null,null,null,"Weight Watchers Smart Ones 9 oz",1.98,"Weight Watchers Smart Ones Products, any $1/5 (active) This Link-06/28","1.78 ea"]
["Wal-Mart","***",null,null,null,null,"AmLactin Moisturizing body lotion 7.9 oz",11.97,"AmLactin Moisturizing Lotion, any $5/1 (active) This Link-05/14",6.97]
["Wal-Mart","*****",null,null,null,null,"Aquafresh Extreme Clean Toothpaste .8 oz travel size",0.97,"Aquafresh Extreme Clean Toothpaste, any $1/1 (active) This Link-09/01","****** +"]
["Wal-Mart","******",null,null,null,null,null,null,"Per Walmarts coupon policy, you will either receive cash back or the overage will be applied to your purchase"]
["Wal-Mart","***",null,null,null,null,"Aquafresh Training Toothpaste 1.5 oz",2.68,"Aquafresh Training Toothpaste for Kids .75/1 (active) This Link-02/19",1.93]
["Wal-Mart","***",null,null,null,null,"Aquafresh Training Toothpaste 1.5 oz",2.68,"Aquafresh Training Toothbrush .50/1 (active) This Link-02/19",2.1800000000000002]
["Wal-Mart","***",null,null,null,null,"Benefiber Powder The Clear Choice 2.80 oz",5.98,"Benefiber Product, any $2/1 (active) This Link-05/18",3.98]
["Wal-Mart","***",null,null,null,null,"Beano Tablets 30 ct",4.96,"Beano Product, any $1/1 (active) This Link-11/05",3.96]
["Wal-Mart","****",null,null,null,null,"Dr. Scholls Massaging Gel Insoles",5.86,"Dr. Scholls Massaging Gel insoles, any $2/1 (active) This Link-02/04",3.86]
["Wal-Mart","****",null,null,null,null,"Excedrin Extra Strength 24 ct",2.92,"Excedrin Extra Strength, any 20 ct or larger $1/1 (active) This Link-05/26",1.92]
["Wal-Mart","***",null,null,null,null,"Hawaiian Tropic Lime Coolada After Sun Moisturizer 16 oz",6.97,"Hawaiian Tropic Sun Care Product, any 4 oz or larger excluding lip balm $1/1 (active) This Link-08/21",5.97]
["Wal-Mart","***",null,null,null,null,"Kiss Salon Results",5.37,"Kiss Artificial Nails, any FACEBOOK COUPON $1/1 (active) This Link-09/24",4.37]
["Wal-Mart","*****",null,null,null,null,"K-Y Gel 2 oz",2.84,"K-Y Products, any excluding trial sizes $2/1 (active) This Link-06/17",0.84]
["Wal-Mart","****",null,null,null,null,"K-Y Yours+Mine",14.98,"K-Y Intense, Kissable Sensations, Yours+Mine or Intrigue products, any $5/1 (active) This Link-06/17",9.98]
["Wal-Mart","*****",null,null,null,null,"Just For Men Haircolor",6.97,"Qualifies for: MAIL IN REBATE, Just for Men Haircolor or Color Gel Product, Get $9.50 Mail-In Rebate with purchase - Expires 12/31/12 (active) This Link-10/22","******"]
["Wal-Mart","*****",null,null,null,null,"Palmers Cocoa Butter Facial Soap",2.17,"Palmers Cocoa Butter Facial Care, any $2/1 (active) This Link-10/22",0.17]
["Wal-Mart","*****",null,null,null,null,"Pure Protein Bar",1.1599999999999999,"Pure Protein Product, any $1/1 (active) This Link-07/26",0.16]
["Wal-Mart","***",null,null,null,null,"Rembrandt Intense Stain Whitening Mint Toothpaste 3.5 oz",6.97,"Rembrandt Toothpaste or Rinse, any $2/1 (active) This Link-03/17",4.97]
["Wal-Mart","***",null,null,null,null,"Rembrandt 2 Hour Whitening Kit",18.62,"Rembrandt 2-Hour Whitening Kit, any $5/1 (active) This Link-03/17",13.62]
["Wal-Mart","***",null,null,null,null,"Theraflu Warming Cold Relief Syrup 8.3 oz",4.97,"Theraflu Warming Syrup or Warming Caplets, any $2/1 (active) This Link-09/23",2.97]
["Wal-Mart","***",null,null,null,null,"Tylenol Precise Cream or Patch",5.97,"Tylenol Precise $2/1 This Link",3.97]
["Wal-Mart","****",null,null,null,null,"Visine AC Eyedrops 1/2 fl oz",3.62,"Visine-A $2/1 (active) This Link-03/22",1.62]
["Wal-Mart","***",null,null,null,null,"Biz Powder Detergent 60 oz",4.97,"Biz Stain fighter product, any $2/1 (active) This Link-05/18",2.97]
["Wal-Mart"]
["Wal-Mart","*****",null,null,null,null,"Looking to buy something online? Try the PYP Screaming Deals Online forum."]
["Wal-Mart"]
["Wal-Mart","...Type other items and notes here..."]

{"sheet":"ItemList","index":3,"n_rows":1397,"n_cols":1,"rows_kept":1397,"cut":false,"hidden":false,"merged":[]}
["\"Early Ad\" Stores"]
["\"Early\" ads (run Monday - Saturday)"]
["\"Late Ad\" Stores"]
["$1 Reward, Buy 2 items"]
["$1.00 Reward, Buy 1 item"]
["$1.00 Reward, Buy 2 items"]
["$10 Reward, Buy $20 of participating items"]
["$10 Reward, Buy $25 of participating items"]
["$2.00 Reward, Buy 1 item"]
["$2.00 Reward, Buy 1 items"]
["$2.00 Reward, Buy 2 items"]
["$2.00 Reward, Buy 4 items"]
["$3.00 Reward, Buy 1 item"]
["$3.00 Reward, Buy 2 items"]
["3 Days Only! 4/13-4/15!"]
["409 Cleaner Select Varieties 30-48 Ounce"]
["740 N. Main, Tooele UT"]
["745 N. Dixie Dr. St. George UT"]
["7up, 2 liter"]
["835 S. Bluff St. St. George UT"]
["8th Continent Soymilk Carton"]
["9 Lives Cat Food 4 ct 5.5 oz cans"]
["915 Redcliffs Dr. Washington UT"]
["ACT Mouthwash 18 oz"]
["Ad says B1 G1 ******"]
["Ad says B1 G1 50% off"]
["Advil Childrens Fever Reducer Pain Reliever Grape Flavor 4 oz"]
["Advil Congestion Relief 10 ct"]
["Advil Ibuprofen 24 ct"]
["Advil Liqui-Gels 160ct"]
["Advil PM 120ct"]
["Advil PM 20 ct"]
["Advil Tablets or Caplets 200ct"]
["Aim Toothpaste, 4.8-6 oz. assorted"]
["Aim, Pepsodent or Close Up Toothpaste, 6 oz."]
["Air Wick Candles, 5.29-6.35 oz."]
["Air Wick Freshmatic Mini Refill, 1 ct."]
["Air Wick Freshmatic Ultra Refill, 6.17 oz."]
["Air Wick Scented Oil Refill Twin Pack, 2 ct."]
["Ajax Dish Liquid 16 oz"]
["-AKA \"Catalina\" deals"]
["Albertsons"]
["Albertsons Apple Sauce, 23-24 oz."]
["Albertsons Canned Fruit, 15-15.25 oz."]
["Albertsons Cheese Singles, 10.7-12 oz."]
["Albertsons Chicken Noodle or Tomato Soup, 10.5-10.75 oz."]
["Albertsons Chunk or Shredded Cheese, 6-8 oz."]
["Albertsons Cottage Cheese, 24 oz."]
["Albertsons French Fries or Potato Rounds, 26-32 oz."]
["Albertsons Ice Cream, 1.5 qt."]
["Albertsons Intermountain/Northwest regions checkout voucher offers"]
["Albertsons Premium Shapes Mac N Cheese, 5.5-7.3 oz."]
["Albertsons Ricotta Cheese, 15 oz."]
["Albertsons Spring or Purified Water, 24 pk. 16.9 oz. bottles"]
["Albertsons Vegetables, 12-16 oz. Frozen or 12 oz. Steamy"]
["Aleve Pain Relief 100 ct Caplets or Tablets"]
["Aleve Pain Relievers 100 ct"]
["Alka Seltzer Original 24 ct"]
["Alka Seltzer Plus Original 24 ct"]
["All Laundry Detergent 84 or 96 loads"]
["All Liquid Laundry Detergent 50 oz 32 laods"]
["Allegra 24 Hour Allergy Relief, 15 ct."]
["Allegra Allergy 24 hr Relief 30 ct"]
["Allegra Allergy 24 hr Relief 5 ct"]
["Allegra Allergy Relief 15 ct Tablets"]
["Allegra Allergy Relief, 15 ct. 24 Hour"]
["Allegra Allergy Relief, 30 ct. Tablets"]
["Allegra -D Allergy 10 ct"]
["Altoids 0.37-0.76 oz"]
["Always Maxi Pads 20-48 Ct"]
["Always Panti-liners 64 Ct"]
["Always Panti-liners 68-80 ct"]
["Always Radiant Infinity Maxi pads 12-16 ct"]
["Always Radiant Maxi Pads 12 or 16 pk"]
["American Licorice Jumbo Red Vines 16 Ounce"]
["AmLactin Moisturizing body lotion 7.9 oz"]
["Amp, 16 oz. cans"]
["Angel Soft Bathroom Tissue, 24 roll white"]
["Apples, Cameo or Braeburn"]
["Apples, Fuji, organic"]
["Apples, Gala, organic"]
["Apples, Jazz or Gala"]
["Apples, Large Golden Delicious, Jonagold, Braeburn or Cameo"]
["Aquafresh Extreme Clean Toothpaste .8 oz travel size"]
["Aquafresh Toothpaste Select Varieties 6-6.4 Ounce"]
["Aquafresh Toothpaste, 6-6.4 oz. assorted"]
["Aquafresh Toothpaste, X-Fresh, Tartar or Original"]
["Aquafresh Training Toothpaste 1.5 oz"]
["Arrowhead Spring Water, 24 pk. half liter bottles"]
["Arrowhead Spring Water, 6 pk. 16.9 oz. bottles or 3 liter bottle"]
["Arrowhead Water, 24 ct"]
["Artichokes"]
["Asparagus"]
["Associated Foods"]
["Ataulfo Mangos"]
["Augason Farms ******ze Dried Sweet Corn, 16 oz."]
["Augason Farms 100% Instant Nonfat Country Fresh Dry Milk, 29 oz."]
["Augason Farms Beef Vegetarian Meat Substitute, 37 oz."]
["Augason Farms Blueberries, 12 oz."]
["Augason Farms Butter Powder, 36 oz."]
["Augason Farms Buttermilk Biscuit Mix, 46 oz."]
["Augason Farms Buttermilk Pancake Mix, 52 oz."]
["Augason Farms Cheese Blend Powder, 52 oz."]
["Augason Farms Cheesy Broccoli Soup Mix, 54 oz."]
["Augason Farms Chopped Onions, 23 oz."]
["Augason Farms Creamy Potato Soup Mix, 58 oz."]
["Augason Farms Dehydrated Apple Slices, 19.2 oz."]
["Augason Farms Dehydrated Potato Shreds, 23 oz. can"]
["Augason Farms Dehydrated Potato Slices, 20 oz."]
["Augason Farms Dough Enhancer, 15 oz."]
["Augason Farms Gulf Pacific Brown Rice, 20 lb. bag"]
["Augason Farms Hard Wheat, 45 lb. Red or White"]
["Augason Farms Hard Wheat, 50 lb. bag Red or White Wheat"]
["Augason Farms Honey Powder, 48 oz."]
["Augason Farms Honey Wheat Bread and Roll Mix , 58 oz."]
["Augason Farms Morning Moos Chocolate Milk Alternative, 71 oz."]
["Augason Farms Morning Moos Milk Alternative, 56 oz."]
["Augason Farms Potato Gems, 48 oz. can"]
["Augason Farms Red and Green Bell Peppers, 20 oz."]
["Augason Farms Rolled Oats, 23 lb. Regular or Quick"]
["Augason Farms Rolled Oats, 50 lb. bag Regular or Quick"]
["Augason Farms Scrambled Egg Mix, 36 oz."]
["Augason Farms Sliced Bananas, 34 oz."]
["Augason Farms Sliced Strawberries, 6.4 oz. ******ze Dried"]
["Augason Farms Spiff-E-Whip Dessert Topping, 20 oz."]
["Augason Farms Super Nutty Granola, 48 oz."]
["Augason Farms Vegetable Stew Blend, 33 oz."]
["Augason Farms Vital Wheat Gluten, 15 oz."]
["Augason Farms Whole Eggs, 33 oz."]
["Aunt Jemima Pancake Mix, 32 oz."]
["Aunt Jemima Syrup, 24 oz."]
["Aussie or Herbal Essences Shampoo, Conditioner or Styling Products, 5.7-14 oz."]
["Aussie Shampoo or Conditioner 8 to 13.5 oz"]
["Avent BPA ****** 4 oz Feeding Bottles 3 pk"]
["Avocados, large"]
["Avocados, Medium Hass"]
["Avocados, Organic"]
["Avocados, Small"]
["Awesome Paper Towels, 1 ct."]
["Baby Savings Promo: Save $5 instantly when you buy 2 participating large powder baby formula products in a single transaction."]
["Baileys Coffee Creamer 16 oz"]
["Balance Bar, 1.76 oz"]
["Ball Park Beef Franks, 14-16 oz"]
["Ball Park Hamburger or Hot Dog Buns, 8 ct."]
["Ball Park Meat Franks, 16 oz"]
["Banana Boat Sun Care, assorted Ultra Mist and Sport"]
["Banana Boat Sun or After-Sun Care"]
["Bananas"]
["Band-Aid Bandages, 10-80 ct."]
["Band-Aid Brand Premium Bandages, 10-80 ct."]
["Banquet Frozen Dinners, 4.66-10.25 oz. Value Menu"]
["Bar S Bologna, 16 oz. Classic, thick or chicken"]
["Bar S Ham or Turkey Breast, 16 oz."]
["Bar S Ham or Turkey Breast, 16 oz. assorted"]
["Bar S Sliced Bacon, 16 oz. assorted"]
["Barbasol or Pure Silk Shaving Cream, 9.5-11 oz."]
["Barbasol or Pure Silk Shaving Cream, 9.5-11 oz. assorted"]
["Bar-S meat Franks, 16 oz."]
["Bar-S Smoked Sausage, 2.5 lb."]
["Bausch and Lomb Ocuvite Eye Care 50 to 240 ct"]
["Bausch and Lomb Ocuvite Eye Vitamins"]
["Bausch and Lomb PreserVision Eye Care 60 ct"]
["Bayer Low Dose Aspirin Pain Reliever 32 ct"]
["Bayer Pain Relievers 100 ct"]
["Beano Tablets 30 ct"]
["Become an instructor"]
["Beef - 93% Lean Ground"]
["Beef - Albertsons 85% Lean Ground, 3 lbs or more"]
["Beef - Albertsons Petite Sirloin or Tri-Tip Steak, boneless max pak"]
["Beef - Chuck Roast, boneless"]
["Beef - Cross Rib Roast"]
["Beef - Quarter Pound Patties, 5 lb. box"]
["Beef - Ribeye Steaks, bone in, super value packs"]
["Beef - Round Steaks, Full Cut boneless"]
["Beef - Rump or Sirloin Tip Roast"]
["Beef - Short Ribs, bone-in"]
["Beef - Sirloin Tip Oven Roast, boneless"]
["Beef - Sirloin Tip, boneless sold whole in the bag"]
["Beef - Stew Meat, boneless"]
["Beef - Top Sirloin Steaks, boneless"]
["Beef - Tri Tip Steaks or Roast, boneless"]
["Bell Peppers, Green"]
["Benefiber Powder The Clear Choice 2.80 oz"]
["Bertolli Extra Virgin or Extra Light Olive Oil, 17 oz."]
["Bertolli Frozen Entrees Assorted Varieties 24 Ounce"]
["Bic Comfort 3 Razors For Men 4 ct"]
["Bic Twin Select Silky Touch Disposable Razor 10ct"]
["Birds Eye Steamfresh 12 oz"]
["Birds Eye Vegetables 10 – 16 oz"]
["Biz Powder Detergent 60 oz"]
["Black Forest Fruit Snacks, 25.2 oz."]
["Blackberries, 6 oz"]
["Blackberries, 6 oz."]
["Blistex Lip Balm, Complete Moisture or Five Star"]
["Blue Bunny Ice Cream, 56 oz"]
["Blue Diamond Almond Breeze Milk 86 oz"]
["Blue Diamond Almond Breeze, 64 oz."]
["Blue Storage Water Drum, 15 gallon"]
["Blue Storage Water Drum, 55 gallon"]
["Bob Evans Refrigerated Side Dishes 20 to 24 oz"]
["Bounce Fabric Softener, 2 month bar"]
["Bounce Fabric Softener, 80 ct. sheets"]
["Bounty Basic Paper Towels 8 pk"]
["Bounty Basic Paper Towels, single roll"]
["Bounty Paper Towels, 8 roll pack"]
["Brawny Paper Towels, 8 Regular Rolls"]
["Breyers Ice Cream 48 oz"]
["Bridgford Frozen Monkey Bread 16 oz"]
["Bridgford Monkey Bread 16 oz"]
["Broccoli"]
["Broccoli Crowns"]
["Broccoli, bunch"]
["Bushs Best Baked Beans, 21-28 oz"]
["Buy $10 of these products and receive a $2 voucher good on your next shopping purchase."]
["Buy 1 of these products and receive a $1.50 voucher good on your next shopping purchase."]
["Buy 1 of these products and receive a $2 coupon valid on your NEXT shopping purchase. NO LIMITS!"]
["Buy 1 of these products and receive a $3.00 voucher good on your next shopping purchase."]
["Buy 2 of these products and receive a $1 coupon valid on your NEXT shopping purchase. NO LIMITS!"]
["Buy 2 of these products and receive a $1.00 voucher good on your next shopping purchase."]
["Buy 2 of these products and receive a $2 coupon valid on your NEXT shopping purchase. NO LIMITS!"]
["Buy 4 of these products and receive a $3.00 voucher good on your next shopping purchase."]
["BUY THE QUANTITY INDICATED, MIX OR MATCH."]
["C and H Pure Cane White Sugar Granulated 2 lbs"]
["California Pizza Kitchen"]
["California Pizza Kitchen Crispy Thin Crust, 11.5-17 oz."]
["Campbells SpaghettiOs or Spaghetti, 14.75-15 oz. Original"]
["Campbells Spaghettios, 26 oz. can original"]
["Campbells Tomato or Chicken Noodle Soup, 10.75 oz."]
["Canine Carry Outs Dog Snacks"]
["Cantaloupe"]
["Care****** Pantiliners 36-60ct or Ultra 16ct"]
["Carnation Evaporated Canned Milk"]
["Carrots, 1 lb. Farm Stand Baby Cut"]
["Carrots, 2 lb bag"]
["Carrots, 2 lb. cello bag"]
["Cascade Dishwasher Detergent Assorted Varieties 120 Ounce"]
["Cascade Fresh Yogurt Assorted Varieties 6 Ounce"]
["Case Lot Sale!"]
["Case of 10 - $19.90"]
["Case of 12 - $10.56"]
["Case of 12 - $11.88"]
["Case of 12 - $12.00"]
["Case of 12 - $15.00"]
["Case of 12 - $18.00"]
["Case of 12 - $19.08"]
["Case of 12 - $20.00"]
["Case of 12 - $23.88"]
["Case of 12 - $24.00"]
["Case of 12 - $24.00 "]
["Case of 12 - $26.28 "]
["Case of 12 - $27.48"]
["Case of 12 - $3.00"]
["Case of 12 - $3.96"]
["Case of 12 - $30.00"]
["Case of 12 - $7.08"]
["Case of 12 - $83.88"]
["Case of 12 - $9.48"]
["Case of 16 - $14.08"]
["Case of 16 - $16.00"]
["Case of 20 - $19.80"]
["Case of 20: $19.80"]
["Case of 24 - $10.56"]
["Case of 24 - $12.00"]
["Case of 24 - $14.16"]
["Case of 24 - $16.56"]
["Case of 24 - $18.96"]
["Case of 24 - $21.12"]
["Case of 24 - $21.36"]
["Case of 24 - $23.76"]
["Case of 24 - $23.96"]
["Case of 24 - $24.00"]
["Case of 24 - $28.56"]
["Case of 24 - $3.60"]
["Case of 24 - $30.00"]
["Case of 24 - $36.00"]
["Case of 24 - $4.80"]
["Case of 24 - $40.00"]
["Case of 24 - $48.00"]
["Case of 24 - $7.92"]
["Case of 24 - $8.00"]
["Case of 24 - $9.36"]
["Case of 24: $12.00"]
["Case of 4 - $19.96"]
["Case of 4 - $21.96"]
["Case of 4 - $27.96"]
["Case of 48 - $15.84"]
["Case of 48 - $16.00"]
["Case of 48 - $28.32"]
["Case of 48 - $33.12"]
["Case of 5 - $19.95"]
["Case of 6 - $15.00"]
["Case of 6 - $32.94"]
["Case of 6 - $6.00"]
["Case of 6 - $71.94"]
["Case of 8 - $12.00"]
["Case of 8 - $23.92"]
["Case of 8 - $24.00"]
["Cauliflower"]
["Celery"]
["Celery, Extra Large"]
["Celery, large"]
["Challenge Whipped Butter 8 oz"]
["Charmin Basic Bathroom Tissue 12 pk"]
["Charmin Bathroom Tissue, 12 pk. double roll"]
["Cheez it Crackers, 9.75-14 oz"]
["Cheez-It Crackers 9 oz"]
["Cheez-its 4.5 oz"]
["Chef Boyardee Pasta, 14.75-15 oz. can With Meat or 7.5 oz. Microwave"]
["Chex Mix or Chex 100 Calorie Snack 4.5 oz or more"]
["Chicken - Albertsons Split Breasts, bone-in"]
["Chicken - Boneless Skinless Breast Tenders"]
["Chicken - Boneless Skinless Breasts"]
["Chicken - Boneless Skinless Breasts, 20 lb. case frozen"]
["Chicken - Breaded Patties, 10 lb. case fully cooked"]
["Chicken - Chefs Trim Boneless Skinless Thighs"]
["Chicken - Drums or Thighs"]
["Chicken - Gold n Plump Boneless Skinless Stir Fry, Tenders or Breasts, 14-15 oz."]
["Chicken - Leg Quarters, fresh Family Pack"]
["Chicken - Smiths Boneless, Skinless Breasts, Tenders or Thighs, super value pack"]
["Chicken of the Sea Premium Chunk Light Tuna, 2.5 oz. pouch"]
["Children's Advil Liquid 0.5oz or Tablets 24ct"]
["Chobani Greek Yogurt, 32 oz. Plain or Vanilla"]
["Cilantro"]
["Cilantro, bunch"]
["Citracal Slow Release 1200 Supplement 80 ct"]
["Clairol Gray Solution Hair Color"]
["Clairol Nice n Easy Hair Color"]
["Claritin Allergy Relief 30 ct"]
["Claritin Childrens Non Drowsy 2 oz"]
["Claritin Non-Drowsy Allergy Medicine 30 ct"]
["Clementine Mandarins, 3 lb. bag"]
["Clorox Clean-Up 32 oz"]
["Clorox, Select Varieties 30-48 Ounce"]
["Clover Club Potato Chips, 8-10 oz. assorted"]
["Coca Cola Soft Drinks, 2 liter bottle"]
["Coca Cola Soft Drinks, 20 pk. cans"]
["Coffee-Mate Creamer, 32 oz"]
["Coke Products, 2 liter bottle"]
["Coke Products, 20 pk. cans"]
["Coke, 2 liter"]
["Coke, 20 pk"]
["Colgate Any Multipack Toothpaste"]
["Colgate Cavity Protection Original Toothpaste 6.4 oz"]
["Colgate Kids Toothpaste, 5-5.2 oz."]
["Colgate Manual Toothbrush 2 pk"]
["Colgate Optic White Toothpaste, 4-5.8 oz"]
["Colgate Power Toothbrush"]
["Colgate Sensitive Pro Relief Toothpaste 4oz"]
["Colgate Toothbrush, 1-2 ct"]
["Colgate Toothpaste, 4-5.8 oz"]
["Colgate Total Advanced 5.8 oz"]
["Colgate Total Advanced Toothpaste (If this variety is included)"]
["Colgate Total Toothpaste, 5-5.2 oz."]
["Combos Snacks 7 oz"]
["Cool Classics Fun Daze Sundaes, 4 ct or Ice Cream Sammies, 12-16 ct"]
["Coppertone Sun Screen Spray, 2 pk. 6 oz."]
["Coppertone Sunscreen, 6-8 oz. Babys or Kids"]
["Cottonelle 12 pack Toilet Paper"]
["Cottonelle Bath Tissue, 18 ct. Double Roll"]
["Cottonelle Bathroom Tissue, 12 Double Roll Clean Care or Ultra"]
["Cottonelle, 12 double rolls"]
["County Crock Vegetable Oil Spread 15 oz"]
["CoverGirl Blast Eye or Blast Lip"]
["Cream o Weber Sour Cream, 24 oz."]
["Crisco Vegetable Oil 32oz"]
["Crunchmaster Crackers 4.5 oz"]
["Crystal Light On the Go Drink Mixes, 7-10 ct."]
["Cucumbers"]
["Current list"]
["Dailys Big Buy Bacon, 1 lb."]
["Dasani Water .5 Liter Bottles 24 Pack"]
["Dasani Water 16.9 oz 24 pk"]
["Dasani Water, 24 pk. 16.9 oz. bottles"]
["DaVinci Pasta, 16 oz. assorted"]
["Degree Antiperspirant/Deodorant 2.6 to 3 oz"]
["Del Monte Fruit Cups, 4 pk."]
["Dessert Meal Deal"]
["Dessert Special"]
["Dial Basic or Coast Bar or Hand Soap, 3 ct. or 9.4 oz."]
["DiGiorno Original Pizza, 12.6-33.3 oz."]
["DiGiorno Pizza 12 in"]
["DiGiorno Smalls Pizzas"]
["Dimetapp Liquid 4 oz"]
["Dinty Moore Beef Stew, 15 oz. can"]
["Dinty Moore Beef Stew, 24 oz."]
["Dole Classic Romaine, 9 oz."]
["Dole Classic Romaine, Greener Selection, Just Lettuce or Spinach, 9-12 oz. bags"]
["Dole Fruit Bowls, Gels, Parfaits, or Crisps"]
["Dole Juice Assorted Varieties 59 Ounce"]
["Dole Mandarin Oranges"]
["Dole Mandarin Oranges, 15 oz."]
["Dole Pineapple, 20 oz cans"]
["Dole Pineapple, 8 oz cans"]
["Dole Real Fruit Bites (Pineapple, Mango or Apple)"]
["Dole Salad Kits, 8-13 oz"]
["Dole Salad, 9 oz. Classic Romaine or 11 oz. Just Lettuce"]
["Dole Salads, 9 oz. Classic Romaine or 11 oz. Just Lettuce"]
["Dole Salads, 9 oz. Classic Romaine or Just Lettuce"]
["Dole Spinach 9 oz. Bag"]
["Dole Tropical Fruit Cans"]
["Don Julio Tortilla Chips, 9 oz. assorted"]
["Doritos Tortilla Chips, 11-11.5 oz. assorted"]
["Doritos, 10.5-11.5 oz."]
["Doritos, 10-11.5 oz."]
["Doritos, 11-11.5 oz"]
["Doritos, 11-11.5 oz."]
["Dove Antiperspirant/Deodorant 2.6 to 3 oz"]
["Dove Miniatures 8.5-9.5 oz"]
["Downy Fabric Softener Liquid 41-51 oz or sheets 90 ct"]
["Downy Fabric Softener, 34 or 64 oz."]
["Downy Unstopables pr Gain Scent Boosters, 13.2 oz."]
["Dr. Scholls Massaging Gel Insoles"]
["Dreyers Fruit Bars, 6-12 ct. assorted"]
["Dunkin Donuts Coffee 12 oz"]
["Duracell Coppertop Batteries AAA or AA 8 pk, C or D 4 pk, or 9V 2 ok"]
["Each stores ad is the final authority on sale pricing."]
["Earthbound Farms Celery Hearts, organic"]
["Earthbound Organic Salad Blends"]
["Eat Smart Cut Vegetables, 12 oz."]
["Edge Shaving Cream, 7-10 oz."]
["Edge Shaving Gel"]
["Eggo Waffles or Pancakes, 6-10 ct"]
["Emergen C, 30 ct"]
["Emetrol Nausea Liquid Medicine Cherry Flavor 4 oz"]
["Enfamil Powder Formula, makes 161-170 oz."]
["Eos Shave Cream 7oz"]
["Essential Everyday or Albertsons Snacker Crackers, 14.5-16 oz."]
["Essential Everyday Pasta, 12-16 oz."]
["Essential Everyday Salad Dressing, 16 oz."]
["Essential Everyday Widepan Breads, 24 oz."]
["Ester C 90 ct"]
["Eucerin Body Lotion Everyday Protection 13.5 oz"]
["Eucerin Lotion or Skin Care"]
["Excedrin Extra Strength 24 ct"]
["Expires: 3/10/12"]
["Expires: 3/14/12"]
["Expires: 3/14/12 "]
["Expires: 3/18/12"]
["Expires: 3/18/12 "]
["Expires: 3/25/12"]
["Expires: 3/4/12"]
["Expires: 3/4/12 "]
["Extra Promo: ****** First Aid Kit, including 15 in valuable coupons, instantly when you buy 3 participating Johnson and Johnson First Aid products in a single transaction."]
["Extra Promo: 4 for $6 when you buy 4 in a single transaction. Individual price $2.00 each."]
["Extra Promo: Buy any 10 participating drink products, get 10 Fuze drinks ******!"]
["Farmland Sausage, 14 oz. Polska Kielbasa or Original Smoked"]
["Farr Ice Cream, 4 qt. pail"]
["Fiber Choice 90 ct Tablets"]
["Fiber One Chewy Bars, Fiber One 90 Calorie Chewy Bars, or Fiber One 90 Calorie Brownies"]
["Finish Automatic Dishwasher Detergent Powerball Tabs or Gelpacs 20 ct"]
["Finish Automatic Dishwasher Detergent Quantum Powerball 10 ct"]
["Finish Powerball Tabs, 32 ct."]
["Finish Tabs or Gelpacs 20 pk"]
["First Aid Coupon"]
["First and second items will ring up $1.99, third item will ring up $1.02"]
["First and second items will ring up $4.49, third item will ring up $3.02"]
["First item will ring up $1.79, second item will ring up $1.21"]
["First item will ring up $2.59, second item will ring up $2.41"]
["First item will ring up $2.99, second item will ring up $1.01"]
["First item will ring up $2.99, second item will ring up $2.01"]
["First item will ring up $3.19, second item will ring up $2.81"]
["First item will ring up $5.49, second item will ring up $4.51"]
["First item will ring up $5.99, second item will ring up $5.01"]
["First, second and third items will ring up $1.49, fourth item will ring up $0.53"]
["First, second and third items will ring up $2.99, fourth item will ring up $1.03"]
["Fisher Boy Fish Sticks 48 ct"]
["Flipz Pretzels, 5 oz"]
["Floridas Natural Orange Juice, 59 oz."]
["Folgers Coffee 33.9 oz, Special Roast or Gourmet Supreme 27.8 oz or Decaf 22.6 oz"]
["Folgers Instant Coffee 8 oz Classic Roast or Decaf"]
["Food Storage Pail with Lid, 5 gallon"]
["Food Storage Sale!"]
["Freschetta Pizza Assorted Varieties 16.44-30.63 Ounce"]
["Freschetta Pizza, 9.4-30.6 oz"]
["Fresh Market"]
["Fresh Selections Salad Kit, 8-13 oz"]
["Fritos or Cheetos, 9-10.5 oz."]
["Fur Reals Toy"]
["Fuze Drinks, 16.9 oz."]
["Fuze, 16.9 oz."]
["Fuze, 18.5 oz. bottles"]
["Garnier Fructis Shampoo or Conditioner 13 oz"]
["Garnier Fructis Style 2 to 8.5 oz"]
["Garnier Nutritioniste Moisture Rescue Cream 1.7 oz"]
["Garnier Shampoo or Conditioner 13 oz"]
["GE Light Bulbs Soft White 4pk or Long Life 2pk"]
["Geisha Chunk Light Tuna, 5 oz."]
["General Mills Chex Honey Nut Cereal"]
["General Mills Kix Cereal 12 oz"]
["General Mills Trix Cereal 14.8 oz"]
["Gerber Good Start Formula, makes 164-182 oz."]
["Gillette Venus with Olay Razor"]
["Glaceau Smartwater, 1 liter bottle"]
["Glaceau Vitaminwater, 20 oz. bottle"]
["Glad ******zer or Storage Bags, 30-50 ct. Gallon or Quart"]
["Glad Trash Bags 13 Gallon 26 ct"]
["Glad Trash Bags Drawstring 13 gal 22 ct, 30 gal 18 ct, or quick-tie 13 gal 35 ct, 30 gal 27 ct"]
["Glad Trash Bags Quick Tie 30 Gallon 40 ct"]
["Glad Trash Bags, 28-35 ct."]
["Glad Trash Bags, 28-80 ct."]
["Glade Aerosol 9 oz"]
["Glade Aerosol, 9.7 oz."]
["Glade Candle, 4 oz."]
["Glade Carpet and Room Deodorizer 32 oz"]
["Glade Carpet and Room Odor Eliminator 32 oz"]
["Glade Decor Scents Refills 2 pk"]
["Glade Decor Scents Warmer"]
["Glade Plug In Scented Oil Refill, 1 ct."]
["Glade Plugins Scented Oil Twin Pack"]
["Glade Plug-Ins Scented Oil Warmer"]
["Glade PlugIns Scented Oil Warmers"]
["Glade Relaxing Moments Spray 9.7 oz"]
["Glade Sense and Spray Kit"]
["Glade Sense and Spray Refill"]
["Glucerna Multi-Pack Bars 4 pk"]
["Godiva Chocolate Bar 3.5 oz"]
["Gold Medal Flour, 10 lb. All Purpose or Unbleached"]
["Goodnites Underwear 35 ct"]
["Gortons Products 6.3 – 24.5 oz"]
["Got a list question? Want to check if next week's list is ready? Our listmakers answer questions and post our \"preview\" lists at PYP."]
["Got2B Styling Gel or Glue 6 to 12 oz"]
["Goya Low Sodium Beans 15.5 oz"]
["Goya Rice 3.5 oz"]
["Grandma Sycamores Bread, 24 oz. White or Wheat"]
["Grape Tomatoes, 10 oz"]
["Grape Tomatoes, organic, pint"]
["Grapes"]
["Grapes, Black Seedless"]
["Grapes, Red or Black Seedless"]
["Grapes, Red, Seedless"]
["Great Grains Bread White or Wheat Split Top, 22.5 oz."]
["Green Onions, bunch"]
["Green Onions, Organic bunch"]
["Grill Night Promo: Buy $10 of participating products, get $2 off"]
["Grill Night Promo: Buy $20 of participating products, get $5 off"]
["Ground Round - Private Selection Angus, 85%"]
["Guldens Mustard, 12 oz."]
["Haagen Dazs Ice Cream, 3.6 oz"]
["Haribo Gummy Bears 5 oz"]
["Harmons"]
["Hatch Green Chiles, 4 oz. chopped or diced"]
["Hawaiian Punch Juice, 32 oz."]
["Hawaiian Tropic Lime Coolada After Sun Moisturizer 16 oz"]
["Hawaiian Tropic Sun or After-Sun Care"]
["Head and Shoulders, 23.7 oz. assorted"]
["Healthy Choice 100% Natural Entrees (If this variety is included)"]
["Healthy Choice Entrees, 9.5-10.8 oz"]
["Healthy Choice Frozen Traditional Classics or Modern Classics (If this variety is included)"]
["Healthy Choice Steaming or Simple Select Entrees, 8.5-9.9 oz."]
["Hefty One Zip Bags - ******zer 13 pk or Storage 17 or 22 pk"]
["Heinz Ketchup, 32-40 oz"]
["Hellmanns Mayonnaise 22 or 30 oz"]
["Herbal Essences Shampoo or Conditioner or Herbal Essences or Aussie Stylers 8 to 13.5 oz"]
["Hersheys Bliss 8.6-9.6 oz"]
["Hersheys Candy Bar Singles 1.4 to 2.5 oz"]
["Hersheys Chocolate Syrup Assorted Varieties 24 Ounce"]
["Hersheys Miniatures or Kisses Candy 19.75 oz"]
["Hersheys Miniatures, Nuggets, Drops, Pieces or Minis 8-12 oz"]
["Hillshire Farms Smoked Sausage, 13-14 oz"]
["Hinode Dry Rice 5 lb Bag"]
["Hint: These deals can be VERY HOT if the item is also on sale, and you use manufacturers coupons when buying them!"]
["Homelife Bleach, 96 oz."]
["Homelife Heavy Duty Scrub Sponges, 3 ct."]
["Homelife Latex Simply Clean Gloves, 1 pair"]
["Homelife Liquid Laundry Detergent, 100 oz."]
["Homelife Napkins, 120 ct."]
["Homelife Whisper Soft Facial Tissue, 66-160 ct."]
["Hormel Compleats, 10 oz."]
["Hormel Country Crock Side Dishes, 20-24 oz."]
["Hormel Entrees Beef, Pork, Turkey or Meat Loaf, 17 Ounce"]
["Hormel Fully Cooked Entrees, 17 oz. assorted"]
["Hormel Little Sizzlers Breakfast Sausage, 12 oz."]
["Hormel Spam Luncheon Meat, 12 oz."]
["Hormel Spam Luncheon Meat, 12 oz. assorted"]
["Hot or Lean Pockets, 2-4 ct"]
["Hot Pockets, 12 pk. Ham and Cheese or Pepperoni Pizza"]
["How to use this list"]
["Huberts Lemonade"]
["Huggies Diapers, 15-50 ct."]
["Huggies Little Movers Big Pack Diapers"]
["Huggies Little Movers Slip-On Diapers"]
["Huggies Pull-Ups, 15-50 ct."]
["Huggies Snug and Dry Big Pack Diapers"]
["Huggies Wipes, 64-72 ct."]
["Hungry Jack Syrup 27.6oz"]
["Hunts Barbecue Sauce, 21.6 oz."]
["Hunts Diced Tomatoes or Fire Roasted Diced Tomatoes, 14.5-15 oz."]
["Hunts Ketchup, 24 oz."]
["Hunts Pasta Sauce, 24-26.5 oz."]
["Hunts Pasta Sauce, 24-26.5 oz. assorted"]
["Hunts Spaghetti Sauce, 24-26.5 oz. assorted"]
["I Cant Believe Its Not Butter, 15 oz. Spreads or 8 oz. Spray"]
["I Cant Believe Its Not Butter, 15 oz. tubs, 2 pk. 8 oz. tubs or 8 oz. spray"]
["I Cant Believe Its Not Butter, 15 oz. tubs, 2 pk. 8 oz. tubs or 8 oz. sprays"]
["Idahoan Potatoes, 4-4.1 oz."]
["If you have questions about these, or to tell us about one not listed here, use this thread at PYP"]
["In-ad store coupon: .69 each when you buy 10. $1.29 each without."]
["IT IS NOT GUARANTEED TO BE ACCURATE FOR EVERY ASSOCIATED FOOD STORE."]
["Item"]
["Ivory Soap Bars, 10 pk."]
["Jennie-O Smoked Sausage, 14 oz."]
["Jet-Dry Rinse 8.45 oz"]
["Jif Peanut Butter 18oz"]
["Jif Peanut Butter, 17.3-18 oz."]
["Jiffy Baking Mix, 40 oz."]
["Jiffy Corn Muffin or Pizza Crust Mix, 6.5-8.5 oz."]
["Jiffy Muffin Mixes, 7 oz. assorted"]
["John Frieda Precision Foam Hair Colour"]
["Johnson and Johnson Band-Aids, 10-80 ct."]
["Johnsonville Breakfast Sausage Links, 12 oz."]
["Johnsonville Breakfast Sausage, 12 oz."]
["Jolly Time Microwave Popcorn, 2-4 pk."]
["Jolly Time Popcorn, 3-4 ct"]
["Jonny Cat Litter 20 lbs"]
["Jose Ole 16 oz"]
["Joy Dish Soap Assorted Varieties 30 Ounce"]
["Juicy Juice, 8 pk. 6.75 oz. assorted"]
["Just For Men Haircolor"]
["Kashi Steam Meal, 9-10 oz"]
["Kashi Steam Meals, 9.5 oz."]
["Kaz Heating Pad"]
["Keebler Club Crackers 11.5 to 16 oz"]
["Keebler Granola Fudge Bars, 7.4 oz."]
["Kelloggs Cereal, 11-17 oz"]
["Kelloggs Cereal, 11-17 oz. Chocolate or Double Chocolate Krave"]
["Kelloggs Cereal, 11-17 oz. Froot Loops, Apple Jacks, Frosted Flakes, Chocolate or Double Chocolate Krave"]
["Kelloggs Cereals, 11 oz. Krave"]
["Kelloggs Cereals, 11-17 oz. Chocolate or Double Chocolate Krave"]
["Kelloggs Cereals, 11-17 oz. Froot Loops, Apple Jacks, Frosted Flakes, Chocolate or Double Chocolate Krave"]
["Kelloggs Cereals, 15.5-18 oz. Frosted Mini Wheats Bite Size"]
["Kelloggs Cereals, 15.5-18 oz. Frosted Mini Wheats Bite Size, 10.8-14.1 oz. Crunchy Nut, 20 oz. Raisin Bran, 14 oz. Frosted Flakes"]
["Kelloggs Cereals, 17 oz. Frosted Flakes, 12.2 oz. Apple Jacks, 12.2 oz. Froot Loops, 12 oz. Rice Krispies, 11 oz. Krave"]
["Kelloggs Cereals, 20 oz. Raisin Bran"]
["Kelloggs Frosted Mini-Wheats16-20 oz"]
["Kelloggs Fruit Snacks, 8 oz."]
["Kelloggs Fruit Snacks, 8oz."]
["Kelloggs Fruit Snacks, 9 oz. assorted"]
["Kelloggs Nutri-Grain Bar, 7.8-10.4 oz. assorted"]
["Kelloggs Nutri-Grain Bars 8 ct"]
["Kelloggs Nutri-Grain Bars 8 pk"]
["Kelloggs Nutri-Grain Bars, 7.8-10.4 oz."]
["Kelloggs Nutri-Grain or Fusion Bars, 7-10.4 oz. assorted"]
["Kelloggs Pop Tarts 8 ct"]
["Kelloggs Pop-Tarts 8 pk"]
["Kelloggs Pop-Tarts Mini Crisps, 4.86 oz."]
["Kelloggs Pop-Tarts, 12 ct."]
["Kelloggs Promo: $1.99 each when you buy 4 in a single transaction. Individual price $2.99 each."]
["Kelloggs Raisin Bran 16-20 oz"]
["Kelloggs Rice Krispies Treats 8 pk"]
["Kelloggs Rice Krispies Treats, 8 ct."]
["Kelloggs Rice Krispies, Frosted Flakes, Froot Loops, Apple Jacks, Corn Pops, or Raisin Bran 8.7-16.5 oz"]
["Kelloggs Rice Krispy Treats 8 ct"]
["Kelloggs Special K Bars 5 or 6 pk"]
["Kelloggs Special K Cracker Crisps 4 oz"]
["Kettle Baked Potato Chips, 4 oz"]
["Kettle Brand Potato Chips 9 oz"]
["Kid Cuisine, 7.21-10.6 oz."]
["Kings Hawaiian Rolls, 12 ct"]
["Kingsford Charcoal, 15.7-16.6 lb bag"]
["Kiss Salon Results"]
["Kiwi"]
["Kiwi, organic"]
["Kleenex Facial Tissue 24, 70 or 100 sheets"]
["Kleenex Facial Tissue, 50-164 ct."]
["Kleenex Facial Tissue, 50-184 ct."]
["Kleenex Family Size 240 ct, Pocket Paks 8 pk, or Cool Touch 50 ct"]
["Knorr Rice or Pasta Side Dishes, 3.8-5.8 oz."]
["Kool Aid Bursts, 6 pk."]
["Kool-Aid Bursts Drinks, 6 ct."]
["Kozy Shack Pudding 22 oz. Tubs or 4-6 Pack Assorted Varieties"]
["Kraft American Singles, 10.7-12 oz."]
["Kraft Cheese, 7-8 oz"]
["Kraft Homestyle Macaroni Dinners, 12-15 oz."]
["Kraft Macaroni and Cheese, 5 pk."]
["Kraft Macaroni and Cheese, 5 pk. 7.25 oz."]
["Kraft Miracle Whip or Mayo, 30 oz"]
["Kraft Miracle Whip or Mayo, 30 oz."]
["Kraft Miracle Whip or Mayo, 30 oz. Original"]
["Kraft Shredded Cheese, 8 oz."]
["Kroger Acetaminophen, 500 ct"]
["Kroger Bacon, 24 oz"]
["Kroger Bratwurst, 18 oz"]
["Kroger Canadian Bacon, 5 oz"]
["Kroger Cheese, 32 oz"]
["Kroger Coffee, 26-34.5 oz"]
["Kroger Cottage Cheese, 24 oz"]
["Kroger Deluxe Sherbet, 16 oz"]
["Kroger Dip, 24 oz"]
["Kroger Ibuprofen, 500 ct"]
["Kroger Italian Sausage, 18 oz"]
["Kroger Singles, 12 ct"]
["Kroger Sour Cream, 24 oz"]
["Krusteaz Buttermilk Pancake Mix, 10 lb. bag"]
["Krusteaz Frozen Waffles, Pancakes or French Toast Sticks, 7-19 oz."]
["K-Y Gel 2 oz"]
["K-Y Yours+Mine"]
["La Choy Bi-Packs, 42-43.5 oz."]
["La Choy Bi-Packs, 42-43.5 oz. assorted"]
["La Choy Chow Mein Dinners, 42 oz. bi-Pack"]
["La Victoria Salsa, 16 oz."]
["La Victoria Salsa, 16 oz. assorted"]
["La Victoria Taco Sauce, 15 oz."]
["La Victoria Taco Sauce, 15 oz. Mild or Medium"]
["Lady Speed Stick Deodorant, 2.3-3.5 oz"]
["Land O Frost Premium Lunchmeat, 16 oz."]
["Langers 100% Apple Juice, 64 oz."]
["Langers Juice Cocktails, 64 oz. Cranberry or Pomegranate"]
["Larger Walmart stores are more likely to carry the variety and size found on this list."]
["Las Palmas Enchilada Sauce or Red Chile Sauce, 28 oz. can"]
["Las Palmas Enchilada Sauce, 28 oz."]
["Lasagna Meal Deal"]
["Late ads (run Wednesday - Tuesday)"]
["Lawrys Seasoning Mixes, .88-1.5 oz."]
["Lays Chips, 10-10.5 oz."]
["Lays Kettle Cooked Potato Chips, 8.5 oz."]
["Lays Potato Chips 10-10.5 oz"]
["Lays Potato Chips, 10-10.5 oz."]
["Lays Stax 5.5-5.75 oz"]
["Leaf Lettuce, Green Red or Romaine"]
["Lean Cuisine Frozen Entrees, 5.25-11.5 oz. assorted"]
["Libbys Vienna Sausage, 5 oz."]
["Libbys Vienna Sausage, 5 oz. Original or Chicken"]
["Libman ******dom Spray Mop, 1 ct."]
["Lifeway Kefir, 32 oz"]
["LIMIT 1 reward per household."]
["LIMIT 1 rewards per household."]
["Limit 1 voucher"]
["Limit 1 voucher "]
["Limit 2"]
["LIMIT 2 reward per household."]
["LIMIT 2 rewards per household."]
["Limit 3"]
["LIMIT 3 rewards per household."]
["Limit 4"]
["LIMIT 4 rewards per household."]
["Limit 6"]
["Lindt Chocolate Bar 3.5 oz"]
["Lipton Green Tea 12 pk 16.9 oz"]
["Lipton Naturals, 20 oz. bottles"]
["Lipton, 20 oz. bottle"]
["Liquid Plumr 17-20 oz"]
["Listerine Mouthwash 1 liter"]
["Listerine Pocketpaks, 72 ct or more"]
["Listerine Toothpaste 4.2 oz"]
["Listerine Zero Mouthwash 1.5 liter"]
["Lloyds Barbeque Chicken, Beef, Pork or Honey Chicken 18 Ounce"]
["Long Term Storage Sale!"]
["Looking to buy something online? Try the PYP Screaming Deals Online forum."]
["LOreal Age Perfect and Revitalift Skin Care"]
["LOreal Colour Riche Lip"]
["LOreal Colour Riche Lipcolour or Nail Colour"]
["LOreal Cosmetics"]
["LOreal EverCreme, EverPure, EverStrong or EverSleek Hair Care"]
["LOreal Excellence Hair color"]
["LOreal Feria Hair Color"]
["LOreal Paris Eye product"]
["LOreal Paris Eyeliner or Eye Shadow"]
["LOreal Paris Face Cosmetic product"]
["LOreal Paris Go 360 Deep Clean Face Cleanser 6 oz"]
["LOreal Preference Hair Color"]
["LOreal Sublime Mousse Hair Color"]
["LOreal True Match Foundation"]
["LOreal Voluminous Mascara"]
["LOreal Voluminous Mascara and Colour Riche Lip"]
["Louisiana Fish Fry Breading"]
["Luster Toothpaste 2.6 or 8 oz"]
["Luvs Diapers, 80-180 ct. Big Pack"]
["Luvs Family Pack Diapers"]
["Lysol Cleaners, 24-40 oz."]
["Lysol Disinfecting Wipes, 150 ct."]
["Lysol Neutra Air Fabric Mist, 7 oz."]
["Lysol No Touch Starter Kit with One Refill, 1 ct."]
["Lysol No-Touch Kitchen System"]
["Lysol Toilet Cleaners, 24 oz."]
["Lysol Wipes, 28-35 oz."]
["M and Ms 9.9-12.6 oz"]
["M and Ms Candy 19.2 oz"]
["Maceys"]
["Magnum Ice Cream Bars 3 pk"]
["Maid o Clover Gallon Milk"]
["Maid O Clover Milk, gallon 2%, 1% or Fat ******"]
["Malt-O-Meal Cereals 11 oz. Frosted Flakes or 12 oz. Frosted Mini Spooners"]
["Mangos"]
["Marc Anthony Shampoo, Conditioner or Stylers"]
["Marie Callenders Dinners Assorted Varieties 10-21 Ounce"]
["Marie Callenders Entrees, 8.5-19 oz"]
["Maruchan Ramen Noodles Instant Lunch, 2.25 oz. cup"]
["McCormick Recipe Creations, .23-.46 oz."]
["Meadow Gold Fudge, Dream or Root Beer Bars, 6 ct."]
["Meal Deal"]
["Mentos UP2U Gum 14-15 ct"]
["Met Rx Big 100 Bars 4 pk"]
["Mi0 Liquid Water Enhancers, 1.62 oz."]
["Micellis String Cheese, 12 oz."]
["Michelinas Entrees, 4-9.5 oz"]
["Michelinas Entrees, 8-9 oz. Authentico, 4.5-7.5 oz. Zapems gourmet, 4.65-9 oz. Lean Gourmet, 8-9 oz. Traditional Recipes"]
["Michelinas Frozen Dinners Assorted Varieties 4-9 Ounce"]
["Minute Rice, 14 oz. Brown or Long Grain White"]
["Moms Best Naturals Cereal, 11.5-16.5 oz"]
["Monthly Register Reward Deals"]
["MorningStar Farms Products 8 – 9.5oz"]
["Mothers Bagged Cookies, 14 oz. assorted"]
["Mothers Cookies, 14 oz. bag"]
["Mountain Dairy Milk, gallon"]
["Move-****** 20-30 ct + 30 ct"]
["Mrs. Butterworths Original Syrup, 2 pk. 64 oz."]
["Mrs. Butterworths Pancake Syrup, 2 pk. 64 oz."]
["Mushrooms, 8 oz"]
["Mushrooms, 8 oz. Cello Wrapped Sliced or Whole Crimini"]
["Must buy 4 to receive discount"]
["Nabisco Belvita Breakfast Biscuits, 8.8 oz."]
["Nabisco Cheese Nips Assorted Varieties 10-12 Ounce"]
["Nabisco Cheese Nips Crackers 12 oz"]
["Nabisco Cheese Nips, 10.5-12 oz."]
["Nabisco Cookies or Crackers 3.5-8 oz"]
["Natural Directions Almondmilk or Soy Milk, 64 oz. Original or Vanilla"]
["Natural Harvest Trail Mix 4 oz"]
["Nature Made B-1 100 mg 100 ct"]
["Nature Made Calcium 500mg 130ct"]
["Nature Made CoQ10"]
["Nature Made D3 400 IU 100 ct"]
["Nature Made Fish Oil"]
["Nature Made Multi-Complete Vitamin 60ct"]
["Nature Made Potassium Gluconate 550 mg 100 ct"]
["Nature Made Vitamin B"]
["Nature Made Vitamin B-12 100ct"]
["Nature Made Vitamin D"]
["Nature Made Vitamins"]
["Nature Sweet Sunburst or Cherry Tomatoes, 10.5 oz"]
["Nature Valley Granola Bars (6 ct or more), Nature Valley Granola Nut Clusters or Nature Valley Granola Thins"]
["Natures Bounty Coral Calcium Plus 1000 Mg 120 ct"]
["Neosporin Ointment, .5 oz."]
["Neosporin, .5 oz, 7.7 mL or 1 ct. On the Go"]
["Nestle Coffee-Mate Flavored Creamers, 32 oz. assorted"]
["Nestle Fruit Flavored Water, 6 pk. Raspberry Splash, Acai Grape or Wild Berry"]
["Nestle Miniatures Assorted Candy 40 oz"]
["Nestle Nesquick Flavored Milk, 16 oz. assorted"]
["Nestle Nesquik, 16-21.8 oz."]
["Nestle Pure Life Spring Water, 24 pk. half liter bottles"]
["Nestle Pure Life Water, 24 pk. 16.9 oz. bottles"]
["Nestle Spring Water, 24 pk. half liter bottles"]
["New York Cheese Toast, 13.5 oz."]
["New York Style Bagel Crisps 6 oz"]
["Nice Bath Tissue 12 rolls"]
["Nice Honey 32 oz"]
["Nice or Walgreens Candy 1.75 to 9.5 oz"]
["Nice Paper Towels 6 rolls"]
["Nice Peanut Butter 18 oz"]
["Nice Tableware - Plastic Cups 16 pk, Designer Bowls 24 pk or Designer Plates 24 to 48 pk"]
["Nice Trash Bags 18 to 80 pk, 13 to 55 gal"]
["Nicorette White Ice 2mg Coated Gum 20 ct"]
["Nissin Souper Meals, Bowl Noodles or Chow Mein Bowls, 3-4 oz."]
["Nissin Top Ramen Noodles, 3 oz."]
["No Rainchecks"]
["Note - $4.99 sale price this week only, $5.99 after that"]
["Nutella Hazelnut Spread 13 Ounce"]
["Nutri Grain Cereal Bars, 5-10 ct"]
["OB Tampons 18ct"]
["Oikos Greek Yogurt, 5.3 oz"]
["Olay Complete Facial Care"]
["Old Orchard Apple Juice or Cranberry, Apple or Pomegranate Juice Blends, 12 oz. frozen"]
["Old Spice Body Wash, 18 oz. assorted"]
["Old Wisconsin Beef Bites 4 oz"]
["Onions"]
["Onions, 3 lb. bag Yellow"]
["Orange, Medium Navel"]
["Oranges, Large Navel"]
["Oranges, Navel"]
["Oranges, Navel, 8 lb"]
["Orbit Mist Gum 14-15 ct"]
["Ore-Ida Potatoes, 19-32 oz. Onion Rings, Steam n Mash, Tator Tots, Fries or Hashbrowns"]
["Ore-Ida Products 19 – 32 oz"]
["Oscar Mayer Bologna or Cotto Salami, 16 oz"]
["Oscar Mayer Bologna or Salami, 16 oz."]
["Oscar Mayer Lunchables, 3.4-4.5 oz."]
["Oscar Mayer Lunchables, 4.5 oz."]
["Oscar Mayer Lunchables, 6.7-10.8 oz"]
["Oscar Mayer Ready to Serve Bacon 15 slices"]
["Oscar Mayer Shaved Turkey or Ham, 16 oz."]
["Oscar Mayer Turkey Bacon, 12 oz"]
["Osteo-Bi-Flex 30 ct"]
["Our price check - Reg $1.49"]
["Our price check - Reg $11.49"]
["Our price check - Reg $16.99"]
["Our price check - Reg $19.99"]
["Our price check - Reg $2.99"]
["Our price check - Reg $23.99"]
["Our price check - Reg $29.99"]
["Our price check - Reg $3.99"]
["Our price check - Reg $4.49"]
["Our price check - Reg $4.99"]
["Our price check - Reg $5.49"]
["Our price check - Reg $5.99"]
["Our price check - Reg $6.79"]
["Our price check - Reg $9.99"]
["Our price check- 13.5 oz - Reg $7.79"]
["Our price check- Maxfresh 6 oz twin pack- Reg $6.49"]
["Our price check- Reg $ 11.29"]
["Our price check- Reg $ 19.99"]
["Our price check- Reg $ 3.79"]
["Our price check- Reg $1.89"]
["Our price check- Reg $10.99"]
["Our price check- Reg $11.99"]
["Our price check- Reg $19.99"]
["Our price check- Reg $29.99"]
["Our price check- Reg $3.79"]
["Our price check- Reg $3.99"]
["Our price check- Reg $32.99"]
["Our price check- Reg $6.29"]
["Our price check- Reg $6.49"]
["Our price check- Reg $7.49"]
["Our price check- Reg $7.99"]
["Our price check- Reg $8.99"]
["Our price check- Reg $9.99"]
["Our price check- Shampoo or Conditioner- Reg $7.99"]
["Pace Fruit Bars Assorted Varieties 6 Count or 36 Ounce"]
["Pace Fruit or Juice Bars, 6-12 ct."]
["Pace Juice or Fruit Bars, 6-12 ct."]
["Palmers Cocoa Butter Facial Soap"]
["Palmolive Liquid Dish Detergent, 25 oz."]
["Pampers Cruisers 20 ct"]
["Pampers Cruisers Super Pack Diapers"]
["Pampers Swaddlers 76 ct"]
["Pampers Wipes 192 or 216 pk"]
["Pampers Wipes 72 ct"]
["Pantene, 24.4 oz. assorted"]
["Pears, Red"]
["Pears, Red, Bosc or Danjou"]
["Pears,Bartlett, Anjou or Bosc"]
["Peppers, Red, Yellow or Orange"]
["Pepsi 12 pk products"]
["Pepsi 2 liter products"]
["Pepsi 20 pk"]
["Pepsi and Mountain Dew Products, 12 pk. cans"]
["Pepsi and Mountain Dew Products, 2 liter bottles"]
["Pepsi and Pepsi Products 12 pk 12 oz Cans"]
["Pepsi Next 12 pk"]
["Pepsi Next Soda Pop 12 Pack 12 Ounce"]
["Pepsi Next, 12 pk. cans"]
["Pepsi Next, 2 liter bottle"]
["Pepsi Next, 2 liter bottles"]
["Pepsi Soft Drinks, 12 pk. cans"]
["Pepsi Soft Drinks, 2 liter bottle"]
["Pepsi, 2 liter"]
["Pepsi, 20 oz. bottle"]
["Pepsi, 6 pk, 24 oz"]
["Pepsi, 7-Up or A and W Products, 12 pk. cans"]
["Pepsi, 7-Up or A and W Products, 12 pk. cans or 6 pk. 24 oz. bottles"]
["Pepsi, 7-Up or A and W Products, 6 pk. 24 oz. bottles or 12 pk. cans"]
["PictSweet Vegetables, 8-12 oz. Deluxe or Seasoned"]
["Pillsbury Cinnamon Rolls with Icing 7.3 oz"]
["Pillsbury Create n Bake Cookies 16.5 oz"]
["Pillsbury Crescent Dinner Rolls"]
["Pillsbury Crescent Dinner Rolls 8 oz"]
["Pillsbury Orange Flavor Sweet Rolls 13.9 oz"]
["Pine Sol Select Varieties 30-48 Ounce"]
["Planters Peanuts Sweet and Crunchy Peanuts 10 oz"]
["Planters Trail Mix 6 oz"]
["PLEASE NOTE: This list is created from the Lees ad."]
["Pledge Furniture Care Wipes 24 ct"]
["Pledge Furniture Polish or Multi-Surface Spray 9.7 oz"]
["Pledge Multi Surface Floor Cleaner 27 oz"]
["Pledge Multi Surface Wipes 25 ct"]
["Pledge Multisurface, 9.7-12.5 oz."]
["Pledge Multisurface, Polish or Electronic Cleaner, 9.7-12.5 oz."]
["Polar Treat Ice Cream, 4.5 Quart"]
["Polident 3 Minute Tablets 40 ct"]
["Pom Wonderful Pistachios, 8 oz."]
["Pompeian Extra Virgin Olive Oil, 68 oz."]
["Pompeian Olive Oil With Canola, 48 oz. or Extra Virgin, 32 oz"]
["Pompeian Olive Oil, 16 oz. Classic, Extra Virgin and Extra Light"]
["Pompeian Olive Oil, 68 oz. Extra Virgin"]
["Pompeian Vinegars, 16 oz. Red Wine, White Wine or Plus Pomegranate"]
["Pork - Center Cut Chops, boneless, super value pack"]
["Pork - Center Cut Loin Chops, super value pack"]
["Pork - Country Style Ribs, bone-in"]
["Pork - Loin Back Ribs"]
["Pork - Loin Chops, bone in"]
["Pork - Loin Chops, boneless"]
["Pork - Picnic Roast"]
["Pork - Shoulder Butt Roast"]
["Pork - Shoulder Roasts, bone-in"]
["Pork - St. Louis Style Ribs"]
["Pork - St. Louis Style Spareribs, previously frozen"]
["Pork - Tenderloins"]
["Post Cereal, 11-20 oz. Fruity or Cocoa Pebbles, Honeycomb or Raisin Bran"]
["Post Cereals Marshmallow Pebbles 10.75 oz., Waffle Crisp 11.5 oz., Golden Crisp 14.75 oz., Cocoa Pebbles 11 oz., Fruity Pebbles 11 oz., Honeycomb 12.5 oz., Alpha Bits 11.5 oz. or Raisin Bran 20 oz."]
["Post Cereals, 11.5 oz. Waffle Crisp, 14.7 oz. Golden Crisp, 12.5 oz. Honeycomb, 11.5 oz. Alpha-Bits, 20 oz. Raisin Bran, or 11 oz. Fruity/Cocoa Pebbles"]
["Post Honey Bunches of Oats, 48 oz. Double Pack Box Roasted Almond or Honey Roasted"]
["Post Pebbles Cereal or Treats, 6 oz or more"]
["Potatoes, 10 lb. bag Farm Stand Russet"]
["Potatoes, Baker"]
["Powerade or Powerade Zero Sports Drink, 32 oz. bottle"]
["Powerade Sports Drinks, 32 oz. assorted"]
["Powerade Sports Drinks, 32 oz. bottles"]
["Prilosec OTC 28ct"]
["Private Selection Coffee, 10-12 oz"]
["Private Selection Ice Cream, 48 oz"]
["Product availability can vary by store."]
["Progresso Soup 18.5 or 19 oz"]
["Propel Fitness Water, 24 oz. bottles"]
["Purchase the items shown and get a store credit toward your next shopping visit, or A Rebate Check!"]
["Pure Protein Bar"]
["Purell Jelly Wrap Assorted Va"]
["Purely Asian Entrees, 22-24 oz. assorted"]
["Purex Crystals, 28 oz or larger (If this variety is included)"]
["Purex Liquid Detergent"]
["Purex, 26 ct packs"]
["Quaker Cereal, 10.5-14.5 oz. Honey Graham Ohs, Life, Oatmeal Squares, Whole Hearts or Capn Crunch"]
["Quaker Cereals Assorted Life, Capn Crunch or Oatmeal Squares Cereal 12-14.5 Ounce"]
["Quaker Granola Bars Assorted Varieties 6.7 Ounce"]
["Quaker Granola Bars, 6.5-7.4 oz. assorted"]
["Quaker Snack Bars, 6.5-7.4 oz. Chewy, Chewy Dipps"]
["Quaker Snack Bars, 6.5-7.4 oz. Soft Baked"]
["Quaker Soft Baked Bars, 6.5-7.4 oz."]
["Quaker Yogurt Granola Bars"]
["Questions on Walgreens coupon policy and how the Register Rewards work?"]
["Quilted Northern Bath Tissue 18 Double Roll Package"]
["Quilted Northern Bath Tissue, 12 ct. Double Roll"]
["Radishes, bunch"]
["Ragu Pasta Sauce 16 to 24 oz"]
["Ragu Pasta Sauce, 23.9-24 oz. Traditional Garden, Meat, Onion Garlic, Mushroom, Parmesan or 7 Herb"]
["Reach Clean Burst Floss 55 yard"]
["Reach Floss 200 yds"]
["Reach Toothbrushes by Design 2ct"]
["Reach Total Care Toothbrush"]
["Reams"]
["Red Baron Pizza Assorted Varieties 16.44-30.63 Ounce"]
["Red Baron Pizza or Pan Pasta, 9.4-30.6 oz"]
["Red Baron Single Serve Pizzas, 10.8-11.6 oz."]
["Red Cross Gauze Pads or Tapes, 1-25 ct."]
["Reeses Ice Cream Cups 6 pk"]
["Reeses Pieces 15 oz"]
["Refresh or Refresh Optive Eye Care 2 pk .5 oz ea or 50 pk .01 oz ea"]
["REGISTER REWARDS:"]
["Rembrandt 2 Hour Whitening Kit"]
["Rembrandt Intense Stain Whitening Mint Toothpaste 3.5 oz"]
["Rembrandt Kits, Paste, or Rinse"]
["Revlon Colorstay Pressed Powder"]
["Revlon Emery Boards 10 ct"]
["Revlon Luxurious Color Diamond Lust Eye Shadow"]
["Rhodes Warm N Serve Rolls, 6-9 ct. pan"]
["Riesen Candy 2.75 to 5.5 oz"]
["Right Guard Total 5 Anti-Perspirant Deodorant"]
["Right Guard Total Defense 5 Products"]
["Rite Aid"]
["Rite Aid +UP REWARDS"]
["Rite Aid limits the purchase of any particular item to 4 per household. Ask your store manager if you wish further clarification, stores may vary."]
["Rite-Aid Adult Acetaminophen 100 Ct"]
["Rite-Aid Asprin 100 Ct"]
["Rite-Aid Cashew Halves or Mixed Nuts 8-10 oz"]
["Rite-Aid Childrens Acetaminophen 4 oz"]
["Rite-Aid Childrens Ibuprofen 4 oz"]
["Rite-Aid Home Erase Away Cleaning Pads"]
["Rite-Aid Ibuprofen 100 Ct"]
["Rite-Aid Naproxen Sodium 100 Ct"]
["Rite-Aid Prune Juice 64 oz"]
["Rite-Aid Prunes 18 oz"]
["Robitussin Liquid 4oz"]
["Robitussin To Go Cold Medicine"]
["Rold Gold Pretzels, 7-16 oz"]
["Rold Gold Pretzels, 8-16 oz. assorted"]
["Rold Gold, 7-16 oz."]
["Rosarita Refried Beans, 16 oz."]
["Ruffles Potato Chips, 8.5-9.5 oz"]
["Russells Ice Cream, half gallon"]
["S and W Beans, 15-15.5 oz."]
["Sale prices are effective at the following locations:"]
["Sally Hansen Diamond Strength Polish"]
["Sally Hansen Moisturetwists 2-in-1 Primer Color Lipcolor"]
["Santitas Tortilla Chips, 11 oz. assorted"]
["Sara Lee Bread, 20 oz. Classic White or Wheat or Iron Kids"]
["Sara Lee English Muffins, 6 ct."]
["Sara Lee Wide Pan Breads, 24 oz."]
["Schick Intuition Razor System or 3 or 4 pk Cartridges"]
["Schick Quattro Razor System or 3 or 4 pk Cartridges"]
["Schiff Glucosamine 150 ct"]
["Schiff Mega D-3 90 ct"]
["Schiff MegaRed 50-68 ct"]
["Schiff MegaRed 60 ct"]
["Schiff Move ****** 80 to 120 ct"]
["Scott Bathroom Tissue 12 ct"]
["Scott Mega Roll Paper Towels 8 ct"]
["Scrubbing Bubbles Aerosol, 22 oz."]
["Scrubbing Bubbles Antibacterial Bathroom Cleaner 22 oz"]
["Scrubbing Bubbles Fantastik 22 oz"]
["Scrubbing Bubbles Mega Foamer 28 oz"]
["Scrubbing Bubbles Mega Shower Foamer 20 oz"]
["Scrubbing Bubbles Toilet Gel Cleaner 1.34 oz"]
["Scrubbing Bubbles Vanish Toilet Bowl Dropins 4 ct"]
["Seafood - Atlantic Salmon Portions, fresh"]
["Seafood - Catfish Fillets, fresh, farm raised"]
["Seafood - Cocktail Shrimp, asst, sold in 2 lb bag"]
["Seafood - Kroger Breaded Shrimp or Calamari Rings, 8-20 oz frozen"]
["Seafood - Kroger Salmon or Cod Fillets, 2.5 lb frozen"]
["Seafood - Sockeye Salmon, wild caught"]
["Seafood - Tilapia Fillets, 10 lb. case frozen"]
["Seafood - Tilapia Fillets, fresh, farm raised"]
["Seattles Best Coffee, 12 oz."]
["See FAQ's Here"]
["Selected items pricing"]
["Sensodyne Toothpaste 4 oz"]
["Seventh Generation Laundry Detergent, 50-100 oz"]
["Shasta Soda Pop, 24 pk. cans"]
["Shoppers Value Pizza, 5.25 oz."]
["Shoppers Value Plastic Wrap, 100 sq. ft."]
["Shout Color Catcher 24 ct"]
["ShurSaving Chunk White Chicken, 5 oz. in water"]
["ShurSaving Granulated Sugar, 4 lb. bag"]
["ShurSaving Milk, gallon 1%, 2% or Skim"]
["ShurSaving Pears or Peaches, 29 oz. can"]
["Similac Infant Formula 22.5 to 23.2 oz"]
["Similac Powder Infant Formula, makes 168-169 oz."]
["Simple Face Care Select Varieties 4.2-6.7 oz. or 25 ct."]
["Simple Truth Organic Soymilk, half gallon"]
["Simply Asia Stir-Fry Sauce, 3.98-4.43 oz. assorted"]
["Simply Organic Spices, Select 0.75-2.99 oz"]
["Skintimate Shaving Cream, 7-10 oz."]
["Skintimate Shaving Gel"]
["Slo-Niacin Tablets 100 ct"]
["Smuckers Strawberry Squeeze Jam 20oz"]
["Snapple Tea or Fruit Drink, 16 oz. bottle"]
["Snuggle Fabric Softener, 32-40 loads or 70-80 ct sheets"]
["Snyders of Hanover Pounder Pretzels, 16 oz."]
["Snyders Pretzels, 9-10 oz. Rods, Snaps or Sticks"]
["Sobe Juice or Life Water, 20 oz. assorted"]
["Sobe Lifewater, 20 oz. bottle"]
["Sobe Lifewater, 20 oz. bottles"]
["Sobe or Sobe Lifewater, 20 oz. bottles"]
["Soffs Baby Wipes Refill, 80 ct."]
["Sparkle Paper Towels, 6 Big Rolls or 8 Roll Pick A Size"]
["Special K Bars, 5-10 ct"]
["Speed Stick Deodorant, 2.3-3.5 oz"]
["SpeedStick or Lady SpeedStick, 2.3-3.25 oz."]
["Spinach, bunch"]
["Splat Hair Color Kits"]
["Squash, Zucchini or Yellow"]
["Star Vinegar, 12 oz."]
["Stay****** Sanitary Protection Pads 14-24ct"]
["Stopain Extra Strength Pain Relief 3 oz"]
["Storage Pail with Lid, 5 gallon"]
["Stouffers Family Size Entrees Assorted Varieties 53-57 Ounce"]
["Stouffers Frozen Meals, 6-12.7 oz."]
["Stouffers Macaroni and Cheese 40 oz"]
["Stouffers Party Size Entrees, 57-96 oz."]
["Strawberries, 1 lb."]
["Strawberries, 2 lb."]
["Stride or Trident Multi-pack gum, 3 pk."]
["Stride Shift, Spark, or Shawn White Gum 14-15 ct"]
["Suave Deodorant 2.6 oz"]
["Suave Naturals Shampoo or Conditioner 15 oz"]
["Suave Shampoo or Conditioner, 15 oz."]
["Suave Shampoo or Conditioner, 15 oz. assorted"]
["Suave Skin Therapy Body Lotion 18 oz"]
["Suavitel Liquid Fabric Softener, 56 oz."]
["Summers Eve Cleansing Cloths 16 pk or Douche 2 to 4 pk"]
["Sundown Fish Oil 60 ct"]
["Sundown Vitamin D 100 ct"]
["Sunny D, 64 oz."]
["Super Chill Soft Drinks, 12 pk. cans"]
["Super Chill Soft Drinks, 2 liter bottle"]
["Swanson Canned Chicken"]
["Taco Bell Bold and Creamy Sauce, 8 oz."]
["Taco Bell Bold and Creamy Sauce, 8 oz. Chipotle or Spicy Ranchero"]
["Taco Bell Refried Beans, 16 oz."]
["Taco Bell Refried Beans, 16 oz. can"]
["Taco Bell Refried Beans, 16 oz. Regular or Fat ******"]
["Taco Bell Taco Shells, 12 ct."]
["Taco Bell Taco Shells, 4.5 oz."]
["Tampax Radiant Tampons 16 ct"]
["Tampax Radiant Tampons 16 pk"]
["Tampax Tampons 40 ct"]
["Tasters Choice Coffee or Nescafe Clasico Coffee"]
["TGI Fridays Snacks 5.5 oz"]
["The following group of items are Buy 1 Get 1 ****** - MIX AND MATCH"]
["The following group of items are Buy 1 Get 1 50% off - MIX AND MATCH"]
["The following group of items are BUY 1, GET 1 ******"]
["The following group of items are BUY 1, GET 1 ****** - MIX OR MATCH"]
["The following group of items have a COMBINED LIMIT OF 3 TOTAL, MIX OR MATCH"]
["The following group of items have a COMBINED LIMIT OF 4 TOTAL, MIX OR MATCH"]
["The following group of items must be purchased in groups of 2 to receive discount."]
["The following group of items must be purchased in groups of 4 to receive discount."]
["The following group of items must be purchased in groups of 5 to receive discount."]
["The following items will earn you a checkout coupon for use on your NEXT shopping trip. Coupon issued at checkout for each qualifying purchase. NO LIMITS!"]
["The following items will earn you a voucher good on your next shopping purchase."]
["Theraflu Warming Cold Relief Syrup 8.3 oz"]
["ThermaCare Heat Wraps 2-3ct"]
["This list is made by Jen. See the Rite Aid thread in this section at PYP for questions and more Rite-Aid info. ALL RITE AID DEALS REQUIRE THAT YOU HAVE A RITE AID LOYALTY CARD"]
["-This list is valid during the dates listed below"]
["-This list shows what you'll actually pay at Wal-Mart when using certain printable coupons"]
["Three Blend Shredded Cheese, 5 lb. bag Mozzarella/Cheddar/Monterey Jack"]
["Tic Tacs 1 oz"]
["Tide Landry Detergent 50 oz 24-32 loads"]
["Tide Laundry Detergent, 150 oz."]
["Tide Liquid Laundry Detergent, 50 oz."]
["Tide Stain Release 18 ct"]
["Tide Stain Release, 36 oz. liquid or 18 ct. packs"]
["Tillamook Ice Cream, 1.75 qt."]
["Tillamook Sliced Cheese, 12 oz."]
["Todays date: "]
["Toffifay Candy 2.75 to 5.5 oz"]
["Tomatoes, Cluster"]
["Tomatoes, Extra Large Roma"]
["Tomatoes, Roma"]
["Tombstone Pizza Assorted 12 inch"]
["Tombstone Pizza, 12 inch"]
["Tombstone Pizzas, Original or Double Top"]
["Tonys Original Crust Pizzas"]
["Top Ramen Noodles, 3 oz. assorted"]
["Tostitos 9-11 oz"]
["Tostitos Queso Dip 15 oz"]
["Tostitos Tortilla Chips, 9-13 oz."]
["Tree Top Growers Best Apple Cider, 10 oz. Organic"]
["Trident Xtra Care or Layers Gum 14-15 ct"]
["Truvia Natural Sweetener 40 ct"]
["Tugaboos Jumbo Pack Diapers"]
["Turkey - Jennie-O 85% Lean Ground"]
["Turkey Breasts Boneless, Skinless Hand Trimmed, Turkey - Boneless, Skinless, Recipe Ready"]
["Tylenol Precise Cream or Patch"]
["Tyson Anytizers, 22-32 oz"]
["Tyson Chicken, 22-32 oz"]
["Tyson Fully Cooked Entrees, 17 oz."]
["U by Kotex Feminine Hygiene Products, 18 ct. Tampons, 14-60 ct. Maxis or Liners"]
["Uncle Bens Ready Rice Long Grain and Wild Rice 8.8 oz"]
["V8 36-46 oz"]
["V8 V Fusion, 36-46 oz"]
["Valid Dates: 04/09 through 04/15"]
["Valid Dates: 04-11 through 04-17"]
["Valid Dates: 4/10 - 4/16"]
["Valid Dates: 4/11 - 4/17"]
["Valid Dates: 4/11 through 4/17"]
["Valid Dates: 4/8 - 4/14"]
["Valid Dates: 4/9 - 4/14"]
["Valley Fresh Canned Chicken, 5 oz."]
["Van De Kamp 18 – 24.6 oz"]
["Vaseline Lotion 10 oz"]
["Velveeta Skillets Dinners, 12-15 oz."]
["Viactiv Soft Chews"]
["Vicks Thermometers"]
["Visine AC Eyedrops 1/2 fl oz"]
["Vitamin or Smart Water 20 or 23.7 oz"]
["Viva Paper Towels, 8 ct. Mega Roll"]
["Viva, 6 double rolls"]
["Vlasic Pickles, 46 oz. Whole Dill"]
["Wal Mart price check **APPROXIMATE, prices vary by location**"]
["Walgreens"]
["Walgreens Baby Wipes 64 to 78 pk"]
["Walgreens Pharmacy - Transfer a prescription and receive a ****** $25 Walgreens Card - Expires 4-30-12"]
["Walgreens Premium Diapers, Sleep Pants or Training Pants Jumbo Pack"]
["Walgreens Sweetener 100 packets"]
["Wal-Mart"]
["WALMART COUPON POLICY-"]
["Water Storage Jug, 5 gallon"]
["Watermelon, seedless"]
["Weight Watchers Frozen Treats, 4-12 ct"]
["Weight Watchers Smart Ones 9 oz"]
["Werthers Candy 2.75 to 5.5 oz"]
["Werthers Chocolate Bar 3.5 oz"]
["Western Family 100% Apple Juice or Cider, 96 oz."]
["Western Family 100% Juice, 46 oz. Tomato or Vegetable"]
["Western Family AA Batteries, 24 pk."]
["Western Family Apple Sauce, 15 oz. Original"]
["Western Family Beef Stew, 24 oz. can"]
["Western Family Bread, 24 oz. Buttermilk White Roundtop, Cracked Wheat or Golden Split top"]
["Western Family Brownie Mixes, 19.8-21.5 oz."]
["Western Family Brownie Mixes, 19.8-21.5 oz. Chewy, Classic or Dark Chocolate"]
["Western Family Burritos, 5 oz."]
["Western Family Buttermilk Pancake Mix, 7 lb. bag"]
["Western Family Cake Mix, 18.25-18.5 oz."]
["Western Family Canned Fruit, 15-15.25 oz. assorted can"]
["Western Family Canned Vegetables, 11-15.25 oz. Cream, No Salt or Whole Supersweet Corn, No Salt Beans, Golden or White Hominy"]
["Western Family Cereal, 28-32 oz. bag"]
["Western Family Cereal, 28-32 oz. bag assorted"]
["Western Family Chicken Noodle or Tomato Soup, 10.5-10.75 oz."]
["Western Family Chicken, 26 oz. Dino Nuggets or Popcorn"]
["Western Family Chicken, 26 oz. Frozen Dino Nuggets or Popcorn"]
["Western Family Chili Con Carne, 15 oz. can"]
["Western Family Chili Con Carne, 15 oz. With Beans"]
["Western Family Chocolate Chips, 11.5-12 oz. Real Milk or Semi-Sweet"]
["Western Family Chow Mein or Rice Noodles, 6 oz. bag"]
["Western Family Clover Honey, 80 oz."]
["Western Family Concord Grape Jelly, 32 oz."]
["Western Family Cooking Oil, 128 oz."]
["Western Family Cooking Oil, 128 oz. assorted"]
["Western Family Cottage Cheese, 16 oz."]
["Western Family Cream Soup, 10.5 oz. Chicken or Mushroom"]
["Western Family Crunchy Fillets or Fish Sticks, 19-24 oz."]
["Western Family Diced or Whole Green Chiles, 4 oz."]
["Western Family Diced Tomatoes, 14.5 oz. assorted can"]
["Western Family Dressing or Seasoning Mixes, .6-1.38 oz. Envelopes"]
["Western Family Dry Black Beans, 20 lb. bag"]
["Western Family Dry Pinto Beans, 20 lb. bag"]
["Western Family Easy Sides Pasta Side Dishes, 4.5 oz."]
["Western Family Easy Sides, 4.3-4.5 oz. Microwaveable"]
["Western Family Evaporated Milk, 12 oz."]
["Western Family Feminine Products, 14-24 ct. Pads or 46-64 ct. Liners"]
["Western Family Flour, 25 lb. bag All Purpose Bleached or Unbleached"]
["Western Family Frozen Orange Juice, 12 oz. assorted"]
["Western Family Fruit Snacks, 6 ct."]
["Western Family Granulated Sugar, 25 lb. bag"]
["Western Family Grape Jelly, 32 oz."]
["Western Family Hair Gel, 20 oz."]
["Western Family Hair Gel, 20 oz. assorted"]
["Western Family Hydrogen Peroxide, 16 oz."]
["Western Family Ice Cream or Sherbet, 5 quart"]
["Western Family Ice Cream or Sherbet, 56 oz. squares"]
["Western Family Individually Wrapped Cheese Slices, 12 oz."]
["Western Family Instant Nonfat Dry Milk, makes 8 quarts"]
["Western Family Instant Oatmeal, 10 ct. assorted"]
["Western Family Isopropyl Alcohol, 16 oz."]
["Western Family Jumbo Franks, 1 lb."]
["Western Family Jumbos Biscuits, 16 oz."]
["Western Family Jumbos Biscuits, 16 oz. assorted"]
["Western Family Ketchup, 24 oz. Regular or 20 oz. Upside Down Bottle"]
["Western Family Lasagna, 96 oz. Family Size"]
["Western Family Laundry Detergent, 30 lb. Regular or With Bleach"]
["Western Family Light Bulbs, 4 pk."]
["Western Family Liquid Bleach, 96 oz. Regular Scent"]
["Western Family Long Grain Enriched Rice, 20 lb. bag"]
["Western Family Macaroni and Cheese, 5.5 oz. Spiral or 7.25 oz. Original"]
["Western Family Mandarin Oranges, 10.5-11 oz. can"]
["Western Family Medium Grain Enriched Rice, 20 lb. bag"]
["Western Family Mexican Style Tomato Sauce, 8 oz."]
["Western Family Microwaveable Easy Sides, 4.3-4.5 oz. assorted"]
["Western Family Mixes, .6-1.38 oz. Envelope Ranch, Onion or Italian Dressing or Seasoning Mixes"]
["Western Family Mouth Rinse, 1 liter bottle"]
["Western Family Mushrooms, 4 oz. Diced or Whole"]
["Western Family Mushrooms, 4 oz. Stems and Pieces"]
["Western Family Oatmeal, 42 oz. Quick or Old Fashioned"]
["Western Family Orange Juice, 64 oz. chilled"]
["Western Family Orange Juice, 89 oz."]
["Western Family Orange Juice, 89 oz. assorted"]
["Western Family Pancake Syrup, 128 oz. Original"]
["Western Family Pasta, 48 oz. Elbow Macaroni, Thin or Long Spaghetti"]
["Western Family Peanut Butter, 18 oz. Creamy, Chunky or Reduced Fat"]
["Western Family Petal Soft Bath Tissue, 36 Roll Advantage Pack or 18 Big Pack"]
["Western Family Pineapple, 20 oz. can"]
["Western Family Pizza Bites, 20 oz. Pepperoni or Combination"]
["Western Family Premium Chunk Chicken Breast, 10 oz."]
["Western Family Premium Chunk Chicken Breast, 10 oz. can"]
["Western Family Ready to Spread Frosting, 16 oz. assorted"]
["Western Family Refried Beans, 15-16 oz. assorted"]
["Western Family Refried Beans, 16 oz. assorted"]
["Western Family Saltine Crackers, 16 oz. assorted"]
["Western Family Skillet Meals, 4.66-10.25 oz. assorted"]
["Western Family Skillet Meals, 5.5-7.3 oz. assorted"]
["Western Family Sloppy Joe Sauce, 26.5 oz."]
["Western Family Solid White Albacore Tuna, 5 oz."]
["Western Family Spaghetti Rings, 15 oz. Plain"]
["Western Family Specialty Beans, 15 oz. assorted"]
["Western Family Specialty Beans, 15-16 oz. assorted"]
["Western Family Speed 3 Razors, 4 plus 2 Bonus Pack"]
["Western Family Spring Water, 24 pk. half liter bottles"]
["Western Family Sweetened Condensed Milk, 14 oz."]
["Western Family Sweetened Condensed Milk, 14 oz. can"]
["Western Family Tomato Sauce, 8 oz."]
["Western Family Tomato Sauce, 8 oz. Regular or No Salt"]
["Western Family Vegetables, 11-15.25 oz. can Corn, Green Beans or Hominy"]
["Western Family Vegetables, 14.5-15.25 oz. can Whole Kernel or Sweet Crisp Corn, Cut or French Cut Green Beans"]
["Western Family Waterchestnuts, 8 oz. sliced or whole"]
["Western Family White Paper Towels, 15 Roll Mega Pack"]
["Western Family Yogurt, 32 oz. assorted"]
["Windex Glass Cleaner Original 32 oz"]
["Windex Glass Cleaner, 26 oz."]
["Windex Multi Surface 32 oz"]
["Wisk Deep Clean Liquid Laundry Detergent 50 oz"]
["Wisk Liquid Laundry Detergent, 100 oz."]
["Wonder Classic Bread 20 Ounce"]
["Wonder Classic Bread, 20 oz."]
["Wonder Classic White Bread, 20 oz."]
["Wonderful In-Shell Pistachios, 10 oz."]
["Wonka Laffy Taffy Candy 18.7 oz"]
["Wrigleys 5 Gum 14-15 ct"]
["Wrigleys Orbit Gum 14 piece"]
["Wrigleys Orbit Single Serve Gum, 14 ct."]
["Xenadrine Results 60 ct"]
["Yoplait Delights Multipack, 4 pk."]
["Yoplait Go-Gurt or Kid Trix Yogurt, 6-8 pk."]
["Yoplait Greek Yogurt Cups, 6 oz."]
["Yoplait Greek Yogurt Multipack, 4 pk."]
["Yoplait Kids Yogurt Multipack, 4 pk."]
["Yoplait Lactose-****** Yogurt, 4-6 oz"]
["Yoplait Light or Greek Yogurt with Granola, 2 pk."]
["Yoplait Light or Original Multipack, 4 pk."]
["Yoplait Light with Granola Yogurt 6 oz 2 pk"]
["Yoplait Light Yogurt with Granola, 2 pk."]
["Yoplait Parfait, 2 pk."]
["Yoplait Trix Yogurt Multipacks"]
["Yoplait Yogurt"]
["Yoplait Yogurt Cups 6 oz"]
["Yoplait Yogurt, 4-6 oz"]
["Zantac Acid Reducer 30 ct"]
["Zatarains Rice Mixes Assorted Varieties 6-8 Ounce"]
["Zatarains Rice, 5.7-8 oz."]
["Zucchini"]
["Zucchini Squash"]
["Zyrtec 24 Hour Allergy Relief, 40 ct. Total bonus pack"]