{"text_format":"1","workbook":"xlsx","n_sheets":28,"sheets":["Trend Chart","Trend Data","Foreign Receivables","Currencies","AUD","BRL","CAD","CHF","CNY","DKK","EUR","GBP","HKD","INR","JPY","KRW","LKR","MXN","MYR","NOK","NZD","SEK","SGD","THB","TWD","USD","VEF","ZAR"],"not_rendered":{"charts":1,"images":0,"macros":1,"external_links":0,"defined_names":936,"comments":0,"pivot_tables":0},"unopened":[],"bounds":{"document_bytes":16777216,"sheet_cells":100000,"rows_first":2000,"rows_last":500,"rows_between":2000,"halvings":0,"cell_chars":16384,"cell_head_chars":4096},"cells_cut":0,"cells_raw":0,"read":"whole","date_system":"1900"}

{"sheet":"Trend Chart","index":0,"n_rows":1,"n_cols":2,"rows_kept":1,"cut":false,"hidden":false,"merged":[]}
[null,"Trend of Brazil Real Versus United States Dollar"]

{"sheet":"Trend Data","index":1,"n_rows":76,"n_cols":2,"rows_kept":76,"cut":false,"hidden":false,"merged":[]}
[]
[]
[]
[]
["End Date","BRL/USD"]
["2012-02-01",0.57199999999999995]
["2012-02-02",0.57379999999999998]
["2012-02-03",0.57730000000000004]
["2012-02-04",0.58050000000000002]
["2012-02-05",0.58189999999999997]
["2012-02-06",0.58199999999999996]
["2012-02-07",0.58079999999999998]
["2012-02-08",0.57879999999999998]
["2012-02-09",0.5796]
["2012-02-10",0.58030000000000004]
["2012-02-11",0.58009999999999995]
["2012-02-12",0.57999999999999996]
["2012-02-13",0.5796]
["2012-02-14",0.58050000000000002]
["2012-02-15",0.58140000000000003]
{"$rows_left_out":57}
{"sheet":"Foreign Receivables","index":2,"n_rows":123,"n_cols":16,"rows_kept":123,"cut":false,"hidden":false,"merged":[]}
["Base Currency:","USD"]
["Invoice Number","Invoice Date","Due Date","Customer Name","Customer Address","City","Country","Amount","Currency","Discount","Days Outstanding","Invoice Date Exchange Rate","Invoice Date Converted Amount","Current Exchange Rate","Current Converted Amount","Foreign Exchange Gain (Loss)"]
["1","2011-12-13","2012-01-12","Test Customer 1","Test Street 1","Sao Paulo","Brazil",10000,"BRL  Brazil Real","None",{"$f":"TODAY()-B3","v":120},{"$f":"VLOOKUP(\"2011-12-13\",BRL!$A$6:$B$186,2,0)","v":0.5494},{"$f":"H3/L3","v":18201.674554058973},{"$f":"BRL!$B$6","v":0.54759999999999998},{"$f":"H3/N3","v":18261.504747991235},{"$f":"O3-M3","v":59.830193932262773}]
["2","2011-12-14","2012-01-13","Test Customer 2","Test Street 2","Sao Paulo","Brazil",10000,"BRL  Brazil Real","None",119,{"$f":"VLOOKUP(\"2011-12-14\",BRL!$A$6:$B$186,2,0)","v":0.54069999999999996},18494.544109487702,{"$f":"BRL!$B$6","v":0.54759999999999998},18261.504747991235,-233.03936149646688]
["3","2011-12-15","2012-01-14","Test Customer 3","Test Street 3","Sao Paulo","Brazil",10000,"BRL  Brazil Real","None",118,{"$f":"VLOOKUP(\"2011-12-15\",BRL!$A$6:$B$186,2,0)","v":0.53510000000000002},18688.095683049898,{"$f":"BRL!$B$6","v":0.54759999999999998},18261.504747991235,-426.59093505866258]
["4","2011-12-16","2012-01-15","Test Customer 4","Test Street 4","Sao Paulo","Brazil",10000,"BRL  Brazil Real","None",117,{"$f":"VLOOKUP(\"2011-12-16\",BRL!$A$6:$B$186,2,0)","v":0.5343},18716.077110237693,{"$f":"BRL!$B$6","v":0.54759999999999998},18261.504747991235,-454.57236224645749]
["5","2011-12-17","2012-01-16","Test Customer 5","Test Street 5","Sao Paulo","Brazil",10000,"BRL  Brazil Real","None",116,{"$f":"VLOOKUP(\"2011-12-17\",BRL!$A$6:$B$186,2,0)","v":0.53839999999999999},18573.551263001485,{"$f":"BRL!$B$6","v":0.54759999999999998},18261.504747991235,-312.04651501025]
["6","2011-12-18","2012-01-17","Test Customer 6","Test Street 6","Sao Paulo","Brazil",10000,"BRL  Brazil Real","None",115,{"$f":"VLOOKUP(\"2011-12-18\",BRL!$A$6:$B$186,2,0)","v":0.53849999999999998},18570.102135561745,{"$f":"BRL!$B$6","v":0.54759999999999998},18261.504747991235,-308.59738757050945]
["7","2011-12-19","2012-01-18","Test Customer 7","Test Street 7","Sao Paulo","Brazil",10000,"BRL  Brazil Real","None",114,{"$f":"VLOOKUP(\"2011-12-19\",BRL!$A$6:$B$186,2,0)","v":0.53820000000000001},18580.453363062057,{"$f":"BRL!$B$6","v":0.54759999999999998},18261.504747991235,-318.94861507082169]
["8","2011-12-20","2012-01-19","Test Customer 8","Test Street 8","Sao Paulo","Brazil",10000,"BRL  Brazil Real","None",113,{"$f":"VLOOKUP(\"2011-12-20\",BRL!$A$6:$B$186,2,0)","v":0.53710000000000002},18618.50679575498,{"$f":"BRL!$B$6","v":0.54759999999999998},18261.504747991235,-357.00204776374449]
["9","2011-12-21","2012-01-20","Test Customer 9","Test Street 9","Sao Paulo","Brazil",10000,"BRL  Brazil Real","None",112,{"$f":"VLOOKUP(\"2011-12-21\",BRL!$A$6:$B$186,2,0)","v":0.53779999999999994},18594.272963927113,{"$f":"BRL!$B$6","v":0.54759999999999998},18261.504747991235,-332.76821593587738]
["10","2011-12-22","2012-01-21","Test Customer 10","Test Street 10","Sao Paulo","Brazil",10000,"BRL  Brazil Real","None",111,{"$f":"VLOOKUP(\"2011-12-22\",BRL!$A$6:$B$186,2,0)","v":0.54010000000000002},18515.08979818552,{"$f":"BRL!$B$6","v":0.54759999999999998},18261.504747991235,-253.58505019428412]
["11","2011-12-23","2012-01-22","Test Customer 11","Test Street 11","Sao Paulo","Brazil",10000,"BRL  Brazil Real","None",110,{"$f":"VLOOKUP(\"2011-12-23\",BRL!$A$6:$B$186,2,0)","v":0.53749999999999998},18604.651162790698,{"$f":"BRL!$B$6","v":0.54759999999999998},18261.504747991235,-343.14641479946295]
["12","2011-12-24","2012-01-23","Test Customer 12","Test Street 12","Sao Paulo","Brazil",10000,"BRL  Brazil Real","None",109,{"$f":"VLOOKUP(\"2011-12-24\",BRL!$A$6:$B$186,2,0)","v":0.53800000000000003},18587.360594795537,{"$f":"BRL!$B$6","v":0.54759999999999998},18261.504747991235,-325.85584680430111]
["13","2011-12-25","2012-01-24","Test Customer 13","Test Street 13","Sao Paulo","Brazil",10000,"BRL  Brazil Real","None",108,{"$f":"VLOOKUP(\"2011-12-25\",BRL!$A$6:$B$186,2,0)","v":0.53700000000000003},18621.973929236497,{"$f":"BRL!$B$6","v":0.54759999999999998},18261.504747991235,-360.46918124526201]
["14","2011-12-26","2012-01-25","Test Customer 14","Test Street 14","Sao Paulo","Brazil",10000,"BRL  Brazil Real","None",107,{"$f":"VLOOKUP(\"2011-12-26\",BRL!$A$6:$B$186,2,0)","v":0.53659999999999997},18635.855385762206,{"$f":"BRL!$B$6","v":0.54759999999999998},18261.504747991235,-374.35063777097093]
["15","2011-12-27","2012-01-26","Test Customer 15","Test Street 15","Sao Paulo","Brazil",10000,"BRL  Brazil Real","None",106,{"$f":"VLOOKUP(\"2011-12-27\",BRL!$A$6:$B$186,2,0)","v":0.53659999999999997},18635.855385762206,{"$f":"BRL!$B$6","v":0.54759999999999998},18261.504747991235,-374.35063777097093]
["16","2011-12-28","2012-01-27","Test Customer 16","Test Street 16","Sao Paulo","Brazil",10000,"BRL  Brazil Real","None",105,{"$f":"VLOOKUP(\"2011-12-28\",BRL!$A$6:$B$186,2,0)","v":0.53710000000000002},18618.50679575498,{"$f":"BRL!$B$6","v":0.54759999999999998},18261.504747991235,-357.00204776374449]
["17","2011-12-29","2012-01-28","Test Customer 17","Test Street 17","Sao Paulo","Brazil",10000,"BRL  Brazil Real","None",104,{"$f":"VLOOKUP(\"2011-12-29\",BRL!$A$6:$B$186,2,0)","v":0.53510000000000002},18688.095683049898,{"$f":"BRL!$B$6","v":0.54759999999999998},18261.504747991235,-426.59093505866258]
["18","2011-12-30","2012-01-29","Test Customer 18","Test Street 18","Sao Paulo","Brazil",10000,"BRL  Brazil Real","None",103,{"$f":"VLOOKUP(\"2011-12-30\",BRL!$A$6:$B$186,2,0)","v":0.53269999999999995},18772.292096865029,{"$f":"BRL!$B$6","v":0.54759999999999998},18261.504747991235,-510.78734887379323]
{"$rows_left_out":104}
{"sheet":"Currencies","index":3,"n_rows":24,"n_cols":1,"rows_kept":24,"cut":false,"hidden":false,"merged":[]}
["AUD  Australia Dollar"]
["BRL  Brazil Real"]
["CAD  Canada Dollar"]
["CHF  Switzerland Franc"]
["CNY  China Yuan Renminbi"]
["DKK  Denmark Krone"]
["EUR  Euro Member Countries"]
["GBP  United Kingdom Pound"]
["HKD  Hong Kong Dollar"]
["INR  India Rupee"]
["JPY  Japan Yen"]
["KRW  South Korea Won"]
["LKR  Sri Lanka Rupee"]
["MXN  Mexico Peso"]
["MYR  Malaysia Ringgit"]
["NOK  Norway Krone"]
["NZD  New Zealand Dollar"]
["SEK  Sweden Krona"]
["SGD  Singapore Dollar"]
["THB  Thailand Baht"]
{"$rows_left_out":5}
{"sheet":"AUD","index":4,"n_rows":186,"n_cols":2,"rows_kept":186,"cut":false,"hidden":false,"merged":[]}
[]
[]
[]
[]
["End Date","AUD/USD"]
["2012-04-11",1.0291999999999999]
["2012-04-10",1.0295000000000001]
["2012-04-09",1.0298]
["2012-04-08",1.0299]
["2012-04-07",1.0307999999999999]
["2012-04-06",1.0287999999999999]
["2012-04-05",1.0276000000000001]
["2012-04-04",1.0387]
["2012-04-03",1.0410999999999999]
["2012-04-02",1.0353000000000001]
["2012-04-01",1.0343]
["2012-03-31",1.0385]
["2012-03-30",1.036]
["2012-03-29",1.0411999999999999]
["2012-03-28",1.0509999999999999]
{"$rows_left_out":167}
{"sheet":"BRL","index":5,"n_rows":186,"n_cols":2,"rows_kept":186,"cut":false,"hidden":false,"merged":[]}
[]
[]
[]
[]
["End Date","BRL/USD"]
["2012-04-11",0.54759999999999998]
["2012-04-10",0.54749999999999999]
["2012-04-09",0.54810000000000003]
["2012-04-08",0.54730000000000001]
["2012-04-07",0.54779999999999995]
["2012-04-06",0.5464]
["2012-04-05",0.54559999999999997]
["2012-04-04",0.54559999999999997]
["2012-04-03",0.54659999999999997]
["2012-04-02",0.54669999999999996]
["2012-04-01",0.54659999999999997]
["2012-03-31",0.54779999999999995]
["2012-03-30",0.54649999999999999]
["2012-03-29",0.54810000000000003]
["2012-03-28",0.54959999999999998]
{"$rows_left_out":167}
{"sheet":"CAD","index":6,"n_rows":186,"n_cols":2,"rows_kept":186,"cut":false,"hidden":false,"merged":[]}
[]
[]
[]
[]
["End Date","CAD/USD"]
["2012-04-11",1.0007999999999999]
["2012-04-10",1.0024999999999999]
["2012-04-09",1.0024]
["2012-04-08",1.0024]
["2012-04-07",1.0055000000000001]
["2012-04-06",1.0044]
["2012-04-05",1.0062]
["2012-04-04",1.0094000000000001]
["2012-04-03",1.0044999999999999]
["2012-04-02",1.0011000000000001]
["2012-04-01",1.0008999999999999]
["2012-03-31",1.0026999999999999]
["2012-03-30",1.0011000000000001]
["2012-03-29",1.0033000000000001]
["2012-03-28",1.0079]
{"$rows_left_out":167}
{"sheet":"CHF","index":7,"n_rows":186,"n_cols":2,"rows_kept":186,"cut":false,"hidden":false,"merged":[]}
[]
[]
[]
[]
["End Date","CHF/USD"]
["2012-04-11",1.0896999999999999]
["2012-04-10",1.0885]
["2012-04-09",1.0900000000000001]
["2012-04-08",1.0900000000000001]
["2012-04-07",1.0881000000000001]
["2012-04-06",1.0894999999999999]
["2012-04-05",1.0942000000000001]
["2012-04-04",1.1065]
["2012-04-03",1.1074999999999999]
["2012-04-02",1.1076999999999999]
["2012-04-01",1.1074999999999999]
["2012-03-31",1.1071]
["2012-03-30",1.1034999999999999]
["2012-03-29",1.1051]
["2012-03-28",1.1065]
{"$rows_left_out":167}
{"sheet":"CNY","index":8,"n_rows":186,"n_cols":2,"rows_kept":186,"cut":false,"hidden":false,"merged":[]}
[]
[]
[]
[]
["End Date","CNY/USD"]
["2012-04-11",0.15809999999999999]
["2012-04-10",0.158]
["2012-04-09",0.15790000000000001]
["2012-04-08",0.15790000000000001]
["2012-04-07",0.158]
["2012-04-06",0.15809999999999999]
["2012-04-05",0.15820000000000001]
["2012-04-04",0.1583]
["2012-04-03",0.15809999999999999]
["2012-04-02",0.15770000000000001]
["2012-04-01",0.15770000000000001]
["2012-03-31",0.15809999999999999]
["2012-03-30",0.158]
["2012-03-29",0.158]
["2012-03-28",0.15809999999999999]
{"$rows_left_out":167}
{"sheet":"DKK","index":9,"n_rows":186,"n_cols":2,"rows_kept":186,"cut":false,"hidden":false,"merged":[]}
[]
[]
[]
[]
["End Date","DKK/USD"]
["2012-04-11",0.17610000000000001]
["2012-04-10",0.1759]
["2012-04-09",0.1759]
["2012-04-08",0.17599999999999999]
["2012-04-07",0.1757]
["2012-04-06",0.17610000000000001]
["2012-04-05",0.17699999999999999]
["2012-04-04",0.17899999999999999]
["2012-04-03",0.1792]
["2012-04-02",0.17929999999999999]
["2012-04-01",0.17929999999999999]
["2012-03-31",0.17929999999999999]
["2012-03-30",0.17879999999999999]
["2012-03-29",0.1792]
["2012-03-28",0.17949999999999999]
{"$rows_left_out":167}
{"sheet":"EUR","index":10,"n_rows":186,"n_cols":2,"rows_kept":186,"cut":false,"hidden":false,"merged":[]}
[]
[]
[]
[]
["End Date","EUR/USD"]
["2012-04-11",1.3099000000000001]
["2012-04-10",1.3079000000000001]
["2012-04-09",1.3090999999999999]
["2012-04-08",1.3089999999999999]
["2012-04-07",1.3075000000000001]
["2012-04-06",1.3105]
["2012-04-05",1.3173999999999999]
["2012-04-04",1.3321000000000001]
["2012-04-03",1.3337000000000001]
["2012-04-02",1.3339000000000001]
["2012-04-01",1.3337000000000001]
["2012-03-31",1.3338000000000001]
["2012-03-30",1.3301000000000001]
["2012-03-29",1.3325]
["2012-03-28",1.3345]
{"$rows_left_out":167}
{"sheet":"GBP","index":11,"n_rows":186,"n_cols":2,"rows_kept":186,"cut":false,"hidden":false,"merged":[]}
[]
[]
[]
[]
["End Date","GBP/USD"]
["2012-04-11",1.5875999999999999]
["2012-04-10",1.5873999999999999]
["2012-04-09",1.5868]
["2012-04-08",1.5867]
["2012-04-07",1.5855999999999999]
["2012-04-06",1.5863]
["2012-04-05",1.5885]
["2012-04-04",1.5999000000000001]
["2012-04-03",1.6015999999999999]
["2012-04-02",1.601]
["2012-04-01",1.6009]
["2012-03-31",1.5987]
["2012-03-30",1.5903]
["2012-03-29",1.5919000000000001]
["2012-03-28",1.5965]
{"$rows_left_out":167}
{"sheet":"HKD","index":12,"n_rows":186,"n_cols":2,"rows_kept":186,"cut":false,"hidden":false,"merged":[]}
[]
[]
[]
[]
["End Date","HKD/USD"]
["2012-04-11",0.1288]
["2012-04-10",0.1288]
["2012-04-09",0.1288]
["2012-04-08",0.1288]
["2012-04-07",0.1288]
["2012-04-06",0.1288]
["2012-04-05",0.1288]
["2012-04-04",0.1288]
["2012-04-03",0.1288]
["2012-04-02",0.12870000000000001]
["2012-04-01",0.12870000000000001]
["2012-03-31",0.1288]
["2012-03-30",0.1288]
["2012-03-29",0.1288]
["2012-03-28",0.1288]
{"$rows_left_out":167}
{"sheet":"INR","index":13,"n_rows":186,"n_cols":2,"rows_kept":186,"cut":false,"hidden":false,"merged":[]}
[]
[]
[]
[]
["End Date","INR/USD"]
["2012-04-11",1.9099999999999999E-2]
["2012-04-10",1.9099999999999999E-2]
["2012-04-09",1.9099999999999999E-2]
["2012-04-08",1.9099999999999999E-2]
["2012-04-07",1.9199999999999998E-2]
["2012-04-06",1.9199999999999998E-2]
["2012-04-05",1.9300000000000001E-2]
["2012-04-04",1.9400000000000001E-2]
["2012-04-03",1.9300000000000001E-2]
["2012-04-02",1.9199999999999998E-2]
["2012-04-01",1.9199999999999998E-2]
["2012-03-31",1.9199999999999998E-2]
["2012-03-30",1.9099999999999999E-2]
["2012-03-29",1.9199999999999998E-2]
["2012-03-28",1.9099999999999999E-2]
{"$rows_left_out":167}
{"sheet":"JPY","index":14,"n_rows":186,"n_cols":2,"rows_kept":186,"cut":false,"hidden":false,"merged":[]}
[]
[]
[]
[]
["End Date","JPY/USD"]
["2012-04-11",1.23E-2]
["2012-04-10",1.23E-2]
["2012-04-09",1.2200000000000001E-2]
["2012-04-08",1.2200000000000001E-2]
["2012-04-07",1.2200000000000001E-2]
["2012-04-06",1.2200000000000001E-2]
["2012-04-05",1.21E-2]
["2012-04-04",1.2200000000000001E-2]
["2012-04-03",1.21E-2]
["2012-04-02",1.21E-2]
["2012-04-01",1.21E-2]
["2012-03-31",1.2200000000000001E-2]
["2012-03-30",1.21E-2]
["2012-03-29",1.21E-2]
["2012-03-28",1.21E-2]
{"$rows_left_out":167}
{"sheet":"KRW","index":15,"n_rows":186,"n_cols":2,"rows_kept":186,"cut":false,"hidden":false,"merged":[]}
[]
[]
[]
[]
["End Date","KRW/USD"]
["2012-04-11",8.9999999999999998E-4]
["2012-04-10",8.9999999999999998E-4]
["2012-04-09",8.9999999999999998E-4]
["2012-04-08",8.9999999999999998E-4]
["2012-04-07",8.9999999999999998E-4]
["2012-04-06",8.9999999999999998E-4]
["2012-04-05",8.9999999999999998E-4]
["2012-04-04",8.9999999999999998E-4]
["2012-04-03",8.9999999999999998E-4]
["2012-04-02",8.9999999999999998E-4]
["2012-04-01",8.9999999999999998E-4]
["2012-03-31",8.9999999999999998E-4]
["2012-03-30",8.9999999999999998E-4]
["2012-03-29",8.9999999999999998E-4]
["2012-03-28",8.9999999999999998E-4]
{"$rows_left_out":167}
{"sheet":"LKR","index":16,"n_rows":186,"n_cols":2,"rows_kept":186,"cut":false,"hidden":false,"merged":[]}
[]
[]
[]
[]
["End Date","LKR/USD"]
["2012-04-11",7.9000000000000008E-3]
["2012-04-10",7.9000000000000008E-3]
["2012-04-09",7.9000000000000008E-3]
["2012-04-08",7.9000000000000008E-3]
["2012-04-07",7.9000000000000008E-3]
["2012-04-06",7.9000000000000008E-3]
["2012-04-05",8.0000000000000002E-3]
["2012-04-04",7.9000000000000008E-3]
["2012-04-03",7.7999999999999996E-3]
["2012-04-02",7.7999999999999996E-3]
["2012-04-01",7.7999999999999996E-3]
["2012-03-31",7.7999999999999996E-3]
["2012-03-30",7.7999999999999996E-3]
["2012-03-29",7.7000000000000002E-3]
["2012-03-28",7.7000000000000002E-3]
{"$rows_left_out":167}
{"sheet":"MXN","index":17,"n_rows":186,"n_cols":2,"rows_kept":186,"cut":false,"hidden":false,"merged":[]}
[]
[]
[]
[]
["End Date","MXN/USD"]
["2012-04-11",7.6600000000000001E-2]
["2012-04-10",7.6799999999999993E-2]
["2012-04-09",7.6899999999999996E-2]
["2012-04-08",7.6899999999999996E-2]
["2012-04-07",7.7299999999999994E-2]
["2012-04-06",7.8E-2]
["2012-04-05",7.8E-2]
["2012-04-04",7.85E-2]
["2012-04-03",7.8299999999999995E-2]
["2012-04-02",7.8E-2]
["2012-04-01",7.8E-2]
["2012-03-31",7.8100000000000003E-2]
["2012-03-30",7.8100000000000003E-2]
["2012-03-29",7.85E-2]
["2012-03-28",7.8899999999999998E-2]
{"$rows_left_out":167}
{"sheet":"MYR","index":18,"n_rows":186,"n_cols":2,"rows_kept":186,"cut":false,"hidden":false,"merged":[]}
[]
[]
[]
[]
["End Date","MYR/USD"]
["2012-04-11",0.32590000000000002]
["2012-04-10",0.32629999999999998]
["2012-04-09",0.3261]
["2012-04-08",0.32650000000000001]
["2012-04-07",0.32600000000000001]
["2012-04-06",0.32590000000000002]
["2012-04-05",0.3266]
["2012-04-04",0.32779999999999998]
["2012-04-03",0.32679999999999998]
["2012-04-02",0.32629999999999998]
["2012-04-01",0.32629999999999998]
["2012-03-31",0.32600000000000001]
["2012-03-30",0.32569999999999999]
["2012-03-29",0.3261]
["2012-03-28",0.32619999999999999]
{"$rows_left_out":167}
{"sheet":"NOK","index":19,"n_rows":186,"n_cols":2,"rows_kept":186,"cut":false,"hidden":false,"merged":[]}
[]
[]
[]
[]
["End Date","NOK/USD"]
["2012-04-11",0.1726]
["2012-04-10",0.17219999999999999]
["2012-04-09",0.17249999999999999]
["2012-04-08",0.17249999999999999]
["2012-04-07",0.17269999999999999]
["2012-04-06",0.17319999999999999]
["2012-04-05",0.1739]
["2012-04-04",0.17599999999999999]
["2012-04-03",0.17610000000000001]
["2012-04-02",0.1754]
["2012-04-01",0.17530000000000001]
["2012-03-31",0.17499999999999999]
["2012-03-30",0.17399999999999999]
["2012-03-29",0.17499999999999999]
["2012-03-28",0.17580000000000001]
{"$rows_left_out":167}
{"sheet":"NZD","index":20,"n_rows":186,"n_cols":2,"rows_kept":186,"cut":false,"hidden":false,"merged":[]}
[]
[]
[]
[]
["End Date","NZD/USD"]
["2012-04-11",0.81799999999999995]
["2012-04-10",0.81910000000000005]
["2012-04-09",0.81889999999999996]
["2012-04-08",0.81910000000000005]
["2012-04-07",0.8175]
["2012-04-06",0.81569999999999998]
["2012-04-05",0.8155]
["2012-04-04",0.82289999999999996]
["2012-04-03",0.82140000000000002]
["2012-04-02",0.81789999999999996]
["2012-04-01",0.81789999999999996]
["2012-03-31",0.8196]
["2012-03-30",0.81589999999999996]
["2012-03-29",0.81830000000000003]
["2012-03-28",0.82240000000000002]
{"$rows_left_out":167}
{"sheet":"SEK","index":21,"n_rows":186,"n_cols":2,"rows_kept":186,"cut":false,"hidden":false,"merged":[]}
[]
[]
[]
[]
["End Date","SEK/USD"]
["2012-04-11",0.14760000000000001]
["2012-04-10",0.1477]
["2012-04-09",0.1479]
["2012-04-08",0.14799999999999999]
["2012-04-07",0.14810000000000001]
["2012-04-06",0.1487]
["2012-04-05",0.1497]
["2012-04-04",0.1515]
["2012-04-03",0.15129999999999999]
["2012-04-02",0.15110000000000001]
["2012-04-01",0.15110000000000001]
["2012-03-31",0.1507]
["2012-03-30",0.15010000000000001]
["2012-03-29",0.14990000000000001]
["2012-03-28",0.14990000000000001]
{"$rows_left_out":167}
{"sheet":"SGD","index":22,"n_rows":186,"n_cols":2,"rows_kept":186,"cut":false,"hidden":false,"merged":[]}
[]
[]
[]
[]
["End Date","SGD/USD"]
["2012-04-11",0.79279999999999995]
["2012-04-10",0.79269999999999996]
["2012-04-09",0.79300000000000004]
["2012-04-08",0.79300000000000004]
["2012-04-07",0.79359999999999997]
["2012-04-06",0.79400000000000004]
["2012-04-05",0.79469999999999996]
["2012-04-04",0.79849999999999999]
["2012-04-03",0.7974]
["2012-04-02",0.79510000000000003]
["2012-04-01",0.79479999999999995]
["2012-03-31",0.79530000000000001]
["2012-03-30",0.7944]
["2012-03-29",0.79520000000000002]
["2012-03-28",0.79549999999999998]
{"$rows_left_out":167}
{"sheet":"THB","index":23,"n_rows":186,"n_cols":2,"rows_kept":186,"cut":false,"hidden":false,"merged":[]}
[]
[]
[]
[]
["End Date","THB/USD"]
["2012-04-11",3.2300000000000002E-2]
["2012-04-10",3.2199999999999999E-2]
["2012-04-09",3.1800000000000002E-2]
["2012-04-08",3.1800000000000002E-2]
["2012-04-07",3.2199999999999999E-2]
["2012-04-06",3.2199999999999999E-2]
["2012-04-05",3.2199999999999999E-2]
["2012-04-04",3.2399999999999998E-2]
["2012-04-03",3.2399999999999998E-2]
["2012-04-02",3.2000000000000001E-2]
["2012-04-01",3.2000000000000001E-2]
["2012-03-31",3.2300000000000002E-2]
["2012-03-30",3.2300000000000002E-2]
["2012-03-29",3.2500000000000001E-2]
["2012-03-28",3.2500000000000001E-2]
{"$rows_left_out":167}
{"sheet":"TWD","index":24,"n_rows":186,"n_cols":2,"rows_kept":186,"cut":false,"hidden":false,"merged":[]}
[]
[]
[]
[]
["End Date","TWD/USD"]
["2012-04-11",3.3799999999999997E-2]
["2012-04-10",3.3799999999999997E-2]
["2012-04-09",3.3799999999999997E-2]
["2012-04-08",3.3799999999999997E-2]
["2012-04-07",3.39E-2]
["2012-04-06",3.39E-2]
["2012-04-05",3.39E-2]
["2012-04-04",3.39E-2]
["2012-04-03",3.39E-2]
["2012-04-02",3.39E-2]
["2012-04-01",3.3700000000000001E-2]
["2012-03-31",3.3799999999999997E-2]
["2012-03-30",3.3799999999999997E-2]
["2012-03-29",3.3799999999999997E-2]
["2012-03-28",3.3799999999999997E-2]
{"$rows_left_out":167}
{"sheet":"USD","index":25,"n_rows":186,"n_cols":2,"rows_kept":186,"cut":false,"hidden":false,"merged":[]}
[]
[]
[]
[]
["End Date","USD/USD"]
["2012-04-11",1]
["2012-04-10",1]
["2012-04-09",1]
["2012-04-08",1]
["2012-04-07",1]
["2012-04-06",1]
["2012-04-05",1]
["2012-04-04",1]
["2012-04-03",1]
["2012-04-02",1]
["2012-04-01",1]
["2012-03-31",1]
["2012-03-30",1]
["2012-03-29",1]
["2012-03-28",1]
{"$rows_left_out":167}
{"sheet":"VEF","index":26,"n_rows":186,"n_cols":2,"rows_kept":186,"cut":false,"hidden":false,"merged":[]}
[]
[]
[]
[]
["End Date","VEF/USD"]
["2012-04-11",0.23230000000000001]
["2012-04-10",0.2324]
["2012-04-09",0.23280000000000001]
["2012-04-08",0.23219999999999999]
["2012-04-07",0.23250000000000001]
["2012-04-06",0.23250000000000001]
["2012-04-05",0.23230000000000001]
["2012-04-04",0.2324]
["2012-04-03",0.2324]
["2012-04-02",0.2326]
["2012-04-01",0.2326]
["2012-03-31",0.2324]
["2012-03-30",0.2324]
["2012-03-29",0.2324]
["2012-03-28",0.2324]
{"$rows_left_out":167}
{"sheet":"ZAR","index":27,"n_rows":186,"n_cols":2,"rows_kept":186,"cut":false,"hidden":false,"merged":[]}
[]
[]
[]
[]
["End Date","ZAR/USD"]
["2012-04-11",0.126]
["2012-04-10",0.12659999999999999]
["2012-04-09",0.126]
["2012-04-08",0.126]
["2012-04-07",0.12720000000000001]
["2012-04-06",0.12770000000000001]
["2012-04-05",0.12839999999999999]
["2012-04-04",0.13020000000000001]
["2012-04-03",0.13070000000000001]
["2012-04-02",0.1295]
["2012-04-01",0.1295]
["2012-03-31",0.13]
["2012-03-30",0.12970000000000001]
["2012-03-29",0.1308]
["2012-03-28",0.1318]
{"$rows_left_out":166}