{"text_format":"1","workbook":"xlsx","n_sheets":16,"sheets":["INFLATION","TEST - INBASE","TEST - UNBASE","Data","Stats","Revenue","Expenses","Deductions","Productivity","Report Data","Final Report","CashFlow","Lookup","New","Old","Sheet1"],"not_rendered":{"charts":0,"images":0,"macros":1,"external_links":0,"defined_names":57,"comments":0,"pivot_tables":0},"unopened":[],"bounds":{"document_bytes":16777216,"sheet_cells":100000,"rows_first":2000,"rows_last":500,"rows_between":2000,"halvings":0,"cell_chars":16384,"cell_head_chars":4096},"cells_cut":0,"cells_raw":0,"read":"whole","date_system":"1900"}

{"sheet":"INFLATION","index":0,"n_rows":47,"n_cols":10,"rows_kept":47,"cut":false,"hidden":true,"merged":[]}
[null,"I","I","I","I",null,"CI","CI","CI","CI"]
[null,"INBASE","INBASE","INBASE","INBASE",null,"INBASE","INBASE","INBASE","INBASE"]
[null,"999","999","999","999",null,"999","999","999","999"]
[null,"2013","2014","2015","2016",null,"2013","2014","2015","2016"]
["ICU",0.06,0.06,0.06,0.06,null,1.06,1.1236000000000002,1.1910160000000003,1.2624769600000003]
["NIC",0.06,0.06,0.06,0.06,null,1.06,1.1236000000000002,1.1910160000000003,1.2624769600000003]
["ONS",0.06,0.06,0.06,0.06,null,1.06,1.1236000000000002,1.1910160000000003,1.2624769600000003]
["PED",0.06,0.06,0.06,0.06,null,1.06,1.1236000000000002,1.1910160000000003,1.2624769600000003]
["WNO",0.06,0.06,0.06,0.06,null,1.06,1.1236000000000002,1.1910160000000003,1.2624769600000003]
["AOIP",0.06,0.06,0.06,0.06,null,1.06,1.1236000000000002,1.1910160000000003,1.2624769600000003]
["CVS",0.06,0.06,0.06,0.06,null,1.06,1.1236000000000002,1.1910160000000003,1.2624769600000003]
["EDR",0.06,0.06,0.06,0.06,null,1.06,1.1236000000000002,1.1910160000000003,1.2624769600000003]
["IMG",0.06,0.06,0.06,0.06,null,1.06,1.1236000000000002,1.1910160000000003,1.2624769600000003]
["SUR",0.06,0.06,0.06,0.06,null,1.06,1.1236000000000002,1.1910160000000003,1.2624769600000003]
["AOOP",0.06,0.06,0.06,0.06,null,1.06,1.1236000000000002,1.1910160000000003,1.2624769600000003]
{"$rows_left_out":33}
{"sheet":"TEST - INBASE","index":1,"n_rows":56,"n_cols":18,"rows_kept":56,"cut":false,"hidden":true,"merged":[]}
[null,null,"2013","2014","2015","2016"]
[null,null,"INBASE","INBASE","INBASE","INBASE"]
[null,null,"999","999","999","999"]
["9001","V",70692,72465,72465,73400,null,"9001","V",{"$f":"SUM(Stats!E5:E9)","v":0},{"$f":"SUM(Stats!F5:F9)","v":0},{"$f":"SUM(Stats!G5:G9)","v":0},{"$f":"SUM(Stats!H5:H9)","v":0},null,{"$f":"C4-J4","v":70692},{"$f":"D4-K4","v":72465},72465,73400]
["9011","V",18532,19416,19416,19600,null,"9011","V",{"$f":"SUM(Stats!E11:E15)","v":0},{"$f":"SUM(Stats!F11:F15)","v":0},{"$f":"SUM(Stats!G11:G15)","v":0},{"$f":"SUM(Stats!H11:H15)","v":0},null,{"$f":"C5-J5","v":18532},19416,19416,19600]
[]
["ICU","V",21299551.962531216,23028372.96181364,24410075.339522462,26315463.879881829,null,"ICU","V",{"$f":"Stats!E5*Revenue!D5*INFLATION!G5","v":0},{"$f":"Stats!F5*Revenue!E5*INFLATION!H5","v":0},{"$f":"Stats!G5*Revenue!F5*INFLATION!I5","v":0},{"$f":"Stats!H5*Revenue!G5*INFLATION!J5","v":0},null,21299551.962531216,23028372.96181364,24410075.339522462,26315463.879881829]
["NIC","V",25413655.986408509,27477310.165816423,29125948.775765412,31189065.660761394,null,"NIC","V",{"$f":"Stats!E6*Revenue!D6*INFLATION!G6","v":0},{"$f":"Stats!F6*Revenue!E6*INFLATION!H6","v":0},{"$f":"Stats!G6*Revenue!F6*INFLATION!I6","v":0},{"$f":"Stats!H6*Revenue!G6*INFLATION!J6","v":0},null,25413655.986408509,27477310.165816423,29125948.775765412,31189065.660761394]
["ONS","V",113356542.95479238,122559340.26289666,129912900.67867047,139113298.67475015,null,"ONS","V",{"$f":"Stats!E7*Revenue!D7*INFLATION!G7","v":0},{"$f":"Stats!F7*Revenue!E7*INFLATION!H7","v":0},{"$f":"Stats!G7*Revenue!F7*INFLATION!I7","v":0},{"$f":"Stats!H7*Revenue!G7*INFLATION!J7","v":0},null,113356542.95479238,122559340.26289666,129912900.67867047,139113298.67475015]
["PED","V",4797494.6317248754,5337995.731135034,5658275.4750031373,6271748.3801080454,null,"PED","V",{"$f":"Stats!E8*Revenue!D8*INFLATION!G8","v":0},{"$f":"Stats!F8*Revenue!E8*INFLATION!H8","v":0},{"$f":"Stats!G8*Revenue!F8*INFLATION!I8","v":0},{"$f":"Stats!H8*Revenue!G8*INFLATION!J8","v":0},null,4797494.6317248754,5337995.731135034,5658275.4750031373,6271748.3801080454]
["WNO","V",34697670.239515632,38619939.201287046,40937135.553364277,44254311.195274197,null,"WNO","V",{"$f":"Stats!E9*Revenue!D9*INFLATION!G9","v":0},{"$f":"Stats!F9*Revenue!E9*INFLATION!H9","v":0},{"$f":"Stats!G9*Revenue!F9*INFLATION!I9","v":0},{"$f":"Stats!H9*Revenue!G9*INFLATION!J9","v":0},null,34697670.239515632,38619939.201287046,40937135.553364277,44254311.195274197]
["AOIP","V",231430936.06196818,247769960.14794317,265262519.33438796,283990053.19939578,null,"AOIP","V",{"$f":"'TEST - UNBASE'!J12*INFLATION!G10","v":0},{"$f":"'TEST - UNBASE'!K12*INFLATION!H10","v":0},{"$f":"'TEST - UNBASE'!L12*INFLATION!I10","v":0},{"$f":"'TEST - UNBASE'!M12*INFLATION!J10","v":0},null,{"$f":"C12-J12","v":231430936.06196818},247769960.14794317,265262519.33438796,283990053.19939578]
[]
["CVS","V",32373275.569715787,35002043.774750486,37102166.401235521,40073333.254594043,null,"CVS","V",{"$f":"Stats!E20*Revenue!D13*INFLATION!G11","v":0},{"$f":"Stats!F20*Revenue!E13*INFLATION!H11","v":0},{"$f":"Stats!G20*Revenue!F13*INFLATION!I11","v":0},{"$f":"Stats!H20*Revenue!G13*INFLATION!J11","v":0},null,32373275.569715787,35002043.774750486,37102166.401235521,40073333.254594043]
["IMG","V",107700235.02316795,116445667.33187871,123432407.37179145,131821260.67726973,null,"IMG","V",{"$f":"Stats!E21*Revenue!D14*INFLATION!G12","v":0},{"$f":"Stats!F21*Revenue!E14*INFLATION!H12","v":0},{"$f":"Stats!G21*Revenue!F14*INFLATION!I12","v":0},{"$f":"Stats!H21*Revenue!G14*INFLATION!J12","v":0},null,107700235.02316795,116445667.33187871,123432407.37179145,131821260.67726973]
{"$rows_left_out":42}
{"sheet":"TEST - UNBASE","index":2,"n_rows":54,"n_cols":18,"rows_kept":54,"cut":false,"hidden":true,"merged":[]}
[null,null,"2013","2014","2015","2016"]
[null,null,"UNBASE","UNBASE","UNBASE","UNBASE"]
[null,null,"999","999","999","999"]
["9001","V",70692,72465,72465,73400,null,"9001","V",{"$f":"SUM(Stats!E5:E9)","v":0},{"$f":"SUM(Stats!F5:F9)","v":0},{"$f":"SUM(Stats!G5:G9)","v":0},{"$f":"SUM(Stats!H5:H9)","v":0},null,{"$f":"C4-J4","v":70692},{"$f":"D4-K4","v":72465},{"$f":"E4-L4","v":72465},{"$f":"F4-M4","v":73400}]
["9011","V",18532,19416,19416,19600,null,"9011","V",{"$f":"SUM(Stats!E11:E15)","v":0},{"$f":"SUM(Stats!F11:F15)","v":0},{"$f":"SUM(Stats!G11:G15)","v":0},{"$f":"SUM(Stats!H11:H15)","v":0},null,{"$f":"C5-J5","v":18532},{"$f":"D5-K5","v":19416},{"$f":"E5-L5","v":19416},{"$f":"F5-M5","v":19600}]
[]
["ICU","V",20093916.945784166,20495169.955334317,20495169.955334317,20844312.184423409,null,"ICU","V",{"$f":"Stats!E5*Revenue!D5","v":0},{"$f":"Stats!F5*Revenue!E5","v":0},{"$f":"Stats!G5*Revenue!F5","v":0},{"$f":"Stats!H5*Revenue!G5","v":0},null,20093916.945784166,20495169.955334317,20495169.955334317,20844312.184423409]
["NIC","V",23975147.156989157,24454708.228743698,24454708.228743698,24704661.272203639,null,"NIC","V",{"$f":"Stats!E6*Revenue!D6","v":0},{"$f":"Stats!F6*Revenue!E6","v":0},{"$f":"Stats!G6*Revenue!F6","v":0},{"$f":"Stats!H6*Revenue!G6","v":0},null,23975147.156989157,24454708.228743698,24454708.228743698,24704661.272203639]
["ONS","V",106940134.86301166,109077376.52447191,109077376.52447191,110190762.35240769,null,"ONS","V",{"$f":"Stats!E7*Revenue!D7","v":0},{"$f":"Stats!F7*Revenue!E7","v":0},{"$f":"Stats!G7*Revenue!F7","v":0},{"$f":"Stats!H7*Revenue!G7","v":0},null,106940134.86301166,109077376.52447191,109077376.52447191,110190762.35240769]
["PED","V",4525938.3318159198,4750797.1975213904,4750797.1975213904,4967812.1493069017,null,"PED","V",{"$f":"Stats!E8*Revenue!D8","v":0},{"$f":"Stats!F8*Revenue!E8","v":0},{"$f":"Stats!G8*Revenue!F8","v":0},{"$f":"Stats!H8*Revenue!G8","v":0},null,4525938.3318159198,4750797.1975213904,4750797.1975213904,4967812.1493069017]
["WNO","V",32733651.169354364,34371608.402711853,34371608.402711853,35053559.468740076,null,"WNO","V",{"$f":"Stats!E9*Revenue!D9","v":0},{"$f":"Stats!F9*Revenue!E9","v":0},{"$f":"Stats!G9*Revenue!F9","v":0},{"$f":"Stats!H9*Revenue!G9","v":0},null,32733651.169354364,34371608.402711853,34371608.402711853,35053559.468740076]
["AOIP","V",218331071.75657374,220514382.47413948,222719526.29888088,224946721.56186968,null,"AOIP","V",{"$f":"Revenue!C10*(1+Revenue!D11)","v":0},{"$f":"Revenue!D10*(1+Revenue!E11)","v":0},{"$f":"Revenue!E10*(1+Revenue!F11)","v":0},{"$f":"Revenue!F10*(1+Revenue!G11)","v":0},null,218331071.75657374,220514382.47413948,222719526.29888088,224946721.56186968]
[]
["CVS","V",30540826.009165835,31151694.352750517,31151694.352750517,31741833.335789375,null,"CVS","V",{"$f":"Stats!E20*Revenue!D13","v":0},{"$f":"Stats!F20*Revenue!E13","v":0},{"$f":"Stats!G20*Revenue!F13","v":0},{"$f":"Stats!H20*Revenue!G13","v":0},null,30540826.009165835,31151694.352750517,31151694.352750517,31741833.335789375]
["IMG","V",101603995.30487542,103636229.38045451,103636229.38045451,104414785.26251258,null,"IMG","V",{"$f":"Stats!E21*Revenue!D14","v":0},{"$f":"Stats!F21*Revenue!E14","v":0},{"$f":"Stats!G21*Revenue!F14","v":0},{"$f":"Stats!H21*Revenue!G14","v":0},null,101603995.30487542,103636229.38045451,103636229.38045451,104414785.26251258]
{"$rows_left_out":40}
{"sheet":"Data","index":3,"n_rows":107,"n_cols":6,"rows_kept":107,"cut":false,"hidden":false,"merged":[]}
[]
[null,null,"2010","2011","2012","2012"]
[null,null,"Actual","UNBASE","UNBASE","INBASE"]
[null,null,{"$f":"Facility","v":"116"},"116",{"$f":"Facility","v":"116"},{"$f":"Facility","v":"116"}]
["9001ICU","V",773,837.00234835222898,830.82483156476928,830.82483156476928]
["9001NIC","V","0","0","0","0"]
["9001ONS","V",7148,6662.4623488943507,6611.0000000000009,6611.0000000000009]
["9001PED","V","0","0","0","0"]
["9001WNO","V",3705,3132.6906007636085,3128.9999999999995,3128.9999999999995]
["9001AOIP","V","0","0","0","0"]
[]
["9011ICU","V",300,279.52952825877975,277.83995972469967,277.83995972469967]
["9011NIC","V","0","0","0","0"]
["9011ONS","V",2091,1861.0225233209799,1846.75327867845,1846.75327867845]
["9011PED","V","0","0","0","0"]
{"$rows_left_out":93}
{"sheet":"Stats","index":4,"n_rows":23,"n_cols":8,"rows_kept":23,"cut":false,"hidden":false,"merged":[]}
[]
[null,null,{"$f":"Facility","v":"116"}]
[null,null,"UNBASE"]
[null,null,"2011","2012","2013","2014","2015","2016"]
["9001ICU","V",{"$f":"Data!D5","v":837.00234835222898},{"$f":"Data!E5","v":830.82483156476928},0,0,0,0]
["9001NIC","V",{"$f":"Data!D6","v":"0"},{"$f":"Data!E6","v":"0"},0,0,0,0]
["9001ONS","V",{"$f":"Data!D7","v":6662.4623488943507},{"$f":"Data!E7","v":6611.0000000000009},0,0,0,0]
["9001PED","V",{"$f":"Data!D8","v":"0"},{"$f":"Data!E8","v":"0"},0,0,0,0]
["9001WNO","V",{"$f":"Data!D9","v":3132.6906007636085},{"$f":"Data!E9","v":3128.9999999999995},0,0,0,0]
[]
["9011ICU","V",{"$f":"Data!D12","v":279.52952825877975},{"$f":"Data!E12","v":277.83995972469967},0,0,0,0]
["9011NIC","V",{"$f":"Data!D13","v":"0"},{"$f":"Data!E13","v":"0"},0,0,0,0]
["9011ONS","V",{"$f":"Data!D14","v":1861.0225233209799},{"$f":"Data!E14","v":1846.75327867845},0,0,0,0]
["9011PED","V",{"$f":"Data!D15","v":"0"},{"$f":"Data!E15","v":"0"},0,0,0,0]
["9011WNO","V",{"$f":"Data!D16","v":1558.3895810225356},{"$f":"Data!E16","v":1556.0111810020433},0,0,0,0]
{"$rows_left_out":9}
{"sheet":"Revenue","index":5,"n_rows":27,"n_cols":7,"rows_kept":27,"cut":false,"hidden":false,"merged":[]}
[]
[null,null,{"$f":"Facility","v":"116"}]
[null,null,"UNBASE"]
[null,null,{"$f":"year2","v":"2012"},{"$f":"year3","v":"2013"},{"$f":"year4","v":"2014"},{"$f":"year5","v":"2015"},{"$f":"year6","v":"2016"}]
["ICU","R",{"$f":"Data!E27","v":"0"},0,0,0,0]
["NIC","R",{"$f":"Data!E28","v":"0"},0,0,0,0]
["ONS","R",{"$f":"Data!E29","v":"0"},0,0,0,0]
["PED","R",{"$f":"Data!E30","v":"0"},0,0,0,0]
["WNO","R",{"$f":"Data!E31","v":"0"},0,0,0,0]
["AOIP","V",{"$f":"Data!E32","v":"0"},{"$f":"C10*(1+D11)","v":0},{"$f":"D10*(1+E11)","v":0},{"$f":"E10*(1+F11)","v":0},{"$f":"F10*(1+G11)","v":0}]
["AOIP","R",null,0,0,0,0]
[]
["CVS","R",{"$f":"Data!E34","v":"0"},0,0,0,0]
["IMG","R",{"$f":"Data!E35","v":"0"},0,0,0,0]
["SUR","R",{"$f":"Data!E36","v":"0"},0,0,0,0]
{"$rows_left_out":13}
{"sheet":"Expenses","index":6,"n_rows":42,"n_cols":7,"rows_kept":42,"cut":false,"hidden":false,"merged":[]}
[]
[null,null,{"$f":"Facility","v":"116"}]
[null,null,"UNBASE"]
[null,null,{"$f":"year2","v":"2012"},{"$f":"year3","v":"2013"},{"$f":"year4","v":"2014"},{"$f":"year5","v":"2015"},{"$f":"year6","v":"2016"}]
["CHAR","R",{"$f":"Data!E49","v":"0"},0,0,0,0]
["BDEBT","R",{"$f":"Data!E51","v":"0"},0,0,0,0]
["ODED","R",{"$f":"Data!E53","v":"0"},0,0,0,0]
["CHAR","F",{"$f":"Data!E50","v":"0"},0,0,0,0]
["BDEBT","F",{"$f":"Data!E52","v":"0"},0,0,0,0]
["ODED","F",{"$f":"Data!E54","v":"0"},0,0,0,0]
[]
["TSAL","R",{"$f":"Data!E56","v":"0"},0,0,0,0]
["TSAL","F",{"$f":"Data!E57","v":"0"},0,0,0,0]
[]
["PHY","R",{"$f":"Data!E59","v":"0"},0,0,0,0]
{"$rows_left_out":28}
{"sheet":"Deductions","index":7,"n_rows":20,"n_cols":7,"rows_kept":20,"cut":false,"hidden":false,"merged":[]}
[]
[null,null,{"$f":"Facility","v":"116"}]
[null,null,"UNBASE"]
[null,null,{"$f":"year2","v":"2012"},{"$f":"year3","v":"2013"},{"$f":"year4","v":"2014"},{"$f":"year5","v":"2015"},{"$f":"year6","v":"2016"}]
["MCARE","P",{"$f":"Data!E93","v":"0"},0,0,0,0]
["MCAID","P",{"$f":"Data!E94","v":"0"},0,0,0,0]
["SELECTH","P",{"$f":"Data!E95","v":"0"},0,0,0,0]
["CONT","P",{"$f":"Data!E96","v":"0"},0,0,0,0]
["NCONT","P",{"$f":"Data!E97","v":"0"},0,0,0,0]
["UNINS","P",{"$f":"Data!E98","v":"0"},0,0,0,0]
[null,null,{"$f":"SUM(C5:C10)","v":0},{"$f":"SUM(D5:D10)","v":0},{"$f":"SUM(E5:E10)","v":0},{"$f":"SUM(F5:F10)","v":0},{"$f":"SUM(G5:G10)","v":0}]
[]
[]
[]
["MCARE","R",{"$f":"Data!E100","v":"0"},0,0,0,0]
{"$rows_left_out":6}
{"sheet":"Productivity","index":8,"n_rows":27,"n_cols":6,"rows_kept":27,"cut":false,"hidden":false,"merged":[]}
[]
[null,null,{"$f":"Facility","v":"116"}]
[null,null,"UNBASE"]
[null,null,{"$f":"year3","v":"2013"},{"$f":"year4","v":"2014"},{"$f":"year5","v":"2015"},{"$f":"year6","v":"2016"}]
["TSAL","PR",0,{"$f":"C5","v":0},{"$f":"D5","v":0},0]
["TSAL","PRF",0,{"$f":"C6","v":0},0,0]
[]
["PHY","PR",0,0,0,0]
["PHY","PRF",0,0,0,0]
[]
["OBEN","PR",0,0,0,0]
["OBEN","PRF",0,0,0,0]
[]
["TFEE","PR",0,0,0,0]
["TFEE","PRF",0,0,0,0]
{"$rows_left_out":13}
{"sheet":"Report Data","index":9,"n_rows":52,"n_cols":8,"rows_kept":52,"cut":false,"hidden":false,"merged":[]}
[]
[null,{"$f":"Facility","v":"116"},{"$f":"Facility","v":"116"}]
[null,"Actual",{"$f":"VLOOKUP(Lookup!D5,Lookup!$C$7:$D$17,2,0)","v":"Inflated"}]
[null,"V","V"]
[null,{"$f":"TEXT(Year,0)","v":"2010"},{"$f":"year1","v":"2011"},{"$f":"year2","v":"2012"},{"$f":"year3","v":"2013"},{"$f":"year4","v":"2014"},{"$f":"year5","v":"2015"},{"$f":"year6","v":"2016"}]
["IPREV","0",519710564.01893598,559484665.63233805,608986099.76485646,663633987.050174,608986099.76485646,663633987.050174]
["OPREV","0",532951472.05613333,583582097.20380723,642939958.09423327,708104845.2064712,642939958.09423327,708104845.2064712]
["SVREV","0",0,0,0,0,0,0]
["LTREV","0",1816941.6128714727,1881002.8296761606,1947234.1548842336,2025803.454405572,1947234.1548842336,2025803.454405572]
["OOR","0",17852952.373175118,18822123.944111183,19743362.433562133,21674310.624438904,19743362.433562133,21674310.624438904]
["PTREV","0",1054478977.6879408,1144947765.6658213,1253873292.013974,1373764635.7110507,1253873292.013974,1373764635.7110507]
["TREV","0",1072331930.0611159,1163769889.6099327,1273616654.4475362,1395438946.3354897,1273616654.4475362,1395438946.3354897]
[]
["MCARE","0",239831500.83882374,273986480.11054933,306525473.81244618,345879907.96419907,306525473.81244618,345879907.96419907]
["MCAID","0",65520292.905283257,76359440.579816118,92521939.414152965,112965704.21666916,92521939.414152965,112965704.21666916]
{"$rows_left_out":38}
{"sheet":"Final Report","index":10,"n_rows":48,"n_cols":14,"rows_kept":48,"cut":false,"hidden":false,"merged":[[0,0,0,11],[5,4,5,11],[1,0,1,11],[2,0,2,11],[3,0,3,11]]}
[{"$f":"VLOOKUP('Report Data'!$B$2,Lookup!A:B,2,0)","v":"Alta View Hospital"}]
[{"$f":"VLOOKUP('Report Data'!C3,Lookup!D:E,2,0)&\" Financial Projection\"","v":"Productivity Adjusted Inflated Financial Projection"}]
[{"$f":"TODAY()","v":"2012-04-11"}]
["(in thousands)"]
[]
[]
[null,null,{"$f":"year1","v":"2011"},null,{"$f":"year2","v":"2012"},null,{"$f":"year3","v":"2013"},null,{"$f":"year4","v":"2014"},null,{"$f":"year5","v":"2015"},null,{"$f":"year6","v":"2016"}]
[]
["Inpatient Revenue",null,{"$f":"'Report Data'!C6/1000","v":519710.56401893595},{"$f":"C9/C$13","v":0.48465456399243456},{"$f":"'Report Data'!D6/1000","v":559484.66563233803},{"$f":"E9/E$13","v":0.48075196877611576},{"$f":"'Report Data'!E6/1000","v":608986.09976485651},{"$f":"G9/G$13","v":0.4781549437487686},{"$f":"'Report Data'!F6/1000","v":663633.98705017404},{"$f":"I9/I$13","v":0.47557364569257471},{"$f":"'Report Data'!G6/1000","v":608986.09976485651},{"$f":"K9/K$13","v":0.4781549437487686},{"$f":"'Report Data'!H6/1000","v":663633.98705017404},{"$f":"M9/M$13","v":0.47557364569257471}]
["Outpatient Revenue",null,{"$f":"'Report Data'!C7/1000","v":532951.47205613332},{"$f":"C10/C$13","v":0.49700233399350385},{"$f":"'Report Data'!D7/1000","v":583582.09720380721},0.50145832300181759,{"$f":"'Report Data'!E7/1000","v":642939.9580942333},{"$f":"G10/G$13","v":0.50481434570524275},{"$f":"'Report Data'!F7/1000","v":708104.84520647116},{"$f":"I10/I$13","v":0.50744236934621811},{"$f":"'Report Data'!G7/1000","v":642939.9580942333},{"$f":"K10/K$13","v":0.50481434570524275},{"$f":"'Report Data'!H7/1000","v":708104.84520647116},{"$f":"M10/M$13","v":0.50744236934621811}]
["Other Patient Revenue",null,{"$f":"('Report Data'!C8+'Report Data'!C9)/1000","v":1816.9416128714727},1.6943835783831587E-3,{"$f":"('Report Data'!D8+'Report Data'!D9)/1000","v":1881.0028296761607},1.61630133797896E-3,{"$f":"('Report Data'!E8+'Report Data'!E9)/1000","v":1947.2341548842337},{"$f":"G11/G$13","v":1.5289012970146E-3},{"$f":"('Report Data'!F8+'Report Data'!F9)/1000","v":2025.803454405572},{"$f":"I11/I$13","v":1.4517320587371155E-3},{"$f":"('Report Data'!G8+'Report Data'!G9)/1000","v":1947.2341548842337},{"$f":"K11/K$13","v":1.5289012970146E-3},{"$f":"('Report Data'!H8+'Report Data'!H9)/1000","v":2025.803454405572},{"$f":"M11/M$13","v":1.4517320587371155E-3}]
["Other Operating Revenue",null,{"$f":"'Report Data'!C10/1000","v":17852.952373175118},1.6648718435678417E-2,{"$f":"'Report Data'!D10/1000","v":18822.123944111183},1.6173406884087627E-2,{"$f":"'Report Data'!E10/1000","v":19743.362433562135},{"$f":"G12/G$13","v":1.5501809248973996E-2},{"$f":"'Report Data'!F10/1000","v":21674.310624438906},{"$f":"I12/I$13","v":1.5532252902469868E-2},{"$f":"'Report Data'!G10/1000","v":19743.362433562135},{"$f":"K12/K$13","v":1.5501809248973996E-2},{"$f":"'Report Data'!H10/1000","v":21674.310624438906},{"$f":"M12/M$13","v":1.5532252902469868E-2}]
["Total Operating Revenue",null,{"$f":"'Report Data'!C12/1000","v":1072331.9300611159},{"$f":"C13/C$13","v":1},{"$f":"'Report Data'!D12/1000","v":1163769.8896099327},{"$f":"E13/E$13","v":1},{"$f":"'Report Data'!E12/1000","v":1273616.6544475362},{"$f":"G13/G$13","v":1},{"$f":"'Report Data'!F12/1000","v":1395438.9463354899},{"$f":"I13/I$13","v":1},{"$f":"'Report Data'!G12/1000","v":1273616.6544475362},{"$f":"K13/K$13","v":1},{"$f":"'Report Data'!H12/1000","v":1395438.9463354899},{"$f":"M13/M$13","v":1}]
[]
["Medicare Discount",null,{"$f":"'Report Data'!C14/1000","v":239831.50083882373},{"$f":"C15/C$13","v":0.22365416352486578},{"$f":"'Report Data'!D14/1000","v":273986.48011054931},0.23543011600204136,{"$f":"'Report Data'!E14/1000","v":306525.47381244617},{"$f":"G15/G$13","v":0.24067326125333172},{"$f":"'Report Data'!F14/1000","v":345879.90796419908},{"$f":"I15/I$13","v":0.24786459405658801},{"$f":"'Report Data'!G14/1000","v":306525.47381244617},{"$f":"K15/K$13","v":0.24067326125333172},{"$f":"'Report Data'!H14/1000","v":345879.90796419908},{"$f":"M15/M$13","v":0.24786459405658801}]
{"$rows_left_out":34}
{"sheet":"CashFlow","index":11,"n_rows":15,"n_cols":13,"rows_kept":15,"cut":false,"hidden":false,"merged":[[0,0,0,10],[1,0,1,10],[2,0,2,10],[3,0,3,10]]}
[{"$f":"'Final Report'!A1:L1","v":"Alta View Hospital"}]
["Statement of Cash Flows"]
[{"$f":"'Final Report'!A3:L3","v":"2012-04-11"}]
[{"$f":"'Final Report'!A4:L4","v":"(in thousands)"}]
[]
[null,null,{"$f":"'Final Report'!C7","v":"2011"},null,{"$f":"'Final Report'!E7","v":"2012"},null,{"$f":"'Final Report'!G7","v":"2013"},null,{"$f":"'Final Report'!I7","v":"2014"},null,{"$f":"'Final Report'!K7","v":"2015"},null,{"$f":"'Final Report'!M7","v":"2016"}]
["Net Operating Income",null,{"$f":"'Final Report'!C36","v":50038.250165350495},null,{"$f":"'Final Report'!E36","v":52887.045388874591},null,{"$f":"'Final Report'!G36","v":58537.167817340611},null,{"$f":"'Final Report'!I36","v":58009.41286611402},null,{"$f":"'Final Report'!K36","v":58537.167817340611},null,{"$f":"'Final Report'!M36","v":58009.41286611402}]
[]
[{"$f":"\"+ Depreciation\"","v":"+ Depreciation"},null,{"$f":"'Final Report'!C32","v":27176.497825826602},null,{"$f":"'Final Report'!E32","v":26280.861666666664},null,{"$f":"'Final Report'!G32","v":26967.395095238098},null,{"$f":"'Final Report'!I32","v":29122.398333333334},null,{"$f":"'Final Report'!K32","v":26967.395095238098},null,{"$f":"'Final Report'!M32","v":29122.398333333334}]
[{"$f":"\"- Capital Expenditures\"","v":"- Capital Expenditures"},null,{"$f":"-'Report Data'!C50/1000","v":0},null,{"$f":"-'Report Data'!D50/1000","v":0},null,{"$f":"-'Report Data'!E50/1000","v":0},null,{"$f":"-'Report Data'!F50/1000","v":0},null,{"$f":"-'Report Data'!G50/1000","v":0},null,{"$f":"-'Report Data'!I50/1000","v":0}]
["Change in Working Capital",null,{"$f":"-(('Report Data'!C12-'Report Data'!B12)*0.07)/1000","v":-75063.235104278123},null,{"$f":"-0.07*('Final Report'!E13-'Final Report'!C13)","v":-6400.6571684171759},null,{"$f":"-0.07*('Final Report'!G13-'Final Report'!E13)","v":-7689.2735386322493},null,{"$f":"-0.07*('Final Report'!I13-'Final Report'!G13)","v":-8527.5604321567553},null,{"$f":"-0.07*('Final Report'!K13-'Final Report'!I13)","v":8527.5604321567553},null,{"$f":"-0.07*('Final Report'!M13-'Final Report'!K13)","v":-8527.5604321567553}]
[]
["Cash Flow",null,{"$f":"SUM(C7:C11)","v":2151.5128868989705},null,{"$f":"SUM(E7:E11)","v":72767.249887124082},null,{"$f":"SUM(G7:G11)","v":77815.289373946463},null,{"$f":"SUM(I7:I11)","v":78604.250767290607},null,{"$f":"SUM(K7:K11)","v":94032.123344735461},null,{"$f":"SUM(M7:M11)","v":78604.250767290607}]
[]
["Discounted Cash Flow @10%",null,{"$f":"C13","v":2151.5128868989705},null,{"$f":"E13/(1.1^(E6-$C$6))","v":66152.045351930981},null,{"$f":"G13/(1.1^(G6-$C$6))","v":64310.15650739376},null,{"$f":"I13/(1.1^(I6-$C$6))","v":59056.537015244612},null,{"$f":"K13/(1.1^(K6-$C$6))","v":64225.205481002275},null,{"$f":"M13/(1.1^(M6-$C$6))","v":48807.055384499683}]
{"$rows_left_out":1}
{"sheet":"Lookup","index":12,"n_rows":102,"n_cols":5,"rows_kept":102,"cut":false,"hidden":true,"merged":[]}
[]
[]
[]
[]
[null,null,null,4]
[]
["IHCE","IHC - Eliminations",1,"UNBASE","Uninflated Baseline"]
["010","Parent Company",2,"INBASE","Inflated Baseline"]
["710","IHC Management Company",3,"Uninfl","Productivity Adjusted Uninflated "]
["810","Healthcare Captive Insurance Co.",4,"Inflated","Productivity Adjusted Inflated"]
["910","IHC Foundation, Inc.",5,"Actual","Actual"]
["610","SelectHealth, Inc.",6,"UF10","Uninflated Final - 2010"]
["611","IHC Care, Inc.",7,"IF10","Inflated Final - 2010"]
["612","IHC Insurance Agency"]
["613","IHC Group, Inc."]
{"$rows_left_out":88}
{"sheet":"New","index":13,"n_rows":94,"n_cols":9,"rows_kept":94,"cut":false,"hidden":true,"merged":[]}
[null,null,"Working"]
[null,null,"V"]
[null,null,"M"]
[null,null,"FY11"]
[null,null,"UNBASE"]
[null,null,"Jan"]
[null,null,"IHC",null,null,null,"New/Not Old","Old/Not New"]
["CAPEX","Capital Expenditures","0","CAPEX",null,null,"Minor Equipment - $2000 to $5000","NMSUP"]
["BDEBT","Tot Bad Debt","0","BDEBT",null,null,"Tot Non Operating Revenue","NOI%",{"$f":"VLOOKUP(H9,Old!$A$5:$B$72,2,FALSE)","v":"NOI%"}]
["CHAR","Tot Charity","0","CHAR",null,null,"Net Operating Income","EBIDA",{"$f":"VLOOKUP(H10,Old!$A$5:$B$72,2,FALSE)","v":"EBIDA"}]
["CONT","Contracted Payers","0","CONT",null,null,"Provider Work RVUs","PHYE",{"$f":"VLOOKUP(H11,Old!$A$5:$B$72,2,FALSE)","v":"Total Physician FTES"}]
["NCONT","Other Non Contracted Payers","0","NCONT",null,null,"IP Base Flexing Stat"]
["SH","SelectHealth","0","SELECTH",null,null,"OP Base Flexing Stat"]
["ODED","Tot Other Deductions","0","ODED",null,null,"Other Possible Base Stat 2"]
["UNINS","Uninsured/Other","0","UNINS",null,null,"Reg, Educ & Orien- Hrs : Management"]
{"$rows_left_out":80}
{"sheet":"Old","index":14,"n_rows":72,"n_cols":3,"rows_kept":72,"cut":false,"hidden":true,"merged":[]}
[null,null,"V"]
[null,null,"2011"]
[null,null,"UNBASE"]
[null,null,"IHC"]
["ICU","Intensive Care Unit Revenue"]
["NIC","Newborn Intensive Care Revenue"]
["ONS","Other Nursing Services Revenue"]
["PED","Pediatric Revenue"]
["WNO","Womens/Nursery/Obstetrics Revenue"]
["AOIP","All Other IP Revenue"]
["CVS","OP Cardiovascular Revenue"]
["EDR","OP Emergency Department Revenue"]
["IMG","OP Imaging Revenue"]
["SUR","OP Surgery Revenue"]
["AOOP","All Other OP Revenue"]
{"$rows_left_out":58}
{"sheet":"Sheet1","index":15,"n_rows":7,"n_cols":2,"rows_kept":7,"cut":false,"hidden":false,"merged":[]}
[null,"V"]
[null,"Y"]
[null,"2010"]
[null,"Actual"]
[null,"Jun"]
[null,"IHC"]
["4005","0"]