{"text_format":"1","workbook":"xlsx","n_sheets":10,"sheets":["Summary","Budget","Checking","Savings","Austin's Credit","Rochelle's Credit","Pivot Table","Data","Lists","Sheet1"],"not_rendered":{"charts":2,"images":0,"macros":1,"external_links":0,"defined_names":4,"comments":0,"pivot_tables":1},"unopened":[],"bounds":{"document_bytes":16777216,"sheet_cells":100000,"rows_first":2000,"rows_last":500,"rows_between":2000,"halvings":0,"cell_chars":16384,"cell_head_chars":4096},"cells_cut":0,"cells_raw":0,"read":"whole","date_system":"1900"}

{"sheet":"Summary","index":0,"n_rows":9,"n_cols":8,"rows_kept":9,"cut":false,"hidden":false,"merged":[]}
["Summary"]
["Accounts",{"$f":"DATE(YEAR(TODAY()),MONTH(TODAY())-5,1)-1","v":"2012-06-30"},{"$f":"DATE(YEAR(TODAY()),MONTH(TODAY())-4,1)-1","v":"2012-07-31"},{"$f":"DATE(YEAR(TODAY()),MONTH(TODAY())-3,1)-1","v":"2012-08-31"},{"$f":"DATE(YEAR(TODAY()),MONTH(TODAY())-2,1)-1","v":"2012-09-30"},{"$f":"DATE(YEAR(TODAY()),MONTH(TODAY())-1,1)-1","v":"2012-10-31"},{"$f":"DATE(YEAR(TODAY()),MONTH(TODAY()),1)-1","v":"2012-11-30"},{"$f":"DATE(YEAR(TODAY()),MONTH(TODAY())+1,1)-1","v":"2012-12-31"}]
["Checking",{"$f":"Checking!$K$3+SUMIFS(Checking!$H:$H,Checking!$B:$B,\"<=\"&B$2)-SUMIFS(Checking!$J:$J,Checking!$B:$B,\"<=\"&B$2)","v":7152.81},{"$f":"Checking!$K$3+SUMIFS(Checking!$H:$H,Checking!$B:$B,\"<=\"&C$2)-SUMIFS(Checking!$J:$J,Checking!$B:$B,\"<=\"&C$2)","v":7152.81},{"$f":"Checking!$K$3+SUMIFS(Checking!$H:$H,Checking!$B:$B,\"<=\"&D$2)-SUMIFS(Checking!$J:$J,Checking!$B:$B,\"<=\"&D$2)","v":8907.73},{"$f":"Checking!$K$3+SUMIFS(Checking!$H:$H,Checking!$B:$B,\"<=\"&E$2)-SUMIFS(Checking!$J:$J,Checking!$B:$B,\"<=\"&E$2)","v":9492.7499999999964},{"$f":"Checking!$K$3+SUMIFS(Checking!$H:$H,Checking!$B:$B,\"<=\"&F$2)-SUMIFS(Checking!$J:$J,Checking!$B:$B,\"<=\"&F$2)","v":8593.7299999999977},{"$f":"Checking!$K$3+SUMIFS(Checking!$H:$H,Checking!$B:$B,\"<=\"&G$2)-SUMIFS(Checking!$J:$J,Checking!$B:$B,\"<=\"&G$2)","v":8880.0399999999972},{"$f":"Checking!$K$3+SUMIFS(Checking!$H:$H,Checking!$B:$B,\"<=\"&H$2)-SUMIFS(Checking!$J:$J,Checking!$B:$B,\"<=\"&H$2)","v":8880.0399999999972}]
["Austin's Money",{"$f":"SUMIFS(Checking!$H:$H,Checking!$B:$B,\"<=\"&B$2,Checking!$F:$F,$A$4)-SUMIFS(Checking!$J:$J,Checking!$B:$B,\"<=\"&B$2,Checking!$F:$F,$A$4)","v":0},{"$f":"SUMIFS(Checking!$H:$H,Checking!$B:$B,\"<=\"&C$2,Checking!$F:$F,$A$4)-SUMIFS(Checking!$J:$J,Checking!$B:$B,\"<=\"&C$2,Checking!$F:$F,$A$4)","v":0},{"$f":"SUMIFS(Checking!$H:$H,Checking!$B:$B,\"<=\"&D$2,Checking!$F:$F,$A$4)-SUMIFS(Checking!$J:$J,Checking!$B:$B,\"<=\"&D$2,Checking!$F:$F,$A$4)","v":0},{"$f":"SUMIFS(Checking!$H:$H,Checking!$B:$B,\"<=\"&E$2,Checking!$F:$F,$A$4)-SUMIFS(Checking!$J:$J,Checking!$B:$B,\"<=\"&E$2,Checking!$F:$F,$A$4)","v":0},{"$f":"SUMIFS(Checking!$H:$H,Checking!$B:$B,\"<=\"&F$2,Checking!$F:$F,$A$4)-SUMIFS(Checking!$J:$J,Checking!$B:$B,\"<=\"&F$2,Checking!$F:$F,$A$4)","v":0},{"$f":"SUMIFS(Checking!$H:$H,Checking!$B:$B,\"<=\"&G$2,Checking!$F:$F,$A$4)-SUMIFS(Checking!$J:$J,Checking!$B:$B,\"<=\"&G$2,Checking!$F:$F,$A$4)","v":0},{"$f":"SUMIFS(Checking!$H:$H,Checking!$B:$B,\"<=\"&H$2,Checking!$F:$F,$A$4)-SUMIFS(Checking!$J:$J,Checking!$B:$B,\"<=\"&H$2,Checking!$F:$F,$A$4)","v":0}]
["Rochelle's Money",{"$f":"SUMIFS(Checking!$H:$H,Checking!$B:$B,\"<=\"&B$2,Checking!$F:$F,$A$5)-SUMIFS(Checking!$J:$J,Checking!$B:$B,\"<=\"&B$2,Checking!$F:$F,$A$5)","v":0},{"$f":"SUMIFS(Checking!$H:$H,Checking!$B:$B,\"<=\"&C$2,Checking!$F:$F,$A$5)-SUMIFS(Checking!$J:$J,Checking!$B:$B,\"<=\"&C$2,Checking!$F:$F,$A$5)","v":0},{"$f":"SUMIFS(Checking!$H:$H,Checking!$B:$B,\"<=\"&D$2,Checking!$F:$F,$A$5)-SUMIFS(Checking!$J:$J,Checking!$B:$B,\"<=\"&D$2,Checking!$F:$F,$A$5)","v":74.5},{"$f":"SUMIFS(Checking!$H:$H,Checking!$B:$B,\"<=\"&E$2,Checking!$F:$F,$A$5)-SUMIFS(Checking!$J:$J,Checking!$B:$B,\"<=\"&E$2,Checking!$F:$F,$A$5)","v":74.5},{"$f":"SUMIFS(Checking!$H:$H,Checking!$B:$B,\"<=\"&F$2,Checking!$F:$F,$A$5)-SUMIFS(Checking!$J:$J,Checking!$B:$B,\"<=\"&F$2,Checking!$F:$F,$A$5)","v":74.5},{"$f":"SUMIFS(Checking!$H:$H,Checking!$B:$B,\"<=\"&G$2,Checking!$F:$F,$A$5)-SUMIFS(Checking!$J:$J,Checking!$B:$B,\"<=\"&G$2,Checking!$F:$F,$A$5)","v":74.5},{"$f":"SUMIFS(Checking!$H:$H,Checking!$B:$B,\"<=\"&H$2,Checking!$F:$F,$A$5)-SUMIFS(Checking!$J:$J,Checking!$B:$B,\"<=\"&H$2,Checking!$F:$F,$A$5)","v":74.5}]
["Savings",{"$f":"Savings!$K$3+SUMIFS(Savings!$H:$H,Savings!$B:$B,\"<=\"&B$2)-SUMIFS(Savings!$J:$J,Savings!$B:$B,\"<=\"&B$2)","v":17946.099999999999},{"$f":"Savings!$K$3+SUMIFS(Savings!$H:$H,Savings!$B:$B,\"<=\"&C$2)-SUMIFS(Savings!$J:$J,Savings!$B:$B,\"<=\"&C$2)","v":17946.099999999999},{"$f":"Savings!$K$3+SUMIFS(Savings!$H:$H,Savings!$B:$B,\"<=\"&D$2)-SUMIFS(Savings!$J:$J,Savings!$B:$B,\"<=\"&D$2)","v":15547.099999999999},{"$f":"Savings!$K$3+SUMIFS(Savings!$H:$H,Savings!$B:$B,\"<=\"&E$2)-SUMIFS(Savings!$J:$J,Savings!$B:$B,\"<=\"&E$2)","v":13989.89},{"$f":"Savings!$K$3+SUMIFS(Savings!$H:$H,Savings!$B:$B,\"<=\"&F$2)-SUMIFS(Savings!$J:$J,Savings!$B:$B,\"<=\"&F$2)","v":13192.89},{"$f":"Savings!$K$3+SUMIFS(Savings!$H:$H,Savings!$B:$B,\"<=\"&G$2)-SUMIFS(Savings!$J:$J,Savings!$B:$B,\"<=\"&G$2)","v":12396.89},{"$f":"Savings!$K$3+SUMIFS(Savings!$H:$H,Savings!$B:$B,\"<=\"&H$2)-SUMIFS(Savings!$J:$J,Savings!$B:$B,\"<=\"&H$2)","v":12396.89}]
["Austin's Credit",{"$f":"'Austin''s Credit'!$K$3+SUMIFS('Austin''s Credit'!$H:$H,'Austin''s Credit'!$B:$B,\"<=\"&B$2)-SUMIFS('Austin''s Credit'!$J:$J,'Austin''s Credit'!$B:$B,\"<=\"&B$2)","v":0},{"$f":"'Austin''s Credit'!$K$3+SUMIFS('Austin''s Credit'!$H:$H,'Austin''s Credit'!$B:$B,\"<=\"&C$2)-SUMIFS('Austin''s Credit'!$J:$J,'Austin''s Credit'!$B:$B,\"<=\"&C$2)","v":0},{"$f":"'Austin''s Credit'!$K$3+SUMIFS('Austin''s Credit'!$H:$H,'Austin''s Credit'!$B:$B,\"<=\"&D$2)-SUMIFS('Austin''s Credit'!$J:$J,'Austin''s Credit'!$B:$B,\"<=\"&D$2)","v":0.35},{"$f":"'Austin''s Credit'!$K$3+SUMIFS('Austin''s Credit'!$H:$H,'Austin''s Credit'!$B:$B,\"<=\"&E$2)-SUMIFS('Austin''s Credit'!$J:$J,'Austin''s Credit'!$B:$B,\"<=\"&E$2)","v":0.35},{"$f":"'Austin''s Credit'!$K$3+SUMIFS('Austin''s Credit'!$H:$H,'Austin''s Credit'!$B:$B,\"<=\"&F$2)-SUMIFS('Austin''s Credit'!$J:$J,'Austin''s Credit'!$B:$B,\"<=\"&F$2)","v":0.35},{"$f":"'Austin''s Credit'!$K$3+SUMIFS('Austin''s Credit'!$H:$H,'Austin''s Credit'!$B:$B,\"<=\"&G$2)-SUMIFS('Austin''s Credit'!$J:$J,'Austin''s Credit'!$B:$B,\"<=\"&G$2)","v":0.35},{"$f":"'Austin''s Credit'!$K$3+SUMIFS('Austin''s Credit'!$H:$H,'Austin''s Credit'!$B:$B,\"<=\"&H$2)-SUMIFS('Austin''s Credit'!$J:$J,'Austin''s Credit'!$B:$B,\"<=\"&H$2)","v":0.35}]
["Rochelle's Credit",{"$f":"'Rochelle''s Credit'!$K$3+SUMIFS('Rochelle''s Credit'!$H:$H,'Rochelle''s Credit'!$B:$B,\"<=\"&B$2)-SUMIFS('Rochelle''s Credit'!$J:$J,'Rochelle''s Credit'!$B:$B,\"<=\"&B$2)","v":0},{"$f":"'Rochelle''s Credit'!$K$3+SUMIFS('Rochelle''s Credit'!$H:$H,'Rochelle''s Credit'!$B:$B,\"<=\"&C$2)-SUMIFS('Rochelle''s Credit'!$J:$J,'Rochelle''s Credit'!$B:$B,\"<=\"&C$2)","v":0},{"$f":"'Rochelle''s Credit'!$K$3+SUMIFS('Rochelle''s Credit'!$H:$H,'Rochelle''s Credit'!$B:$B,\"<=\"&D$2)-SUMIFS('Rochelle''s Credit'!$J:$J,'Rochelle''s Credit'!$B:$B,\"<=\"&D$2)","v":0},{"$f":"'Rochelle''s Credit'!$K$3+SUMIFS('Rochelle''s Credit'!$H:$H,'Rochelle''s Credit'!$B:$B,\"<=\"&E$2)-SUMIFS('Rochelle''s Credit'!$J:$J,'Rochelle''s Credit'!$B:$B,\"<=\"&E$2)","v":0},{"$f":"'Rochelle''s Credit'!$K$3+SUMIFS('Rochelle''s Credit'!$H:$H,'Rochelle''s Credit'!$B:$B,\"<=\"&F$2)-SUMIFS('Rochelle''s Credit'!$J:$J,'Rochelle''s Credit'!$B:$B,\"<=\"&F$2)","v":0},{"$f":"'Rochelle''s Credit'!$K$3+SUMIFS('Rochelle''s Credit'!$H:$H,'Rochelle''s Credit'!$B:$B,\"<=\"&G$2)-SUMIFS('Rochelle''s Credit'!$J:$J,'Rochelle''s Credit'!$B:$B,\"<=\"&G$2)","v":0},{"$f":"'Rochelle''s Credit'!$K$3+SUMIFS('Rochelle''s Credit'!$H:$H,'Rochelle''s Credit'!$B:$B,\"<=\"&H$2)-SUMIFS('Rochelle''s Credit'!$J:$J,'Rochelle''s Credit'!$B:$B,\"<=\"&H$2)","v":0}]
["Total",{"$f":"SUM(B6:B8,B3)","v":25098.91},{"$f":"SUM(C6:C8,C3)","v":25098.91},{"$f":"SUM(D6:D8,D3)","v":24455.18},{"$f":"SUM(E6:E8,E3)","v":23482.989999999998},{"$f":"SUM(F6:F8,F3)","v":21786.969999999998},{"$f":"SUM(G6:G8,G3)","v":21277.279999999999},{"$f":"SUM(H6:H8,H3)","v":21277.279999999999}]

{"sheet":"Budget","index":1,"n_rows":18,"n_cols":13,"rows_kept":18,"cut":false,"hidden":false,"merged":[]}
[11,{"$f":" EDATE(DATE(2012,1,1),M2)","v":"2012-11-01"},"Budget",3]
[null,"Category","Remaining","Actual","Checking","Savings","A's Cred","C's Cred","Budget","Remainder w/cap","Actual",250,10]
[null,"Baby Supplies",{"$f":"I3-D3","v":-143.30000000000001},{"$f":"SUM(E3:H3)","v":183.3},{"$f":"SUMIFS(Checking!$J:$J,Checking!$F:$F,$B3,Checking!$B:$B,\">=\"&$B$1,Checking!$B:$B,\"<\"&EDATE($B$1,1))-SUMIFS(Checking!$H:$H,Checking!$F:$F,$B3,Checking!$B:$B,\">=\"&$B$1,Checking!$B:$B,\"<=\"&EDATE($B$1,1))","v":183.3},{"$f":"SUMIFS(Savings!$J:$J,Savings!$F:$F,$B3,Savings!$B:$B,\">=\"&$B$1,Savings!$B:$B,\"<=\"&EDATE($B$1,1))-SUMIFS(Savings!$H:$H,Savings!$F:$F,$B3,Savings!$B:$B,\">=\"&$B$1,Savings!$B:$B,\"<=\"&EDATE($B$1,1))","v":0},{"$f":"SUMIFS('Austin''s Credit'!$J:$J,'Austin''s Credit'!$F:$F,$B3,'Austin''s Credit'!$B:$B,\">=\"&$B$1,'Austin''s Credit'!$B:$B,\"<=\"&EDATE($B$1,1))-SUMIFS('Austin''s Credit'!$H:$H,'Austin''s Credit'!$F:$F,$B3,'Austin''s Credit'!$B:$B,\">=\"&$B$1,'Austin''s Credit'!$B:$B,\"<=\"&EDATE($B$1,1))","v":0},null,40,{"$f":"IF(IF(I3-D3<0,0,I3-D3)>$L$2,IF(I3-D3<0,0,I3-D3)/10,IF(I3-D3<0,0,I3-D3))","v":0},{"$f":"IF(I3>$L$2,D3/10,D3)","v":183.3}]
[null,"Books & Supplies",5,0,{"$f":"SUMIFS(Checking!$J:$J,Checking!$F:$F,$B4,Checking!$B:$B,\">=\"&$B$1,Checking!$B:$B,\"<\"&EDATE($B$1,1))-SUMIFS(Checking!$H:$H,Checking!$F:$F,$B4,Checking!$B:$B,\">=\"&$B$1,Checking!$B:$B,\"<=\"&EDATE($B$1,1))","v":0},{"$f":"SUMIFS(Savings!$J:$J,Savings!$F:$F,$B4,Savings!$B:$B,\">=\"&$B$1,Savings!$B:$B,\"<=\"&EDATE($B$1,1))-SUMIFS(Savings!$H:$H,Savings!$F:$F,$B4,Savings!$B:$B,\">=\"&$B$1,Savings!$B:$B,\"<=\"&EDATE($B$1,1))","v":0},{"$f":"SUMIFS('Austin''s Credit'!$J:$J,'Austin''s Credit'!$F:$F,$B4,'Austin''s Credit'!$B:$B,\">=\"&$B$1,'Austin''s Credit'!$B:$B,\"<=\"&EDATE($B$1,1))-SUMIFS('Austin''s Credit'!$H:$H,'Austin''s Credit'!$F:$F,$B4,'Austin''s Credit'!$B:$B,\">=\"&$B$1,'Austin''s Credit'!$B:$B,\"<=\"&EDATE($B$1,1))","v":0},null,5,{"$f":"IF(IF(I4-D4<0,0,I4-D4)>$L$2,IF(I4-D4<0,0,I4-D4)/10,IF(I4-D4<0,0,I4-D4))","v":5},{"$f":"IF(I4>$L$2,D4/10,D4)","v":0}]
[null,"Dates",-57.599999999999994,103.6,{"$f":"SUMIFS(Checking!$J:$J,Checking!$F:$F,$B5,Checking!$B:$B,\">=\"&$B$1,Checking!$B:$B,\"<\"&EDATE($B$1,1))-SUMIFS(Checking!$H:$H,Checking!$F:$F,$B5,Checking!$B:$B,\">=\"&$B$1,Checking!$B:$B,\"<=\"&EDATE($B$1,1))","v":103.6},{"$f":"SUMIFS(Savings!$J:$J,Savings!$F:$F,$B5,Savings!$B:$B,\">=\"&$B$1,Savings!$B:$B,\"<=\"&EDATE($B$1,1))-SUMIFS(Savings!$H:$H,Savings!$F:$F,$B5,Savings!$B:$B,\">=\"&$B$1,Savings!$B:$B,\"<=\"&EDATE($B$1,1))","v":0},{"$f":"SUMIFS('Austin''s Credit'!$J:$J,'Austin''s Credit'!$F:$F,$B5,'Austin''s Credit'!$B:$B,\">=\"&$B$1,'Austin''s Credit'!$B:$B,\"<=\"&EDATE($B$1,1))-SUMIFS('Austin''s Credit'!$H:$H,'Austin''s Credit'!$F:$F,$B5,'Austin''s Credit'!$B:$B,\">=\"&$B$1,'Austin''s Credit'!$B:$B,\"<=\"&EDATE($B$1,1))","v":0},null,46,{"$f":"IF(IF(I5-D5<0,0,I5-D5)>$L$2,IF(I5-D5<0,0,I5-D5)/10,IF(I5-D5<0,0,I5-D5))","v":0},{"$f":"IF(I5>$L$2,D5/10,D5)","v":103.6}]
[null,"Doctor",1571.9,273.10000000000002,{"$f":"SUMIFS(Checking!$J:$J,Checking!$F:$F,$B6,Checking!$B:$B,\">=\"&$B$1,Checking!$B:$B,\"<\"&EDATE($B$1,1))-SUMIFS(Checking!$H:$H,Checking!$F:$F,$B6,Checking!$B:$B,\">=\"&$B$1,Checking!$B:$B,\"<=\"&EDATE($B$1,1))","v":273.10000000000002},{"$f":"SUMIFS(Savings!$J:$J,Savings!$F:$F,$B6,Savings!$B:$B,\">=\"&$B$1,Savings!$B:$B,\"<=\"&EDATE($B$1,1))-SUMIFS(Savings!$H:$H,Savings!$F:$F,$B6,Savings!$B:$B,\">=\"&$B$1,Savings!$B:$B,\"<=\"&EDATE($B$1,1))","v":0},{"$f":"SUMIFS('Austin''s Credit'!$J:$J,'Austin''s Credit'!$F:$F,$B6,'Austin''s Credit'!$B:$B,\">=\"&$B$1,'Austin''s Credit'!$B:$B,\"<=\"&EDATE($B$1,1))-SUMIFS('Austin''s Credit'!$H:$H,'Austin''s Credit'!$F:$F,$B6,'Austin''s Credit'!$B:$B,\">=\"&$B$1,'Austin''s Credit'!$B:$B,\"<=\"&EDATE($B$1,1))","v":0},null,1845,{"$f":"IF(IF(I6-D6<0,0,I6-D6)>$L$2,IF(I6-D6<0,0,I6-D6)/10,IF(I6-D6<0,0,I6-D6))","v":157.19},{"$f":"IF(I6>$L$2,D6/10,D6)","v":27.310000000000002}]
[null,"Fast Offering",-172.10000000000002,192.10000000000002,{"$f":"SUMIFS(Checking!$J:$J,Checking!$F:$F,$B7,Checking!$B:$B,\">=\"&$B$1,Checking!$B:$B,\"<\"&EDATE($B$1,1))-SUMIFS(Checking!$H:$H,Checking!$F:$F,$B7,Checking!$B:$B,\">=\"&$B$1,Checking!$B:$B,\"<=\"&EDATE($B$1,1))","v":192.10000000000002},{"$f":"SUMIFS(Savings!$J:$J,Savings!$F:$F,$B7,Savings!$B:$B,\">=\"&$B$1,Savings!$B:$B,\"<=\"&EDATE($B$1,1))-SUMIFS(Savings!$H:$H,Savings!$F:$F,$B7,Savings!$B:$B,\">=\"&$B$1,Savings!$B:$B,\"<=\"&EDATE($B$1,1))","v":0},{"$f":"SUMIFS('Austin''s Credit'!$J:$J,'Austin''s Credit'!$F:$F,$B7,'Austin''s Credit'!$B:$B,\">=\"&$B$1,'Austin''s Credit'!$B:$B,\"<=\"&EDATE($B$1,1))-SUMIFS('Austin''s Credit'!$H:$H,'Austin''s Credit'!$F:$F,$B7,'Austin''s Credit'!$B:$B,\">=\"&$B$1,'Austin''s Credit'!$B:$B,\"<=\"&EDATE($B$1,1))","v":0},null,20,{"$f":"IF(IF(I7-D7<0,0,I7-D7)>$L$2,IF(I7-D7<0,0,I7-D7)/10,IF(I7-D7<0,0,I7-D7))","v":0},{"$f":"IF(I7>$L$2,D7/10,D7)","v":192.10000000000002}]
[null,"Gas & Fuel",-87.700000000000045,277.70000000000005,{"$f":"SUMIFS(Checking!$J:$J,Checking!$F:$F,$B8,Checking!$B:$B,\">=\"&$B$1,Checking!$B:$B,\"<\"&EDATE($B$1,1))-SUMIFS(Checking!$H:$H,Checking!$F:$F,$B8,Checking!$B:$B,\">=\"&$B$1,Checking!$B:$B,\"<=\"&EDATE($B$1,1))","v":277.70000000000005},{"$f":"SUMIFS(Savings!$J:$J,Savings!$F:$F,$B8,Savings!$B:$B,\">=\"&$B$1,Savings!$B:$B,\"<=\"&EDATE($B$1,1))-SUMIFS(Savings!$H:$H,Savings!$F:$F,$B8,Savings!$B:$B,\">=\"&$B$1,Savings!$B:$B,\"<=\"&EDATE($B$1,1))","v":0},{"$f":"SUMIFS('Austin''s Credit'!$J:$J,'Austin''s Credit'!$F:$F,$B8,'Austin''s Credit'!$B:$B,\">=\"&$B$1,'Austin''s Credit'!$B:$B,\"<=\"&EDATE($B$1,1))-SUMIFS('Austin''s Credit'!$H:$H,'Austin''s Credit'!$F:$F,$B8,'Austin''s Credit'!$B:$B,\">=\"&$B$1,'Austin''s Credit'!$B:$B,\"<=\"&EDATE($B$1,1))","v":0},null,190,0,277.70000000000005]
[null,"Gifts for Others",196.5,103.5,{"$f":"SUMIFS(Checking!$J:$J,Checking!$F:$F,$B9,Checking!$B:$B,\">=\"&$B$1,Checking!$B:$B,\"<\"&EDATE($B$1,1))-SUMIFS(Checking!$H:$H,Checking!$F:$F,$B9,Checking!$B:$B,\">=\"&$B$1,Checking!$B:$B,\"<=\"&EDATE($B$1,1))","v":103.5},{"$f":"SUMIFS(Savings!$J:$J,Savings!$F:$F,$B9,Savings!$B:$B,\">=\"&$B$1,Savings!$B:$B,\"<=\"&EDATE($B$1,1))-SUMIFS(Savings!$H:$H,Savings!$F:$F,$B9,Savings!$B:$B,\">=\"&$B$1,Savings!$B:$B,\"<=\"&EDATE($B$1,1))","v":0},{"$f":"SUMIFS('Austin''s Credit'!$J:$J,'Austin''s Credit'!$F:$F,$B9,'Austin''s Credit'!$B:$B,\">=\"&$B$1,'Austin''s Credit'!$B:$B,\"<=\"&EDATE($B$1,1))-SUMIFS('Austin''s Credit'!$H:$H,'Austin''s Credit'!$F:$F,$B9,'Austin''s Credit'!$B:$B,\">=\"&$B$1,'Austin''s Credit'!$B:$B,\"<=\"&EDATE($B$1,1))","v":0},null,300,196.5,10.35]
[null,"Groceries",-410.29999999999995,560.29999999999995,{"$f":"SUMIFS(Checking!$J:$J,Checking!$F:$F,$B10,Checking!$B:$B,\">=\"&$B$1,Checking!$B:$B,\"<\"&EDATE($B$1,1))-SUMIFS(Checking!$H:$H,Checking!$F:$F,$B10,Checking!$B:$B,\">=\"&$B$1,Checking!$B:$B,\"<=\"&EDATE($B$1,1))","v":560.29999999999995},{"$f":"SUMIFS(Savings!$J:$J,Savings!$F:$F,$B10,Savings!$B:$B,\">=\"&$B$1,Savings!$B:$B,\"<=\"&EDATE($B$1,1))-SUMIFS(Savings!$H:$H,Savings!$F:$F,$B10,Savings!$B:$B,\">=\"&$B$1,Savings!$B:$B,\"<=\"&EDATE($B$1,1))","v":0},{"$f":"SUMIFS('Austin''s Credit'!$J:$J,'Austin''s Credit'!$F:$F,$B10,'Austin''s Credit'!$B:$B,\">=\"&$B$1,'Austin''s Credit'!$B:$B,\"<=\"&EDATE($B$1,1))-SUMIFS('Austin''s Credit'!$H:$H,'Austin''s Credit'!$F:$F,$B10,'Austin''s Credit'!$B:$B,\">=\"&$B$1,'Austin''s Credit'!$B:$B,\"<=\"&EDATE($B$1,1))","v":0},null,150,0,560.29999999999995]
{"$rows_left_out":9}
{"sheet":"Checking","index":2,"n_rows":197,"n_cols":11,"rows_kept":197,"cut":false,"hidden":false,"merged":[]}
["Checking"]
["Column1","Date","Check #","Payee","Memo","Category","Notes","Deposit","Clr","Payment","Balance"]
[null,"2012-08-12",null,null,null,"Rochelle's Money",null,100,"R",null,7152.81]
[null,"2012-08-12",null,null,"Beginning Balance",null,null,null,"R",null,{"$f":"K3+H4-J4","v":7152.81}]
[null,"2012-08-13",null,"AMERICAN APPAREL-0 SEATTLE WA 4","CHECK CRD PURCHASE 08/11 AMERICAN APPAREL-0 SEATTLE WA 434258XXXXXX0954 282224722041255 ?MCC=5699 ","Clothing",null,null,"R",32.6,7120.21]
[null,"2012-08-13",null,"USA GASOLINE 62 KENNEWICK WA ","POS PURCHASE - USA GASOLINE 62 KENNEWICK WA 0954 00302226609599213 ","Gas & Fuel",null,null,"R",16.100000000000001,7104.11]
[null,"2012-08-13",null,"FRED-MEYER #0608 SEATTLE WA 4","CHECK CRD PURCHASE 08/11 FRED-MEYER #0608 SEATTLE WA 434258XXXXXX0954 082224790526316 ?MCC=5411 ","Groceries",null,null,"R",28.1,7076.0099999999993]
[null,"2012-08-13",null,"SEATTLE 684-PARK SEATTLE WA 4","CHECK CRD PURCHASE 08/11 SEATTLE 684-PARK SEATTLE WA 434258XXXXXX0954 002224705532286 ?MCC=9399 ","Parking",null,null,"R",111.6,6964.4099999999989]
[null,"2012-08-13",null,"ORCA KCM AUTOLOAD 206-6247277 WA 4","CHECK CRD PURCHASE 08/11 ORCA KCM AUTOLOAD 206-6247277 WA 434258XXXXXX0954 282223256759004 ?MCC=9399 ","Public Transportation",null,null,"R",129.6,6834.8099999999986]
[null,"2012-08-13",null,"GROUPON INC 877-788-7858 IL 4","CHECK CRD PURCHASE 08/12 GROUPON INC 877-788-7858 IL 434258XXXXXX8672 082224658005480 ?MCC=7299 ","Seattle Fun Fund",null,null,"R",119.3,6715.5099999999984]
{"$rows_left_out":188}
{"sheet":"Savings","index":3,"n_rows":17,"n_cols":11,"rows_kept":17,"cut":false,"hidden":false,"merged":[]}
["Savings"]
["Column1","Date","Check #","Payee","Memo","Category","Notes","Deposit","Clr","Payment","Balance"]
[null,"2012-08-12",null,null,"Beginning Balance",null,null,null,"R",null,17946.099999999999]
[null,"2012-08-14",null,null,"INTEREST PAYMENT ","Interest Income",null,1,"R",null,{"$f":"K3+H4-J4","v":17947.099999999999}]
[null,"2012-08-17",null,null,"ONLINE TRANSFER REF #IBE2FZDXTV TO COMPLETE ADVANTAGE(RM) VIA MOBILE ","Checking",null,null,"R",2500,15447.099999999999]
[null,"2012-08-31",null,null,"RECURRING TRANSFER REF #OPEQQGLZRM FROM COMPLETE ADVANTAGE(RM) XXXXXX9464 ","Checking",null,100,"R",null,15547.099999999999]
[null,"2012-09-17",null,null,"ONLINE TRANSFER REF #IBE88CH5BV TO VISA BECCAS DRESS AND HOSPITAL DEPOSIT ","Checking",null,null,"R",559.21,14987.89]
[null,"2012-09-17",null,null,"INTEREST PAYMENT ","Interest Income",null,2,"R",null,14989.89]
[null,"2012-09-27",null,null,"ONLINE TRANSFER REF #IBEXJS2PTS TO COMPLETE ADVANTAGE(RM) VIA MOBILE ","Checking",null,null,"R",1000,13989.89]
[null,"2012-10-01",null,null,"RECURRING TRANSFER REF #OPE2GC8N85 FROM COMPLETE ADVANTAGE(RM) XXXXXX9464 ","Checking",null,100,"R",null,14089.89]
{"$rows_left_out":8}
{"sheet":"Austin's Credit","index":4,"n_rows":4,"n_cols":11,"rows_kept":4,"cut":false,"hidden":false,"merged":[]}
["Austin's Credit"]
["New","Date","Check #","Payee","Memo","Category","Notes","Payment","Clr","Charge","Balance"]
[null,"2012-08-12",null,null,"Beginning Balance",null,null,null,null,null,0]
[null,"2012-08-12",null,null,null,"Other Income","Redemption of points",null,null,-0.35,{"$f":"K3+H4-J4","v":0.35}]

{"sheet":"Rochelle's Credit","index":5,"n_rows":3,"n_cols":11,"rows_kept":3,"cut":false,"hidden":false,"merged":[]}
["Rochelle's Credit"]
["New","Date","Check #","Payee","Memo","Category","Notes","Payment","Clr","Charge","Balance"]
[null,"2012-08-12",null,null,"Beginning Balance",null,null,null,null,null,0]

{"sheet":"Pivot Table","index":6,"n_rows":29,"n_cols":6,"rows_kept":29,"cut":false,"hidden":false,"merged":[]}
["Type","Expense"]
[]
["Sum of Amount","Column Labels"]
[null,"2012",null,null,null,"Grand Total"]
["Row Labels","Aug","Sep","Oct","Nov"]
["Gas & Fuel",434.1,432.59999999999997,256.89999999999998,277.70000000000005,1401.3]
["Groceries",309.59999999999997,0,246.3,560.29999999999995,1116.1999999999998]
["Misc",205.5,132.70000000000002,538.9,210,1087.1000000000001]
["Doctor",0,137.9,292.60000000000002,273.10000000000002,703.6]
["Baby Supplies",0,171.6,273.10000000000002,183.3,627.99999999999989]
{"$rows_left_out":20}
{"sheet":"Data","index":7,"n_rows":210,"n_cols":10,"rows_kept":210,"cut":false,"hidden":false,"merged":[]}
["Date","Check #","Payee","Memo","SubCategory","Notes","Deposit","Clr","Payment","Type"]
["2012-08-12",null,null,"Beginning Balance",null,null,null,"R"]
["2012-08-13",null,"AMERICAN APPAREL-0 SEATTLE WA 4","CHECK CRD PURCHASE 08/11 AMERICAN APPAREL-0 SEATTLE WA 434258XXXXXX0954 282224722041255 ?MCC=5699 ","Clothing",null,null,"R",32.6,"Expense"]
["2012-08-13",null,"USA GASOLINE 62 KENNEWICK WA ","POS PURCHASE - USA GASOLINE 62 KENNEWICK WA 0954 00302226609599213 ","Gas & Fuel",null,null,"R",16.100000000000001,"Expense"]
["2012-08-13",null,"FRED-MEYER #0608 SEATTLE WA 4","CHECK CRD PURCHASE 08/11 FRED-MEYER #0608 SEATTLE WA 434258XXXXXX0954 082224790526316 ?MCC=5411 ","Groceries",null,null,"R",28.1,"Expense"]
["2012-08-13",null,"SEATTLE 684-PARK SEATTLE WA 4","CHECK CRD PURCHASE 08/11 SEATTLE 684-PARK SEATTLE WA 434258XXXXXX0954 002224705532286 ?MCC=9399 ","Parking",null,null,"R",111.6,"Expense"]
["2012-08-13",null,"ORCA KCM AUTOLOAD 206-6247277 WA 4","CHECK CRD PURCHASE 08/11 ORCA KCM AUTOLOAD 206-6247277 WA 434258XXXXXX0954 282223256759004 ?MCC=9399 ","Public Transportation",null,null,"R",129.6,"Expense"]
["2012-08-13",null,"GROUPON INC 877-788-7858 IL 4","CHECK CRD PURCHASE 08/12 GROUPON INC 877-788-7858 IL 434258XXXXXX8672 082224658005480 ?MCC=7299 ","Seattle Fun Fund",null,null,"R",119.3,"Expense"]
["2012-08-14",null,null,"Employeer","Austin's Net Income",null,114.3,"R",null,"Income"]
["2012-08-14",null,"GREASE MONKEY AMERICAN FORKUT ","POS PURCHASE - GREASE MONKEY AMERICAN FORKUT 8672 00000227001753402 ","Auto Insurance",null,null,"R",80.3,"Expense"]
{"$rows_left_out":201}
{"sheet":"Lists","index":8,"n_rows":45,"n_cols":6,"rows_kept":45,"cut":false,"hidden":true,"merged":[]}
["Category","Sub Category","Type","Budget",null,"Category"]
["","Austin's Money",null,"",null,"Auto & Transportation"]
[null,"Austin's Net Income","Income",null,null,"Bills & Utilities"]
["Auto & Transportation","Auto Insurance","Expense",null,null,"Education"]
["Home","Baby Purchases","Expense",null,null,"Entertainment"]
["Home","Baby Supplies","Expense","x",null,"Fees"]
["Fees","Bankng Fees","Expense",null,null,"Food & Dining"]
["Education","Books & Supplies","Expense","x",null,"Gifts & Donations"]
["","Checking",null,null,null,"Health & Fitness"]
["Home","Clothing","Expense"]
{"$rows_left_out":36}
{"sheet":"Sheet1","index":9,"n_rows":153,"n_cols":3,"rows_kept":153,"cut":false,"hidden":true,"merged":[]}
["Start","End"]
["BILL PAY","ON-LINE","BILL PAY Slate Canyon Sto ON-LINE No Account Number ON 08-28 "]
[null,null,"BILL PAY SLATE CANYON STO ON-LINE No Account Number ON 09-25 "]
[null,null,"BILL PAY Slate Canyon Sto ON-LINE xxxt 0018 ON 10-26 "]
[null,null,"BYU Health Plan Insurance 120904 XXXXX0027 Austin Somers "]
[null,null,"BYU Health Plan Insurance 121019 XXXXX2459 Austin Somers "]
[null,null,"BYU Health Pmt Health 121018 XXXXX6516 Austin Somers "]
[null,null,"BYU Health Pmt Health 121101 XXXXX1879 Austin Somers "]
[null,null,"BYU Other Pmt Other 120904 XXXXX0001 Austin Somers "]
[null,null,"BYU Other Pmt Other 121016 XXXXX0137 Austin Somers "]
{"$rows_left_out":143}