{"text_format":"1","workbook":"xlsx","n_sheets":5,"sheets":["Department Assumptions","P&L Statement","Dept P&L","Assumptions","Data Dump"],"not_rendered":{"charts":0,"images":0,"macros":1,"external_links":6,"defined_names":57,"comments":0,"pivot_tables":0},"unopened":[],"bounds":{"document_bytes":16777216,"sheet_cells":100000,"rows_first":2000,"rows_last":500,"rows_between":2000,"halvings":0,"cell_chars":16384,"cell_head_chars":4096},"cells_cut":0,"cells_raw":0,"read":"whole","date_system":"1900"}

{"sheet":"Department Assumptions","index":0,"n_rows":48,"n_cols":31,"rows_kept":48,"cut":false,"hidden":false,"merged":[]}
[]
[null,"Department: ",null,null,null,"R&D"]
[null,"Budget Owner:",null,null,null,"INPUT DEPARTMENT HEAD HERE",null,null,null,null,null,null,null,null,null,null,null,{"$f":"'P&L Statement'!G3","v":"2013-01-01"},{"$f":"'P&L Statement'!H3","v":"2013-02-01"},{"$f":"'P&L Statement'!I3","v":"2013-03-01"},{"$f":"'P&L Statement'!J3","v":"2013-04-01"},{"$f":"'P&L Statement'!K3","v":"2013-05-01"},{"$f":"'P&L Statement'!L3","v":"2013-06-01"},{"$f":"'P&L Statement'!M3","v":"2013-07-01"},{"$f":"'P&L Statement'!N3","v":"2013-08-01"},{"$f":"'P&L Statement'!O3","v":"2013-09-01"},{"$f":"'P&L Statement'!P3","v":"2013-10-01"},{"$f":"'P&L Statement'!Q3","v":"2013-11-01"},{"$f":"'P&L Statement'!R3","v":"2013-12-01"},null,{"$f":"YEAR(AC3)&\" Total\"","v":"2013 Total"}]
[]
[]
[null,{"$f":"\"Current \"&IF($F$2 <>\"INPUT DEPARTMENT HERE\",$F$2&\" \",\"\")&\"Employees\"","v":"Current R&D Employees"},null,null,null,null,null,null,null,null,null,"Outside Vendor Contracts",null,null,null,null,null,null,null,null,null,null,null,null,null,null,null,null,null,null,{"$f":"SUM(R6:AC6)","v":0}]
[null,"Name",null,null,null,null,"Salary","MBO",null,"Start Date",null,null,"Input Vendor and Monthly Expense",null,null,null,null,null,null,null,null,null,null,null,null,null,null,null,null,null,0]
[null,"Tom",null,null,null,null,50000,null,null,"2011-06-01",null,1,"Test",null,null,null,null,11,3000,342,3000,3000,123,3000,1,3000,3000,3000,432,null,{"$f":"SUM(R8:AC8)","v":21909}]
[null,"Tom",null,null,null,null,50000,null,{"$f":"G9/12+H9/12","v":4166.666666666667},"2011-06-01",null,{"$f":"L8+1","v":2},"Test",null,null,null,null,2000,243,2000,123,2000,123,2000,312,41,2000,234,2000,null,{"$f":"SUM(R9:AC9)","v":13076}]
[null,"Tom",null,null,null,null,50000,null,4166.666666666667,"2011-06-01",null,{"$f":"L9+1","v":3},"Test",null,null,null,null,1000,1000,1000,1000,1000,1000,1000,1000,1000,5423,1000,1000,null,16423]
[null,"Tom",null,null,null,null,50000,null,4166.666666666667,"2011-06-01",null,4,null,null,null,null,null,null,null,null,null,null,null,null,null,null,null,null,null,null,0]
[null,"Tom",null,null,null,null,50000,null,4166.666666666667,"2011-06-01",null,5,null,null,null,null,null,null,null,null,null,null,null,null,null,null,null,null,null,null,0]
[null,"Tom",null,null,null,null,50000,null,4166.666666666667,"2011-06-01",null,6,null,null,null,null,null,null,null,null,null,null,null,null,null,null,null,null,null,null,0]
[null,"Tom",null,null,null,null,50000,null,4166.666666666667,"2011-06-01",null,7,null,null,null,null,null,null,null,null,null,null,null,null,null,null,null,null,null,null,0]
[null,"Tom",null,null,null,null,50000,null,4166.666666666667,"2011-06-01",null,8,null,null,null,null,null,null,null,null,null,null,null,null,null,null,null,null,null,null,0]
{"$rows_left_out":34}
{"sheet":"P&L Statement","index":1,"n_rows":16,"n_cols":19,"rows_kept":16,"cut":false,"hidden":false,"merged":[]}
[null,null,null,null,null,null,2013,2013,2013,2013,2013,2013,2013,2013,2013,2013,2013,2013]
[null,{"$f":"IF('Department Assumptions'!$F$2<>\"INPUT DEPARTMENT HERE\",'Department Assumptions'!$F$2,\"Department\")","v":"R&D"}]
[null,"In actual dollars",null,null,null,null,"2013-01-01","2013-02-01","2013-03-01","2013-04-01","2013-05-01","2013-06-01","2013-07-01","2013-08-01","2013-09-01","2013-10-01","2013-11-01","2013-12-01",{"$f":"YEAR(R3)&\" Total\"","v":"2013 Total"}]
[]
[null,"Salaries and Wages",null,null,null,null,null,null,null,null,null,null,null,null,null,null,null,null,{"$f":"SUM(G5:R5)","v":0}]
[null,"Payroll Taxes",null,null,null,null,null,null,null,null,null,null,null,null,null,null,null,null,{"$f":"SUM(G6:R6)","v":0}]
[null,"Benefits",null,null,null,null,null,null,null,null,null,null,null,null,null,null,null,null,0]
[null,"Legal and Accounting Expenses",null,null,null,null,null,null,null,null,null,null,null,null,null,null,null,null,0]
[null,"Marketing and Public Relations",null,null,null,null,null,null,null,null,null,null,null,null,null,null,null,null,0]
[null,"Outside Services",null,null,null,null,null,null,null,null,null,null,null,null,null,null,null,null,0]
[null,"Telecommunications",null,null,null,null,null,null,null,null,null,null,null,null,null,null,null,null,0]
[null,"Travel",null,null,null,null,null,null,null,null,null,null,null,null,null,null,null,null,0]
[]
[null,"Total Operating Expenses ",null,null,null,null,{"$f":"SUM(G5:G12)","v":0},0,0,0,0,0,0,0,0,0,0,{"$f":"SUM(R5:R12)","v":0},{"$f":"SUM(G14:R14)","v":0}]
[]
{"$rows_left_out":2}
{"sheet":"Dept P&L","index":2,"n_rows":118,"n_cols":23,"rows_kept":118,"cut":false,"hidden":false,"merged":[[0,2,0,15],[2,2,2,15],[4,2,4,15]]}
[]
[]
[null,null,"Statement of Income and Expenses"]
[{"$f":"'Department Assumptions'!F2","v":"R&D"}]
[]
[]
[]
[null,null,null,null,null,null,null,null,null,null,null,null,null,null,null," "]
[null,"2009-12-31","2011-01-31",{"$f":"EOMONTH(C9,1)","v":"2011-02-28"},"2011-03-31","2011-04-30","2011-05-31","2011-06-30","2011-07-31","2011-08-31","2011-09-30","2011-10-31","2011-11-30","2011-12-31",{"$f":"EOMONTH(N9,1)","v":"2012-01-31"},"2012-02-29","2012-03-31","2012-04-30","2012-05-31","2012-06-30","2012-07-31","2012-08-31","2012-09-30"]
["COST OF GOODS SOLD"]
[]
["Direct Salary",null,{"$f":"ROUND(SUMIFS('Data Dump'!$I$7:$I$80000,'Data Dump'!$J$7:$J$80000,$A12,'Data Dump'!$C$7:$C$80000,\">\"&B$9,'Data Dump'!$C$7:$C$80000,\"<=\"&C$9,'Data Dump'!$F$7:$F$80000,$A$4),2)","v":0},{"$f":"ROUND(SUMIFS('Data Dump'!$I$7:$I$80000,'Data Dump'!$J$7:$J$80000,$A12,'Data Dump'!$C$7:$C$80000,\">\"&C$9,'Data Dump'!$C$7:$C$80000,\"<=\"&D$9,'Data Dump'!$F$7:$F$80000,$A$4),2)","v":0},{"$f":"ROUND(SUMIFS('Data Dump'!$I$7:$I$80000,'Data Dump'!$J$7:$J$80000,$A12,'Data Dump'!$C$7:$C$80000,\">\"&D$9,'Data Dump'!$C$7:$C$80000,\"<=\"&E$9,'Data Dump'!$F$7:$F$80000,$A$4),2)","v":0},{"$f":"ROUND(SUMIFS('Data Dump'!$I$7:$I$80000,'Data Dump'!$J$7:$J$80000,$A12,'Data Dump'!$C$7:$C$80000,\">\"&E$9,'Data Dump'!$C$7:$C$80000,\"<=\"&F$9,'Data Dump'!$F$7:$F$80000,$A$4),2)","v":0},{"$f":"ROUND(SUMIFS('Data Dump'!$I$7:$I$80000,'Data Dump'!$J$7:$J$80000,$A12,'Data Dump'!$C$7:$C$80000,\">\"&F$9,'Data Dump'!$C$7:$C$80000,\"<=\"&G$9,'Data Dump'!$F$7:$F$80000,$A$4),2)","v":0},{"$f":"ROUND(SUMIFS('Data Dump'!$I$7:$I$80000,'Data Dump'!$J$7:$J$80000,$A12,'Data Dump'!$C$7:$C$80000,\">\"&G$9,'Data Dump'!$C$7:$C$80000,\"<=\"&H$9,'Data Dump'!$F$7:$F$80000,$A$4),2)","v":0},{"$f":"ROUND(SUMIFS('Data Dump'!$I$7:$I$80000,'Data Dump'!$J$7:$J$80000,$A12,'Data Dump'!$C$7:$C$80000,\">\"&H$9,'Data Dump'!$C$7:$C$80000,\"<=\"&I$9,'Data Dump'!$F$7:$F$80000,$A$4),2)","v":0},{"$f":"ROUND(SUMIFS('Data Dump'!$I$7:$I$80000,'Data Dump'!$J$7:$J$80000,$A12,'Data Dump'!$C$7:$C$80000,\">\"&I$9,'Data Dump'!$C$7:$C$80000,\"<=\"&J$9,'Data Dump'!$F$7:$F$80000,$A$4),2)","v":0},{"$f":"ROUND(SUMIFS('Data Dump'!$I$7:$I$80000,'Data Dump'!$J$7:$J$80000,$A12,'Data Dump'!$C$7:$C$80000,\">\"&J$9,'Data Dump'!$C$7:$C$80000,\"<=\"&K$9,'Data Dump'!$F$7:$F$80000,$A$4),2)","v":0},{"$f":"ROUND(SUMIFS('Data Dump'!$I$7:$I$80000,'Data Dump'!$J$7:$J$80000,$A12,'Data Dump'!$C$7:$C$80000,\">\"&K$9,'Data Dump'!$C$7:$C$80000,\"<=\"&L$9,'Data Dump'!$F$7:$F$80000,$A$4),2)","v":0},{"$f":"ROUND(SUMIFS('Data Dump'!$I$7:$I$80000,'Data Dump'!$J$7:$J$80000,$A12,'Data Dump'!$C$7:$C$80000,\">\"&L$9,'Data Dump'!$C$7:$C$80000,\"<=\"&M$9,'Data Dump'!$F$7:$F$80000,$A$4),2)","v":0},{"$f":"ROUND(SUMIFS('Data Dump'!$I$7:$I$80000,'Data Dump'!$J$7:$J$80000,$A12,'Data Dump'!$C$7:$C$80000,\">\"&M$9,'Data Dump'!$C$7:$C$80000,\"<=\"&N$9,'Data Dump'!$F$7:$F$80000,$A$4),2)","v":0},{"$f":"ROUND(SUMIFS('Data Dump'!$I$7:$I$80000,'Data Dump'!$J$7:$J$80000,$A12,'Data Dump'!$C$7:$C$80000,\">\"&N$9,'Data Dump'!$C$7:$C$80000,\"<=\"&O$9,'Data Dump'!$F$7:$F$80000,$A$4),2)","v":0},{"$f":"ROUND(SUMIFS('Data Dump'!$I$7:$I$80000,'Data Dump'!$J$7:$J$80000,$A12,'Data Dump'!$C$7:$C$80000,\">\"&O$9,'Data Dump'!$C$7:$C$80000,\"<=\"&P$9,'Data Dump'!$F$7:$F$80000,$A$4),2)","v":0},{"$f":"ROUND(SUMIFS('Data Dump'!$I$7:$I$80000,'Data Dump'!$J$7:$J$80000,$A12,'Data Dump'!$C$7:$C$80000,\">\"&P$9,'Data Dump'!$C$7:$C$80000,\"<=\"&Q$9,'Data Dump'!$F$7:$F$80000,$A$4),2)","v":0},{"$f":"ROUND(SUMIFS('Data Dump'!$I$7:$I$80000,'Data Dump'!$J$7:$J$80000,$A12,'Data Dump'!$C$7:$C$80000,\">\"&Q$9,'Data Dump'!$C$7:$C$80000,\"<=\"&R$9,'Data Dump'!$F$7:$F$80000,$A$4),2)","v":0},{"$f":"ROUND(SUMIFS('Data Dump'!$I$7:$I$80000,'Data Dump'!$J$7:$J$80000,$A12,'Data Dump'!$C$7:$C$80000,\">\"&R$9,'Data Dump'!$C$7:$C$80000,\"<=\"&S$9,'Data Dump'!$F$7:$F$80000,$A$4),2)","v":0},{"$f":"ROUND(SUMIFS('Data Dump'!$I$7:$I$80000,'Data Dump'!$J$7:$J$80000,$A12,'Data Dump'!$C$7:$C$80000,\">\"&S$9,'Data Dump'!$C$7:$C$80000,\"<=\"&T$9,'Data Dump'!$F$7:$F$80000,$A$4),2)","v":0},{"$f":"ROUND(SUMIFS('Data Dump'!$I$7:$I$80000,'Data Dump'!$J$7:$J$80000,$A12,'Data Dump'!$C$7:$C$80000,\">\"&T$9,'Data Dump'!$C$7:$C$80000,\"<=\"&U$9,'Data Dump'!$F$7:$F$80000,$A$4),2)","v":0},{"$f":"ROUND(SUMIFS('Data Dump'!$I$7:$I$80000,'Data Dump'!$J$7:$J$80000,$A12,'Data Dump'!$C$7:$C$80000,\">\"&U$9,'Data Dump'!$C$7:$C$80000,\"<=\"&V$9,'Data Dump'!$F$7:$F$80000,$A$4),2)","v":0},{"$f":"ROUND(SUMIFS('Data Dump'!$I$7:$I$80000,'Data Dump'!$J$7:$J$80000,$A12,'Data Dump'!$C$7:$C$80000,\">\"&V$9,'Data Dump'!$C$7:$C$80000,\"<=\"&W$9,'Data Dump'!$F$7:$F$80000,$A$4),2)","v":0}]
["Website Expenses",null,{"$f":"ROUND(SUMIFS('Data Dump'!$I$7:$I$80000,'Data Dump'!$J$7:$J$80000,$A13,'Data Dump'!$C$7:$C$80000,\">\"&B$9,'Data Dump'!$C$7:$C$80000,\"<=\"&C$9,'Data Dump'!$F$7:$F$80000,$A$4),2)","v":0},{"$f":"ROUND(SUMIFS('Data Dump'!$I$7:$I$80000,'Data Dump'!$J$7:$J$80000,$A13,'Data Dump'!$C$7:$C$80000,\">\"&C$9,'Data Dump'!$C$7:$C$80000,\"<=\"&D$9,'Data Dump'!$F$7:$F$80000,$A$4),2)","v":0},{"$f":"ROUND(SUMIFS('Data Dump'!$I$7:$I$80000,'Data Dump'!$J$7:$J$80000,$A13,'Data Dump'!$C$7:$C$80000,\">\"&D$9,'Data Dump'!$C$7:$C$80000,\"<=\"&E$9,'Data Dump'!$F$7:$F$80000,$A$4),2)","v":0},{"$f":"ROUND(SUMIFS('Data Dump'!$I$7:$I$80000,'Data Dump'!$J$7:$J$80000,$A13,'Data Dump'!$C$7:$C$80000,\">\"&E$9,'Data Dump'!$C$7:$C$80000,\"<=\"&F$9,'Data Dump'!$F$7:$F$80000,$A$4),2)","v":0},{"$f":"ROUND(SUMIFS('Data Dump'!$I$7:$I$80000,'Data Dump'!$J$7:$J$80000,$A13,'Data Dump'!$C$7:$C$80000,\">\"&F$9,'Data Dump'!$C$7:$C$80000,\"<=\"&G$9,'Data Dump'!$F$7:$F$80000,$A$4),2)","v":0},{"$f":"ROUND(SUMIFS('Data Dump'!$I$7:$I$80000,'Data Dump'!$J$7:$J$80000,$A13,'Data Dump'!$C$7:$C$80000,\">\"&G$9,'Data Dump'!$C$7:$C$80000,\"<=\"&H$9,'Data Dump'!$F$7:$F$80000,$A$4),2)","v":0},{"$f":"ROUND(SUMIFS('Data Dump'!$I$7:$I$80000,'Data Dump'!$J$7:$J$80000,$A13,'Data Dump'!$C$7:$C$80000,\">\"&H$9,'Data Dump'!$C$7:$C$80000,\"<=\"&I$9,'Data Dump'!$F$7:$F$80000,$A$4),2)","v":0},{"$f":"ROUND(SUMIFS('Data Dump'!$I$7:$I$80000,'Data Dump'!$J$7:$J$80000,$A13,'Data Dump'!$C$7:$C$80000,\">\"&I$9,'Data Dump'!$C$7:$C$80000,\"<=\"&J$9,'Data Dump'!$F$7:$F$80000,$A$4),2)","v":0},{"$f":"ROUND(SUMIFS('Data Dump'!$I$7:$I$80000,'Data Dump'!$J$7:$J$80000,$A13,'Data Dump'!$C$7:$C$80000,\">\"&J$9,'Data Dump'!$C$7:$C$80000,\"<=\"&K$9,'Data Dump'!$F$7:$F$80000,$A$4),2)","v":0},{"$f":"ROUND(SUMIFS('Data Dump'!$I$7:$I$80000,'Data Dump'!$J$7:$J$80000,$A13,'Data Dump'!$C$7:$C$80000,\">\"&K$9,'Data Dump'!$C$7:$C$80000,\"<=\"&L$9,'Data Dump'!$F$7:$F$80000,$A$4),2)","v":0},{"$f":"ROUND(SUMIFS('Data Dump'!$I$7:$I$80000,'Data Dump'!$J$7:$J$80000,$A13,'Data Dump'!$C$7:$C$80000,\">\"&L$9,'Data Dump'!$C$7:$C$80000,\"<=\"&M$9,'Data Dump'!$F$7:$F$80000,$A$4),2)","v":0},{"$f":"ROUND(SUMIFS('Data Dump'!$I$7:$I$80000,'Data Dump'!$J$7:$J$80000,$A13,'Data Dump'!$C$7:$C$80000,\">\"&M$9,'Data Dump'!$C$7:$C$80000,\"<=\"&N$9,'Data Dump'!$F$7:$F$80000,$A$4),2)","v":0},{"$f":"ROUND(SUMIFS('Data Dump'!$I$7:$I$80000,'Data Dump'!$J$7:$J$80000,$A13,'Data Dump'!$C$7:$C$80000,\">\"&N$9,'Data Dump'!$C$7:$C$80000,\"<=\"&O$9,'Data Dump'!$F$7:$F$80000,$A$4),2)","v":0},{"$f":"ROUND(SUMIFS('Data Dump'!$I$7:$I$80000,'Data Dump'!$J$7:$J$80000,$A13,'Data Dump'!$C$7:$C$80000,\">\"&O$9,'Data Dump'!$C$7:$C$80000,\"<=\"&P$9,'Data Dump'!$F$7:$F$80000,$A$4),2)","v":0},{"$f":"ROUND(SUMIFS('Data Dump'!$I$7:$I$80000,'Data Dump'!$J$7:$J$80000,$A13,'Data Dump'!$C$7:$C$80000,\">\"&P$9,'Data Dump'!$C$7:$C$80000,\"<=\"&Q$9,'Data Dump'!$F$7:$F$80000,$A$4),2)","v":0},{"$f":"ROUND(SUMIFS('Data Dump'!$I$7:$I$80000,'Data Dump'!$J$7:$J$80000,$A13,'Data Dump'!$C$7:$C$80000,\">\"&Q$9,'Data Dump'!$C$7:$C$80000,\"<=\"&R$9,'Data Dump'!$F$7:$F$80000,$A$4),2)","v":0},{"$f":"ROUND(SUMIFS('Data Dump'!$I$7:$I$80000,'Data Dump'!$J$7:$J$80000,$A13,'Data Dump'!$C$7:$C$80000,\">\"&R$9,'Data Dump'!$C$7:$C$80000,\"<=\"&S$9,'Data Dump'!$F$7:$F$80000,$A$4),2)","v":0},{"$f":"ROUND(SUMIFS('Data Dump'!$I$7:$I$80000,'Data Dump'!$J$7:$J$80000,$A13,'Data Dump'!$C$7:$C$80000,\">\"&S$9,'Data Dump'!$C$7:$C$80000,\"<=\"&T$9,'Data Dump'!$F$7:$F$80000,$A$4),2)","v":0},{"$f":"ROUND(SUMIFS('Data Dump'!$I$7:$I$80000,'Data Dump'!$J$7:$J$80000,$A13,'Data Dump'!$C$7:$C$80000,\">\"&T$9,'Data Dump'!$C$7:$C$80000,\"<=\"&U$9,'Data Dump'!$F$7:$F$80000,$A$4),2)","v":0},{"$f":"ROUND(SUMIFS('Data Dump'!$I$7:$I$80000,'Data Dump'!$J$7:$J$80000,$A13,'Data Dump'!$C$7:$C$80000,\">\"&U$9,'Data Dump'!$C$7:$C$80000,\"<=\"&V$9,'Data Dump'!$F$7:$F$80000,$A$4),2)","v":0},{"$f":"ROUND(SUMIFS('Data Dump'!$I$7:$I$80000,'Data Dump'!$J$7:$J$80000,$A13,'Data Dump'!$C$7:$C$80000,\">\"&V$9,'Data Dump'!$C$7:$C$80000,\"<=\"&W$9,'Data Dump'!$F$7:$F$80000,$A$4),2)","v":0}]
["Printing and Reproduction",null,{"$f":"ROUND(SUMIFS('Data Dump'!$I$7:$I$80000,'Data Dump'!$J$7:$J$80000,$A14,'Data Dump'!$C$7:$C$80000,\">\"&B$9,'Data Dump'!$C$7:$C$80000,\"<=\"&C$9,'Data Dump'!$F$7:$F$80000,$A$4),2)","v":0},{"$f":"ROUND(SUMIFS('Data Dump'!$I$7:$I$80000,'Data Dump'!$J$7:$J$80000,$A14,'Data Dump'!$C$7:$C$80000,\">\"&C$9,'Data Dump'!$C$7:$C$80000,\"<=\"&D$9,'Data Dump'!$F$7:$F$80000,$A$4),2)","v":0},{"$f":"ROUND(SUMIFS('Data Dump'!$I$7:$I$80000,'Data Dump'!$J$7:$J$80000,$A14,'Data Dump'!$C$7:$C$80000,\">\"&D$9,'Data Dump'!$C$7:$C$80000,\"<=\"&E$9,'Data Dump'!$F$7:$F$80000,$A$4),2)","v":0},{"$f":"ROUND(SUMIFS('Data Dump'!$I$7:$I$80000,'Data Dump'!$J$7:$J$80000,$A14,'Data Dump'!$C$7:$C$80000,\">\"&E$9,'Data Dump'!$C$7:$C$80000,\"<=\"&F$9,'Data Dump'!$F$7:$F$80000,$A$4),2)","v":0},{"$f":"ROUND(SUMIFS('Data Dump'!$I$7:$I$80000,'Data Dump'!$J$7:$J$80000,$A14,'Data Dump'!$C$7:$C$80000,\">\"&F$9,'Data Dump'!$C$7:$C$80000,\"<=\"&G$9,'Data Dump'!$F$7:$F$80000,$A$4),2)","v":0},{"$f":"ROUND(SUMIFS('Data Dump'!$I$7:$I$80000,'Data Dump'!$J$7:$J$80000,$A14,'Data Dump'!$C$7:$C$80000,\">\"&G$9,'Data Dump'!$C$7:$C$80000,\"<=\"&H$9,'Data Dump'!$F$7:$F$80000,$A$4),2)","v":0},{"$f":"ROUND(SUMIFS('Data Dump'!$I$7:$I$80000,'Data Dump'!$J$7:$J$80000,$A14,'Data Dump'!$C$7:$C$80000,\">\"&H$9,'Data Dump'!$C$7:$C$80000,\"<=\"&I$9,'Data Dump'!$F$7:$F$80000,$A$4),2)","v":0},{"$f":"ROUND(SUMIFS('Data Dump'!$I$7:$I$80000,'Data Dump'!$J$7:$J$80000,$A14,'Data Dump'!$C$7:$C$80000,\">\"&I$9,'Data Dump'!$C$7:$C$80000,\"<=\"&J$9,'Data Dump'!$F$7:$F$80000,$A$4),2)","v":0},{"$f":"ROUND(SUMIFS('Data Dump'!$I$7:$I$80000,'Data Dump'!$J$7:$J$80000,$A14,'Data Dump'!$C$7:$C$80000,\">\"&J$9,'Data Dump'!$C$7:$C$80000,\"<=\"&K$9,'Data Dump'!$F$7:$F$80000,$A$4),2)","v":0},{"$f":"ROUND(SUMIFS('Data Dump'!$I$7:$I$80000,'Data Dump'!$J$7:$J$80000,$A14,'Data Dump'!$C$7:$C$80000,\">\"&K$9,'Data Dump'!$C$7:$C$80000,\"<=\"&L$9,'Data Dump'!$F$7:$F$80000,$A$4),2)","v":0},{"$f":"ROUND(SUMIFS('Data Dump'!$I$7:$I$80000,'Data Dump'!$J$7:$J$80000,$A14,'Data Dump'!$C$7:$C$80000,\">\"&L$9,'Data Dump'!$C$7:$C$80000,\"<=\"&M$9,'Data Dump'!$F$7:$F$80000,$A$4),2)","v":0},{"$f":"ROUND(SUMIFS('Data Dump'!$I$7:$I$80000,'Data Dump'!$J$7:$J$80000,$A14,'Data Dump'!$C$7:$C$80000,\">\"&M$9,'Data Dump'!$C$7:$C$80000,\"<=\"&N$9,'Data Dump'!$F$7:$F$80000,$A$4),2)","v":0},{"$f":"ROUND(SUMIFS('Data Dump'!$I$7:$I$80000,'Data Dump'!$J$7:$J$80000,$A14,'Data Dump'!$C$7:$C$80000,\">\"&N$9,'Data Dump'!$C$7:$C$80000,\"<=\"&O$9,'Data Dump'!$F$7:$F$80000,$A$4),2)","v":0},{"$f":"ROUND(SUMIFS('Data Dump'!$I$7:$I$80000,'Data Dump'!$J$7:$J$80000,$A14,'Data Dump'!$C$7:$C$80000,\">\"&O$9,'Data Dump'!$C$7:$C$80000,\"<=\"&P$9,'Data Dump'!$F$7:$F$80000,$A$4),2)","v":0},{"$f":"ROUND(SUMIFS('Data Dump'!$I$7:$I$80000,'Data Dump'!$J$7:$J$80000,$A14,'Data Dump'!$C$7:$C$80000,\">\"&P$9,'Data Dump'!$C$7:$C$80000,\"<=\"&Q$9,'Data Dump'!$F$7:$F$80000,$A$4),2)","v":0},{"$f":"ROUND(SUMIFS('Data Dump'!$I$7:$I$80000,'Data Dump'!$J$7:$J$80000,$A14,'Data Dump'!$C$7:$C$80000,\">\"&Q$9,'Data Dump'!$C$7:$C$80000,\"<=\"&R$9,'Data Dump'!$F$7:$F$80000,$A$4),2)","v":0},{"$f":"ROUND(SUMIFS('Data Dump'!$I$7:$I$80000,'Data Dump'!$J$7:$J$80000,$A14,'Data Dump'!$C$7:$C$80000,\">\"&R$9,'Data Dump'!$C$7:$C$80000,\"<=\"&S$9,'Data Dump'!$F$7:$F$80000,$A$4),2)","v":0},{"$f":"ROUND(SUMIFS('Data Dump'!$I$7:$I$80000,'Data Dump'!$J$7:$J$80000,$A14,'Data Dump'!$C$7:$C$80000,\">\"&S$9,'Data Dump'!$C$7:$C$80000,\"<=\"&T$9,'Data Dump'!$F$7:$F$80000,$A$4),2)","v":0},{"$f":"ROUND(SUMIFS('Data Dump'!$I$7:$I$80000,'Data Dump'!$J$7:$J$80000,$A14,'Data Dump'!$C$7:$C$80000,\">\"&T$9,'Data Dump'!$C$7:$C$80000,\"<=\"&U$9,'Data Dump'!$F$7:$F$80000,$A$4),2)","v":0},{"$f":"ROUND(SUMIFS('Data Dump'!$I$7:$I$80000,'Data Dump'!$J$7:$J$80000,$A14,'Data Dump'!$C$7:$C$80000,\">\"&U$9,'Data Dump'!$C$7:$C$80000,\"<=\"&V$9,'Data Dump'!$F$7:$F$80000,$A$4),2)","v":0},{"$f":"ROUND(SUMIFS('Data Dump'!$I$7:$I$80000,'Data Dump'!$J$7:$J$80000,$A14,'Data Dump'!$C$7:$C$80000,\">\"&V$9,'Data Dump'!$C$7:$C$80000,\"<=\"&W$9,'Data Dump'!$F$7:$F$80000,$A$4),2)","v":0}]
["Hosting",null,{"$f":"ROUND(SUMIFS('Data Dump'!$I$7:$I$80000,'Data Dump'!$J$7:$J$80000,$A15,'Data Dump'!$C$7:$C$80000,\">\"&B$9,'Data Dump'!$C$7:$C$80000,\"<=\"&C$9,'Data Dump'!$F$7:$F$80000,$A$4),2)","v":0},{"$f":"ROUND(SUMIFS('Data Dump'!$I$7:$I$80000,'Data Dump'!$J$7:$J$80000,$A15,'Data Dump'!$C$7:$C$80000,\">\"&C$9,'Data Dump'!$C$7:$C$80000,\"<=\"&D$9,'Data Dump'!$F$7:$F$80000,$A$4),2)","v":0},{"$f":"ROUND(SUMIFS('Data Dump'!$I$7:$I$80000,'Data Dump'!$J$7:$J$80000,$A15,'Data Dump'!$C$7:$C$80000,\">\"&D$9,'Data Dump'!$C$7:$C$80000,\"<=\"&E$9,'Data Dump'!$F$7:$F$80000,$A$4),2)","v":0},{"$f":"ROUND(SUMIFS('Data Dump'!$I$7:$I$80000,'Data Dump'!$J$7:$J$80000,$A15,'Data Dump'!$C$7:$C$80000,\">\"&E$9,'Data Dump'!$C$7:$C$80000,\"<=\"&F$9,'Data Dump'!$F$7:$F$80000,$A$4),2)","v":0},{"$f":"ROUND(SUMIFS('Data Dump'!$I$7:$I$80000,'Data Dump'!$J$7:$J$80000,$A15,'Data Dump'!$C$7:$C$80000,\">\"&F$9,'Data Dump'!$C$7:$C$80000,\"<=\"&G$9,'Data Dump'!$F$7:$F$80000,$A$4),2)","v":0},{"$f":"ROUND(SUMIFS('Data Dump'!$I$7:$I$80000,'Data Dump'!$J$7:$J$80000,$A15,'Data Dump'!$C$7:$C$80000,\">\"&G$9,'Data Dump'!$C$7:$C$80000,\"<=\"&H$9,'Data Dump'!$F$7:$F$80000,$A$4),2)","v":0},{"$f":"ROUND(SUMIFS('Data Dump'!$I$7:$I$80000,'Data Dump'!$J$7:$J$80000,$A15,'Data Dump'!$C$7:$C$80000,\">\"&H$9,'Data Dump'!$C$7:$C$80000,\"<=\"&I$9,'Data Dump'!$F$7:$F$80000,$A$4),2)","v":0},{"$f":"ROUND(SUMIFS('Data Dump'!$I$7:$I$80000,'Data Dump'!$J$7:$J$80000,$A15,'Data Dump'!$C$7:$C$80000,\">\"&I$9,'Data Dump'!$C$7:$C$80000,\"<=\"&J$9,'Data Dump'!$F$7:$F$80000,$A$4),2)","v":0},{"$f":"ROUND(SUMIFS('Data Dump'!$I$7:$I$80000,'Data Dump'!$J$7:$J$80000,$A15,'Data Dump'!$C$7:$C$80000,\">\"&J$9,'Data Dump'!$C$7:$C$80000,\"<=\"&K$9,'Data Dump'!$F$7:$F$80000,$A$4),2)","v":0},{"$f":"ROUND(SUMIFS('Data Dump'!$I$7:$I$80000,'Data Dump'!$J$7:$J$80000,$A15,'Data Dump'!$C$7:$C$80000,\">\"&K$9,'Data Dump'!$C$7:$C$80000,\"<=\"&L$9,'Data Dump'!$F$7:$F$80000,$A$4),2)","v":0},{"$f":"ROUND(SUMIFS('Data Dump'!$I$7:$I$80000,'Data Dump'!$J$7:$J$80000,$A15,'Data Dump'!$C$7:$C$80000,\">\"&L$9,'Data Dump'!$C$7:$C$80000,\"<=\"&M$9,'Data Dump'!$F$7:$F$80000,$A$4),2)","v":0},{"$f":"ROUND(SUMIFS('Data Dump'!$I$7:$I$80000,'Data Dump'!$J$7:$J$80000,$A15,'Data Dump'!$C$7:$C$80000,\">\"&M$9,'Data Dump'!$C$7:$C$80000,\"<=\"&N$9,'Data Dump'!$F$7:$F$80000,$A$4),2)","v":0},{"$f":"ROUND(SUMIFS('Data Dump'!$I$7:$I$80000,'Data Dump'!$J$7:$J$80000,$A15,'Data Dump'!$C$7:$C$80000,\">\"&N$9,'Data Dump'!$C$7:$C$80000,\"<=\"&O$9,'Data Dump'!$F$7:$F$80000,$A$4),2)","v":0},{"$f":"ROUND(SUMIFS('Data Dump'!$I$7:$I$80000,'Data Dump'!$J$7:$J$80000,$A15,'Data Dump'!$C$7:$C$80000,\">\"&O$9,'Data Dump'!$C$7:$C$80000,\"<=\"&P$9,'Data Dump'!$F$7:$F$80000,$A$4),2)","v":0},{"$f":"ROUND(SUMIFS('Data Dump'!$I$7:$I$80000,'Data Dump'!$J$7:$J$80000,$A15,'Data Dump'!$C$7:$C$80000,\">\"&P$9,'Data Dump'!$C$7:$C$80000,\"<=\"&Q$9,'Data Dump'!$F$7:$F$80000,$A$4),2)","v":0},{"$f":"ROUND(SUMIFS('Data Dump'!$I$7:$I$80000,'Data Dump'!$J$7:$J$80000,$A15,'Data Dump'!$C$7:$C$80000,\">\"&Q$9,'Data Dump'!$C$7:$C$80000,\"<=\"&R$9,'Data Dump'!$F$7:$F$80000,$A$4),2)","v":0},{"$f":"ROUND(SUMIFS('Data Dump'!$I$7:$I$80000,'Data Dump'!$J$7:$J$80000,$A15,'Data Dump'!$C$7:$C$80000,\">\"&R$9,'Data Dump'!$C$7:$C$80000,\"<=\"&S$9,'Data Dump'!$F$7:$F$80000,$A$4),2)","v":0},{"$f":"ROUND(SUMIFS('Data Dump'!$I$7:$I$80000,'Data Dump'!$J$7:$J$80000,$A15,'Data Dump'!$C$7:$C$80000,\">\"&S$9,'Data Dump'!$C$7:$C$80000,\"<=\"&T$9,'Data Dump'!$F$7:$F$80000,$A$4),2)","v":0},{"$f":"ROUND(SUMIFS('Data Dump'!$I$7:$I$80000,'Data Dump'!$J$7:$J$80000,$A15,'Data Dump'!$C$7:$C$80000,\">\"&T$9,'Data Dump'!$C$7:$C$80000,\"<=\"&U$9,'Data Dump'!$F$7:$F$80000,$A$4),2)","v":0},{"$f":"ROUND(SUMIFS('Data Dump'!$I$7:$I$80000,'Data Dump'!$J$7:$J$80000,$A15,'Data Dump'!$C$7:$C$80000,\">\"&U$9,'Data Dump'!$C$7:$C$80000,\"<=\"&V$9,'Data Dump'!$F$7:$F$80000,$A$4),2)","v":0},{"$f":"ROUND(SUMIFS('Data Dump'!$I$7:$I$80000,'Data Dump'!$J$7:$J$80000,$A15,'Data Dump'!$C$7:$C$80000,\">\"&V$9,'Data Dump'!$C$7:$C$80000,\"<=\"&W$9,'Data Dump'!$F$7:$F$80000,$A$4),2)","v":0}]
{"$rows_left_out":104}
{"sheet":"Assumptions","index":3,"n_rows":5,"n_cols":6,"rows_kept":5,"cut":false,"hidden":false,"merged":[]}
[]
[null,"General Assumptions"]
[null,"Payroll Taxes",null,null,null,7.0000000000000007E-2]
[null,"Benefits",null,null,null,0.08]
[null,"Avg. Cell Phone Reimbursement",null,null,null,50]

{"sheet":"Data Dump","index":4,"n_rows":58356,"n_cols":18,"rows_kept":58356,"cut":false,"hidden":false,"merged":[]}
[]
[]
[]
[" "]
[" ",null,null,null,null,null,null,null,null,null,null,null,"Account Table",null,null,null,"Department Table"]
["Account","Type","Date","Num","Name","Department","Debit","Credit","Net","Category","Dept",null,"Account","Income Statement Category","Dept Breakout?",null,"Department","Column1"]
[null,null,null,null,null,null,null,null,null,null,null,null,"10100 - Cash Operating","Cash","No",null,"- No Department -"]
[null,null,null,null,null,null,null,null,null,null,null,null,"10103 - PayPal","Cash","No",null,"G&A","G&A"]
[null,null,null,null,null,null,null,null,null,null,null,null,"10104 - INQ Cash Operating","Cash","No",null,"Marketing","Marketing"]
[null,null,null,null,null,null,null,null,null,null,null,null,"10110 - Zions Grand Cayman","Cash","No",null,"Solution Engineering"]
[null,null,null,null,null,null,null,null,null,null,null,null,"10206 - Restricted Cash - SW Escrow","Cash","No",null,"Engineering Services"]
[null,null,null,null,null,null,null,null,null,null,null,null,"10206 - Restricted Cash - LoC","Cash","No",null,"Account Management","Sales"]
[null,null,null,null,null,null,null,null,null,null,null,null,"10208 - INQ 125c Account","Cash","No",null,"Client Services","Client Services"]
[null,null,null,null,null,null,null,null,null,null,null,null,"10209 - Zion's 125c Account","Cash","No",null,"Professional Services (CSM)","Client Services"]
[null,null,null,null,null,null,null,null,null,null,null,null,"10300 - Petty Cash","Cash","No",null,"Support","Client Services"]
{"$rows_left_out":58341}