{"text_format":"1","workbook":"xlsx","n_sheets":5,"sheets":["Category List","Budget Summary","Expenses List","Detailed Budget","Variance Analysis"],"not_rendered":{"charts":3,"images":0,"macros":1,"external_links":1,"defined_names":5,"comments":0,"pivot_tables":0},"unopened":[],"bounds":{"document_bytes":16777216,"sheet_cells":100000,"rows_first":2000,"rows_last":500,"rows_between":2000,"halvings":0,"cell_chars":16384,"cell_head_chars":4096},"cells_cut":0,"cells_raw":0,"read":"whole","date_system":"1900"}

{"sheet":"Category List","index":0,"n_rows":23,"n_cols":1,"rows_kept":23,"cut":false,"hidden":true,"merged":[]}
["CATEGORIES"]
["Clothing/Hair"]
["Eating Out"]
["EJ's Gross"]
["EJ's Net"]
["EJ's tips"]
["Fast Offerings"]
["Fun"]
["Gas"]
["Groceries"]
["Gym"]
["Insurance/Car"]
["Jeff's Gross"]
["Jeff's Net"]
["Medical/Health"]
["Misc"]
["Rent"]
["Renter's  Insurance"]
["Savings"]
["School"]
{"$rows_left_out":4}
{"sheet":"Budget Summary","index":1,"n_rows":37,"n_cols":5,"rows_kept":37,"cut":false,"hidden":false,"merged":[[1,0,12,0],[13,0,24,0],[25,0,36,0]]}
["Year","Month","Budget","Actual","Variance"]
[2012,"January",null,null,{"$f":"C2-D2","v":0}]
[null,"February",null,null,0]
[null,"March",null,null,0]
[null,"April",null,null,0]
[null,"May",null,null,0]
[null,"June",null,null,0]
[null,"July",null,null,0]
[null,"August",null,null,0]
[null,"September",null,null,0]
[null,"October",{"$f":"'Detailed Budget'!B33","v":2315},{"$f":"'Detailed Budget'!C33","v":2347.37},-32.369999999999891]
[null,"November",{"$f":"'Detailed Budget'!E33","v":1035},{"$f":"'Detailed Budget'!F33","v":924.83999999999992},110.16000000000008]
[null,"December",{"$f":"'Detailed Budget'!H33","v":0},{"$f":"'Detailed Budget'!I33","v":36.4},-36.4]
[2013,"January",null,null,0]
[null,"February",null,null,0]
[null,"March",null,null,0]
[null,"April",null,null,0]
[null,"May",null,null,0]
[null,"June",null,null,0]
[null,"July",null,null,0]
{"$rows_left_out":18}
{"sheet":"Expenses List","index":2,"n_rows":51,"n_cols":5,"rows_kept":51,"cut":false,"hidden":false,"merged":[]}
["Description","Category","Amount","Month","Year"]
["Rent (accidentally paid it early)","Rent",567.27,"November",2012]
["Haircut","Clothing/Hair",15,"October",2012]
["KK Doughnuts","Eating Out",4.3099999999999996,"October",2012]
["Pirate O's Adventure","Eating Out",7.24,"October",2012]
["Ikea Food","Eating Out",4.3,"October",2012]
["Hot Chocolate (2)","Eating Out",2.5,"October",2012]
["Fast Offering","Fast Offerings",20,"October",2012]
["Ikea stuff for Mom/ frozen meatballs","Fun",36.67,"October",2012]
["Quarry Membership","Fun",69.39,"October",2012]
["Cut the Rope Phone Ap","Fun",0.99,"October",2012]
["Dollar Theatre","Fun",2,"October",2012]
["Floral Stuff","Fun",31.42,"October",2012]
["Gas","Gas",48.92,"October",2012]
["Gas","Gas",53.73,"October",2012]
["Gas","Gas",47.22,"October",2012]
["Groceries- Macey's","Groceries",99.26,"October",2012]
["Groceries","Groceries",64.010000000000005,"October",2012]
["Groceries","Groceries",23.33,"October",2012]
["Buy Low","Groceries",23.33,"October",2012]
{"$rows_left_out":32}
{"sheet":"Detailed Budget","index":3,"n_rows":35,"n_cols":46,"rows_kept":35,"cut":false,"hidden":false,"merged":[]}
["Income and Expenses","October 2012 Budget","October 2012 Actual","Variance","November 2012 Budget","November 2012 Actual","Variance","December 2012 Budget","December 2012 Actual","Variance","January 2013 Budget","January 2013 Actual","Variance","February 2013 Budget","February 2013 Actual","Variance","March 2013 Budget","March 2013 Actual","Variance","April 2013Budget","April 2013 Actual","Variance","May 2013 Budget","May 2013 Actual","Variance","June 2013 Budget","June 2013 Actual","Variance","July 2013 Budget","July 2013 Actual","Variance","August 2013 Budget","August 2013 Actual","Variance","September 2013 Budget","September 2013 Actual","Variance","October 2013 Budget","October 2013 Actual","Variance","November 2013 Budget","November 2013 Actual","Variance","December 2013 Budget","December 2013 Actual","Variance"]
[]
["INCOME"]
["Jeff's Gross",100,null,{"$f":"C4-B4","v":-100},650,600,{"$f":"F4-E4","v":-50},null,null,{"$f":"I4-H4","v":0},null,null,{"$f":"L4-K4","v":0},null,null,{"$f":"O4-N4","v":0},null,null,{"$f":"R4-Q4","v":0},null,null,{"$f":"U4-T4","v":0},null,null,{"$f":"X4-W4","v":0},null,null,{"$f":"AA4-Z4","v":0},null,null,{"$f":"AD4-AC4","v":0},null,null,{"$f":"AG4-AF4","v":0},null,null,{"$f":"AJ4-AI4","v":0},null,null,{"$f":"AM4-AL4","v":0},null,null,{"$f":"AP4-AO4","v":0},null,null,{"$f":"AS4-AR4","v":0}]
["Jeff's Net",600,472.93,-127.07,700,705,5,null,null,0,null,null,0,null,null,0,null,null,0,null,null,0,null,null,0,null,null,0,null,null,0,null,null,0,null,null,0,null,null,0,null,null,0,null,null,0]
["EJ's Gross",700,{"$f":"372.79+719.29","v":1092.08},392.07999999999993,320,300,-20,null,null,0,null,null,0,null,null,0,null,null,0,null,null,0,null,null,0,null,null,0,null,null,0,null,null,0,null,null,0,null,null,0,null,null,0,null,null,0]
["EJ's Net",600,{"$f":"662.21+351.73","v":1013.94},413.94000000000005,275,300,25,null,null,0,null,null,0,null,null,0,null,null,0,null,null,0,null,null,0,null,null,0,null,null,0,null,null,0,null,null,0,null,null,0,null,null,0,null,null,0]
["EJ's tips",100,30,-70,100,115,15,null,null,0,null,null,0,null,null,0,null,null,0,null,null,0,null,null,0,null,null,0,null,null,0,null,null,0,null,null,0,null,null,0,null,null,0,null,null,0]
["Total Net Income",{"$f":"SUM(B7,B8,B5)","v":1300},{"$f":"SUM(C7,C8,C5)","v":1516.8700000000001},216.87000000000012,{"$f":"SUM(E7,E8,E5)","v":1075},{"$f":"SUM(F7,F8,F5)","v":1120},45,{"$f":"SUM(H7,H8,H5)","v":0},{"$f":"SUM(I7,I8,I5)","v":0},0,{"$f":"SUM(K7,K8,K5)","v":0},{"$f":"SUM(L7,L8,L5)","v":0},0,{"$f":"SUM(N7,N8,N5)","v":0},{"$f":"SUM(O7,O8,O5)","v":0},0,{"$f":"SUM(Q7,Q8,Q5)","v":0},{"$f":"SUM(R7,R8,R5)","v":0},0,{"$f":"SUM(T7,T8,T5)","v":0},{"$f":"SUM(U7,U8,U5)","v":0},0,{"$f":"SUM(W7,W8,W5)","v":0},{"$f":"SUM(X7,X8,X5)","v":0},0,{"$f":"SUM(Z7,Z8,Z5)","v":0},{"$f":"SUM(AA7,AA8,AA5)","v":0},0,{"$f":"SUM(AC7,AC8,AC5)","v":0},{"$f":"SUM(AD7,AD8,AD5)","v":0},0,{"$f":"SUM(AF7,AF8,AF5)","v":0},{"$f":"SUM(AG7,AG8,AG5)","v":0},0,{"$f":"SUM(AI7,AI8,AI5)","v":0},{"$f":"SUM(AJ7,AJ8,AJ5)","v":0},0,{"$f":"SUM(AL7,AL8,AL5)","v":0},{"$f":"SUM(AM7,AM8,AM5)","v":0},0,{"$f":"SUM(AO7,AO8,AO5)","v":0},{"$f":"SUM(AP7,AP8,AP5)","v":0},0,{"$f":"SUM(AR7,AR8,AR5)","v":0},{"$f":"SUM(AS7,AS8,AS5)","v":0},0]
[]
["Fast Offerings",20,{"$f":"SUMIFS('Expenses List'!C:C,'Expenses List'!B:B,\"Fast Offerings\",'Expenses List'!D:D,\"October\",'Expenses List'!E:E,\"2012\")","v":20},{"$f":"C11-B11","v":0},30,{"$f":"SUMIFS('Expenses List'!C:C,'Expenses List'!B:B,\"Fast Offerings\",'Expenses List'!D:D,\"November\",'Expenses List'!E:E,\"2012\")","v":20},{"$f":"F11-E11","v":-10},null,{"$f":"SUMIFS('Expenses List'!C:C,'Expenses List'!B:B,\"Fast Offerings\",'Expenses List'!D:D,\"December\",'Expenses List'!E:E,\"2012\")","v":0},{"$f":"I11-H11","v":0},null,{"$f":"SUMIFS('Expenses List'!C:C,'Expenses List'!B:B,\"Fast Offerings\",'Expenses List'!D:D,\"January\",'Expenses List'!E:E,\"2013\")","v":0},{"$f":"L11-K11","v":0},null,{"$f":"SUMIFS('Expenses List'!C:C,'Expenses List'!B:B,\"Fast Offerings\",'Expenses List'!D:D,\"February\",'Expenses List'!E:E,\"2013\")","v":0},{"$f":"O11-N11","v":0},null,{"$f":"SUMIFS('Expenses List'!C:C,'Expenses List'!B:B,\"Fast Offerings\",'Expenses List'!D:D,\"March\",'Expenses List'!E:E,\"2013\")","v":0},{"$f":"R11-Q11","v":0},null,{"$f":"SUMIFS('Expenses List'!C:C,'Expenses List'!B:B,\"Fast Offerings\",'Expenses List'!D:D,\"April\",'Expenses List'!E:E,\"2013\")","v":0},{"$f":"U11-T11","v":0},null,{"$f":"SUMIFS('Expenses List'!C:C,'Expenses List'!B:B,\"Fast Offerings\",'Expenses List'!D:D,\"May\",'Expenses List'!E:E,\"2013\")","v":0},{"$f":"X11-W11","v":0},null,{"$f":"SUMIFS('Expenses List'!C:C,'Expenses List'!B:B,\"Fast Offerings\",'Expenses List'!D:D,\"June\",'Expenses List'!E:E,\"2013\")","v":0},{"$f":"AA11-Z11","v":0},null,{"$f":"SUMIFS('Expenses List'!C:C,'Expenses List'!B:B,\"Fast Offerings\",'Expenses List'!D:D,\"July\",'Expenses List'!E:E,\"2013\")","v":0},{"$f":"AD11-AC11","v":0},null,{"$f":"SUMIFS('Expenses List'!C:C,'Expenses List'!B:B,\"Fast Offerings\",'Expenses List'!D:D,\"August\",'Expenses List'!E:E,\"2013\")","v":0},{"$f":"AG11-AF11","v":0},null,{"$f":"SUMIFS('Expenses List'!C:C,'Expenses List'!B:B,\"Fast Offerings\",'Expenses List'!D:D,\"September\",'Expenses List'!E:E,\"2013\")","v":0},{"$f":"AJ11-AI11","v":0},null,{"$f":"SUMIFS('Expenses List'!C:C,'Expenses List'!B:B,\"Fast Offerings\",'Expenses List'!D:D,\"October\",'Expenses List'!E:E,\"2013\")","v":0},{"$f":"AM11-AL11","v":0},null,{"$f":"SUMIFS('Expenses List'!C:C,'Expenses List'!B:B,\"Fast Offerings\",'Expenses List'!D:D,\"November\",'Expenses List'!E:E,\"2013\")","v":0},{"$f":"AP11-AO11","v":0},null,{"$f":"SUMIFS('Expenses List'!C:C,'Expenses List'!B:B,\"Fast Offerings\",'Expenses List'!D:D,\"December\",'Expenses List'!E:E,\"2013\")","v":0},{"$f":"AS11-AR11","v":0}]
["Savings",20,{"$f":"SUMIFS('Expenses List'!C:C,'Expenses List'!B:B,\"Savings\",'Expenses List'!D:D,\"October\",'Expenses List'!E:E,\"2012\")","v":0},{"$f":"C12-B12","v":-20},30,{"$f":"SUMIFS('Expenses List'!C:C,'Expenses List'!B:B,\"Savings\",'Expenses List'!D:D,\"November\",'Expenses List'!E:E,\"2012\")","v":0},{"$f":"F12-E12","v":-30},null,{"$f":"SUMIFS('Expenses List'!C:C,'Expenses List'!B:B,\"Savings\",'Expenses List'!D:D,\"December\",'Expenses List'!E:E,\"2012\")","v":0},{"$f":"I12-H12","v":0},null,{"$f":"SUMIFS('Expenses List'!C:C,'Expenses List'!B:B,\"Savings\",'Expenses List'!D:D,\"January\",'Expenses List'!E:E,\"2013\")","v":0},{"$f":"L12-K12","v":0},null,{"$f":"SUMIFS('Expenses List'!C:C,'Expenses List'!B:B,\"Savings\",'Expenses List'!D:D,\"February\",'Expenses List'!E:E,\"2013\")","v":0},{"$f":"O12-N12","v":0},null,{"$f":"SUMIFS('Expenses List'!C:C,'Expenses List'!B:B,\"Savings\",'Expenses List'!D:D,\"March\",'Expenses List'!E:E,\"2013\")","v":0},{"$f":"R12-Q12","v":0},null,{"$f":"SUMIFS('Expenses List'!C:C,'Expenses List'!B:B,\"Savings\",'Expenses List'!D:D,\"April\",'Expenses List'!E:E,\"2013\")","v":0},{"$f":"U12-T12","v":0},null,{"$f":"SUMIFS('Expenses List'!C:C,'Expenses List'!B:B,\"Savings\",'Expenses List'!D:D,\"May\",'Expenses List'!E:E,\"2013\")","v":0},{"$f":"X12-W12","v":0},null,{"$f":"SUMIFS('Expenses List'!C:C,'Expenses List'!B:B,\"Savings\",'Expenses List'!D:D,\"June\",'Expenses List'!E:E,\"2013\")","v":0},{"$f":"AA12-Z12","v":0},null,{"$f":"SUMIFS('Expenses List'!C:C,'Expenses List'!B:B,\"Savings\",'Expenses List'!D:D,\"July\",'Expenses List'!E:E,\"2013\")","v":0},{"$f":"AD12-AC12","v":0},null,{"$f":"SUMIFS('Expenses List'!C:C,'Expenses List'!B:B,\"Savings\",'Expenses List'!D:D,\"August\",'Expenses List'!E:E,\"2013\")","v":0},{"$f":"AG12-AF12","v":0},null,{"$f":"SUMIFS('Expenses List'!C:C,'Expenses List'!B:B,\"Savings\",'Expenses List'!D:D,\"September\",'Expenses List'!E:E,\"2013\")","v":0},{"$f":"AJ12-AI12","v":0},null,{"$f":"SUMIFS('Expenses List'!C:C,'Expenses List'!B:B,\"Savings\",'Expenses List'!D:D,\"October\",'Expenses List'!E:E,\"2013\")","v":0},{"$f":"AM12-AL12","v":0},null,{"$f":"SUMIFS('Expenses List'!C:C,'Expenses List'!B:B,\"Savings\",'Expenses List'!D:D,\"November\",'Expenses List'!E:E,\"2013\")","v":0},{"$f":"AP12-AO12","v":0},null,{"$f":"SUMIFS('Expenses List'!C:C,'Expenses List'!B:B,\"Savings\",'Expenses List'!D:D,\"December\",'Expenses List'!E:E,\"2013\")","v":0},{"$f":"AS12-AR12","v":0}]
["Tithing",450,{"$f":"SUMIFS('Expenses List'!C:C,'Expenses List'!B:B,\"Tithing\",'Expenses List'!D:D,\"October\",'Expenses List'!E:E,\"2012\")","v":457},{"$f":"C13-B13","v":7},40,{"$f":"SUMIFS('Expenses List'!C:C,'Expenses List'!B:B,\"Tithing\",'Expenses List'!D:D,\"November\",'Expenses List'!E:E,\"2012\")","v":50},{"$f":"F13-E13","v":10},null,{"$f":"SUMIFS('Expenses List'!C:C,'Expenses List'!B:B,\"Tithing\",'Expenses List'!D:D,\"December\",'Expenses List'!E:E,\"2012\")","v":0},{"$f":"I13-H13","v":0},null,{"$f":"SUMIFS('Expenses List'!C:C,'Expenses List'!B:B,\"Tithing\",'Expenses List'!D:D,\"January\",'Expenses List'!E:E,\"2013\")","v":0},{"$f":"L13-K13","v":0},null,{"$f":"SUMIFS('Expenses List'!C:C,'Expenses List'!B:B,\"Tithing\",'Expenses List'!D:D,\"February\",'Expenses List'!E:E,\"2013\")","v":0},{"$f":"O13-N13","v":0},null,{"$f":"SUMIFS('Expenses List'!C:C,'Expenses List'!B:B,\"Tithing\",'Expenses List'!D:D,\"March\",'Expenses List'!E:E,\"2013\")","v":0},{"$f":"R13-Q13","v":0},null,{"$f":"SUMIFS('Expenses List'!C:C,'Expenses List'!B:B,\"Tithing\",'Expenses List'!D:D,\"April\",'Expenses List'!E:E,\"2013\")","v":0},{"$f":"U13-T13","v":0},null,{"$f":"SUMIFS('Expenses List'!C:C,'Expenses List'!B:B,\"Tithing\",'Expenses List'!D:D,\"May\",'Expenses List'!E:E,\"2013\")","v":0},{"$f":"X13-W13","v":0},null,{"$f":"SUMIFS('Expenses List'!C:C,'Expenses List'!B:B,\"Tithing\",'Expenses List'!D:D,\"June\",'Expenses List'!E:E,\"2013\")","v":0},{"$f":"AA13-Z13","v":0},null,{"$f":"SUMIFS('Expenses List'!C:C,'Expenses List'!B:B,\"Tithing\",'Expenses List'!D:D,\"July\",'Expenses List'!E:E,\"2013\")","v":0},{"$f":"AD13-AC13","v":0},null,{"$f":"SUMIFS('Expenses List'!C:C,'Expenses List'!B:B,\"Tithing\",'Expenses List'!D:D,\"August\",'Expenses List'!E:E,\"2013\")","v":0},{"$f":"AG13-AF13","v":0},null,{"$f":"SUMIFS('Expenses List'!C:C,'Expenses List'!B:B,\"Tithing\",'Expenses List'!D:D,\"September\",'Expenses List'!E:E,\"2013\")","v":0},{"$f":"AJ13-AI13","v":0},null,{"$f":"SUMIFS('Expenses List'!C:C,'Expenses List'!B:B,\"Tithing\",'Expenses List'!D:D,\"October\",'Expenses List'!E:E,\"2013\")","v":0},{"$f":"AM13-AL13","v":0},null,{"$f":"SUMIFS('Expenses List'!C:C,'Expenses List'!B:B,\"Tithing\",'Expenses List'!D:D,\"November\",'Expenses List'!E:E,\"2013\")","v":0},{"$f":"AP13-AO13","v":0},null,{"$f":"SUMIFS('Expenses List'!C:C,'Expenses List'!B:B,\"Tithing\",'Expenses List'!D:D,\"December\",'Expenses List'!E:E,\"2013\")","v":0},{"$f":"AS13-AR13","v":0}]
["Total Saving/Giving",{"$f":"SUM(B11:B13)","v":490},{"$f":"SUM(C11:C13)","v":477},{"$f":"C14-B14","v":-13},{"$f":"SUM(E11:E13)","v":100},{"$f":"SUM(F11:F13)","v":70},{"$f":"F14-E14","v":-30},{"$f":"SUM(H11:H13)","v":0},{"$f":"SUM(I11:I13)","v":0},{"$f":"I14-H14","v":0},{"$f":"SUM(K11:K13)","v":0},{"$f":"SUM(L11:L13)","v":0},{"$f":"L14-K14","v":0},{"$f":"SUM(N11:N13)","v":0},{"$f":"SUM(O11:O13)","v":0},{"$f":"O14-N14","v":0},{"$f":"SUM(Q11:Q13)","v":0},{"$f":"SUM(R11:R13)","v":0},{"$f":"R14-Q14","v":0},{"$f":"SUM(T11:T13)","v":0},{"$f":"SUM(U11:U13)","v":0},{"$f":"U14-T14","v":0},{"$f":"SUM(W11:W13)","v":0},{"$f":"SUM(X11:X13)","v":0},{"$f":"X14-W14","v":0},{"$f":"SUM(Z11:Z13)","v":0},{"$f":"SUM(AA11:AA13)","v":0},{"$f":"AA14-Z14","v":0},{"$f":"SUM(AC11:AC13)","v":0},{"$f":"SUM(AD11:AD13)","v":0},{"$f":"AD14-AC14","v":0},{"$f":"SUM(AF11:AF13)","v":0},{"$f":"SUM(AG11:AG13)","v":0},{"$f":"AG14-AF14","v":0},{"$f":"SUM(AI11:AI13)","v":0},{"$f":"SUM(AJ11:AJ13)","v":0},{"$f":"AJ14-AI14","v":0},{"$f":"SUM(AL11:AL13)","v":0},{"$f":"SUM(AM11:AM13)","v":0},{"$f":"AM14-AL14","v":0},{"$f":"SUM(AO11:AO13)","v":0},{"$f":"SUM(AP11:AP13)","v":0},{"$f":"AP14-AO14","v":0},{"$f":"SUM(AR11:AR13)","v":0},{"$f":"SUM(AS11:AS13)","v":0},{"$f":"AS14-AR14","v":0}]
[]
["Net after Giving",{"$f":"B9-B14","v":810},{"$f":"C9-C14","v":1039.8700000000001},{"$f":"C16-B16","v":229.87000000000012},{"$f":"E9-E14","v":975},{"$f":"F9-F14","v":1050},{"$f":"F16-E16","v":75},{"$f":"H9-H14","v":0},{"$f":"I9-I14","v":0},{"$f":"I16-H16","v":0},{"$f":"K9-K14","v":0},{"$f":"L9-L14","v":0},{"$f":"L16-K16","v":0},{"$f":"N9-N14","v":0},{"$f":"O9-O14","v":0},{"$f":"O16-N16","v":0},{"$f":"Q9-Q14","v":0},{"$f":"R9-R14","v":0},{"$f":"R16-Q16","v":0},{"$f":"T9-T14","v":0},{"$f":"U9-U14","v":0},{"$f":"U16-T16","v":0},{"$f":"W9-W14","v":0},{"$f":"X9-X14","v":0},{"$f":"X16-W16","v":0},{"$f":"Z9-Z14","v":0},{"$f":"AA9-AA14","v":0},{"$f":"AA16-Z16","v":0},{"$f":"AC9-AC14","v":0},{"$f":"AD9-AD14","v":0},{"$f":"AD16-AC16","v":0},{"$f":"AF9-AF14","v":0},{"$f":"AG9-AG14","v":0},{"$f":"AG16-AF16","v":0},{"$f":"AI9-AI14","v":0},{"$f":"AJ9-AJ14","v":0},{"$f":"AJ16-AI16","v":0},{"$f":"AL9-AL14","v":0},{"$f":"AM9-AM14","v":0},{"$f":"AM16-AL16","v":0},{"$f":"AO9-AO14","v":0},{"$f":"AP9-AP14","v":0},{"$f":"AP16-AO16","v":0},{"$f":"AR9-AR14","v":0},{"$f":"AS9-AS14","v":0},{"$f":"AS16-AR16","v":0}]
[]
["EXPENSES"]
["Clothing/Hair",15,{"$f":"SUMIFS('Expenses List'!C:C,'Expenses List'!B:B,\"Clothing/Hair\",'Expenses List'!D:D,\"October\",'Expenses List'!E:E,\"2012\")","v":15},{"$f":"B19-C19","v":0},null,{"$f":"SUMIFS('Expenses List'!C:C,'Expenses List'!B:B,\"Clothing/Hair\",'Expenses List'!D:D,\"November\",'Expenses List'!E:E,\"2012\")","v":0},{"$f":"E19-F19","v":0},null,{"$f":"SUMIFS('Expenses List'!C:C,'Expenses List'!B:B,\"Clothing/Hair\",'Expenses List'!D:D,\"December\",'Expenses List'!E:E,\"2012\")","v":0},{"$f":"H19-I19","v":0},null,{"$f":"SUMIFS('Expenses List'!C:C,'Expenses List'!B:B,\"Clothing/Hair\",'Expenses List'!D:D,\"January\",'Expenses List'!E:E,\"2013\")","v":0},{"$f":"K19-L19","v":0},null,{"$f":"SUMIFS('Expenses List'!C:C,'Expenses List'!B:B,\"Clothing/Hair\",'Expenses List'!D:D,\"February\",'Expenses List'!E:E,\"2013\")","v":0},{"$f":"N19-O19","v":0},null,{"$f":"SUMIFS('Expenses List'!C:C,'Expenses List'!B:B,\"Clothing/Hair\",'Expenses List'!D:D,\"March\",'Expenses List'!E:E,\"2013\")","v":0},{"$f":"Q19-R19","v":0},null,{"$f":"SUMIFS('Expenses List'!C:C,'Expenses List'!B:B,\"Clothing/Hair\",'Expenses List'!D:D,\"April\",'Expenses List'!E:E,\"2013\")","v":0},{"$f":"T19-U19","v":0},null,{"$f":"SUMIFS('Expenses List'!C:C,'Expenses List'!B:B,\"Clothing/Hair\",'Expenses List'!D:D,\"May\",'Expenses List'!E:E,\"2013\")","v":0},{"$f":"W19-X19","v":0},null,{"$f":"SUMIFS('Expenses List'!C:C,'Expenses List'!B:B,\"Clothing/Hair\",'Expenses List'!D:D,\"June\",'Expenses List'!E:E,\"2013\")","v":0},{"$f":"Z19-AA19","v":0},null,{"$f":"SUMIFS('Expenses List'!C:C,'Expenses List'!B:B,\"Clothing/Hair\",'Expenses List'!D:D,\"July\",'Expenses List'!E:E,\"2013\")","v":0},{"$f":"AC19-AD19","v":0},null,{"$f":"SUMIFS('Expenses List'!C:C,'Expenses List'!B:B,\"Clothing/Hair\",'Expenses List'!D:D,\"August\",'Expenses List'!E:E,\"2013\")","v":0},{"$f":"AF19-AG19","v":0},null,{"$f":"SUMIFS('Expenses List'!C:C,'Expenses List'!B:B,\"Clothing/Hair\",'Expenses List'!D:D,\"September\",'Expenses List'!E:E,\"2013\")","v":0},{"$f":"AI19-AJ19","v":0},null,{"$f":"SUMIFS('Expenses List'!C:C,'Expenses List'!B:B,\"Clothing/Hair\",'Expenses List'!D:D,\"October\",'Expenses List'!E:E,\"2013\")","v":0},{"$f":"AL19-AM19","v":0},null,{"$f":"SUMIFS('Expenses List'!C:C,'Expenses List'!B:B,\"Clothing/Hair\",'Expenses List'!D:D,\"November\",'Expenses List'!E:E,\"2013\")","v":0},{"$f":"AO19-AP19","v":0},null,{"$f":"SUMIFS('Expenses List'!C:C,'Expenses List'!B:B,\"Clothing/Hair\",'Expenses List'!D:D,\"December\",'Expenses List'!E:E,\"2013\")","v":0},{"$f":"AR19-AS19","v":0}]
["Eating Out",20,{"$f":"SUMIFS('Expenses List'!C:C,'Expenses List'!B:B,\"Eating Out\",'Expenses List'!D:D,\"October\",'Expenses List'!E:E,\"2012\")","v":18.350000000000001},{"$f":"B20-C20","v":1.6499999999999986},20,{"$f":"SUMIFS('Expenses List'!C:C,'Expenses List'!B:B,\"Eating Out\",'Expenses List'!D:D,\"November\",'Expenses List'!E:E,\"2012\")","v":15.76},{"$f":"E20-F20","v":4.24},null,{"$f":"SUMIFS('Expenses List'!C:C,'Expenses List'!B:B,\"Eating Out\",'Expenses List'!D:D,\"December\",'Expenses List'!E:E,\"2012\")","v":0},{"$f":"H20-I20","v":0},null,{"$f":"SUMIFS('Expenses List'!C:C,'Expenses List'!B:B,\"Eating Out\",'Expenses List'!D:D,\"January\",'Expenses List'!E:E,\"2013\")","v":0},{"$f":"K20-L20","v":0},null,{"$f":"SUMIFS('Expenses List'!C:C,'Expenses List'!B:B,\"Eating Out\",'Expenses List'!D:D,\"February\",'Expenses List'!E:E,\"2013\")","v":0},{"$f":"N20-O20","v":0},null,{"$f":"SUMIFS('Expenses List'!C:C,'Expenses List'!B:B,\"Eating Out\",'Expenses List'!D:D,\"March\",'Expenses List'!E:E,\"2013\")","v":0},{"$f":"Q20-R20","v":0},null,{"$f":"SUMIFS('Expenses List'!C:C,'Expenses List'!B:B,\"Eating Out\",'Expenses List'!D:D,\"April\",'Expenses List'!E:E,\"2013\")","v":0},{"$f":"T20-U20","v":0},null,{"$f":"SUMIFS('Expenses List'!C:C,'Expenses List'!B:B,\"Eating Out\",'Expenses List'!D:D,\"May\",'Expenses List'!E:E,\"2013\")","v":0},{"$f":"W20-X20","v":0},null,{"$f":"SUMIFS('Expenses List'!C:C,'Expenses List'!B:B,\"Eating Out\",'Expenses List'!D:D,\"June\",'Expenses List'!E:E,\"2013\")","v":0},{"$f":"Z20-AA20","v":0},null,{"$f":"SUMIFS('Expenses List'!C:C,'Expenses List'!B:B,\"Eating Out\",'Expenses List'!D:D,\"July\",'Expenses List'!E:E,\"2013\")","v":0},{"$f":"AC20-AD20","v":0},null,{"$f":"SUMIFS('Expenses List'!C:C,'Expenses List'!B:B,\"Eating Out\",'Expenses List'!D:D,\"August\",'Expenses List'!E:E,\"2013\")","v":0},{"$f":"AF20-AG20","v":0},null,{"$f":"SUMIFS('Expenses List'!C:C,'Expenses List'!B:B,\"Eating Out\",'Expenses List'!D:D,\"September\",'Expenses List'!E:E,\"2013\")","v":0},{"$f":"AI20-AJ20","v":0},null,{"$f":"SUMIFS('Expenses List'!C:C,'Expenses List'!B:B,\"Eating Out\",'Expenses List'!D:D,\"October\",'Expenses List'!E:E,\"2013\")","v":0},{"$f":"AL20-AM20","v":0},null,{"$f":"SUMIFS('Expenses List'!C:C,'Expenses List'!B:B,\"Eating Out\",'Expenses List'!D:D,\"November\",'Expenses List'!E:E,\"2013\")","v":0},{"$f":"AO20-AP20","v":0},null,{"$f":"SUMIFS('Expenses List'!C:C,'Expenses List'!B:B,\"Eating Out\",'Expenses List'!D:D,\"December\",'Expenses List'!E:E,\"2013\")","v":0},{"$f":"AR20-AS20","v":0}]
{"$rows_left_out":16}
{"sheet":"Variance Analysis","index":4,"n_rows":3,"n_cols":7,"rows_kept":3,"cut":false,"hidden":false,"merged":[[2,6,2,13]]}
[]
[]
[null,null,null,null,null,null,"November Variance Analysis"]