{"text_format":"1","workbook":"xlsx","n_sheets":4,"sheets":["transactions","List","Lookup Lists","Summary"],"not_rendered":{"charts":1,"images":0,"macros":1,"external_links":0,"defined_names":8,"comments":1,"pivot_tables":0},"unopened":[],"bounds":{"document_bytes":16777216,"sheet_cells":100000,"rows_first":2000,"rows_last":500,"rows_between":2000,"halvings":0,"cell_chars":16384,"cell_head_chars":4096},"cells_cut":0,"cells_raw":0,"read":"whole","date_system":"1900"}

{"sheet":"transactions","index":0,"n_rows":2056,"n_cols":9,"rows_kept":2056,"cut":false,"hidden":true,"merged":[]}
["Date","Description","Original Description","Amount","Transaction Type","Category","Account Name","Labels","Notes"]
["2011-04-15","PayPal","Electronic Withdrawal from PAYPA",25,"debit","Shopping","ING Checking"]
["2011-04-15","Citi","Electronic Withdrawal from CITI",73,"debit","Uncategorized","ING Checking"]
["2011-04-15","PayPal","Electronic Withdrawal from PAYPA",60,"debit","Shopping","ING Checking"]
["2011-04-15","External Electronic Withdrawal","External Electronic Withdrawal f",113.16,"debit","Bank Fee","ING Holding"]
["2011-04-15","Children's Place","Withdrawal #110507014385THE CHILDRENS PLACE #0941 575 EAST UNIVERSITY PKY OREM UT %% Card 08 #4748",18.11,"debit","Clothing","MACU Checking"]
["2011-04-14","Marketplace","Debit Card Purchase - MARKETPLAC",3.86,"debit","Fast Food","ING Checking"]
["2011-04-14","PayPal","Electronic Withdrawal from PAYPA",32,"debit","Shopping","ING Checking"]
["2011-04-14","Byu Creame","Debit Card Purchase - BYU CREAME",6.43,"debit","Fast Food","ING Checking"]
["2011-04-14","Subway","Debit Card Purchase - SUBWAY 030",1.82,"debit","Fast Food","ING Checking"]
["2011-04-14","Byu Creame","Debit Card Purchase - BYU CREAME",12.34,"debit","Fast Food","ING Checking"]
["2011-04-14","Chevron","WithdrawalCHEVRON 00072863 OREM UT Date 04/13/11 24046031103000178964034 5542",62.71,"debit","Gas & Fuel","MACU Checking"]
["2011-04-13","Chevron","Debit Card Purchase - CHEVRON/WI",3.28,"debit","Gas & Fuel","ING Checking"]
["2011-04-13","Target","Withdrawal #012425TARGET T1754 OREM STAT 175 West Center Street Orem UT %% Card 08 #4748",42.33,"debit","Miscellaneous","MACU Checking"]
["2011-04-12","Daisy Mart","Debit Card Purchase - DAISY MAY",22.59,"debit","Groceries","ING Checking"]
["2011-04-12","Byu Creame","Debit Card Purchase - BYU CREAME",2.9,"debit","Fast Food","ING Checking"]
["2011-04-12","Nyc Taxi Q","Debit Card Purchase - NYC TAXI Q",8.1999999999999993,"debit","Rental Car & Taxi","ING Checking"]
["2011-04-11","Rite Aid","RITE AID 6148 RITE AID",98.59,"credit","Pharmacy","B of A CC"]
["2011-04-11","Timpview Pharmacy","TIMPVIEW PHARMACY 3000",53.95,"credit","Pharmacy","B of A CC"]
["2011-04-11","Transfer to B of A CC","Electronic Withdrawal from BK OF",100,"debit","Credit Card Payment","ING Checking"]
["2011-04-11","Max Brenne","Debit Card Purchase - MAX BRENNE",14.04,"debit","Uncategorized","ING Checking"]
["2011-04-11","Byu O","Electronic Withdrawal from BYU O",5.3,"debit","Uncategorized","ING Checking"]
["2011-04-11","Nyc Taxi Q","Debit Card Purchase - NYC TAXI Q",7.4,"debit","Rental Car & Taxi","ING Checking"]
["2011-04-11","Nyc Taxi M","Debit Card Purchase - NYC TAXI M",14.16,"debit","Rental Car & Taxi","ING Checking"]
["2011-04-11","Byu T","Electronic Withdrawal from BYU T",10,"debit","Uncategorized","ING Checking"]
["2011-04-11","Grove","Debit Card Purchase - THE GROVE",11.29,"debit","Uncategorized","ING Checking"]
["2011-04-11","Orpheum","Debit Card Purchase - ORPHEUM 07",12.5,"debit","Uncategorized","ING Checking"]
["2011-04-11","Byu H","Electronic Withdrawal from BYU H",194,"debit","Uncategorized","ING Checking"]
["2011-04-11","Byu H","Electronic Withdrawal from BYU H",30,"debit","Uncategorized","ING Checking"]
["2011-04-11","Withdrawal Adjustmentonline Tax","Withdrawal AdjustmentONLINE TAX PRODUCT KANSAS CITY MO Date 04/10/11 74108381100083001747554 8931",79.900000000000006,"credit","Income","MACU Checking"]
["2011-04-11","Circle K","WithdrawalARCTIC CIRCLE 515 OREM OREM UT Date 04/09/11 24071051100987111476499 5814",12.63,"debit","Gas & Fuel","MACU Checking"]
["2011-04-11","H&R Block","WithdrawalONLINE TAX PRODUCT HRBLOCK.COM MO Date 04/10/11 24108381100083731323721 8931",114.85,"debit","Taxes","MACU Checking"]
["2011-04-11","Blockbuster","WithdrawalBLOCKBUSTER INC#49096 801-373-9688 UT Date 04/10/11 24692161100000331994485 7841",7.46,"debit","Movies & DVDs","MACU Checking"]
["2011-04-10","MTA","Debit Card Purchase - MTA VENDIN",10,"debit","Public Transportation","ING Checking"]
["2011-04-10","Costco","Debit Card Purchase - COSTCO COM",170.79,"debit","Miscellaneous","ING Checking"]
["2011-04-10","Shake Shack","Debit Card Purchase - SHAKE SHAC",6.53,"debit","Restaurants","ING Checking"]
["2011-04-09","Jo-Ann Stores","Withdrawal #109987953813JOANN STORES, INC. 1666 S STATE ST OREM UT %% Card 08 #4748",5.32,"debit","Miscellaneous","MACU Checking"]
["2011-04-08","Transfer from ING Checking","BA ELECTRONIC PAYMENT",100,"credit","Credit Card Payment","B of A CC"]
["2011-04-08","Brigham Yo","Debit Card Purchase - BRIGHAM YO",10,"debit","Uncategorized","ING Checking"]
["2011-04-08","Brigham Yo","Debit Card Purchase - BRIGHAM YO",30,"debit","Uncategorized","ING Checking"]
["2011-04-08","MTA","Debit Card Purchase - MTA VENDIN",10,"debit","Public Transportation","ING Checking"]
["2011-04-08","ATM Fee","ATM Withdrawal - *MIDTOWN NORTH",2,"debit","ATM Fee","ING Checking"]
["2011-04-08","ATM Withdrawal","ATM Withdrawal - *MIDTOWN NORTH",40,"debit","Cash & ATM","ING Checking"]
["2011-04-08","Interest Charge","PURCHASE INTEREST CHARGE",42.96,"debit","Finance Charge","Chase CC"]
["2011-04-08","Cash","CASH ADVANCE INTEREST CHA",0.1,"debit","Business Services","Chase CC"]
["2011-04-08","Rite Aid","Withdrawal #109876823369RITE AID CORP. RIVERSIDE PLAZA PROVO UT %% Card 08 #4748",7.46,"debit","Pharmacy","MACU Checking"]
["2011-04-08","Metrocard","Debit Card Purchase - METROCARD",10,"debit","Uncategorized","ING Checking"]
["2011-04-08","Electronic Deposit Brigham","Electronic Deposit from BRIGHAM",14.5,"credit","Income","ING Checking"]
["2011-04-08","Super Sonic Car Wash","WithdrawalSUPERSONIC CAR WASH - PROVO UT Date 04/06/11 24071051097158142668273 7542",10.55,"debit","Service & Parts","MACU Checking"]
["2011-04-07","Microsoft XBox Live","MICROSOFT   *XBOX LIVE 080038655",9.99,"debit","Electronics & Software","Citi CC"]
["2011-04-07","Withdrawal","Withdrawal #000000000003",57.68,"debit","Uncategorized","MACU Checking"]
["2011-04-07","Carl's Jr","WithdrawalCARL'S JR #1101363 QPS PROVO UT Date 04/05/11 24492151096207499500868 5814",9.68,"debit","Fast Food","MACU Checking"]
["2011-04-07","Commentken Garff Honda","Transaction COMMENTKEN GARFF HONDA O 115 E UNIVERSITY P OREM UT %% Card 08 #4748",0,"credit","Income","MACU Checking"]
["2011-04-06","Salt Lake","Debit Card Purchase - SALT LAKE",35,"debit","Uncategorized","ING Checking"]
["2011-04-06","Farmers Market","Withdrawal #471669SUNFLOWER FARMERS MARKET 1375 S. STATE ST. OREM UT %% Card 08 #4748",12.81,"debit","Groceries","MACU Checking"]
["2011-04-06","Chase","Electronic Withdrawal from CHASE",73,"debit","Uncategorized","ING Checking"]
["2011-04-05","Hertz","Debit Card Purchase - HERTZ RENT",67.5,"debit","Rental Car & Taxi","ING Checking"]
["2011-04-05","La Roadhou","Debit Card Purchase - LA ROADHOU",35.590000000000003,"debit","Uncategorized","ING Checking"]
["2011-04-05","United","Debit Card Purchase - UNITED CHI",2.5,"debit","Air Travel","ING Checking"]
["2011-04-05","Chevron","Debit Card Purchase - CHEVRON 03",38.590000000000003,"debit","Gas & Fuel","ING Checking"]
["2011-04-05","Target","Withdrawal Adjustment #024114TARGET T1754 OREM STAT 175 West Center Street Orem UT %% Card 08 #4748",8.5299999999999994,"credit","Miscellaneous","MACU Checking"]
["2011-04-05","Rite Aid","Withdrawal #109591359705RITE AID CORP. RIVERSIDE PLAZA PROVO UT %% Card 08 #4748",6.07,"debit","Pharmacy","MACU Checking"]
["2011-04-05","Transfer from ING Checking","AUTOMATIC PAYMENT - THANK",73,"credit","Credit Card Payment","Chase CC"]
["2011-04-05","Baja Fresh","WithdrawalBAJA FRESH #130 LA CRENSTENTA CA Date 04/03/11 24425131094578002010819 5814",10.62,"debit","Fast Food","MACU Checking"]
["2011-04-05","Kid To Kid","KID TO KID",17.149999999999999,"debit","Shopping","Chase CC"]
["2011-04-04","iTunes","APL*ITUNES             866-712-7",6.37,"debit","Music","Citi CC"]
["2011-04-04","Costco","Withdrawal #489299COSTCO WHSE #0484 648 EAST 800 SOUTH OREM UT %% Card 08 #3404",7.45,"debit","Miscellaneous","MACU Checking"]
["2011-04-04","Costco","Withdrawal #188106COSTCO WHSE #0484 648 EAST 800 SOUTH OREM UT %% Card 08 #3404",56.61,"debit","Miscellaneous","MACU Checking"]
["2011-04-04","Withdrawalbyu Cougar Creations","WithdrawalBYU COUGAR CREATIONS PROVO UT Date 04/01/11 24323011092575604010998 8220",1.49,"debit","Uncategorized","MACU Checking"]
["2011-04-04","Carl's Jr","WithdrawalCARLJR1100503 11005030 BAKERSFIELD CA Date 04/01/11 24164071093589362372230 5814",7.23,"debit","Fast Food","MACU Checking"]
["2011-04-04","Transfer from ING Checking","Deposit SWENSEN,AMBER MTYPE: ING DIRECT CO: SWENSEN,AMBER M",730,"credit","Transfer","MACU Checking"]
["2011-04-04","Withdrawal Sunflr Sunflr","Withdrawal #432732SUNFLR, INC. SUNFLR, INC23440 VALENC VALENCIA CA %% Card 08 #3404",1.69,"debit","Uncategorized","MACU Checking"]
["2011-04-03","IHOP","IHOP 763               BAKERSFIE",11,"debit","Restaurants","Citi CC"]
["2011-04-03","Arby's","ARBY'S             Q99",25.25,"debit","Fast Food","Chase CC"]
["2011-04-02","Person Person Laura","Person2Person Payment to Laura o",1075,"debit","Mortgage & Rent","ING Checking"]
["2011-04-02","Interest Charged Cash","Interest Charged on Cash Advances",0,"credit","Interest Income","B of A CC"]
["2011-04-02","Interest Charged Purchases","Interest Charged on Purchases",22.91,"debit","Finance Charge","B of A CC"]
["2011-04-02","Interest Charged Balance","Interest Charged on Balance Transfers",0,"credit","Interest Income","B of A CC"]
["2011-04-01","Black Angus","BLACK ANGUS BAKERSFIEL BAKERSFIE",32.39,"debit","Restaurants","Citi CC"]
["2011-04-01","Transfer from ING Holding","Internet Deposit transferred fro",2979,"credit","Transfer","ING Checking"]
["2011-04-01","Transfer to MACU Checking","Internet Withdrawal MOUNTAIN AME",730,"debit","Transfer","ING Checking"]
["2011-04-01","Transfer to ING Checking","Internet Withdrawal transferred",2979,"debit","Transfer","ING Holding"]
["2011-04-01","Costco","Withdrawal #180528COSTCO WHSE #0688 3800 ROSEDALE HIGHWAY BAKERSFIELD CA %% Card 08 #3404",5.9,"debit","Miscellaneous","MACU Checking"]
["2011-04-01","Subway","WithdrawalSUBWAY 00407841 BAKERFIELD CA Date 03/30/11 24164071090255908921335 5814",3.24,"debit","Fast Food","MACU Checking"]
["2011-04-01","Target","Withdrawal #009566TARGET T1754 OREM STAT 175 West Center Street Orem UT %% Card 08 #4748",12.45,"debit","Miscellaneous","MACU Checking"]
["2011-04-01","Carl's Jr","WithdrawalCARLJR1100503 11005030 BAKERSFIELD CA Date 03/30/11 24164071090589360451229 5814",3.12,"debit","Fast Food","MACU Checking"]
["2011-04-01","Baja Fresh","WithdrawalT7 BAJA FRESH 30052906 LOS ANGELES CA Date 03/30/11 24164071090531404290361 5814",10.73,"debit","Fast Food","MACU Checking"]
["2011-04-01","BYU Bookstore","WithdrawalBYU BOOKSTORE PROVO UT Date 03/30/11 24337891090147015816826 8220",10.62,"debit","Books","MACU Checking"]
["2011-04-01","Carl's Jr","WithdrawalCARLJR1100503 11005030 BAKERSFIELD CA Date 03/30/11 24164071090589360451260 5814",1.61,"debit","Fast Food","MACU Checking"]
["2011-04-01","Air Terminal Gifts","WithdrawalAIR TERMINAL GIFTS SALT LAKE CIT UT Date 03/30/11 24445001090100131790636 5999",2.0499999999999998,"debit","Gift","MACU Checking"]
["2011-03-31","Monthly Interest Paid","Monthly Interest Paid",0.03,"credit","Interest Income","ING Checking"]
["2011-03-31","Periodic Finance Charge","Finance Charge Paid for Overdraf",0.03,"debit","Finance Charge","ING Checking"]
["2011-03-31","Monthly Interest Paid","Monthly Interest Paid",4.59,"credit","Interest Income","ING Holding"]
["2011-03-31","Commentavg Checking Bal","Transaction COMMENTAvg Checking Bal for Mar $345.50",0,"credit","Income","MACU Checking"]
["2011-03-31","Chevron","WithdrawalCHEVRON 00073049 PROVO UT Date 03/30/11 24046031089000108884516 5542",35.07,"debit","Gas & Fuel","MACU Checking"]
["2011-03-30","Trip Charges","TRIP CHARGES           208-429-2",163.26,"debit","Uncategorized","Citi CC"]
["2011-03-30","BYU Bookstore","Debit Card Purchase - BYU BOOKST",34.950000000000003,"debit","Books","ING Checking"]
["2011-03-30","Byu Wsc L","Debit Card Purchase - BYU WSC L",5.91,"debit","Uncategorized","ING Checking"]
["2011-03-30","Electric Orange Adjustment","Electric Orange Card Adjustment",21.95,"credit","Income","ING Checking"]
["2011-03-30","Wal-Mart","Withdrawal #109078556473Wal-Mart Super Center 1768 WAL-SAMS OREM UT %% Card 08 #4748",38.869999999999997,"debit","Shopping","MACU Checking"]
["2011-03-30","Chevron","WithdrawalCHEVRON 00208662 PROVO UT Date 03/29/11 24046031088000177391204 5542",71.41,"debit","Gas & Fuel","MACU Checking"]
["2011-03-29","United","UNITED  0162122792730  CHICAGO",5,"debit","Uncategorized","Citi CC"]
["2011-03-29","Smdavis","PAYPAL *SMDAVIS        402935773",84.66,"debit","Uncategorized","Citi CC"]
["2011-03-29","Electric Orange Adjustment","Electric Orange Card Adjustment",44.62,"credit","Income","ING Checking"]
["2011-03-29","External Electronic Withdrawal","External Electronic Withdrawal f",89.49,"debit","Bank Fee","ING Holding"]
["2011-03-29","Deposit By","Deposit by Check",167.11,"credit","Income","MACU Checking"]
["2011-03-29","Withdrawal Smiths N","Withdrawal #002519SMITHS 350 N. FREEDOM PROVO UT %% Card 08 #3404",9.0500000000000007,"debit","Uncategorized","MACU Checking"]
["2011-03-28","El Salvado","Debit Card Purchase - EL SALVADO",12.3,"debit","Uncategorized","ING Checking"]
["2011-03-28","Verizon","Debit Card Purchase - VERIZON WR",166.25,"debit","Home Phone","ING Checking"]
["2011-03-28","Blockbuster","WithdrawalBLOCKBUSTER INC#49096 PROVO UT Date 03/26/11 24692161086000590912390 7841",3.19,"debit","Movies & DVDs","MACU Checking"]
["2011-03-28","Children's Place","Withdrawal AdjustmentTHE CHILDRENS PLACE #0941 OREM UT Date 03/25/11 74610431085004039107721 5641",21.77,"credit","Clothing","MACU Checking"]
["2011-03-28","Withdrawal Adjustmentjcpenney Provo","Withdrawal AdjustmentJCPENNEY STORE 2770 PROVO UT Date 03/26/11 74299161086906926673351 5311",10.54,"credit","Income","MACU Checking"]
["2011-03-27","Gold's Gym","GYM*GOLDS GYM",54.4,"debit","Gym","Chase CC"]
["2011-03-25","Southwest","SOUTHWES5262163670296  080043597",157.4,"debit","Air Travel","Citi CC"]
["2011-03-25","Electronic Deposit Brigham","Electronic Deposit from BRIGHAM",50.75,"credit","Income","ING Checking"]
["2011-03-25","Transfer to Citi CC","Electronic Withdrawal from CITI",500,"debit","Credit Card Payment","ING Checking"]
["2011-03-25","Withdrawalbyu Pmpc Wsc","WithdrawalBYU PMPC WSC MAIL PROVO UT Date 03/23/11 24323011083572471011184 8220",5.6,"debit","Uncategorized","MACU Checking"]
["2011-03-24","Transfer from ING Checking","CLICK-TO-PAY PAYMENT, THANK YOU",500,"credit","Credit Card Payment","Citi CC"]
["2011-03-24","Withdrawal Maceys Provo","Withdrawal #345130MACEYS PROVO 1400 N STATE PROVO UT %% Card 08 #4748",6.78,"debit","Uncategorized","MACU Checking"]
["2011-03-24","Withdrawal","Withdrawal",10,"debit","Uncategorized","MACU Checking"]
["2011-03-23","ATM Withdrawal","ATM Withdrawal - CARDTRONICS CCS",140,"debit","Cash & ATM","ING Checking"]
["2011-03-23","Transfer from ING Holding","Internet Deposit transferred fro",140,"credit","Transfer","ING Checking"]
["2011-03-23","Transfer from ING Holding","Internet Deposit transferred fro",600,"credit","Transfer","ING Checking"]
["2011-03-23","ATM Withdrawal","ATM Withdrawal - CARDTRONICS CCS",20,"debit","Cash & ATM","ING Checking"]
["2011-03-23","Transfer to ING Checking","Internet Withdrawal transferred",600,"debit","Transfer","ING Holding"]
["2011-03-23","External Electronic Withdrawal","External Electronic Withdrawal f",48.28,"debit","Bank Fee","ING Holding"]
["2011-03-23","Transfer to ING Checking","Internet Withdrawal transferred",140,"debit","Transfer","ING Holding"]
["2011-03-23","Children's Place","WithdrawalTHECHILDRENSPLACE.COM THECHILDRENSP NJ Date 03/22/11 24341291081083722495042 5641",99.67,"debit","Clothing","MACU Checking"]
["2011-03-23","Deposit","Deposit",160,"credit","Income","MACU Checking"]
["2011-03-22","Priceline - Hotel","PLN*PRICELINE.COM HTL  800-657-9",69.61,"debit","Hotel","Citi CC"]
["2011-03-22","Bombay Hou","Debit Card Purchase - BOMBAY HOU",45.02,"debit","Furnishings","ING Checking"]
["2011-03-22","Pln Pricel","Debit Card Purchase - PLN PRICEL",69.62,"debit","Uncategorized","ING Checking"]
["2011-03-21","iTunes","APL*ITUNES             866-712-7",7.47,"debit","Music","Citi CC"]
["2011-03-21","External Electronic Withdrawal","External Electronic Withdrawal f",50,"debit","Bank Fee","ING Holding"]
["2011-03-21","Withdrawalfive Guys Ut","WithdrawalFIVE GUYS--UT # 04 OREM UT Date 03/18/11 24224431078104015097532 5814",17.75,"debit","Bank Fee","MACU Checking"]
["2011-03-21","Hibachi San","WithdrawalHIBACHI SAN 33 OREM UT Date 03/19/11 24224431079103019452916 5812",6.42,"debit","Restaurants","MACU Checking"]
["2011-03-21","Nordstrom","Withdrawal Adjustment #003756NORDSTROM 038 693 UNIVERSITY PKWY OREM UT %% Card 08 #4748",51.29,"credit","Clothing","MACU Checking"]
["2011-03-21","Withdrawalthe Sweet Tooth","WithdrawalTHE SWEET TOOTH FAIRY PROVO UT Date 03/18/11 24071051077158160459351 5814",7.6,"debit","Cash & ATM","MACU Checking"]
["2011-03-21","Transfer from MACU Savings 1","Deposit Transfer From Share 01",0.15,"credit","Transfer","MACU Checking"]
["2011-03-21","Pretzelmaker","WithdrawalPRETZELMAKER OREM UT Date 03/19/11 24323011079572143010545 5814",6.02,"debit","Fast Food","MACU Checking"]
["2011-03-21","Sally Beauty Supply","WithdrawalSALLY BEAUTY #1535 PROVO UT Date 03/17/11 24445001077200052259236 5977",30.94,"debit","Personal Care","MACU Checking"]
["2011-03-21","Chevron","WithdrawalCHEVRON 00208862 PROVO UT Date 03/18/11 24046031077000204490865 5542",64.099999999999994,"debit","Gas & Fuel","MACU Checking"]
["2011-03-21","Cinemark","WithdrawalCINEMARK 1041 Q34 OREM UT Date 03/18/11 24761971078251825013672 7832",12.5,"debit","Movies & DVDs","MACU Checking"]
["2011-03-21","Sally Beauty Supply","WithdrawalSALLY BEAUTY #1535 PROVO UT Date 03/17/11 24445001077200052259319 5977",8.5299999999999994,"debit","Personal Care","MACU Checking"]
["2011-03-21","Iceberg Drive Inn","WithdrawalICEBERG DRIVE INN OREM UT Date 03/19/11 24394681079980000107623 5814",4.96,"debit","Restaurants","MACU Checking"]
["2011-03-21","Withdrawalbyu Creamery Ninth","WithdrawalBYU CREAMERY ON NINTH PROVO UT Date 03/18/11 24323011078575433014607 5499",13.87,"debit","Uncategorized","MACU Checking"]
["2011-03-21","Transfer to MACU Checking","Withdrawal Transfer To Share 50",0.15,"debit","Transfer","MACU Savings 1"]
["2011-03-19","Nordstrom","Withdrawal #005568NORDSTROM 038 693 UNIVERSITY PKWY OREM UT %% Card 08 #4748",82.81,"debit","Clothing","MACU Checking"]
["2011-03-19","Sports Authority","Withdrawal #013660SPORTS AUTHORI 643 E UNIVERSITY PKWY OREM UT %% Card 08 #3404",2.12,"debit","Sporting Goods","MACU Checking"]
["2011-03-19","Sports Aut","Debit Card Purchase - SPORTS AUT",17.05,"debit","Uncategorized","ING Checking"]
["2011-03-18","Transfer to MACU Savings 1","External Electronic Withdrawal f",265,"debit","Transfer","ING Holding"]
["2011-03-18","Wendy's","WithdrawalWENDYS #4710 Q25 PROVO UT Date 03/16/11 24445001076100132184241 5814",14.4,"debit","Fast Food","MACU Checking"]
["2011-03-18","Bajio Mexican Grill","WithdrawalBAJIO MEXICAN GRILL 00001 PROVO UT Date 03/16/11 24717051076640761671600 5814",10.42,"debit","Fast Food","MACU Checking"]
["2011-03-18","Withdrawal ATM Mountain","Withdrawal at ATM #000000008599MOUNTAIN AMERICA CU 88 N 500 W #2 PROVO UT COO332 %% Card 08 #4748",80,"debit","Cash & ATM","MACU Checking"]
["2011-03-18","Chevron","WithdrawalCHEVRON 00073049 PROVO UT Date 03/17/11 24046031077000026900851 5542",20.21,"debit","Gas & Fuel","MACU Checking"]
["2011-03-18","USPS","Withdrawal #107720001234USPS 4966310149 877 E 1200 S OREM UT %% Card 08 #3404",4.49,"debit","Shipping","MACU Checking"]
["2011-03-18","Transfer from ING Holding","Deposit ACH ORIGINATION",265,"credit","Transfer","MACU Savings 1"]
["2011-03-18","Withdrawal Transfer Loan","Withdrawal Transfer To Loan 61",265,"debit","Transfer","MACU Savings 1"]
["2011-03-17","Interest Charged Pur","INTEREST CHARGED TO PUR PR-03/10",11.93,"debit","Finance Charge","Citi CC"]
["2011-03-17","Interest Charged Standard","INTEREST CHARGED TO STANDARD PUR",0.01,"debit","Finance Charge","Citi CC"]
["2011-03-17","Auth User Member","AUTH USER MEMBER FEE",50,"debit","Fees & Charges","Citi CC"]
["2011-03-17","Membership Fee Mar","MEMBERSHIP FEE MAR 11-FEB 12",75,"debit","Fees & Charges","Citi CC"]
["2011-03-17","JCPenney","Withdrawal #107662009776JCPENNEY STORE 2770 1200 TOWNE CENTRE BLVD PROVO UT %% Card 08 #4748",25.6,"debit","Clothing","MACU Checking"]
["2011-03-17","External Electronic Withdrawal","External Electronic Withdrawal f",117.65,"debit","Bank Fee","ING Holding"]
["2011-03-17","Children's Place","WithdrawalTHECHILDRENSPLACE.COM THECHILDRENSP NJ Date 03/16/11 24341291075083732037519 5641",45.23,"debit","Clothing","MACU Checking"]
["2011-03-16","External Electronic Withdrawal","External Electronic Withdrawal f",113.16,"debit","Bank Fee","ING Holding"]
["2011-03-16","Withdrawalbyu Creamery Fountain","WithdrawalBYU CREAMERY FOUNTAIN PROVO UT Date 03/14/11 24323011074575407010965 5814",5.25,"debit","Uncategorized","MACU Checking"]
["2011-03-15","Electric Orange Adjustment","Electric Orange Card Adjustment",37.340000000000003,"credit","Income","ING Checking"]
["2011-03-15","Electric Orange Adjustment","Electric Orange Card Adjustment",37.340000000000003,"credit","Income","ING Checking"]
["2011-03-14","Check 332","Draft 000332",28,"debit","Check","MACU Checking"]
["2011-03-14","Withdrawalbyu Pmpc Wsc","WithdrawalBYU PMPC WSC MAIL PROVO UT Date 03/10/11 24323011070572462010927 8220",1.05,"debit","Uncategorized","MACU Checking"]
["2011-03-14","Wendy's","WithdrawalWENDYS #4710 Q25 PROVO UT Date 03/10/11 24445001070100126120231 5814",7.95,"debit","Fast Food","MACU Checking"]
["2011-03-14","Bajio Mexican Grill","WithdrawalBAJIO MEXICAN GRILL 00001 PROVO UT Date 03/11/11 24717051071640711833107 5814",12.89,"debit","Fast Food","MACU Checking"]
["2011-03-12","Costco","Withdrawal #441869COSTCO WHSE #0484 648 EAST 800 SOUTH OREM UT %% Card 08 #3404",29.68,"debit","Miscellaneous","MACU Checking"]
["2011-03-12","Transfer from ING Holding","Internet Deposit transferred fro",1100,"credit","Transfer","ING Checking"]
["2011-03-12","Person Person Laura","Person2Person Payment to Laura o",1075,"debit","Mortgage & Rent","ING Checking"]
["2011-03-12","Transfer to ING Checking","Internet Withdrawal transferred",1100,"debit","Transfer","ING Holding"]
["2011-03-11","Withdrawal Blickenstaff N","Withdrawal #111351232598BLICKENSTAFF'S 4801 N UNIVERSITY AVE # PROVO UT %% Card 08 #4748",6.93,"debit","Gift","MACU Checking"]
["2011-03-11","Walgreen","Withdrawal #427162WALGREEN COMPANY 1315 N STATE ST PROVO UT %% Card 08 #4748",43.47,"debit","Miscellaneous","MACU Checking",null,"compression socks, bubble bath, face moisturizer, tylenol, lip gloss"]
["2011-03-11","Electronic Deposit Brigham","Electronic Deposit from BRIGHAM",116,"credit","Income","ING Checking"]
["2011-03-11","Wendy's","WithdrawalWENDYS #4710 Q25 PROVO UT Date 03/09/11 24445001069100131071224 5814",6.23,"debit","Fast Food","MACU Checking"]
["2011-03-11","Withdrawalbyu Creamery Fountain","WithdrawalBYU CREAMERY FOUNTAIN PROVO UT Date 03/09/11 24323011069575403010909 5814",2.67,"debit","Fast Food","MACU Checking"]
["2011-03-10","Withdrawal Provo Di","Withdrawal #069001833638PROVO DI 1415 NORTH STATE ST PROVO UT %% Card 08 #4748",18,"debit","Clothing","MACU Checking"]
["2011-03-10","Kiddie Kandids","WithdrawalKIDDIE KANDIDS PORTRAITS PROVO UT Date 03/09/11 24231681069286000000084 7221",25.59,"debit","Miscellaneous","MACU Checking"]
["2011-03-09","Withdrawalbyu Creamery Fountain","WithdrawalBYU CREAMERY FOUNTAIN PROVO UT Date 03/07/11 24323011067575401010879 5814",5.75,"debit","Fast Food","MACU Checking"]
["2011-03-09","Withdrawalbroiler Express Date","WithdrawalBROILER EXPRESS PROVO UT Date 03/07/11 24071051067158125055908 5814",5.88,"debit","Restaurants","MACU Checking"]
["2011-03-09","Chevron","WithdrawalCHEVRON 00073049 PROVO UT Date 03/08/11 24046031067000206767692 5542",15.22,"debit","Gas & Fuel","MACU Checking"]
["2011-03-08","Cash","CASH ADVANCE INTEREST CHA",0.08,"debit","Business Services","Chase CC"]
["2011-03-08","Interest Charge","PURCHASE INTEREST CHARGE",38.369999999999997,"debit","Finance Charge","Chase CC"]
["2011-03-08","Tepanyaki Japanese Steakhouse","WithdrawalTEPANYAKI JAPANESE STEAKH LEHI UT Date 03/05/11 24019511066066283112503 5812",46.92,"debit","Restaurants","MACU Checking"]
["2011-03-08","Smith's Food","WithdrawalSMITHS FOOD #4136 PROVO UT Date 03/07/11 24445001066300094288947 5411",4.1500000000000004,"debit","Miscellaneous","MACU Checking",null,"napkins and something else"]
["2011-03-08","Redbox","WithdrawalREDBOX *DVD RENTAL 866-733-2693 IL Date 03/07/11 24692161066000847354754 7841",4.26,"debit","Movies & DVDs","MACU Checking"]
["2011-03-07","Microsoft XBox Live","MICROSOFT   *XBOX LIVE 080038655",9.99,"debit","Electronics & Software","Citi CC"]
["2011-03-07","Papa John's","Debit Card Purchase - PAPA JOHNS",31.55,"debit","Fast Food","ING Checking"]
["2011-03-07","Provo Beac","Debit Card Purchase - PROVO BEAC",3,"debit","Uncategorized","ING Checking"]
["2011-03-07","External Electronic Withdrawal","External Electronic Withdrawal f",139.69,"debit","Bank Fee","ING Holding"]
["2011-03-07","Withdrawaltricked Out Accessories","WithdrawalTRICKED OUT ACCESSORIES OREM UT Date 03/04/11 24019511064064178841908 5999",21.35,"debit","Miscellaneous","MACU Checking",null,"iPhone cover"]
["2011-03-07","Krispy Kreme","WithdrawalKRISPY KREME DONUTS OREM UT Date 03/03/11 24341291063206388100745 5814",3.38,"debit","Fast Food","MACU Checking"]
["2011-03-04","Redbox","WithdrawalREDBOX *DVDRESERVATION 866-733-2693 IL Date 03/03/11 24692161062000064878091 7841",1.07,"debit","Movies & DVDs","MACU Checking"]
["2011-03-03","ShopKo","Withdrawal #0018920086 ShopKo 2266 North University P Provo UT %% Card 08 #4748",9.33,"debit","Miscellaneous","MACU Checking",null,"detangler, bottles"]
["2011-03-03","ShopKo","Withdrawal #0018920086 ShopKo 2266 North University P Provo UT %% Card 08 #4748",5,"debit","Gift","MACU Checking",null,"Becky's baby gift"]
["2011-03-03","ShopKo","Withdrawal #0018920086 ShopKo 2266 North University P Provo UT %% Card 08 #4748",10,"debit","Clothing","MACU Checking",null,"Amber pj shirt"]
["2011-03-03","Transfer to Chase CC","Electronic Withdrawal from CHASE",77,"debit","Credit Card Payment","ING Checking"]
["2011-03-03","Transfer to Citi CC","Electronic Withdrawal from CITI",61.63,"debit","Credit Card Payment","ING Checking"]
["2011-03-03","Costa","Debit Card Purchase - COSTA VIDA",15.9,"debit","Fast Food","ING Checking"]
["2011-03-03","Withdrawal Lds Orem","Withdrawal #062001532915LDS OREM CENTER #767 232 E UNIVERSITY PKWY OREM UT %% Card 08 #4748",16.2,"debit","Clothing","MACU Checking",null,"garments"]
["2011-03-03","Check 331","Draft 000331",7,"debit","Arts","MACU Checking",null,"Dallin's play"]
["2011-03-03","Chevron","WithdrawalCHEVRON 00208662 PROVO UT Date 03/02/11 24046031062000037935216 5542",63.02,"debit","Gas & Fuel","MACU Checking"]
["2011-03-02","Withdrawal Maceys Provo","Withdrawal #469278MACEYS PROVO 1400 N STATE PROVO UT %% Card 08 #4748",20,"debit","Transfer for Cash Spending","MACU Checking",null,"used for babysitting money"]
["2011-03-02","Withdrawal Maceys Provo","Withdrawal #469278MACEYS PROVO 1400 N STATE PROVO UT %% Card 08 #4748",4.5599999999999996,"debit","Miscellaneous","MACU Checking"]
["2011-03-02","Interest Charged Balance","Interest Charged on Balance Transfers",0,"credit","Interest Income","B of A CC"]
["2011-03-02","Interest Charged Purchases","Interest Charged on Purchases",15.64,"debit","Finance Charge","B of A CC"]
["2011-03-02","Interest Charged Cash","Interest Charged on Cash Advances",0,"credit","Interest Income","B of A CC"]
["2011-03-02","Transfer from ING Checking","CLICK-TO-PAY PAYMENT, THANK YOU",61.63,"credit","Credit Card Payment","Citi CC"]
["2011-03-02","Marketplace","Debit Card Purchase - MARKETPLAC",0.85,"debit","Fast Food","ING Checking"]
["2011-03-02","Pretzelmaker","WithdrawalPRETZELMAKER OREM UT Date 03/01/11 24323011061572125010091 5814",12.31,"debit","Fast Food","MACU Checking"]
["2011-03-02","Transfer from ING Checking","Payment - Thank You",77,"credit","Credit Card Payment","Chase CC"]
["2011-03-01","Late Payment Fee","LATE FEE FOR PAYMENT DUE 03/01",16,"debit","Late Fee","B of A CC"]
["2011-03-01","Scout Com","SCOUT.COM",9.9499999999999993,"debit","Uncategorized","B of A CC"]
["2011-03-01","IHOP","Debit Card Purchase - IHOP 947 Q",14.72,"debit","Restaurants","ING Checking"]
["2011-03-01","Dnc Travel","Debit Card Purchase - DNC TRAVEL",7.88,"debit","Travel","ING Checking"]
["2011-03-01","Chevron","Debit Card Purchase - CHEVRON 00",10.01,"debit","Gas & Fuel","ING Checking"]
["2011-03-01","Cal","Debit Card Purchase - CAL AND CO",3.25,"debit","Uncategorized","ING Checking"]
["2011-03-01","Subway","Debit Card Purchase - SUBWAY QPS",11.44,"debit","Fast Food","ING Checking"]
["2011-03-01","External Electronic Withdrawal","External Electronic Withdrawal f",46.11,"debit","Bank Fee","ING Holding"]
["2011-03-01","Transfer from ING Holding","Deposit SWENSEN,AMBER MTYPE: ING DIRECT CO: SWENSEN,AMBER M",800,"credit","Transfer","MACU Checking"]
["2011-02-28","Monthly Interest Paid","Monthly Interest Paid",0.06,"credit","Interest Income","ING Checking"]
["2011-02-28","Baja Fresh","Debit Card Purchase - BAJA FRESH",7.53,"debit","Fast Food","ING Checking"]
["2011-02-28","Wendy's","Debit Card Purchase - WENDY S OL",7.99,"debit","Fast Food","ING Checking"]
["2011-02-28","Jack in the Box","Debit Card Purchase - JACK IN TH",2.06,"debit","Fast Food","ING Checking"]
["2011-02-28","Baja Fresh","Debit Card Purchase - BAJA FRESH",9.3699999999999992,"debit","Fast Food","ING Checking"]
["2011-02-28","Monthly Interest Paid","Monthly Interest Paid",6.52,"credit","Interest Income","ING Holding"]
["2011-02-28","Transfer to MACU Checking","Internet Withdrawal MOUNTAIN AME",800,"debit","Transfer","ING Holding"]
["2011-02-28","Commentavg Checking Bal","Transaction COMMENTAvg Checking Bal for Feb $456.70",0,"credit","Income","MACU Checking"]
["2011-02-28","Children's Place","Withdrawal AdjustmentTHE CHILDRENS PLACE #1220 BOISE ID Date 02/24/11 74610431056004059460179 5641",33.53,"credit","Clothing","MACU Checking"]
["2011-02-27","Consumer Reports","CR *CONSUMERREPORTS.OR 800333066",5.95,"debit","Books","Citi CC"]
["2011-02-27","Southwest","SOUTHWES5262158027640  080043597",9.5,"debit","Air Travel","Citi CC"]
["2011-02-27","Chevron","Debit Card Purchase - CHEVRON/JA",49.78,"debit","Gas & Fuel","ING Checking"]
["2011-02-27","Gold's Gym","GYM*GOLDS GYM",54.4,"debit","Gym","Chase CC"]
["2011-02-26","iTunes","APL*ITUNES             866-712-7",1.06,"debit","Music","Citi CC"]
["2011-02-26","Paradies","PARADIES SHOP#208 Q02",4.8600000000000003,"debit","Shopping","B of A CC"]
["2011-02-26","Marshalls","Withdrawal #134234MARSHALLS MERIDIAN ID %% Card 08 #4748",10.59,"debit","Miscellaneous","MACU Checking",null,"carseat cover"]
["2011-02-26","Withdrawal Boise Di","Withdrawal #057001662404BOISE DI 10740 FAIRVIEW AVE BOISE ID %% Card 08 #4748",21.2,"debit","Clothing","MACU Checking"]
["2011-02-25","Chipotle","Debit Card Purchase - CHIPOTLE 0",16.86,"debit","Fast Food","ING Checking"]
["2011-02-25","Onta","Debit Card Purchase - 00110 ONTA",38.06,"debit","Clothing","ING Checking"]
["2011-02-25","Electronic Deposit Brigham","Electronic Deposit from BRIGHAM",145,"credit","Income","ING Checking"]
["2011-02-25","Chevron","Debit Card Purchase - CHEVRON 00",54.54,"debit","Gas & Fuel","ING Checking"]
["2011-02-25","Arco","Debit Card Purchase - ARCO PAYPO",6.41,"debit","Gas & Fuel","ING Checking"]
["2011-02-25","Carl's Jr","Debit Card Purchase - CARLJR1100",11.24,"debit","Fast Food","ING Checking"]
["2011-02-24","ATM Fee","ATM Withdrawal - 3445 SHELBY  ON",2.5,"debit","ATM Fee","ING Checking"]
["2011-02-24","ATM Withdrawal","ATM Withdrawal - 3445 SHELBY  ON",80,"debit","Cash & ATM","ING Checking"]
["2011-02-24","Children's Place","Withdrawal #105531023223THE CHILDRENS PLACE #1220 350 N MILWAUKEE, STE #1 BOISE ID %% Card 08 #4748",33.71,"debit","Clothing","MACU Checking"]
["2011-02-24","Albertsons","Withdrawal #323408#00161 ALBERTSONS 10700 USTICK RD. BOISE ID %% Card 08 #4748",1.79,"debit","Miscellaneous","MACU Checking"]
["2011-02-24","Chevron","Debit Card Purchase - CHEVRON/JA",17.21,"debit","Gas & Fuel","ING Checking"]
["2011-02-24","Invisible","Debit Card Purchase - INVISIBLE",27.73,"debit","Electronics & Software","ING Checking"]
["2011-02-23","Southwest","INTERNET 2621566867022",528.29999999999995,"debit","Air Travel","B of A CC"]
["2011-02-23","External Electronic Withdrawal","External Electronic Withdrawal f",48.28,"debit","Bank Fee","ING Holding"]
["2011-02-22","Chevron","Debit Card Purchase - CHEVRON 00",21.41,"debit","Gas & Fuel","ING Checking"]
["2011-02-22","Panda","Debit Card Purchase - PANDA EXPR",9.31,"debit","Business Services","ING Checking"]
["2011-02-22","Heather McAllister","Draft 000329",45,"debit","Hair","MACU Checking"]
["2011-02-22","Heather McAllister","Draft 000330",15,"debit","Hair","MACU Checking"]
["2011-02-22","Burger King","WithdrawalBURGER KING #10647 PROVO UT Date 02/18/11 24186161049206199000334 5814",5.74,"debit","Fast Food","MACU Checking"]
["2011-02-22","Jo-Ann Stores","Withdrawal #105244741650JOANN STORES, INC. 1666 S STATE ST OREM UT %% Card 08 #4748",24.51,"debit","Miscellaneous","MACU Checking",null,"Sawyer's bed foam and fabric"]
["2011-02-20","Transfer to 7125","Debit Card Purchase - CITIBANK S",72,"debit","Credit Card Payment","ING Checking"]
["2011-02-19","Target","Withdrawal #060492TARGET T1754 OREM STAT 175 West Center Street Orem UT %% Card 08 #4748",15,"debit","Gift","MACU Checking",null,"Batista wedding gift"]
["2011-02-18","Transfer from Checking","DEBIT CARD PAYMENT - THANK YOU",72,"credit","Credit Card Payment","Citi CC"]
["2011-02-18","Simply Mac","Debit Card Purchase - SIMPLY MAC",37.340000000000003,"debit","Electronics & Software","ING Checking"]
["2011-02-18","Marketplace","Debit Card Purchase - MARKETPLAC",4.62,"debit","Fast Food","ING Checking"]
["2011-02-18","Transfer to PRIMARY SAVINGS","External Electronic Withdrawal f",265,"debit","Auto Payment","ING Holding"]
["2011-02-18","Deposit By","Deposit by Check",24.87,"credit","Income","MACU Checking"]
["2011-02-18","Jo-Ann Stores","Withdrawal #104953408317JOANN STORES, INC. 1666 S STATE ST OREM UT %% Card 08 #4748",28.83,"debit","Miscellaneous","MACU Checking"]
["2011-02-18","Withdrawal Transfer Loan","Withdrawal Transfer To Loan 61",265,"debit","Transfer","MACU Savings 1"]
["2011-02-18","Transfer from ING Holding","Deposit ACH ORIGINATION",265,"credit","Transfer","MACU Savings 1"]
["2011-02-17","Refund Late Fee","REFUND LATE FEE",25,"credit","Late Fee","Citi CC"]
["2011-02-17","External Electronic Withdrawal","External Electronic Withdrawal f",110.91,"debit","Bank Fee","ING Holding"]
["2011-02-17","Interest Charged Standard","INTEREST CHARGED TO STANDARD PUR",12.63,"debit","Finance Charge","Citi CC"]
["2011-02-17","Late Payment Fee","LATE FEE - JAN PAYMENT PAST DUE",25,"debit","Late Fee","Citi CC"]
["2011-02-17","Bajio Mexican Grill","WithdrawalBAJIO MEXICAN GRILL 00001 PROVO UT Date 02/15/11 24717051047640471879770 5814",6.28,"debit","Fast Food","MACU Checking"]
["2011-02-17","Smiths","Debit Card Purchase - SMITHS 350",4.6900000000000004,"debit","Groceries","ING Checking"]
["2011-02-16","Rite Aid","Debit Card Purchase - RITE AID C",22.58,"debit","Pharmacy","ING Checking"]
["2011-02-16","Byu Creame","Debit Card Purchase - BYU CREAME",13.53,"debit","Fast Food","ING Checking"]
["2011-02-16","External Electronic Withdrawal","External Electronic Withdrawal f",113.16,"debit","Bank Fee","ING Holding"]
["2011-02-16","Redbox","WithdrawalREDBOX *DVD RENTAL 866-733-2693 IL Date 02/15/11 24692161046000005434450 7841",10.65,"debit","Movies & DVDs","MACU Checking"]
["2011-02-16","Bath & Body Works","Withdrawal #104794719033BATH & BODY WORKS 4800 N. UNIVERSITY AVE PROVO UT %% Card 08 #4748",21.35,"debit","Miscellaneous","MACU Checking",null,"wall scents"]
["2011-02-15","Simply Mac","Debit Card Purchase - SIMPLY MAC",37.340000000000003,"debit","Electronics & Software","ING Checking"]
["2011-02-15","Withdrawal Swensen Amber","Withdrawal SWENSEN,AMBER MTYPE: ING DIRECT CO: SWENSEN,AMBER M",474,"debit","Uncategorized","MACU Checking"]
["2011-02-14","iTunes","APL*ITUNES             866-712-7",3.19,"debit","Music","Citi CC"]
["2011-02-14","Chevron","CHEVRON EXTRA MART #40",63.07,"debit","Gas & Fuel","B of A CC"]
["2011-02-14","Utah Valley Hospital","UTAH VALLEY HOSPITAL U",1.83,"debit","Fast Food","B of A CC"]
["2011-02-14","Timpview Pharmacy","TIMPVIEW PHARMACY 3000",53.95,"debit","Pharmacy","B of A CC"]
["2011-02-14","Utah Valley Hospital","UTAH VALLEY HOSPITAL U",4.1500000000000004,"debit","Fast Food","B of A CC"]
["2011-02-14","Utah Valley Hospital","UTAH VALLEY HOSPITAL U",5.39,"debit","Fast Food","B of A CC"]
["2011-02-14","Rite Aid","RITE AID 6148 RITE AID",50.99,"debit","Pharmacy","B of A CC"]
["2011-02-14","Costco","Debit Card Purchase - COSTCO WHS",2.15,"debit","Miscellaneous","ING Checking"]
["2011-02-14","Smiths","Debit Card Purchase - SMITHS 350",4.26,"debit","Gift","ING Checking"]
["2011-02-14","Transfer from FREE CHECKING","Internet Deposit MOUNTAIN AMERIC",474,"credit","Transfer","ING Checking"]
["2011-02-12","Verizon Wireless","VERIZON WRLS W0038-01",381.08,"debit","Mobile Phone","B of A CC"]
["2011-02-12","Rite Aid","RITE AID 6148 RITE AID",172.8,"debit","Pharmacy","B of A CC"]
["2011-02-12","Utah Valley Hospital","UTAH VALLEY HOSPITAL U",4.58,"debit","Fast Food","B of A CC"]
["2011-02-12","Target","Withdrawal #086482TARGET T1754 OREM STAT 175 West Center Street Orem UT %% Card 08 #4748",60.2,"debit","Miscellaneous","MACU Checking"]
["2011-02-11","Electronic Deposit Brigham","Electronic Deposit from BRIGHAM",58,"credit","Income","ING Checking"]
["2011-02-10","Utah Valle","Debit Card Purchase - UTAH VALLE",4.58,"debit","Uncategorized","ING Checking"]
["2011-02-10","Costa","Debit Card Purchase - COSTA VIDA",9.14,"debit","Fast Food","ING Checking"]
["2011-02-10","Chevron","Debit Card Purchase - CHEVRON 00",10.07,"debit","Gas & Fuel","ING Checking"]
["2011-02-10","Redbox","WithdrawalREDBOX *DVD RENTAL OAKBRKTERRACE IL Date 02/09/11 24692161040000876934196 7841",2.13,"debit","Movies & DVDs","MACU Checking"]
["2011-02-09","Costco","COSTCO WHSE #0484 0000",130.44999999999999,"debit","Miscellaneous","B of A CC"]
["2011-02-09","Game Cente","Debit Card Purchase - GAME CENTE",3,"debit","Amusement","ING Checking"]
["2011-02-09","Byu Creame","Debit Card Purchase - BYU CREAME",6.78,"debit","Fast Food","ING Checking"]
["2011-02-08","Cash","CASH ADVANCE INTEREST CHA",0.09,"debit","Business Services","Chase CC"]
["2011-02-08","Interest Charge","PURCHASE INTEREST CHARGE",42.3,"debit","Finance Charge","Chase CC"]
["2011-02-08","Chevron","WithdrawalCHEVRON 00208662 PROVO UT Date 02/07/11 24046031039000016819142 5542",15.92,"debit","Gas & Fuel","MACU Checking"]
["2011-02-08","Rite Aid","Withdrawal #103914720563RITE AID CORP. RIVERSIDE PLAZA PROVO UT %% Card 08 #4748",25.37,"debit","Pharmacy","MACU Checking"]
["2011-02-08","Pretzelmaker","WithdrawalPRETZELMAKER OREM UT Date 02/07/11 24323011039572105010425 5814",6.43,"debit","Fast Food","MACU Checking"]
["2011-02-07","Papa John's","PAPA JOHNS 1566.COM 30",22.9,"debit","Fast Food","B of A CC"]
["2011-02-07","Microsoft XBox Live","MICROSOFT   *XBOX LIVE 080038655",9.99,"debit","Electronics & Software","Citi CC"]
["2011-02-07","Build-A-Bear","Withdrawal #038001285678BUILDABEAR WRKSHP 0237 575 UNIVERSITY PKWY B32 OREM UT %% Card 08 #4748",2.93,"debit","Gift","MACU Checking",null,"Amelie's birthday"]
["2011-02-07","Withdrawal Smiths N","Withdrawal #007600SMITHS 350 N. FREEDOM PROVO UT %% Card 08 #4748",1.69,"debit","Miscellaneous","MACU Checking"]
["2011-02-07","Nordstrom","Withdrawal #007358NORDSTROM 038 693 UNIVERSITY PKWY OREM UT %% Card 08 #4748",23.93,"debit","Miscellaneous","MACU Checking",null,"makeup bare essentials"]
["2011-02-07","External Electronic Withdrawal","External Electronic Withdrawal f",128.51,"debit","Bank Fee","ING Holding"]
["2011-02-07","Wendy's","WithdrawalWENDYS #3540 OREM UT Date 02/04/11 24445001035200040838936 5814",5.16,"debit","Fast Food","MACU Checking"]
["2011-02-07","Chevron","WithdrawalCHEVRON 00207403 EAGLE ID Date 02/05/11 24046031036000193855862 5542",44.52,"debit","Gas & Fuel","MACU Checking"]
["2011-02-07","Top Stop C3","Withdrawal #263553TOP STOP C-30 TOP STOP C-114 SOUTH 85 LEHI UT %% Card 08 #4748",9.67,"debit","Gas & Fuel","MACU Checking"]
["2011-02-07","Withdrawal Jacksons Food","Withdrawal #102061JACKSONS FOOD S JACKSONS FO3100 MAGICVI MERIDIAN ID %% Card 08 #4748",40.76,"debit","Gas & Fuel","MACU Checking"]
["2011-02-07","Carl's Jr","WithdrawalCARL'S JR #1101363 QPS PROVO UT Date 02/03/11 24492151035207499502876 5814",8.7799999999999994,"debit","Fast Food","MACU Checking"]
["2011-02-06","Marketplace","Debit Card Purchase - MARKETPLAC",1.72,"debit","Fast Food","ING Checking"]
["2011-02-05","Albertsons","Withdrawal #386265#00177 ALBERTSONS 4700 N. EAGLE RD. BOISE ID %% Card 08 #4748",55.04,"debit","Groceries","MACU Checking"]
["2011-02-04","Children's Place","Withdrawal #103642011622THE CHILDRENS PLACE #1220 350 N MILWAUKEE, STE #1 BOISE ID %% Card 08 #4748",114.27,"debit","Clothing","MACU Checking"]
["2011-02-04","Withdrawal Motherhood","Withdrawal #103604400028MOTHERHOOD #506 BOISE ID %% Card 08 #4748",60.36,"debit","Clothing","MACU Checking"]
["2011-02-04","Wendy's","WithdrawalWENDYS #4710 Q25 PROVO UT Date 02/02/11 24445001034100105435357 5814",12.01,"debit","Fast Food","MACU Checking"]
["2011-02-04","Chevron","WithdrawalCHEVRON 00305397 LEHI UT Date 02/03/11 24046031035000005854864 5542",45.25,"debit","Gas & Fuel","MACU Checking"]
["2011-02-03","Person Person Laura","Person2Person Payment to Laura o",1075,"debit","Mortgage & Rent","ING Checking"]
["2011-02-02","Interest Charged Balance","Interest Charged on Balance Transfers",0,"credit","Interest Income","B of A CC"]
["2011-02-02","Interest Charged Cash","Interest Charged on Cash Advances",0,"credit","Interest Income","B of A CC"]
["2011-02-02","Interest Charged Purchases","Interest Charged on Purchases",6.71,"debit","Finance Charge","B of A CC"]
["2011-02-02","Transfer to Bank of America","Electronic Withdrawal from BK OF",25,"debit","Credit Card Payment","ING Checking"]
["2011-02-02","Wendy's","Debit Card Purchase - WENDYS 471",7.29,"debit","Fast Food","ING Checking"]
["2011-02-02","Disney","WithdrawalTHE DISNEY STORE #948 OREM UT Date 01/31/11 24210731032522002065101 5947",4.8099999999999996,"debit","Miscellaneous","MACU Checking",null,"straws"]
["2011-02-02","Withdrawalheindselmans Date","WithdrawalHEINDSELMANS INC PROVO UT Date 01/31/11 24512391032900019900023 5949",4.25,"debit","Miscellaneous","MACU Checking",null,"baby blanket floss"]
["2011-02-02","Deposit Byu Refundtype","Deposit BYU RefundTYPE: UCA CO: BYU Refund",874,"credit","Income","MACU Checking"]
["2011-02-02","Transfer from ING Holding","Deposit SWENSEN,AMBER MTYPE: ING DIRECT CO: SWENSEN,AMBER M",272,"credit","Transfer","MACU Checking"]
["2011-02-01","Ba Electronic","BA ELECTRONIC PAYMENT",25,"credit","Credit Card Payment","B of A CC"]
["2011-02-01","Costa","Debit Card Purchase - COSTA VIDA",6.55,"debit","Fast Food","ING Checking"]
["2011-02-01","Transfer to FREE CHECKING","Internet Withdrawal MOUNTAIN AME",272,"debit","Transfer","ING Holding"]
["2011-02-01","External Electronic Withdrawal","External Electronic Withdrawal f",211.51,"debit","Bank Fee","ING Holding"]
["2011-02-01","Pretzelmaker","WithdrawalPRETZELMAKER OREM UT Date 01/31/11 24323011032572099010974 5814",8.6300000000000008,"debit","Fast Food","MACU Checking"]
["2011-01-31","Payless ShoeSource","Withdrawal #007829PAYLESS SHOESOURCE 575 E UNIVERSITY MALL OREM UT %% Card 08 #4748",19,"debit","Clothing","MACU Checking"]
["2011-01-31","Icing By Claires","Withdrawal #728012ICING BY CLAIRE E 205 UNIVERSITY MALL OREM UT %% Card 08 #4748",9.6199999999999992,"debit","Clothing","MACU Checking"]
["2011-01-31","Commentavg Checking Bal","Transaction COMMENTAvg Checking Bal for Jan $1,473.25",0,"credit","Income","MACU Checking"]
["2011-01-31","Monthly Interest Paid","Monthly Interest Paid",0.14000000000000001,"credit","Interest Income","ING Checking"]
["2011-01-31","Monthly Interest Paid","Monthly Interest Paid",7.3,"credit","Interest Income","ING Holding"]
["2011-01-31","Withdrawalmaceys Provo Date","WithdrawalMACEYS PROVO PROVO UT Date 01/29/11 24427331030710020071835 5411",5.96,"debit","Uncategorized","MACU Checking"]
["2011-01-30","Byu Wsc Su","Debit Card Purchase - BYU WSC SU",4.51,"debit","Uncategorized","ING Checking"]
["2011-01-30","Rite Aid","Debit Card Purchase - RITE AID C",8.51,"debit","Pharmacy","ING Checking"]
["2011-01-30","Amazon","AMAZON MKTPLACE PMTS",4.9800000000000004,"debit","Shopping","Chase CC"]
["2011-01-29","Rite Aid","Debit Card Purchase - RITE AID C",27.19,"debit","Pharmacy","ING Checking"]
["2011-01-28","Electronic Deposit Brigham","Electronic Deposit from BRIGHAM",79.75,"credit","Income","ING Checking"]
["2011-01-28","Marketplace","Debit Card Purchase - MARKETPLAC",6.24,"debit","Fast Food","ING Checking"]
["2011-01-28","Byu Creame","Debit Card Purchase - BYU CREAME",2.12,"debit","Fast Food","ING Checking"]
["2011-01-28","Amazon","Amazon.com",29.69,"debit","Shopping","Chase CC"]
["2011-01-27","Scout Com","SCOUT.COM",9.9499999999999993,"debit","Uncategorized","B of A CC"]
["2011-01-27","Consumer Reports","CR *CONSUMERREPORTS.OR 800333066",5.95,"debit","Books","Citi CC"]
["2011-01-27","Withdrawal Motherhood Orem","Withdrawal #102803005014MOTHERHOOD #465 OREM UT %% Card 08 #4748",80.08,"debit","Uncategorized","MACU Checking"]
["2011-01-27","Check 327","Draft 000327",75,"debit","Check","MACU Checking"]
["2011-01-27","Kohl's","Withdrawal #102700002939KOHL'S #1285 1281 S 800 EAST OREM UT %% Card 08 #4748",5.98,"debit","Clothing","MACU Checking"]
["2011-01-26","Scout Com Wa","SCOUT.COM              888-979-0979 WA",9.9499999999999993,"debit","Uncategorized","B of A CC"]
["2011-01-26","Bath & Body Works","Withdrawal #102684778517BATH & BODY WORKS 1300 S. STATE STREET S OREM UT %% Card 08 #4748",13.89,"debit","Miscellaneous","MACU Checking"]
["2011-01-26","Pretzelmaker","WithdrawalPRETZELMAKER OREM UT Date 01/25/11 24323011026572094010308 5814",12.35,"debit","Fast Food","MACU Checking"]
["2011-01-25","External Electronic Withdrawal","External Electronic Withdrawal f",48.28,"debit","Bank Fee","ING Holding"]
["2011-01-25","Check 328","Draft 000328",46.41,"debit","Check","MACU Checking"]
["2011-01-25","Withdrawal Lds Orem","Withdrawal #025001826867LDS OREM CENTER #767 232 E UNIVERSITY PKWY OREM UT %% Card 08 #4748",9.6,"debit","Uncategorized","MACU Checking"]
["2011-01-25","Withdrawal Motherhood Orem","Withdrawal #102523610223MOTHERHOOD #465 OREM UT %% Card 08 #4748",12.8,"debit","Uncategorized","MACU Checking"]
["2011-01-24","Withdrawal","Withdrawal",65,"debit","Uncategorized","MACU Checking"]
["2011-01-24","PayPal","Electronic Withdrawal from PAYPA",10,"debit","Shopping","ING Checking"]
["2011-01-24","Chevron","Debit Card Purchase - CHEVRON 00",50.27,"debit","Gas & Fuel","ING Checking"]
["2011-01-24","Coneys Fro","Debit Card Purchase - CONEYS FRO",5.94,"debit","Uncategorized","ING Checking"]
["2011-01-24","Best Buy","Best Buy      00007732",18.16,"credit","Credit Card Payment","Chase CC"]
["2011-01-24","Radioshack Cor","RADIOSHACK COR00140293",43.48,"credit","Credit Card Payment","Chase CC"]
["2011-01-22","Amazon","Amazon.com             AMZN.COM/",45,"debit","Shopping","Citi CC"]
["2011-01-22","Deposit ATM Mountain","Deposit at ATM #000000004391MOUNTAIN AMERICA CU 88 N 500 W #1 PROVO UT COO331 %% Card 08 #4748",25,"credit","Income","MACU Checking"]
["2011-01-22","Lds Orem C","Debit Card Purchase - LDS OREM C",18,"debit","Uncategorized","ING Checking"]
["2011-01-22","Costco","Debit Card Purchase - COSTCO WHS",37.520000000000003,"debit","Miscellaneous","ING Checking"]
["2011-01-22","Comment Checks Cashed","Transaction COMMENT%% Checks Cashed 002 for 100.00",0,"credit","Income","MACU Savings 1"]
["2011-01-21","Marketplace Iga","MARKETPLACE CAFE       PROVO",3.86,"debit","Groceries","Citi CC"]
["2011-01-21","Marketplace Iga","MARKETPLACE CAFE       PROVO",0.96,"debit","Groceries","Citi CC"]
["2011-01-21","800 970 88","Debit Card Purchase - 800 970 88",10.99,"debit","Uncategorized","ING Checking"]
["2011-01-21","Transfer from ING Holding","Deposit SWENSEN,AMBER MTYPE: ING DIRECT CO: SWENSEN,AMBER M",300,"credit","Transfer","MACU Checking"]
["2011-01-20","Marketplace Iga","MARKETPLACE CAFE       PROVO",6.24,"debit","Groceries","Citi CC"]
["2011-01-20","Check 326","Draft 000326",50,"debit","Check","MACU Checking"]
["2011-01-20","Transfer from ING Holding","Deposit ACH ORIGINATION",265,"credit","Transfer","MACU Savings 1"]
["2011-01-20","Withdrawal Transfer Loan","Withdrawal Transfer To Loan 61",265,"debit","Transfer","MACU Savings 1"]
["2011-01-20","Byu Cougar Creations","BYU COUGAR CREATIONS   PROVO",3.68,"debit","Uncategorized","Citi CC"]
["2011-01-20","Precision","Debit Card Purchase - PRECISION",25.62,"debit","Home Improvement","ING Checking"]
["2011-01-20","Dept Wo","Debit Card Purchase - DEPT OF WO",331.5,"debit","Uncategorized","ING Checking"]
["2011-01-20","PayPal","Debit Card Purchase - PAYPAL COV",15,"debit","Shopping","ING Checking"]
["2011-01-20","Transfer to FREE CHECKING","Internet Withdrawal MOUNTAIN AME",300,"debit","Transfer","ING Holding"]
["2011-01-20","Transfer to PRIMARY SAVINGS","External Electronic Withdrawal f",265,"debit","Auto Payment","ING Holding"]
["2011-01-20","External Electronic Withdrawal","External Electronic Withdrawal f",93.41,"debit","Bank Fee","ING Holding"]
["2011-01-19","Transfer to Checking","Withdrawal SWENSEN,AMBER MTYPE: ING DIRECT CO: SWENSEN,AMBER M",1062,"debit","Transfer","MACU Checking"]
["2011-01-19","Check 324","Draft 000324",100,"debit","Check","MACU Checking"]
["2011-01-19","Interest Charged Standard","INTEREST CHARGED TO STANDARD PUR",14.09,"debit","Finance Charge","Citi CC"]
["2011-01-19","Pretzelmaker","Debit Card Purchase - PRETZELMAK",5.91,"debit","Food & Dining","ING Checking"]
["2011-01-19","Jewelers M","Debit Card Purchase - JEWELERS M",30,"debit","Uncategorized","ING Checking"]
["2011-01-18","Transfer from FREE CHECKING","Internet Deposit MOUNTAIN AMERIC",1062,"credit","Transfer","ING Checking"]
["2011-01-18","Transfer to CREDIT CARD","Electronic Withdrawal from CHASE",68,"debit","Credit Card Payment","ING Checking"]
["2011-01-18","Transfer to 7125","Electronic Withdrawal from CITI",71,"debit","Credit Card Payment","ING Checking"]
["2011-01-18","Bath Bod","Debit Card Purchase - BATH & BOD",25.38,"debit","Uncategorized","ING Checking"]
["2011-01-18","External Electronic Withdrawal","External Electronic Withdrawal f",113.16,"debit","Bank Fee","ING Holding"]
["2011-01-17","Buehler's Buy-Low","BUY LOW MARKET         PROVO",1.48,"debit","Groceries","Citi CC"]
["2011-01-17","Transfer from Checking","CLICK-TO-PAY PAYMENT, THANK YOU",71,"credit","Credit Card Payment","Citi CC"]
["2011-01-17","Amazon","Amazon.com",9.99,"debit","Shopping","Chase CC"]
["2011-01-17","Transfer from Checking","Payment - Thank You",68,"credit","Credit Card Payment","Chase CC"]
["2011-01-15","Jamba Juice","JAMBA JUICE #201 00000 PROVO        UT",11.64,"debit","Food & Dining","B of A CC"]
["2011-01-15","UPS","THE UPS STORE #5266 30 PROUD        UT",15.37,"debit","Shipping","B of A CC"]
["2011-01-15","Hilton","HILTON OMAHA 000000000 OMAHA        NE",39.96,"debit","Hotel","B of A CC"]
["2011-01-14","MS Pub","M'S PUB                OMAHA        NE",47.44,"debit","Restaurants","B of A CC"]
["2011-01-14","Salt Lake City Dept Airports","SALT LAKE CITY DEPT OF SALT LAKE CTYUT",14,"debit","Air Travel","B of A CC"]
["2011-01-14","Nouvelle Eve","NOUVELLE EVE NOUVELLE  OMAHA        NE",21.39,"debit","Clothing","B of A CC"]
["2011-01-14","Hudson News","HUDSON NEWS - OMAHA 30 OMAHA        NE",3.37,"debit","Gift","B of A CC"]
["2011-01-14","Delta","DELTA AI 0625130673035 OMAHA        NE",25,"debit","Air Travel","B of A CC"]
["2011-01-14","Sq Coriander Ca","SQ *CORIANDER          877-417-4551 CA",21.4,"debit","Uncategorized","B of A CC"]
["2011-01-14","Kracy Mcgees Kracy","KRACY MCGEES KRACY MCG OMAHA        NE",3,"debit","Uncategorized","B of A CC"]
["2011-01-14","Nebraska Clothing","NEBRASKA CLOTHING COMP OMAHA        NE",58.85,"debit","Clothing","B of A CC"]
["2011-01-14","Ted Wallys Qps","TED AND WALLYS     QPS OMAHA",8.9700000000000006,"debit","Uncategorized","Citi CC"]
["2011-01-14","Person Person Laura","Person2Person Payment to Laura o",1075,"debit","Mortgage & Rent","ING Checking"]
["2011-01-14","Transfer from ING Holding","Internet Deposit transferred fro",2000,"credit","Transfer","ING Checking"]
["2011-01-14","Provocityr","Debit Card Purchase - PROVOCITYR",98.89,"debit","Uncategorized","ING Checking"]
["2011-01-14","Transfer to Checking","Internet Withdrawal transferred",2000,"debit","Transfer","ING Holding"]
["2011-01-13","St Bag","1ST BAG  1645176115036 SALT LAKE CITUT",25,"debit","Uncategorized","B of A CC"]
["2011-01-13","Sara Lee","SARA LEE SANDWICH SHOP DENVER       CO",8.51,"debit","Coffee Shops","B of A CC"]
["2011-01-13","Arby's","ARBYS 466     004663 9 OMAHA        NE",12.91,"debit","Fast Food","B of A CC"]
["2011-01-13","Great Ame Bage","GREAT AME BAGE551303 5 SALT LAKE CITUT",7.2,"debit","Fast Food","B of A CC"]
["2011-01-12","Quality Inn","QUALITY INN & SUITES 0 TAYLOR       MI",99.09,"debit","Hotel","B of A CC"]
["2011-01-12","Salt Lake City Dept Airports","SALT LAKE CITY DEPT OF SALT LAKE CTYUT",102,"debit","Air Travel","B of A CC"]
["2011-01-12","Kracy Mcgees Kracy","KRACY MCGEES KRACY MCG OMAHA        NE",4.54,"debit","Uncategorized","B of A CC"]
["2011-01-12","Snack","SNACK SODA VENDING SNA 8668995849   PA",1.25,"debit","Fast Food","B of A CC"]
["2011-01-12","Chevron","CHEVRON EXTRA MART #40 PROVO        UT",42.94,"debit","Gas & Fuel","B of A CC"]
["2011-01-12","Kracy Mcgees Kracy","KRACY MCGEES KRACY MCG OMAHA        NE",16.23,"debit","Uncategorized","B of A CC"]
["2011-01-12","Metro","METRO CARS             TAYLOR       MI",36,"debit","Groceries","B of A CC"]
["2011-01-11","Canteen Vending Svc","CANTEEN VENDING CANTEE 8668995849   PA",1.5,"debit","Fast Food","B of A CC"]
["2011-01-11","Canteen Vending Svc","CANTEEN VENDING CANTEE 8668995849   PA",3,"debit","Fast Food","B of A CC"]
["2011-01-11","Delta","DELTA AI 0682348037490 APPLETON     WI",25,"debit","Air Travel","B of A CC"]
["2011-01-11","Casa Blanca","CASABLANCA             APPLETON     WI",42.27,"debit","Food & Dining","B of A CC"]
["2011-01-11","Copperleaf Boutique Hotel","COPPERLEAF BOUTIQUE HO APPLETON     WI",35.950000000000003,"debit","Hotel","B of A CC"]
["2011-01-11","PayPal","Electronic Withdrawal from PAYPA",4.7,"debit","Shopping","ING Checking"]
["2011-01-10","Gingerootz","GINGEROOTZ 000         APPLETON     WI",42,"debit","Restaurants","B of A CC"]
["2011-01-10","Walgreen","WALGREENS #12019 00001 APPLETON     WI",14.97,"debit","Miscellaneous","B of A CC"]
["2011-01-10","iTunes","APL*ITUNES             866-712-7",14.32,"debit","Music","Citi CC"]
["2011-01-09","Grove Salt Lake","THE GROVE-SALT LAKE CI SALT LAKE CITUT",2.0699999999999998,"debit","Uncategorized","B of A CC"]
["2011-01-09","Detroit Metro Airport","DETROIT METRO AIRPORT  DETROIT      MI",23.77,"debit","Air Travel","B of A CC"]
["2011-01-09","Delta","DELTA AI 0682335786440 SALT LAKE CTYUT",23,"debit","Air Travel","B of A CC"]
["2011-01-09","Burger King","BURGER KING #3727 0438 APPLETON     WI",6.49,"debit","Fast Food","B of A CC"]
["2011-01-09","Walgreen","WALGREENS #5102 000005 APPLETON     WI",24.53,"debit","Miscellaneous","B of A CC"]
["2011-01-09","F Town Taxi","S. F. TOWN TAXI INC",71.349999999999994,"debit","Rental Car & Taxi","Chase CC"]
["2011-01-09","Hilton Glendale","HILTON GLENDALE",150.84,"credit","Credit Card Payment","Chase CC"]
["2011-01-09","BYU Bookstore","BYU BOOKSTORE",92.5,"debit","Books","Chase CC"]
["2011-01-09","Resort Spa","CLAREMONT RESORT & SPA",73.88,"debit","Uncategorized","Chase CC"]
["2011-01-09","Salt Lake City Dept Airports","SALT LAKE CITY DEPT OF AI",21,"debit","Air Travel","Chase CC"]
["2011-01-09","Wendy's","WENDY'S #2",2.68,"debit","Fast Food","Chase CC"]
["2011-01-09","Oakland East B","OAKLAND EAST B31286701",2.4700000000000002,"debit","Uncategorized","Chase CC"]
["2011-01-09","Chili's","CHILI'S TOGO O31288160",16.760000000000002,"debit","Restaurants","Chase CC"]
["2011-01-08","Chevron","CHEVRON 0208662        PROVO",34.14,"debit","Gas & Fuel","Citi CC"]
["2011-01-07","Microsoft XBox Live","MICROSOFT   *XBOX LIVE 080038655",9.99,"debit","Electronics & Software","Citi CC"]
["2011-01-07","iTunes","APL*ITUNES             866-712-7",2.11,"debit","Music","Citi CC"]
["2011-01-07","Costco","Debit Card Purchase - COSTCO WHSE #04 648 EAST 800 SOUTH",17.09,"debit","Miscellaneous","ING Checking"]
["2011-01-07","Interest Charge","PURCHASE INTEREST CHARGE",25.68,"debit","Finance Charge","Chase CC"]
["2011-01-07","Cash","CASH ADVANCE INTEREST CHA",5.61,"debit","Business Services","Chase CC"]
["2011-01-07","Hudson News","HUDSON NEWS- LOS ANGEL",7.97,"debit","Uncategorized","Chase CC"]
["2011-01-07","BART","BART ROCKRIDGE STA QPS",7,"debit","Public Transportation","Chase CC"]
["2011-01-07","Target","TARGET        00017541",37.770000000000003,"debit","Miscellaneous","Chase CC"]
["2011-01-07","Sunflower Farmers M","SUNFLOWER FARMERS M",37.380000000000003,"debit","Uncategorized","Chase CC"]
["2011-01-07","Primary","PRIMARY HEALTH MEDICAL GR",24.98,"debit","Entertainment","Chase CC"]
["2011-01-07","Hilton","HILTON GLENDALE",150.84,"debit","Hotel","Chase CC"]
["2011-01-07","Barbacco","BARBACCO",19.239999999999998,"debit","Uncategorized","Chase CC"]
["2011-01-07","Baja Fresh","T7 BAJA FRESH 30052906",14.66,"debit","Fast Food","Chase CC"]
["2011-01-07","Hilton","HILTON GLENDALE",5,"debit","Hotel","Chase CC"]
["2011-01-06","Delta","DELTA   00625134642540 OAKLAND",25,"debit","Air Travel","Citi CC"]
["2011-01-06","ATM Fee","ATM Withdrawal - *MARKET & FREMONT  SAN FRANCISCO, CA US",2,"debit","ATM Fee","ING Checking"]
["2011-01-06","ATM Withdrawal","ATM Withdrawal - *MARKET & FREMONT  SAN FRANCISCO, CA US",40,"debit","Cash & ATM","ING Checking"]
["2011-01-06","Transfer from ING Holding","Internet Deposit transferred from OSA XXXX4516",93,"credit","Transfer","ING Checking"]
["2011-01-06","Transfer to Checking","Internet Withdrawal transferred to EO XXXX4669",93,"debit","Transfer","ING Holding"]
["2011-01-06","Withdrawal Swensen Amber","Withdrawal SWENSEN,AMBER MTYPE: ING DIRECT CO: SWENSEN,AMBER M",11544,"debit","Uncategorized","MACU Checking"]
["2011-01-06","Air Terminal Gifts","AIR TERMINAL GIFTS",1.84,"debit","Gift","Chase CC"]
["2011-01-06","Kneaders","KNEADER'S PROVO",9.25,"debit","Restaurants","Chase CC"]
["2011-01-06","Hilton","HILTON F&B",21.46,"debit","Hotel","Chase CC"]
["2011-01-06","Laundry Plus","LAUNDRY PLUS",10.68,"debit","Laundry","Chase CC"]
["2011-01-06","Costa","COSTA VIDA OF PROVO",16.98,"debit","Fast Food","Chase CC"]
["2011-01-06","C Wolfgang Puc","C WOLFGANG PUC30558316",7.86,"debit","Uncategorized","Chase CC"]
["2011-01-06","Maceys","MACEYS PROVO",21,"debit","Groceries","Chase CC"]
["2011-01-05","United","UNITED  0164517126583  LOS ANGEL",25,"debit","Air Travel","Citi CC"]
["2011-01-05","AT&amp;T","External Electronic Withdrawal from AT&T PAYMENT",128.12,"debit","Mobile Phone","ING Holding"]
["2011-01-05","Transfer from FREE CHECKING","Internet Deposit MOUNTAIN AMERICA FCU checking account XXXXXXXX1875",11544,"credit","Transfer","ING Holding"]
["2011-01-05","Deposit Byu Refundtype","Deposit BYU RefundTYPE: UCA CO: BYU Refund",1262,"credit","Income","MACU Checking"]
["2011-01-05","Check 325","Draft 000325",20,"debit","Check","MACU Checking"]
["2011-01-05","Federal Express","FEDEX OFFICE #0154",2.7,"debit","Shipping","Chase CC"]
["2011-01-05","BYU Bookstore","BYU BOOKSTORE",10.89,"debit","Books","Chase CC"]
["2011-01-05","Delta","DELTA AIR   0068233722395",23,"debit","Air Travel","Chase CC"]
["2011-01-05","Byu Cougar Creations","BYU COUGAR CREATIONS",3.23,"debit","Uncategorized","Chase CC"]
["2011-01-04","Transfer to ING Holding","Internet Withdrawal transferred to OSA XXXX4516",121,"debit","Transfer","ING Checking"]
["2011-01-04","Transfer from Checking","Internet Deposit transferred from EO XXXX4669",121,"credit","Transfer","ING Holding"]
["2011-01-04","Deposit Byu Refundtype","Deposit BYU RefundTYPE: UCA CO: BYU Refund",11519,"credit","Income","MACU Checking"]
["2011-01-04","Amazon","Amazon.com",81.569999999999993,"debit","Shopping","Chase CC"]
["2011-01-03","Gold's Gym","GOLD'S GYM UNIVERSITY",54.4,"debit","Gym","Chase CC"]
["2011-01-03","Interest Charged Purchases","Interest Charged on Purchases",22.63,"debit","Finance Charge","B of A CC"]
["2011-01-02","Cinemark","CINEMARK 1041      Q34",16.5,"debit","Movies & DVDs","Chase CC"]
["2011-01-02","Chevron","CHEVRON 00073049",51.27,"debit","Gas & Fuel","Chase CC"]
["2011-01-02","Runners Corner","RUNNERS CORNER INC.",96.14,"debit","Sporting Goods","Chase CC"]
["2011-01-02","Hale Centre Theatre","HALE CENTRE THEATRE",51,"debit","Entertainment","Chase CC"]
["2010-12-31","Electronic Deposit Brigham","Electronic Deposit from BRIGHAM YOUNG UN DIR DEP",50.75,"credit","Paycheck","ING Checking"]
["2010-12-31","Monthly Interest Paid","Monthly Interest Paid",0.12,"credit","Interest Income","ING Checking"]
["2010-12-31","Monthly Interest Paid","Monthly Interest Paid",0.15,"credit","Interest Income","ING Holding"]
["2010-12-31","iTunes","APL*ITUNES 866-712-7753 CA",7.43,"debit","Music","Citi CC"]
["2010-12-31","Commentavg Checking Bal","Transaction COMMENTAvg Checking Bal for Dec $598.38",0,"credit","Income","MACU Checking"]
["2010-12-31","Sizzler","SIZZLER 875",28.36,"debit","Restaurants","Chase CC"]
["2010-12-31","Buehler's Buy-Low","BUY LOW MARKET",2.75,"debit","Groceries","Chase CC"]
["2010-12-31","Redbox","REDBOX *DVD RENTAL",1.6,"debit","Movies & DVDs","Chase CC"]
["2010-12-31","Amazon","Amazon.com",103.98,"debit","Shopping","Chase CC"]
["2010-12-30","USPS","Debit Card Purchase - USPS 4971740605 936 S 250 E",9.8000000000000007,"debit","Shipping","ING Checking"]
["2010-12-30","Carl's Jr","CARL'S JR. #7224N  Q12",14.07,"debit","Fast Food","Chase CC"]
["2010-12-30","Hardy","HARDY'S #48",22.23,"debit","Uncategorized","Chase CC"]
["2010-12-30","Apple","APPLE STORE R303",95.35,"credit","Electronics & Software","Chase CC"]
["2010-12-30","Ross","ROSS STORE #501",31.97,"debit","Clothing","Chase CC"]
["2010-12-29","Transfer to ING Holding","Internet Withdrawal transferred to OSA XXXX4516",10,"debit","Transfer","ING Checking"]
["2010-12-29","Transfer from Checking","Internet Deposit transferred from EO XXXX4669",10,"credit","Transfer","ING Holding"]
["2010-12-29","Chuck E. Cheese","CHUCK E CHEESE00009597",38.14,"debit","Kids Activities","Chase CC"]
["2010-12-29","Marshalls","MARSHALLS #871",15.88,"debit","Clothing","Chase CC"]
["2010-12-29","Marshalls","MARSHALLS #871",47.68,"debit","Clothing","Chase CC"]
["2010-12-29","Maverik","MAVERIK #394",7.06,"debit","Gas & Fuel","Chase CC"]
["2010-12-29","Microsoft","DRI*MICROSOFT HUP",10.62,"debit","Electronics & Software","Chase CC"]
["2010-12-29","ShopKo","SHOPKO        00501072",10.65,"debit","Shopping","Chase CC"]
["2010-12-29","Chevron","CHEVRON 00207403",50.5,"debit","Gas & Fuel","Chase CC"]
["2010-12-28","iTunes","APL*ITUNES 866-712-7753 CA",2.1,"debit","Music","Citi CC"]
["2010-12-28","Wendy's","WENDYS   13      Q25",3.15,"debit","Fast Food","Chase CC"]
["2010-12-27","Costco","Debit Card Purchase - COSTCO WHSE #07 2051 S. COLE RD.",61.05,"debit","Miscellaneous","ING Checking"]
["2010-12-27","Scout Com Wa","SCOUT.COM              888-979-0979 WA",9.9499999999999993,"debit","Uncategorized","B of A CC"]
["2010-12-26","Consumer Reports","CR *CONSUMERREPORTS.OR 8003330663 NY",5.95,"debit","Books","Citi CC"]
["2010-12-26","Quiznos","QUIZNOS SUB #10120",3.18,"debit","Fast Food","Chase CC"]
["2010-12-26","Garden Lanes","WESTY'S GARDEN LANES",17.23,"debit","Amusement","Chase CC"]
["2010-12-26","Hobby Lobby","HOBBY LOBBY # 433",5.27,"debit","Hobbies","Chase CC"]
["2010-12-26","Players","PLAYER'S PUB",1.5,"debit","Fast Food","Chase CC"]
["2010-12-26","Garden Lanes","WESTY'S GARDEN LANES",17.78,"debit","Amusement","Chase CC"]
["2010-12-26","Walgreen","WALGREENS #11452",10.59,"debit","Miscellaneous","Chase CC"]
["2010-12-24","Dick's Sporting","DICKS SPORTING GOODS#685",96.38,"debit","Sporting Goods","Chase CC"]
["2010-12-24","Hallett Cinemas","HALLETT CINEMAS",15,"debit","Movies & DVDs","Chase CC"]
["2010-12-23","Fast","FAST LANE INDOOR KART RAC",29.57,"debit","Air Travel","Chase CC"]
["2010-12-23","Microsoft","DRI*MICROSOFT HUP",10.62,"debit","Electronics & Software","Chase CC"]
["2010-12-23","McDonald's","MCDONALD'S F13630",5.89,"debit","Fast Food","Chase CC"]
["2010-12-23","Apple","APPLE STORE R303",95.35,"debit","Electronics & Software","Chase CC"]
["2010-12-22","Japan Express Qps","Debit Card Purchase - JAPAN EXPRESS QPS BOISE ID",6.61,"debit","Uncategorized","ING Checking"]
["2010-12-22","Transfer to CREDIT CARD","Electronic Payment to Chase Card Services",1600,"debit","Credit Card Payment","ING Checking"]
["2010-12-22","iTunes","APL*ITUNES 866-712-7753 CA",1.06,"debit","Music","Citi CC"]
["2010-12-22","Marshalls","MARSHALLS #871",26.49,"debit","Clothing","Chase CC"]
["2010-12-22","Transfer from Checking","Payment - Thank You",1600,"credit","Credit Card Payment","Chase CC"]
["2010-12-22","Wal-Mart","WAL-MART #2862",117.87,"debit","Shopping","Chase CC"]
["2010-12-22","Amazon","Amazon.com",36.99,"debit","Shopping","Chase CC"]
["2010-12-21","Adjustment We Changed","Credit Adjustment - We changed how we applied your online payments and you got money back.",0.14000000000000001,"credit","Credit Card Payment","ING Checking"]
["2010-12-21","Veracity Network Veracity","External Electronic Withdrawal from Veracity Network Veracity N",48.28,"debit","Internet","ING Holding"]
["2010-12-21","Quiznos Sub","QUIZNO'S SUB #1522",8.35,"debit","Restaurants","Chase CC"]
["2010-12-21","Amazon","Amazon.com",215.5,"debit","Shopping","Chase CC"]
["2010-12-21","Chevron","CHEVRON 00207403",55.55,"debit","Gas & Fuel","Chase CC"]
["2010-12-21","Amazon","AMAZON MKTPLACE PMTS",59.95,"debit","Shopping","Chase CC"]
["2010-12-21","Wendy's","WENDYS #7750       Q25",3.41,"debit","Fast Food","Chase CC"]
["2010-12-21","Treasures","TREASURE VALLEY FAMILY YM",37.1,"debit","Clothing","Chase CC"]
["2010-12-21","Carl's Jr","CARLJR1100602 11006020",9.9700000000000006,"debit","Fast Food","Chase CC"]
["2010-12-20","Byu Student Id","Debit Card Purchase - BYU STUDENT ID CENTER PROVO UT",10,"debit","Uncategorized","ING Checking"]
["2010-12-20","Orange Julius","Debit Card Purchase - ORANGE JULIUS 6169QPS OREM UT",5.38,"debit","Food & Dining","ING Checking"]
["2010-12-20","Icing North","Debit Card Purchase - THE ICING #3471 350 NORTH MILWAUKEE",20.67,"debit","Uncategorized","ING Checking"]
["2010-12-20","Toys \"R\" Us","Debit Card Purchase - TOYS R US 350 NORTH MILWAUKEE      0000",25.95,"debit","Toys","ING Checking"]
["2010-12-20","Iceberg","Debit Card Purchase - ICEBERG DRIVE INN SAN SANDY UT",9.9,"debit","Restaurants","ING Checking"]
["2010-12-20","Childrens P N","Debit Card Purchase - THE CHILDRENS P 350 N MILWAUKEE, STE #",12.4,"debit","Kids","ING Checking"]
["2010-12-20","Transfer to PRIMARY SAVINGS","External Electronic Withdrawal from MOUNTAIN AMERICA PAMT",265,"debit","Auto Payment","ING Holding"]
["2010-12-20","Withdrawal Transfer Loan","Withdrawal Transfer To Loan 61",265,"debit","Transfer","MACU Savings 1"]
["2010-12-20","Transfer from ING Holding","Deposit ACH ORIGINATION",265,"credit","Transfer","MACU Savings 1"]
["2010-12-20","Harmon's","HARMON'S - OREM",6.17,"debit","Groceries","Chase CC"]
["2010-12-20","Chevron","CHEVRON 00073049",41.98,"debit","Gas & Fuel","Chase CC"]
["2010-12-20","Amazon","AMAZON MKTPLACE PMTS",11.97,"debit","Shopping","Chase CC"]
["2010-12-20","Iceberg Drive Inn","ICEBERG DRIVE-INN- SAN",8.09,"debit","Restaurants","Chase CC"]
["2010-12-19","Allens Super Save","ALLEN'S SUPER SAVE",9.4700000000000006,"debit","Pharmacy","Chase CC"]
["2010-12-19","Texaco","TEXACO 00305131",2.5499999999999998,"debit","Gas & Fuel","Chase CC"]
["2010-12-19","Apple","APL*APPLE ONLINE STORE",34.42,"debit","Electronics & Software","Chase CC"]
["2010-12-19","Amazon","AMAZON MKTPLACE PMTS",2.59,"debit","Shopping","Chase CC"]
["2010-12-19","Gap","GAP #8405/THE",8.3000000000000007,"credit","Clothing","Chase CC"]
["2010-12-19","Bajio Mexican Grill","BAJIO MEXICAN GRILL 00001",8.6,"debit","Fast Food","Chase CC"]
["2010-12-19","Deseret Book","DESERET BOOK CO #30",4.26,"debit","Books","Chase CC"]
["2010-12-19","Amazon","Amazon.com",9.9600000000000009,"debit","Shopping","Chase CC"]
["2010-12-19","Amazon","AMAZON MKTPLACE PMTS",5.95,"debit","Shopping","Chase CC"]
["2010-12-17","Mod Bod","Debit Card Purchase - THE MOD BOD 575 E UNIVERSITY PARKW   000",10.87,"debit","Clothing","ING Checking"]
["2010-12-17","Electronic Deposit Brigham","Electronic Deposit from BRIGHAM YOUNG UN DIR DEP",43.5,"credit","Paycheck","ING Checking"]
["2010-12-17","Questar Gas","External Electronic Withdrawal from Questar Gas Co. QGC",37.94,"debit","Utilities","ING Holding"]
["2010-12-17","Interest Charged Standard","INTEREST CHARGED TO STANDARD PURCH",12.61,"debit","Finance Charge","Citi CC"]
["2010-12-17","Amazon","Amazon.com",26.99,"debit","Shopping","Chase CC"]
["2010-12-17","Best Buy","Best Buy      00007732",18.16,"debit","Electronics & Software","Chase CC"]
["2010-12-17","Rite Aid","RITE AID STORE 6148",19.64,"debit","Pharmacy","Chase CC"]
["2010-12-17","Amazon","Amazon.com",69.489999999999995,"debit","Shopping","Chase CC"]
["2010-12-17","Deposit By","Deposit by Check",100,"credit","Income","MACU Checking"]
["2010-12-17","Transfer to Checking","Withdrawal SWENSEN,AMBER MTYPE: ING DIRECT CO: SWENSEN,AMBER M",1140,"debit","Transfer","MACU Checking"]
["2010-12-16","Transfer from FREE CHECKING","Internet Deposit MOUNTAIN AMERICA FCU checking account XXXXXXXX1875",1140,"credit","Transfer","ING Checking"]
["2010-12-16","Toys \"R\" Us","TOYS 'R' US            OREM         UT",88.66,"debit","Toys","B of A CC"]
["2010-12-16","Costco","COSTCO WHSE #0484 0000 OREM         UT",21.36,"debit","Miscellaneous","B of A CC"]
["2010-12-16","Cafe Rio","CAFE RIO PROVO Q35",9.5399999999999991,"debit","Restaurants","Chase CC"]
["2010-12-16","Wendy's","WENDYS #4710       Q25",2.13,"debit","Fast Food","Chase CC"]
["2010-12-15","Liberty Mutual","External Electronic Withdrawal from LIBERTY MUTUAL PAYMENT",113.16,"debit","Auto Insurance","ING Holding"]
["2010-12-15","Transfer from Checking","ELECTRONIC PAYMENT-THANK YOU",59,"credit","Credit Card Payment","Citi CC"]
["2010-12-15","Children's Place","THECHILDRENSPLACE.COM",54.58,"debit","Clothing","Chase CC"]
["2010-12-15","L & L Hawaiian Barbecue","L and  L Hawaiian Barbequ",10.210000000000001,"debit","Restaurants","Chase CC"]
["2010-12-15","The Barber Shop","BYU BARBERSHOP",15,"debit","Hair","Chase CC"]
["2010-12-15","Blockbuster","BLOCKBUSTER INC#49096",3.19,"debit","Movies & DVDs","Chase CC"]
["2010-12-14","Transfer to Bank of America","Electronic Payment to BANK OF AMERICA",6858.7,"debit","Credit Card Payment","ING Checking"]
["2010-12-14","Paper Church Jesus","Paper Payment to CHURCH OF JESUS CHRIST OF LDS",99.24,"debit","Charity","ING Checking"]
["2010-12-14","Transfer to Amber","Electronic Payment to CITI CARDS",59,"debit","Credit Card Payment","ING Checking"]
["2010-12-14","Transfer from Checking","PAYMENT - ELECTRONIC",6858.7,"credit","Credit Card Payment","B of A CC"]
["2010-12-14","Gas N Go","GAS N GO #2   10019016",35.72,"debit","Groceries","Chase CC"]
["2010-12-14","Gas N Go","GAS N GO #2   10019016",4.8099999999999996,"debit","Groceries","Chase CC"]
["2010-12-13","Transfer from ING Holding","Internet Deposit transferred from OSA XXXX4516",5667.72,"credit","Transfer","ING Checking"]
["2010-12-13","Transfer to Checking","Internet Withdrawal transferred to EO XXXX4669",5667.72,"debit","Transfer","ING Holding"]
["2010-12-13","Savings Deposit Direct","Savings Deposit - Direct Deposit from BENEFIT PAYMENTS DEPOSIT",6218.77,"credit","Paycheck","ING Holding"]
["2010-12-13","Blockbuster","BLOCKBUSTER INC#49096",3.19,"debit","Movies & DVDs","Chase CC"]
["2010-12-13","Target","TARGET        00017541",30.38,"debit","Miscellaneous","Chase CC"]
["2010-12-12","Redbox","REDBOX *DVD RENTAL",0.53,"debit","Movies & DVDs","Chase CC"]
["2010-12-12","Teriyaki Stix","BYU WSC TERIYAKI STIX",6.66,"debit","Restaurants","Chase CC"]
["2010-12-12","RadioShack","RADIOSHACK COR00140269",43.44,"debit","Electronics & Software","Chase CC"]
["2010-12-12","Gap","GAP #8412/THE",55.82,"debit","Clothing","Chase CC"]
["2010-12-12","Byu Wsc L","BYU WSC L&T PRODUCE",10,"debit","Groceries","Chase CC"]
["2010-12-12","Marketplace Iga","MARKETPLACE CAFE",6.62,"debit","Groceries","Chase CC"]
["2010-12-12","Wal-Mart","WALMART.COM",46.64,"debit","Shopping","Chase CC"]
["2010-12-12","Spicy Thai Restaurant","SPICY THAI RESTAURANT",24,"debit","Restaurants","Chase CC"]
["2010-12-12","Subway","BYU WSC SUBWAY",3.78,"debit","Fast Food","Chase CC"]
["2010-12-12","Chevron","CHEVRON 00208662",46.65,"debit","Gas & Fuel","Chase CC"]
["2010-12-10","Amazon","Debit Card Purchase - AMAZON COM AMZN COM BIL WA",16.97,"debit","Shopping","ING Checking"]
["2010-12-10","Deposit Byu Refundtype","Deposit BYU RefundTYPE: UCA CO: BYU Refund",1142,"credit","Income","MACU Checking"]
["2010-12-10","Transfer to Checking","Withdrawal SWENSEN,AMBER MTYPE: ING DIRECT CO: SWENSEN,AMBER M",1950,"debit","Transfer","MACU Checking"]
["2010-12-10","L & L Hawaiian Barbecue","L and  L Hawaiian Barbequ",10.210000000000001,"debit","Restaurants","Chase CC"]
["2010-12-09","Transfer from FREE CHECKING","Internet Deposit MOUNTAIN AMERICA FCU checking account XXXXXXXX1875",1950,"credit","Transfer","ING Checking"]
["2010-12-09","Marketplace Iga","MARKETPLACE CAFE",2.35,"debit","Groceries","Chase CC"]
["2010-12-08","Person Person Laura","Person2Person Payment to Laura or Clayne Larsen",225,"debit","Mortgage & Rent","ING Checking"]
["2010-12-08","Cash","CASH ADVANCE INTEREST CHA",4.66,"debit","Business Services","Chase CC"]
["2010-12-08","Withdrawal Byu Health","Withdrawal BYU Health PmtTYPE: Health CO: BYU Health Pmt",51.3,"debit","Health & Fitness","MACU Checking"]
["2010-12-08","Brigham Young University","BRIGHAM YOUNG UNIV WEB",18,"debit","Education","Chase CC"]
["2010-12-08","Alpine Electronics","ALPINE ELECTRONICS I",50,"debit","Business Services","Chase CC"]
["2010-12-07","Redbox","REDBOX *DVD RENTAL",1.6,"debit","Movies & DVDs","Chase CC"]
["2010-12-06","Cha Ching Here","Cha-ching! Here's your Cash Back",0.92,"credit","Income","ING Checking"]
["2010-12-06","AT&amp;T","External Electronic Withdrawal from AT&T PAYMENT",136.41,"debit","Mobile Phone","ING Holding"]
["2010-12-06","Carl's Jr","CARL'S JR #1101363 QPS PROVO        UT",11.81,"debit","Fast Food","B of A CC"]
["2010-12-06","Wal-Mart","WAL-MART  1768         OREM         UT",135.72999999999999,"debit","Shopping","B of A CC"]
["2010-12-06","Deposit Byu Refundtype","Deposit BYU RefundTYPE: UCA CO: BYU Refund",2023,"credit","Income","MACU Checking"]
["2010-12-06","Papa John's","PAPA JOHNS 1566",27.67,"debit","Fast Food","Chase CC"]
["2010-12-05","Cafe Paesan","CAFE PAESAN",20.38,"debit","Restaurants","Chase CC"]
["2010-12-05","Redbox","REDBOX *DVDRESERVATION",1.6,"debit","Movies & DVDs","Chase CC"]
["2010-12-05","Marketplace Iga","MARKETPLACE CAFE",7.75,"debit","Groceries","Chase CC"]
["2010-12-03","Person Person Laura","Person2Person Payment to Laura or Clayne Larsen",850,"debit","Mortgage & Rent","ING Checking"]
["2010-12-03","Electronic Deposit Brigham","Electronic Deposit from BRIGHAM YOUNG UN DIR DEP",43.5,"credit","Paycheck","ING Checking"]
["2010-12-03","Transfer to Bank of America","Electronic Withdrawal from BK OF AMER VI/MC ONLINE PMT",118,"debit","Credit Card Payment","ING Checking"]
["2010-12-03","JCPenney","JCPENNEY STORE 2770    PROVO        UT",14.93,"credit","Clothing","B of A CC"]
["2010-12-03","Transfer to Checking","Withdrawal SWENSEN,AMBER MTYPE: ING DIRECT CO: SWENSEN,AMBER M",245,"debit","Transfer","MACU Checking"]
["2010-12-02","Transfer from FREE CHECKING","Internet Deposit MOUNTAIN AMERICA FCU checking account XXXXXXXX1875",245,"credit","Transfer","ING Checking"]
["2010-12-02","Interest Charged Purchases","Interest Charged on Purchases",57.81,"debit","Finance Charge","B of A CC"]
["2010-12-01","Transfer to ING Holding","Internet Withdrawal transferred to OSA XXXX4516",136,"debit","Transfer","ING Checking"]
["2010-12-01","Transfer from Checking","Internet Deposit transferred from EO XXXX4669",136,"credit","Transfer","ING Holding"]
["2010-12-01","Transfer from Checking","BA ELECTRONIC PAYMENT",118,"credit","Credit Card Payment","B of A CC"]
["2010-12-01","Crazy Gym Orem","CRAZY 8 #6061 GYM60060 OREM         UT",21.43,"credit","Credit Card Payment","B of A CC"]
["2010-12-01","Fee","TRANSACTION FEE",11.4,"debit","Service Fee","Chase CC"]
["2010-12-01","Cash","CASH CHASE-PROVO WMBFSB",380,"debit","Business Services","Chase CC"]
["2010-12-01","Transfer to Checking","Withdrawal SWENSEN,AMBER MTYPE: ING DIRECT CO: SWENSEN,AMBER M",800,"debit","Transfer","MACU Checking"]
["2010-11-30","Monthly Interest Paid","Monthly Interest Paid",0.02,"credit","Interest Income","ING Checking"]
["2010-11-30","Periodic Finance Charge","Finance Charge Paid for Overdraft",0.03,"debit","Finance Charge","ING Checking"]
["2010-11-30","Transfer from FREE CHECKING","Internet Deposit MOUNTAIN AMERICA FCU checking account XXXXXXXX1875",800,"credit","Transfer","ING Checking"]
["2010-11-30","Monthly Interest Paid","Monthly Interest Paid",0.1,"credit","Interest Income","ING Holding"]
["2010-11-30","Provo City Utili","External Electronic Withdrawal from PROVO CITY UTILI UTIL PAYMT",94.39,"debit","Uncategorized","ING Holding"]
["2010-11-30","Monthly Interest Paid","Monthly Interest Paid",7.0000000000000007E-2,"credit","Interest Income","ING Savings"]
["2010-11-30","Amazon","AMAZON.COM             AMZN.COM/BILLWA",20,"debit","Shopping","B of A CC"]
["2010-11-30","Deposit","Deposit",110,"credit","Income","MACU Checking"]
["2010-11-30","Deposit By","Deposit by Check",132,"credit","Income","MACU Checking"]
["2010-11-30","Commentavg Checking Bal","Transaction COMMENTAvg Checking Bal for Nov $569.74",0,"credit","Income","MACU Checking"]
["2010-11-29","Kohl Orem Ut","KOHL'S #1285 OREM UT",79.849999999999994,"credit","Credit Card Payment","Citi CC"]
["2010-11-29","Scout Com Wa","SCOUT.COM              888-979-0979 WA",9.9499999999999993,"debit","Uncategorized","B of A CC"]
["2010-11-29","Target","TARGET STORE T-1754 17 OREM         UT",71.56,"debit","Miscellaneous","B of A CC"]
["2010-11-29","Target","TARGET STORE T-1754 17 OREM         UT",7.87,"debit","Miscellaneous","B of A CC"]
["2010-11-29","Chevron","CHEVRON EXTRA MART #50 PROVO        UT",51.04,"debit","Gas & Fuel","B of A CC"]
["2010-11-29","Deposit","Deposit",780,"credit","Income","MACU Checking"]
["2010-11-29","Chas Adv ATM","CHAS ADV ATM #UT1114  PRO",400,"debit","Cash & ATM","Chase CC"]
["2010-11-29","Fee","TRANSACTION FEE",12,"debit","Service Fee","Chase CC"]
["2010-11-29","Transfer to Checking","Withdrawal SWENSEN,AMBER MTYPE: ING DIRECT CO: SWENSEN,AMBER M",180,"debit","Transfer","MACU Checking"]
["2010-11-28","Best Buy","Bestbuy.com   00009944",106.74,"debit","Electronics & Software","Chase CC"]
["2010-11-27","Mod Bod","THE MOD BOD 0098001139 OREM         UT",41.54,"debit","Clothing","B of A CC"]
["2010-11-27","Crazy Gym","CRAZY 8 #6061 GYM60060 OREM         UT",55.69,"debit","Gym","B of A CC"]
["2010-11-27","Pretzelmaker","PRETZELMAKER 300001816 OREM         UT",6.65,"debit","Fast Food","B of A CC"]
["2010-11-26","Blickenstaff","BLICKENSTAFF'S PROVO UT",6.11,"debit","Uncategorized","Citi CC"]
["2010-11-26","Consumer Reports","CR *CONSUMERREPORTS.OR 8003330663 NY",5.95,"debit","Books","Citi CC"]
["2010-11-26","Costco","COSTCO WHSE #0484 0000 OREM         UT",44.86,"credit","Miscellaneous","B of A CC"]
["2010-11-26","Transfer from FREE CHECKING","amber bday money - Internet Deposit MOUNTAIN AMERICA FCU checking account XXXXXXXX1875",180,"credit","Transfer","ING Checking"]
["2010-11-25","Chevron","CHEVRON 0203586 PROVO UT",43.68,"debit","Gas & Fuel","Citi CC"]
["2010-11-25","Harmon's","HARMON'S - OREM QPS OREM UT",10.67,"debit","Groceries","Citi CC"]
["2010-11-24","Coffee Pod","COFFEE POD PROVO UT",3.1,"debit","Coffee Shops","Citi CC"]
["2010-11-24","JCPenney","JCPENNEY STORE 2770    PROVO        UT",22.4,"debit","Clothing","B of A CC"]
["2010-11-24","JCPenney","JCPENNEY STORE 2770    PROVO        UT",67.209999999999994,"debit","Clothing","B of A CC"]
["2010-11-24","Deposit By","Deposit by Check",180,"credit","Income","MACU Checking"]
["2010-11-23","Priceline - Hotel","PLN*PRICELINE.COM HTL 800-657-9168 CT",58.2,"debit","Hotel","Citi CC"]
["2010-11-23","Byu Creamery Ninth","BYU CREAMERY ON NINTH PROVO UT",4.3,"debit","Uncategorized","Citi CC"]
["2010-11-23","Mac Neil Automotive Products","MAP*MACNEIL AUTOMOTIVE 800-441-6287 IL",79.95,"debit","Service & Parts","Citi CC"]
["2010-11-23","Costco","COSTCO WHSE #0484 0000 OREM         UT",90.79,"debit","Miscellaneous","B of A CC"]
["2010-11-23","Costco","COSTCO WHSE #0484 0000 OREM         UT",37.26,"debit","Miscellaneous","B of A CC"]
["2010-11-23","Veracity Network Veracity","External Electronic Withdrawal from Veracity Network Veracity N",48.28,"debit","Internet","ING Holding"]
["2010-11-22","Mod Bod","THE MOD BOD QPS OREM UT",19.190000000000001,"debit","Clothing","Citi CC"]
["2010-11-22","Kohl's","KOHL'S #1285 OREM UT",201.37,"debit","Clothing","Citi CC"]
["2010-11-22","Byu Creamery Ninth","BYU CREAMERY ON NINTH PROVO UT",12.27,"debit","Uncategorized","Citi CC"]
["2010-11-22","Hilton","HILTON HOTELS OMAHA OMAHA NE",51.23,"debit","Hotel","Citi CC"]
["2010-11-22","Panda Express","PANDA EXPRESS 455 QPS PROVO UT",9.75,"debit","Fast Food","Citi CC"]
["2010-11-22","Orange Julius","ORANGE JULIUS #6164QPS PROVO UT",3.76,"debit","Restaurants","Citi CC"]
["2010-11-21","Apple","APPLE STORE  #R125",1281.08,"debit","Electronics & Software","Chase CC"]
["2010-11-20","Smith's Food","SMITHS FOOD #4136 QPS PROVO UT",4.78,"debit","Groceries","Citi CC"]
["2010-11-20","Sizzler","SIZZLER 875 PROVO UT",28.37,"debit","Restaurants","Citi CC"]
["2010-11-20","Maceys","MACEYS PROVO PROVO UT",24.6,"debit","Groceries","Citi CC"]
["2010-11-20","Provo Di","PROVO DI PROVO UT",11,"debit","Uncategorized","Citi CC"]
["2010-11-19","Chevron","CHEVRON 0203586 PROVO UT",50.83,"debit","Gas & Fuel","Citi CC"]
["2010-11-19","Wendy's","WENDYS #8261 Q25 SALT LAKE CIT UT",3.2,"debit","Fast Food","Citi CC"]
["2010-11-19","Target American Fork","TARGET 00018143 AMERICAN FORK UT",5.12,"credit","Credit Card Payment","Citi CC"]
["2010-11-19","Ken Garff Honda","KEN GARFF HONDA O OREM UT",130.59,"debit","Service & Parts","Citi CC"]
["2010-11-19","Kracy Mcgees Qps","KRACY MCGEES QPS OMAHA NE",6,"debit","Uncategorized","Citi CC"]
["2010-11-19","Salt Lake City Dept Airports","SALT LAKE CITY DEPT OF SALT LAKE CTY UT",14,"debit","Air Travel","Citi CC"]
["2010-11-19","Wendy's","WENDYS #8261 Q25 SALT LAKE CIT UT",4.62,"debit","Fast Food","Citi CC"]
["2010-11-19","Delta","DELTA 00682304231066 OMAHA NE",25,"debit","Air Travel","Citi CC"]
["2010-11-19","Electronic Deposit Brigham","Electronic Deposit from BRIGHAM YOUNG UN DIR DEP",101.5,"credit","Paycheck","ING Checking"]
["2010-11-19","ATM Withdrawal","ATM Withdrawal - CARDTRONICSLPC  AMERICAN FORK, UT US",40,"debit","Cash & ATM","ING Checking"]
["2010-11-18","ATM Fee","ATM Withdrawal - 1219 SOUTH 800 EAST  OREM, UT US",1.5,"debit","ATM Fee","ING Checking"]
["2010-11-18","ATM Withdrawal","ATM Withdrawal - 1219 SOUTH 800 EAST  OREM, UT US",80,"debit","Cash & ATM","ING Checking"]
["2010-11-17","Great Ame Bage","GREAT AME BAGE30551303 SALT LAKECITY UT",5.71,"debit","Fast Food","Citi CC"]
["2010-11-17","Maceys","MACEYS PROVO PROVO UT",5.41,"debit","Groceries","Citi CC"]
["2010-11-17","Delta","DELTA 00682295957814 SALT LAKE CTY UT",23,"debit","Air Travel","Citi CC"]
["2010-11-17","Subway","SUBWAY 03024239 PROVO UT",10.97,"debit","Fast Food","Citi CC"]
["2010-11-17","Air Terminal Gifts","AIR TERMINAL GIFTS QPS SALT LAKE CIT UT",1.84,"debit","Gift","Citi CC"]
["2010-11-17","Chevron","CHEVRON 0208662 PROVO UT",28.62,"debit","Gas & Fuel","Citi CC"]
["2010-11-17","Marketplace Iga","MARKETPLACE CAFE PROVO UT",8.2799999999999994,"debit","Groceries","Citi CC"]
["2010-11-17","Costco","COSTCO WHSE #0484 0000 OREM         UT",23.95,"debit","Miscellaneous","B of A CC"]
["2010-11-17","Cascade Collision Repair","WithdrawalCASCADE COLLISION REPA OREM UT Date 11/15/10 24071050320987153980115 7531",1000,"debit","Service & Parts","MACU Checking"]
["2010-11-17","Newegg","WWW.NEWEGG.COM 800-390-1119 CA",90.98,"debit","Electronics & Software","Citi CC"]
["2010-11-17","Interest Charged Standard","INTEREST CHARGED TO STANDARD PURCH",8.48,"debit","Finance Charge","Citi CC"]
["2010-11-17","Liberty Mutual","External Electronic Withdrawal from LIBERTY MUTUAL PAYMENT",113.16,"debit","Auto Insurance","ING Holding"]
["2010-11-17","Questar Gas","External Electronic Withdrawal from Questar Gas Co. QGC",24.02,"debit","Utilities","ING Holding"]
["2010-11-16","Marketplace Iga","MARKETPLACE CAFE PROVO UT",2.0299999999999998,"debit","Groceries","Citi CC"]
["2010-11-16","Marketplace Iga","MARKETPLACE CAFE PROVO UT",4.3099999999999996,"debit","Groceries","Citi CC"]
["2010-11-16","Transfer to Checking","Withdrawal SWENSEN,AMBER MTYPE: ING DIRECT CO: SWENSEN,AMBER M",253,"debit","Transfer","MACU Checking"]
["2010-11-15","Smith's Food","SMITHS FOOD #4136 QPS PROVO UT",16,"debit","Groceries","Citi CC"]
["2010-11-15","Honks","HONKS 25 QPS PROVO UT",9.61,"debit","Shopping","Citi CC"]
["2010-11-15","Toys \"R\" Us","TOYS R US #5689 QPS OREM UT",5.33,"debit","Toys","Citi CC"]
["2010-11-15","Marketplace Iga","MARKETPLACE CAFE PROVO UT",2.1,"debit","Groceries","Citi CC"]
["2010-11-15","Wendy's","WENDYS #4710 Q25 PROVO UT",12.91,"debit","Fast Food","Citi CC"]
["2010-11-15","Transfer from FREE CHECKING","Internet Deposit MOUNTAIN AMERICA FCU checking account XXXXXXXX1875",253,"credit","Transfer","ING Checking"]
["2010-11-15","Transfer to Amber","Electronic Withdrawal from CITI CARD ONLINE PAYMENT",39,"debit","Credit Card Payment","ING Checking"]
["2010-11-13","Steve Crest","STEVE'S CREST PROVO UT",14.2,"debit","Uncategorized","Citi CC"]
["2010-11-13","Immaculate Heart Relig","IMMACULATE HEART RELIG DRAPER UT",3.73,"debit","Uncategorized","Citi CC"]
["2010-11-12","Withdrawal Transfer Loan","Withdrawal Transfer To Loan 61",265,"debit","Transfer","MACU Checking"]
["2010-11-12","Chili's","CHILI'S TO GO 10338150 DETROIT MI",12.01,"debit","Restaurants","Citi CC"]
["2010-11-12","Delta","DELTA 00625136381454 APPLETON WI",25,"debit","Air Travel","Citi CC"]
["2010-11-12","Chevron","CHEVRON 0305397 Q61 LEHI UT",2.66,"debit","Gas & Fuel","Citi CC"]
["2010-11-12","Salt Lake City Dept Airports","SALT LAKE CITY DEPT OF SALT LAKE CTY UT",56,"debit","Air Travel","Citi CC"]
["2010-11-12","Copperleaf Hotel","COPPERLEAF HOTEL QPS APPLETON WI",17.149999999999999,"debit","Hotel","Citi CC"]
["2010-11-12","Transfer from Checking","CLICK-TO-PAY PAYMENT, THANK YOU",39,"credit","Credit Card Payment","Citi CC"]
["2010-11-12","Chs Atw Main","CHS @ ATW MAIN00995076 APPLETON WI",3,"debit","Uncategorized","Citi CC"]
["2010-11-12","Transfer from ING Savings","Internet Deposit transferred from OSA XXXX3822",223.44,"credit","Transfer","ING Holding"]
["2010-11-12","Transfer to ING Holding","Internet Withdrawal transferred to OSA XXXX4516",223.44,"debit","Transfer","ING Savings"]
["2010-11-11","F Lakeside N","F15 LAKESIDE N20356093 ST PAUL MN",2.46,"debit","Uncategorized","Citi CC"]
["2010-11-11","Air Terminal Gifts","AIR TERMINAL GIFTS QPS SALT LAKE CIT UT",1.84,"debit","Gift","Citi CC"]
["2010-11-11","California Pizza Kitchen","CALIFORNIA PIZ30553218 SALT LAKECITY UT",9.8000000000000007,"debit","Restaurants","Citi CC"]
["2010-11-11","Chili's","CHILI'S - M MS20350724 ST PAUL MN",18,"debit","Restaurants","Citi CC"]
["2010-11-11","Delta","DELTA 00682299069583 SALT LAKE CTY UT",23,"debit","Air Travel","Citi CC"]
["2010-11-11","Wendy's","WENDYS #8260 Q25 DRAPER UT",8.9600000000000009,"debit","Fast Food","Citi CC"]
["2010-11-11","McDonald's","MCDONALD'S F11655 MURRAY UT",3.24,"debit","Fast Food","Citi CC"]
["2010-11-10","Buehler's Buy-Low","BUY LOW MARKET PROVO UT",22.4,"debit","Groceries","Citi CC"]
["2010-11-10","Marketplace Iga","MARKETPLACE CAFE PROVO UT",9.35,"debit","Groceries","Citi CC"]
["2010-11-10","Brigham Young Univ Senior","BRIGHAM YOUNG UNIV. PROVO UT",2,"debit","Education","Citi CC"]
["2010-11-10","Byu Barbershop","Debit Card Purchase - BYU BARBERSHOP PROVO UT",15,"debit","Hair","ING Checking"]
["2010-11-10","J Dawgs","Debit Card Purchase - J DAWGS RESTAURANTS LL PROVO UT",4,"debit","Restaurants","ING Checking"]
["2010-11-10","Brigham Young University","Debit Card Purchase - BRIGHAM YOUNG UNIV WEB 01111111111 UT",14,"debit","Education","ING Checking"]
["2010-11-09","Marketplace Iga","MARKETPLACE CAFE PROVO UT",1.72,"debit","Groceries","Citi CC"]
["2010-11-09","Target Orem Ut","TARGET 00017541 OREM UT",3.21,"credit","Credit Card Payment","Citi CC"]
["2010-11-09","Spicy Thai Restauraqps","Debit Card Purchase - SPICY THAI RESTAURAQPS PROVO UT",11.61,"debit","Restaurants","ING Checking"]
["2010-11-09","Redbox","Debit Card Purchase - REDBOX DVD RENTAL 866 733 2693 IL",2.14,"debit","Movies & DVDs","ING Checking"]
["2010-11-08","Costco","COSTCO WHSE #0484 0000 OREM         UT",105.01,"debit","Miscellaneous","B of A CC"]
["2010-11-08","Deposit","Deposit",1296.6300000000001,"credit","Income","MACU Checking"]
["2010-11-08","Microsoft XBox Live","MICROSOFT *XBOX LIVE 08003865550 WA",9.99,"debit","Electronics & Software","Citi CC"]
["2010-11-08","Smith's Tix","SMITHS TIX WEB 801-4671055 UT",51.6,"debit","Entertainment","Citi CC"]
["2010-11-08","Target","TARGET 00017541 OREM UT",80.069999999999993,"debit","Miscellaneous","Citi CC"]
["2010-11-08","iTunes","APL*ITUNES 866-712-7753 CA",6.33,"debit","Music","Citi CC"]
["2010-11-08","Taylor's Bike Shop","Debit Card Purchase - TAYLOR S BIKE SHOP PROVO UT",16,"debit","Sporting Goods","ING Checking"]
["2010-11-08","Byu Creamery Ninth","Debit Card Purchase - BYU CREAMERY ON NINTH PROVO UT",8.5299999999999994,"debit","Uncategorized","ING Checking"]
["2010-11-08","Marketplace Iga","Debit Card Purchase - MARKETPLACE CAFE PROVO UT",2.89,"debit","Groceries","ING Checking"]
["2010-11-07","Marketplace Iga","Debit Card Purchase - MARKETPLACE CAFE PROVO UT",1.72,"debit","Groceries","ING Checking"]
["2010-11-06","AutoZone","AUTOZONE #0865 PROVO UT",88.25,"debit","Service & Parts","Citi CC"]
["2010-11-06","AutoZone","AUTOZONE #0865 QPS PROVO UT",9.6,"debit","Service & Parts","Citi CC"]
["2010-11-05","iTunes","APL*ITUNES 866-712-7753 CA",7.47,"debit","Music","Citi CC"]
["2010-11-05","Goodwood Barbecue","GOODWOOD BARBECUE CO OREM UT",44,"debit","Restaurants","Citi CC"]
["2010-11-05","Electronic Deposit","Electronic Deposit",68.88,"credit","Income","ING Checking"]
["2010-11-05","External Electronic Withdrawal","External Electronic Withdrawal",76.680000000000007,"debit","Uncategorized","ING Holding"]
["2010-11-03","Wendy's","WENDYS #5263 Q25 OREM UT",3.53,"debit","Fast Food","Citi CC"]
["2010-11-03","Byu Creamery Ninth","BYU CREAMERY ON NINTH PROVO UT",5.33,"debit","Uncategorized","ING Checking"]
["2010-11-03","Cha Ching Here","Cha-ching! Here's your Cash Back",3.27,"credit","Income","ING Checking"]
["2010-11-02","iTunes","APL*ITUNES 866-712-7753 CA",10.65,"debit","Music","Citi CC"]
["2010-11-02","Electronic Withdrawal","Electronic Withdrawal",25,"debit","Uncategorized","ING Checking"]
["2010-11-02","External Electronic Withdrawal","External Electronic Withdrawal",112.13,"debit","Uncategorized","ING Holding"]
["2010-11-02","Interest Charged Purchases","Interest Charged on Purchases",57.06,"debit","Finance Charge","B of A CC"]
["2010-11-01","Target","TARGET 00017541 OREM UT",31.96,"debit","Miscellaneous","Citi CC"]
["2010-11-01","Chevron","CHEVRON 0204564 LEHI UT",50.94,"debit","Gas & Fuel","Citi CC"]
["2010-11-01","Marketplace Iga","MARKETPLACE CAFE PROVO UT - Deb",9.35,"debit","Groceries","ING Checking"]
["2010-11-01","Marketplace Iga","MARKETPLACE CAFE PROVO UT - Deb",1.07,"debit","Groceries","ING Checking"]
["2010-11-01","Interest Paid For","Interest paid for overdraft Int",0.03,"debit","Bank Fee","ING Checking"]
["2010-10-31","Commentavg Checking Bal","Transaction COMMENTAvg Checking Bal for Oct $128.95",0,"credit","Income","MACU Checking"]
["2010-10-31","Wendy's","WENDYS 12 Q25 MOUNTAIN HOME ID",1.26,"debit","Fast Food","Citi CC"]
["2010-10-31","Pilot Travel Center","PILOT 00007740 SNOWVILLE UT",3.94,"debit","Gas & Fuel","Citi CC"]
["2010-10-31","Chevron","CHEVRON 0208859 Q61 MERIDIAN ID",4,"debit","Gas & Fuel","Citi CC"]
["2010-10-31","McDonald's","MCDONALD'S F23720 MERIDIAN ID",4.6500000000000004,"debit","Fast Food","Citi CC"]
["2010-10-31","Chevron","CHEVRON 0208859 MERIDIAN ID",49.97,"debit","Gas & Fuel","Citi CC"]
["2010-10-31","Person Person Laura","Person2Person Payment to Laura",1075,"debit","Mortgage & Rent","ING Checking"]
["2010-10-31","Transfer from ING Savings","Internet Deposit",1001,"credit","Transfer","ING Checking"]
["2010-10-31","Interest Paid","Interest Paid",0.04,"credit","Interest Income","ING Checking"]
["2010-10-31","Interest Paid","Interest Paid",0.44,"credit","Interest Income","ING Holding"]
["2010-10-31","Transfer to Checking","Internet Withdrawal",1001,"debit","Transfer","ING Savings"]
["2010-10-31","Interest Paid","Interest Paid",1.0900000000000001,"credit","Interest Income","ING Savings"]
["2010-10-31","Transfer from Checking","BA ELECTRONIC PAYMENT",25,"credit","Credit Card Payment","B of A CC"]
["2010-10-30","Savers","SAVERS 1033 BOISE ID",60.95,"debit","Shopping","Citi CC"]
["2010-10-30","Good Times Dr","GOOD TIMES DR THRU 128 BOISE ID",8.14,"debit","Uncategorized","Citi CC"]
["2010-10-30","Maverik","MAVERIK CTRY STRE #2 BOISE ID",10.050000000000001,"debit","Gas & Fuel","Citi CC"]
["2010-10-29","Arby's","ARBY'S QQ52 CENTERVILLE UT",3.11,"debit","Fast Food","Citi CC"]
["2010-10-29","Chevron","CHEVRON 0073049 PROVO UT",52.14,"debit","Gas & Fuel","Citi CC"]
["2010-10-29","Carl's Jr","CARLJR1100602 11006020 CENTERVILLE UT",4.72,"debit","Fast Food","Citi CC"]
["2010-10-29","Fsprg Com Ca","FSPRG.COM877-327-89 08773278914 CA",29.95,"debit","Uncategorized","Citi CC"]
["2010-10-29","Scera","SCERA THEATRE QPS OREM UT - Deb",4.5,"debit","Charity","ING Checking"]
["2010-10-29","Marketplace Iga","MARKETPLACE CAFE PROVO UT - Deb",1.08,"debit","Fast Food","ING Checking"]
["2010-10-27","Marketplace Iga","MARKETPLACE CAFE PROVO UT - Deb",1.72,"debit","Fast Food","ING Checking"]
["2010-10-26","ShopKo","SHOPKO 00500868 PROVO UT",16.010000000000002,"debit","Shopping","Citi CC"]
["2010-10-26","Children's Place","THE CHILDRENS PLACE #0 OREM UT",23.5,"credit","Clothing","Citi CC"]
["2010-10-26","Wendy's","WENDYS #4710 Q25 PROVO UT",7.95,"debit","Fast Food","Citi CC"]
["2010-10-26","Fabric.com","ACI*FABRIC.COM 888-455-2940 GA",48.26,"debit","Arts","Citi CC"]
["2010-10-26","Consumer Reports","CR *CONSUMERREPORTS.OR 8003330663 NY",5.95,"debit","Books","Citi CC"]
["2010-10-25","Rue 21","RUE 21 360 PROVO UT",6.39,"debit","Clothing","Citi CC"]
["2010-10-25","Chicago Transit Authority","CTA-MADISON/MONROE/DEA CHICAGO IL",5,"debit","Public Transportation","Citi CC"]
["2010-10-25","Children's Place","THE CHILDRENS PLACE #0 OREM UT",9.08,"debit","Clothing","Citi CC"]
["2010-10-25","Scout Com Wa","SCOUT.COM              888-979-0979 WA",9.9499999999999993,"debit","Uncategorized","B of A CC"]
["2010-10-24","United","UNITED 0164514454002 CHICAGO IL",25,"debit","Uncategorized","Citi CC"]
["2010-10-24","Chi Taxi Med","CHI TAXI MED 1445 QPS CHICAGO IL",9.3000000000000007,"debit","Rental Car & Taxi","Citi CC"]
["2010-10-24","Congress Plaza Hotel","CONGRESS PLAZA HOTEL C CHICAGO IL",640.45000000000005,"debit","Home Improvement","Citi CC"]
["2010-10-23","Mccormick Place","MCCORMICK PLAC10275402 CHICAGO IL",10.82,"debit","Business Services","Citi CC"]
["2010-10-23","Amazon","Amazon.com AMZN.COM/BILL WA",14.99,"credit","Shopping","Citi CC"]
["2010-10-22","Mccormick Place","MCCORMICK PLAC10275402 CHICAGO IL",12.49,"debit","Business Services","Citi CC"]
["2010-10-22","Payless ShoeSource","PAYLESSSHOESOU00056879 PROVO UT",16,"debit","Clothing","Citi CC"]
["2010-10-22","Just Us","JUST US GIRLS, LLC QPS WEST JORDAN UT",17.63,"debit","Electronics & Software","Citi CC"]
["2010-10-22","Bewitched Bootique Qps","BEWITCHED BOOTIQUE QPS WEST JORDAN UT",5.33,"debit","Uncategorized","Citi CC"]
["2010-10-22","Federal Express","FEDEX OFFICE #5052 CHICAGO IL",6.92,"debit","Shipping","Citi CC"]
["2010-10-22","Dunkin Donuts","DUNKIN #339728 Q35 CHICAGO IL",6.9,"debit","Coffee Shops","Citi CC"]
["2010-10-22","Hot Dog On A Stick","HOT DOG ON A STICK #17 PROVO UT",9.9700000000000006,"debit","Restaurants","Citi CC"]
["2010-10-22","Electronic Deposit","Electronic Deposit",159.5,"credit","Income","ING Checking"]
["2010-10-21","Priceline - Hotel","PLN*PRICELINE.COM HTL 800-657-9168 CT",679.64,"credit","Hotel","Citi CC"]
["2010-10-21","Kraftemplstore","KRAFTEMPLSTORE30024913 GLENVIEW IL",7.01,"debit","Uncategorized","Citi CC"]
["2010-10-21","Subway","SUBWAY 00230896 MORTON GROVE IL",5.61,"debit","Fast Food","Citi CC"]
["2010-10-21","Congress Plaza Hotel","CONGRESS PLAZA HOTEL C CHICAGO IL",195.03,"debit","Home Improvement","Citi CC"]
["2010-10-21","Panera Bread","PANERA BREAD #1004 CHICAGO IL",6.32,"debit","Fast Food","Citi CC"]
["2010-10-21","Priceline - Hotel","PLN*PRICELINE.COM HTL 800-657-9168 CT",26.2,"credit","Hotel","Citi CC"]
["2010-10-21","Federal Express","FEDEX OFFICE #5052 QPS CHICAGO IL",8.65,"debit","Shipping","Citi CC"]
["2010-10-21","Ross","ROSS STORES 751 OREM UT - Debit",19.21,"debit","Clothing","ING Checking"]
["2010-10-21","Regal Lager Ga","REGAL LAGER 07709555060 GA - De",2.41,"debit","Uncategorized","ING Checking"]
["2010-10-21","Laundry Plus","LAUNDRY PLUS PROVO UT - Debit",37.36,"debit","Laundry","ING Checking"]
["2010-10-21","Lds Orem Center","LDS OREM CENTER 767 OREM UT - D",35.5,"debit","Uncategorized","ING Checking"]
["2010-10-21","The Barber Shop","BYU BARBERSHOP PROVO UT - Debit",15,"debit","Hair","ING Checking"]
["2010-10-20","Withdrawal Transfer Loan","Withdrawal Transfer To Loan 61",265,"debit","Transfer","MACU Savings 1"]
["2010-10-20","Transfer from ING Holding","Deposit ACH ORIGINATION",265,"credit","Transfer","MACU Savings 1"]
["2010-10-20","Air Terminal Gifts","AIR TERMINAL GIFTS QPS SALT LAKE CIT UT",4.26,"debit","Gift","Citi CC"]
["2010-10-20","Burger King","BURGER KING QPS SALT LAKECITY UT",7.43,"debit","Fast Food","Citi CC"]
["2010-10-20","Chevron","CHEVRON 0357355 SALT LAKE CIT UT",50.19,"debit","Gas & Fuel","Citi CC"]
["2010-10-20","Amazon","AMAZON MKTPLACE PMTS AMZN COM B",35.99,"debit","Shopping","ING Checking"]
["2010-10-20","Amazon","AMAZON MKTPLACE PMTS AMZN COM B",5.85,"debit","Shopping","ING Checking"]
["2010-10-20","Transfer to PRIMARY SAVINGS","External Electronic Withdrawal",265,"debit","Auto Payment","ING Holding"]
["2010-10-19","Deposit","Deposit",231.28,"credit","Income","MACU Checking"]
["2010-10-19","Interest Charged Standard","INTEREST CHARGED TO STANDARD PURCH",4.7699999999999996,"debit","Finance Charge","Citi CC"]
["2010-10-19","Panda Express","PANDA EXPRESS 724 QPS PROVO UT",9,"debit","Fast Food","ING Checking"]
["2010-10-19","Veracity Network Veracity","External Electronic Withdrawal",48.28,"debit","Internet","ING Holding"]
["2010-10-18","Central Utah Electroni","CENTRAL UTAH ELECTRONI PROVO UT",20.29,"debit","Uncategorized","ING Checking"]
["2010-10-18","Central Utah Electroni","CENTRAL UTAH ELECTRONI PROVO UT",3.69,"debit","Uncategorized","ING Checking"]
["2010-10-18","External Electronic Withdrawal","External Electronic Withdrawal",21.06,"debit","Uncategorized","ING Holding"]
["2010-10-17","iTunes","APL*ITUNES 866-712-7753 CA",15.44,"debit","Music","Citi CC"]
["2010-10-17","Chevron","CHEVRON 0305397 LEHI UT - Debit",52.02,"debit","Gas & Fuel","ING Checking"]
["2010-10-17","Marketplace Iga","MARKETPLACE CAFE PROVO UT - Deb",1.72,"debit","Fast Food","ING Checking"]
["2010-10-17","RadioShack","RADIOSHACK COR00140293 OREM UT",4.26,"debit","Electronics & Software","ING Checking"]
["2010-10-15","IKEA","IKEA DRAPER DRAPER UT",216.87,"debit","Furnishings","Citi CC"]
["2010-10-15","Marketplace Iga","MARKETPLACE CAFE PROVO UT - Deb",2.67,"debit","Fast Food","ING Checking"]
["2010-10-15","Byu Wsc L","BYU WSC L T PRODUCE PROVO UT -",5.7,"debit","Groceries","ING Checking"]
["2010-10-15","Liberty Mutual","External Electronic Withdrawal",113.16,"debit","Auto Insurance","ING Holding"]
["2010-10-14","Amazon","Amazon.com AMZN.COM/BILL WA",14.99,"debit","Shopping","Citi CC"]
["2010-10-14","Amazon","Amazon.com AMZN.COM/BILL WA",29.95,"debit","Shopping","Citi CC"]
["2010-10-14","Wal-Mart","WAL-MART #1768 QPS OREM UT",13.62,"debit","Shopping","Citi CC"]
["2010-10-14","Marketplace Iga","MARKETPLACE CAFE PROVO UT - Deb",1.08,"debit","Fast Food","ING Checking"]
["2010-10-14","Children's Place","THECHILDRENSPLACE COM 020155826",52.46,"debit","Clothing","ING Checking"]
["2010-10-13","Lenscrafters","LENSCRAFTERS  002442 5 PROVO        UT",208.13,"debit","Eyecare","B of A CC"]
["2010-10-12","Priceline - Hotel","PLN*PRICELINE.COM HTL 800-657-9168 CT",705.84,"debit","Hotel","Citi CC"]
["2010-10-12","Children's Place","THECHILDRENSPLACE COM 020155826",19.649999999999999,"debit","Clothing","ING Checking"]
["2010-10-12","Marketplace Iga","MARKETPLACE CAFE PROVO UT - Deb",8.0500000000000007,"debit","Fast Food","ING Checking"]
["2010-10-10","Marketplace Iga","MARKETPLACE CAFE PROVO UT - Deb",3.7,"debit","Fast Food","ING Checking"]
["2010-10-08","Electronic Deposit","Electronic Deposit",174,"credit","Income","ING Checking"]
["2010-10-07","MCM Electronics","MCM ELECTRONICS INC CENTERVILLE OH",30.45,"debit","Electronics & Software","Citi CC"]
["2010-10-07","Natl Society Hispan","NATL SOCIETY OF HISPAN 877-469-4622 TX",195,"debit","Uncategorized","Citi CC"]
["2010-10-07","Marketplace Iga","MARKETPLACE CAFE PROVO UT - Deb",1.72,"debit","Fast Food","ING Checking"]
["2010-10-06","Marketplace Iga","MARKETPLACE CAFE PROVO UT - Deb",6.24,"debit","Fast Food","ING Checking"]
["2010-10-06","Chevron","CHEVRON 0073049 PROVO UT - Debit",49.23,"debit","Gas & Fuel","ING Checking"]
["2010-10-05","Transfer to ING Savings","Withdrawal SWENSEN,AMBER MTYPE: ING DIRECT CO: SWENSEN,AMBER M",129,"debit","Transfer","MACU Checking"]
["2010-10-05","Transfer from Checking","ELECTRONIC PAYMENT-THANK YOU",50,"credit","Credit Card Payment","Citi CC"]
["2010-10-04","Transfer from FREE CHECKING","Internet Deposit MOUNTAIN AMERI",129,"credit","Transfer","ING Savings"]
["2010-10-04","Marketplace Iga","MARKETPLACE CAFE PROVO UT - Deb",0.96,"debit","Fast Food","ING Checking"]
["2010-10-04","Transfer to Bank of America","Electronic Payment to BANK OF A",100,"debit","Credit Card Payment","ING Checking"]
["2010-10-04","Smiths","SMITHS 45 SOUTH STATE",15.47,"debit","Groceries","ING Checking"]
["2010-10-04","Transfer to Amber","Electronic Payment to CITI CARDS",50,"debit","Credit Card Payment","ING Checking"]
["2010-10-04","Marketplace Iga","MARKETPLACE CAFE PROVO UT - Deb",1.82,"debit","Fast Food","ING Checking"]
["2010-10-04","Transfer from Checking","PAYMENT - ELECTRONIC",100,"credit","Credit Card Payment","B of A CC"]
["2010-10-03","Pioneer Family Medicine","PIONEER FAMILY MEDICIN BOISE ID",75.959999999999994,"debit","Doctor","ING Checking"]
["2010-10-02","Interest Charged Purchases","Interest Charged on Purchases",54.55,"debit","Finance Charge","B of A CC"]
["2010-10-02","Cardtronics Ccsb","CARDTRONICS CCSB  OREM, UT US -",400,"debit","Uncategorized","ING Checking"]
["2010-10-02","Cardtronics Ccsb","CARDTRONICS CCSB  OREM, UT US -",60,"debit","Uncategorized","ING Checking"]
["2010-10-01","Transfer from ING Savings","Internet Deposit",60,"credit","Transfer","ING Checking"]
["2010-10-01","Transfer from ING Savings","Internet Deposit",207,"credit","Transfer","ING Checking"]
["2010-10-01","Person Person Laura","Person2Person Payment to Laura",1075,"debit","Mortgage & Rent","ING Checking"]
["2010-10-01","Smiths","SMITHS 350 N. FREEDOM",12.79,"debit","Groceries","ING Checking"]
["2010-10-01","Transfer from ING Holding","Internet Deposit",1075,"credit","Transfer","ING Checking"]
["2010-10-01","Interest Paid For","Interest paid for overdraft Int",0.04,"debit","Bank Fee","ING Checking"]
["2010-10-01","Transfer from ING Holding","Internet Deposit",150,"credit","Transfer","ING Checking"]
["2010-10-01","Transfer from ING Savings","Internet Deposit",40,"credit","Transfer","ING Holding"]
["2010-10-01","Transfer to Checking","Internet Withdrawal",1075,"debit","Transfer","ING Holding"]
["2010-10-01","Transfer to Checking","Internet Withdrawal",150,"debit","Transfer","ING Holding"]
["2010-10-01","Transfer to Checking","Internet Withdrawal",207,"debit","Transfer","ING Savings"]
["2010-10-01","Transfer to Checking","Internet Withdrawal",60,"debit","Transfer","ING Savings"]
["2010-10-01","Transfer to ING Holding","Internet Withdrawal",40,"debit","Transfer","ING Savings"]
["2010-09-30","Commentavg Checking Bal","Transaction COMMENTAvg Checking Bal for Sep $264.42",0,"credit","Income","MACU Checking"]
["2010-09-30","Monthly Interest Paid","Monthly Interest Paid",0.13,"credit","Interest Income","ING Checking"]
["2010-09-30","Monthly Interest Paid","Monthly Interest Paid",1.88,"credit","Interest Income","ING Holding"]
["2010-09-30","Monthly Interest Paid","Monthly Interest Paid",1.35,"credit","Interest Income","ING Savings"]
["2010-09-30","Interest Paid","Interest Paid",0.13,"credit","Interest Income","ING Checking"]
["2010-09-30","Interest Paid","Interest Paid",1.88,"credit","Interest Income","ING Holding"]
["2010-09-30","External Electronic Withdrawal","External Electronic Withdrawal",161.91,"debit","Uncategorized","ING Holding"]
["2010-09-30","Interest Paid","Interest Paid",1.35,"credit","Interest Income","ING Savings"]
["2010-09-29","Amazon","AMAZON COM AMZN COM BIL WA - De",35.54,"debit","Hair","ING Checking"]
["2010-09-28","Deposit Half Comtype","Deposit HALF.COMTYPE: PAYMENTS CO: HALF.COM",129.08000000000001,"credit","Income","MACU Checking"]
["2010-09-27","Airport","LAX AIRPORT BACKLOT DE LOS ANGE",3.68,"debit","Air Travel","ING Checking"]
["2010-09-27","Cafe Crepe","CAFE CREPE QPS SANTA MONICA CA",21.19,"debit","Restaurants","ING Checking"]
["2010-09-27","Texaco","TEXACO 0305131 OREM UT - Debit",32.840000000000003,"debit","Gas & Fuel","ING Checking"]
["2010-09-27","El Paseo Cafe","EL PASEO CAFE TE LOS ANGELES CA",12.01,"debit","Restaurants","ING Checking"]
["2010-09-27","Aramark","ARAMARK LOS ANGELES CO LOS ANGE",4.66,"debit","Food & Dining","ING Checking"]
["2010-09-26","Consumer Reports","CR *CONSUMERREPORTS.OR 8003330663 NY",5.95,"debit","Books","Citi CC"]
["2010-09-26","Aramark","ARAMARK LOS ANGELES CO LOS ANGE",24.69,"debit","Food & Dining","ING Checking"]
["2010-09-26","Domino's Pizza","DOMINO S PIZZA 08376 0111111111",15.75,"debit","Fast Food","ING Checking"]
["2010-09-26","Smiths","SMITHS 350 N. FREEDOM",11.27,"debit","Groceries","ING Checking"]
["2010-09-26","Aramark","ARAMARK LOS ANGELES CO LOS ANGE",4.66,"debit","Food & Dining","ING Checking"]
["2010-09-25","Chevron","CHEVRON/PWI #95 CHEVRON/PWI #95",7.06,"debit","Gas & Fuel","ING Checking"]
["2010-09-25","H&M","H & M 1452 THIRD ST PROMENAD",14.21,"debit","Clothing","ING Checking"]
["2010-09-24","Southwest","SOUTHWES5xxxxxxxxxxxx4359792 TX",80,"debit","Air Travel","Citi CC"]
["2010-09-24","Scout Com Wa","SCOUT.COM              888-979-0979 WA",9.9499999999999993,"debit","Uncategorized","B of A CC"]
["2010-09-24","El Pollo Loco","EL POLLO LOCO 5400QPS ANAHEIM C",6.51,"debit","Fast Food","ING Checking"]
["2010-09-24","Transfer to ING Savings","Internet Withdrawal",326,"debit","Transfer","ING Checking"]
["2010-09-24","Electronic Deposit","Electronic Deposit",145,"credit","Income","ING Checking"]
["2010-09-24","Transfer to ING Savings","Internet Withdrawal",1074,"debit","Transfer","ING Holding"]
["2010-09-24","Transfer from Checking","Internet Deposit",326,"credit","Transfer","ING Savings"]
["2010-09-24","Transfer from ING Holding","Internet Deposit",1074,"credit","Transfer","ING Savings"]
["2010-09-23","CVS","CVS 09647 09647 - Debit",35.75,"debit","Miscellaneous","ING Checking",null,"Rick"]
["2010-09-23","Ralphs","RALPHS 645 W. 9TH ST.",31.23,"debit","Groceries","ING Checking"]
["2010-09-23","Federal Express","FEDEX OFFICE 3702 QPS GLENDALE",4.97,"debit","Shipping","ING Checking"]
["2010-09-23","Nestle","NESTLE C STORE12115002 GLENDALE",2.46,"debit","Food & Dining","ING Checking"]
["2010-09-23","Marketplace Iga","MARKETPLACE CAFE PROVO UT - Deb",6.45,"debit","Fast Food","ING Checking"]
["2010-09-23","Grenatos Deli Qps","GRENATOS DELI 30554QPS SALT LAK",10.98,"debit","Restaurants","ING Checking"]
["2010-09-22","Marketplace Iga","MARKETPLACE CAFE PROVO UT - Deb",2.66,"debit","Fast Food","ING Checking"]
["2010-09-21","Smiths","SMITHS 45 SOUTH STATE",7.35,"debit","Groceries","ING Checking",null,"birthday stuff for karl"]
["2010-09-21","Screamin Coupons Coqps","SCREAMIN COUPONS COQPS 800 6559",25,"debit","Uncategorized","ING Checking"]
["2010-09-21","Transfer to Amber","Electronic Withdrawal",40,"debit","Credit Card Payment","ING Checking"]
["2010-09-21","Rite Aid","RITE AID CORP. RIVERSIDE PLAZA",12.04,"debit","Miscellaneous","ING Checking",null,"bandages for rick's foot"]
["2010-09-21","Veracity Network Veracity","External Electronic Withdrawal",48.28,"debit","Internet","ING Holding"]
["2010-09-20","Transfer from Checking","CLICK-TO-PAY PAYMENT, THANK YOU",40,"credit","Credit Card Payment","Citi CC"]
["2010-09-20","Costco","COSTCO WHSE #04 648 EAST 800 SO",50,"debit","Personal Care","ING Checking",null,"tissue, tp, nyquil, bodywash"]
["2010-09-20","Costco","COSTCO WHSE #04 648 EAST 800 SO",39.450000000000003,"debit","Baby Supplies","ING Checking",null,"diapers"]
["2010-09-20","Marketplace Iga","MARKETPLACE CAFE PROVO UT - Deb",8.2799999999999994,"debit","Fast Food","ING Checking"]
["2010-09-20","Chevron","CHEVRON 0305397 LEHI UT - Debit",48.52,"debit","Gas & Fuel","ING Checking"]
["2010-09-20","McDonald's","MCDONALD S F7490 Q17 CENTERVILL",15.13,"debit","Fast Food","ING Checking"]
["2010-09-20","Costa","COSTA VIDA OF PROVOQPS PROVO UT",22.14,"debit","Fast Food","ING Checking"]
["2010-09-19","Amazon","AMAZON COM AMZN COM BIL WA - De",13.42,"debit","Hair","ING Checking",null,"bed head rick"]
["2010-09-19","Smiths","SMITHS 350 N. FREEDOM",45.67,"debit","Groceries","ING Checking"]
["2010-09-19","Byu Creamery Ninth","BYU CREAMERY ON NINTH PROVO UT",20.45,"debit","Groceries","ING Checking"]
["2010-09-19","Amazon","AMAZON COM AMZN COM BIL WA - De",11.97,"debit","Hair","ING Checking",null,"hairspray"]
["2010-09-18","Chevron","CHEVRON/PWI #92 CHEVRON/PWI #92",4.5999999999999996,"debit","Gas & Fuel","ING Checking"]
["2010-09-17","Maceys","MACEYS PROVO 1400 N STATE",7.5,"debit","Groceries","ING Checking"]
["2010-09-17","Amazon","AMAZON MKTPLACE PMTS AMZN COM B",48.47,"debit","Shopping","ING Checking"]
["2010-09-17","External Electronic Withdrawal","External Electronic Withdrawal",20.83,"debit","Uncategorized","ING Holding"]
["2010-09-16","Target","TARGET T1754 OR 175 WEST CENTER",64.14,"debit","Miscellaneous","ING Checking"]
["2010-09-16","Ustc","USTC  - Debit",78.5,"debit","Uncategorized","ING Checking",null,"registration"]
["2010-09-15","Byu Barbershop","BYU BARBERSHOP PROVO UT",15,"debit","Hair","Citi CC"]
["2010-09-15","Marketplace Iga","MARKETPLACE CAFE PROVO UT",8.2799999999999994,"debit","Groceries","Citi CC"]
["2010-09-15","Person Person Heathe","Person2Person Payment to Heathe",65.540000000000006,"debit","Uncategorized","ING Checking"]
["2010-09-15","Inspection Station","THE INSPECTION STATION OREM UT",122.11,"debit","Parking","ING Checking"]
["2010-09-15","ShopKo","0086 SHOPKO 2266 NORTH UNIVERSI",45.41,"debit","Shopping","ING Checking"]
["2010-09-15","Liberty Mutual","External Electronic Withdrawal",108.58,"debit","Auto Insurance","ING Holding"]
["2010-09-14","Deposit","Deposit",260,"credit","Income","MACU Checking"]
["2010-09-14","Withdrawal","Withdrawal",265,"debit","Uncategorized","MACU Checking"]
["2010-09-14","Panda Express","PANDA EXPRESS 724 QAE PROVO UT",9.27,"debit","Fast Food","Citi CC"]
["2010-09-14","Marketplace Iga","MARKETPLACE CAFE PROVO UT",8.0500000000000007,"debit","Groceries","Citi CC"]
["2010-09-14","Marketplace Iga","MARKETPLACE CAFE PROVO UT",1.82,"debit","Groceries","Citi CC"]
["2010-09-14","Marketplace Iga","MARKETPLACE CAFE PROVO UT",2.67,"debit","Groceries","Citi CC"]
["2010-09-14","Provo City Just","PROVO CITY JUST PROVO CITY JUST",30,"debit","Uncategorized","ING Checking"]
["2010-09-14","Costco","COSTCO WHSE #04 648 EAST 800 SO",8.5399999999999991,"debit","Miscellaneous","ING Checking"]
["2010-09-14","Amazon","AMAZON COM AMZN COM BIL WA - De",16.97,"debit","Shopping","ING Checking"]
["2010-09-14","Ct Vcom ATM","CT VCOM  PROVO, UT US - ATM",280,"debit","Uncategorized","ING Checking"]
["2010-09-14","Provo City Just","PROVO CITY JUST PROVO CITY JUST",90,"debit","Uncategorized","ING Checking"]
["2010-09-14","Transfer to Amber","Electronic Withdrawal",87.59,"debit","Credit Card Payment","ING Checking"]
["2010-09-13","Bajio Mexican Grill","BAJIO MEXICAN GRILL 00 OREM UT",11.3,"debit","Fast Food","Citi CC"]
["2010-09-13","Costa","COSTA VIDA OF PROVOQPS PROVO UT",9.33,"debit","Fast Food","Citi CC"]
["2010-09-13","Toys \"R\" Us","TOYS R US 85 EAST 300 SOUTH",17.71,"debit","Toys","ING Checking"]
["2010-09-13","Malt Shoppe","THE MALT SHOPPE QPS PROVO UT -",3.65,"debit","Fast Food","ING Checking"]
["2010-09-13","Smiths","SMITHS 45 SOUTH STATE",20.59,"debit","Groceries","ING Checking"]
["2010-09-12","Transfer from Checking","CLICK-TO-PAY PAYMENT, THANK YOU",87.59,"credit","Credit Card Payment","Citi CC"]
["2010-09-12",{"$f":"- Debit","v":{"$error":"#NAME?"}},{"$f":"- Debit","v":{"$error":"#NAME?"}},72.59,"credit","Income","ING Checking"]
["2010-09-11","Allens Super Save","ALLEN'S SUPER S 655 EAST 300 SO",8.83,"debit","Pharmacy","ING Checking"]
["2010-09-10","Transfer to ING Savings","Withdrawal SWENSEN,RICHARDTYPE: ING DIRECT CO: SWENSEN,RICHARD",2343,"debit","Transfer","MACU Checking"]
["2010-09-10","Byu Creamery Fountain","BYU CREAMERY FOUNTAIN PROVO UT",7.59,"debit","Uncategorized","Citi CC"]
["2010-09-10","Marketplace Iga","MARKETPLACE CAFE PROVO UT",2.14,"debit","Groceries","Citi CC"]
["2010-09-10","Byu Creamery Ninth","BYU CREAMERY ON NINTH PROVO UT",2.58,"debit","Uncategorized","Citi CC"]
["2010-09-10","Byu Creamery Ninth","BYU CREAMERY ON NINTH PROVO UT",4.42,"debit","Uncategorized","Citi CC"]
["2010-09-10","iTunes","APL*ITUNES 866-712-7753 CA",21.26,"debit","Music","Citi CC"]
["2010-09-10","Marketplace Iga","MARKETPLACE CAFE PROVO UT",0.96,"debit","Groceries","Citi CC"]
["2010-09-10","Marketplace Iga","MARKETPLACE CAFE PROVO UT",1.72,"debit","Groceries","Citi CC"]
["2010-09-10","Apl Mobileme Www","APL MOBILEME WWW ME COM CA - De",99,"debit","Uncategorized","ING Checking"]
["2010-09-09","Marketplace Iga","MARKETPLACE CAFE PROVO UT",2.67,"debit","Groceries","Citi CC"]
["2010-09-09","Marketplace Iga","MARKETPLACE CAFE PROVO UT",0.96,"debit","Groceries","Citi CC"]
["2010-09-09","National","NATIONAL BLACK MBA ASS 312-236-2622 IL",60,"debit","Home Improvement","Citi CC"]
["2010-09-09","National","NATIONAL BLACK MBA ASS 312-236-2622 IL",100,"debit","Home Improvement","Citi CC"]
["2010-09-09","Marketplace Iga","MARKETPLACE CAFE PROVO UT",2.89,"debit","Groceries","Citi CC"]
["2010-09-09","Transfer from ING Savings","Deposit From Linked Account MOU",2343,"credit","Transfer","ING Checking"]
["2010-09-09","Sunflower Farme State","SUNFLOWER FARME 1375 S. STATE S",70.45,"debit","Uncategorized","ING Checking"]
["2010-09-09","Sunflower Farme State","SUNFLOWER FARME 1375 S. STATE S",13.38,"debit","Uncategorized","ING Checking"]
["2010-09-09","Electronic Withdrawal","Electronic Withdrawal",240,"debit","Uncategorized","ING Checking"]
["2010-09-09","Transfer from ING Savings","Internet Deposit",3082.96,"credit","Transfer","ING Holding"]
["2010-09-09","Transfer to ING Holding","Internet Withdrawal",3082.96,"debit","Transfer","ING Savings"]
["2010-09-08","Marketplace Iga","MARKETPLACE CAFE PROVO UT",6.45,"debit","Groceries","Citi CC"]
["2010-09-08","Transfer to Checking","Internet Deposit   Reversal",2343,"debit","Transfer","ING Savings"]
["2010-09-08","Transfer from FREE CHECKING","Internet Deposit",2343,"credit","Transfer","ING Savings"]
["2010-09-07","Allen's Super Save Markets","Withdrawal #416774ALLEN'S SUPER SAVE #1 655 EAST 300 SOUTH PROVO UT %% Card 08 #4748",14.03,"debit","Groceries","MACU Checking"]
["2010-09-07","Deposit Byu Refundtype","Deposit BYU RefundTYPE: UCA CO: BYU Refund",2358,"credit","Income","MACU Checking"]
["2010-09-07","Marketplace Iga","MARKETPLACE CAFE PROVO UT",1.72,"debit","Groceries","Citi CC"]
["2010-09-07","Marketplace Iga","MARKETPLACE CAFE PROVO UT",6.24,"debit","Groceries","Citi CC"]
["2010-09-07","JetBlue","JETBLUE 27xxxxxxxxxxxx5382583 UT",104.7,"debit","Air Travel","Citi CC"]
["2010-09-07","Dunn Oil","DUNN OIL, INC Q39 SALT LAKE CIT UT",44.3,"debit","Gas & Fuel","Citi CC"]
["2010-09-07","Southwest","SOUTHWES5xxxxxxxxxxxx4359792 TX",112.7,"debit","Air Travel","Citi CC"]
["2010-09-07","Pioneer Family Medicine","PIONEER FAMILY MEDICIN BOISE ID",40.96,"debit","Doctor","ING Checking"]
["2010-09-07","Taco Bell","TACO BELL 09595 SALT LAKE CI UT",7.71,"debit","Fast Food","ING Checking"]
["2010-09-07","Internet Deposit","Internet Deposit",240,"credit","Income","ING Checking"]
["2010-09-07","AT&amp;T","External Electronic Withdrawal",325.95999999999998,"debit","Mobile Phone","ING Holding"]
["2010-09-07","Transfer to Bank of America","Internet Withdrawal",240,"debit","Credit Card Payment","ING Savings"]
["2010-09-07","Transfer from ING Savings","BA ELECTRONIC PAYMENT",240,"credit","Credit Card Payment","B of A CC"]
["2010-09-07","Transfer from ING Savings","Internet Deposit",1075,"credit","Transfer","ING Checking"]
["2010-09-07","Person Person Laura","Person2Person Payment to Laura",1075,"debit","Mortgage & Rent","ING Checking"]
["2010-09-07","Transfer from ING Savings","Internet Deposit",400,"credit","Transfer","ING Holding"]
["2010-09-07","Transfer to ING Holding","Internet Withdrawal",400,"debit","Transfer","ING Savings"]
["2010-09-07","Transfer to Checking","Internet Withdrawal",1075,"debit","Transfer","ING Savings"]
["2010-09-06","Chevron","CHEVRON 0201054 Q61 WELLINGTON UT",3.99,"debit","Gas & Fuel","Citi CC"]
["2010-09-04","Harmons Grocery","HARMONS GROCERY 870 E 800 N",42.66,"debit","Groceries","ING Checking"]
["2010-09-02","ShopKo","0086 SHOPKO 2266 NORTH UNIVERSI",16.25,"debit","Shopping","ING Checking"]
["2010-09-02","Person Person Kimmi","Person2Person Payment to Kimmi",65.540000000000006,"debit","Uncategorized","ING Checking"]
["2010-09-02","Transfer from ING Savings","Internet Deposit",300,"credit","Transfer","ING Checking"]
["2010-09-02","Transfer to Checking","Internet Withdrawal",300,"debit","Transfer","ING Savings"]
["2010-09-02","Interest Charged Purchases","Interest Charged on Purchases",53.44,"debit","Finance Charge","B of A CC"]
["2010-09-02","Late Charge Adjustment","LATE CHARGE ADJUSTMENT",25,"credit","Credit Card Payment","B of A CC"]
["2010-09-01","Byu Creamery Fountain","BYU CREAMERY FOUNTAIN PROVO UT",12.77,"debit","Uncategorized","ING Checking"]
["2010-09-01","Interest Paid For","Interest paid for overdraft Int",7.0000000000000007E-2,"debit","Bank Fee","ING Checking"]
["2010-09-01","Gridiron Rehab Athle","GRIDIRON REHAB ATHLE MERIDIAN I",347,"debit","Uncategorized","ING Checking"]
["2010-09-01","Byu Creamery Ninth","BYU CREAMERY ON NINTH PROVO UT",25.33,"debit","Uncategorized","ING Checking"]
["2010-09-01","Target","TARGET T1754 OR 175 WEST CENTER",39.58,"debit","Miscellaneous","ING Checking"]
["2010-09-01","Late Payment Fee","LATE FEE FOR PAYMENT DUE 09/01",25,"debit","Late Fee","B of A CC"]
["2010-08-31","Commentavg Checking Bal","Transaction COMMENTAvg Checking Bal for Aug $1,545.00",0,"credit","Income","MACU Checking"]
["2010-08-31","Transfer to ING Savings","Withdrawal SWENSEN,AMBER MTYPE: ING DIRECT CO: SWENSEN,AMBER M",4797,"debit","Transfer","MACU Checking"]
["2010-08-31","BYU Bookstore","BYU BOOKSTORE PROVO UT",276.55,"debit","Books","Citi CC"]
["2010-08-31","Byu Wsc L","BYU WSC L&T PRODUCE PROVO UT",5.7,"debit","Groceries","Citi CC"]
["2010-08-31","iTunes","APL*ITUNES 866-712-7753 CA",10.65,"debit","Music","Citi CC"]
["2010-08-31","Wendy's","WENDYS #4710 Q25 PROVO UT",11.8,"debit","Fast Food","Citi CC"]
["2010-08-31","Subway","BYU WSC SUBWAY PROVO UT",5.39,"debit","Fast Food","Citi CC"]
["2010-08-31","Target","TARGET T1754 OR 175 WEST CENTER",115.67,"debit","Miscellaneous","ING Checking"]
["2010-08-31","Interest Paid","Interest Paid",0.02,"credit","Interest Income","ING Checking"]
["2010-08-31","Street",{"$f":"- Debit STREET","v":{"$error":"#NAME?"}},11.72,"credit","Income","ING Checking"]
["2010-08-31","Interest Paid","Interest Paid",0.44,"credit","Interest Income","ING Holding"]
["2010-08-31","Interest Paid","Interest Paid",0.21,"credit","Interest Income","ING Savings"]
["2010-08-31","External Electronic Withdrawal","External Electronic Withdrawal",289.2,"debit","Uncategorized","ING Holding"]
["2010-08-30","Withdrawalfedex Tn Date","WithdrawalFEDEX 871332113332 800-4633339 TN Date 08/27/10 24164070239741178332620 4215",26.66,"debit","Bank Fee","MACU Checking"]
["2010-08-30","Deposit Transferfrom Swensen","Deposit TransferFrom SWENSEN,AMBER M 0008992288 Share 50",35,"credit","Income","MACU Checking"]
["2010-08-30","Chevron","CHEVRON 0204058 PROVO UT - Debit",54.09,"debit","Gas & Fuel","ING Checking"]
["2010-08-30","Electronic Deposit","Electronic Deposit",111,"credit","Income","ING Checking"]
["2010-08-30","Transfer from FREE CHECKING","Internet Deposit MOUNTAIN AMERI",4797,"credit","Transfer","ING Savings"]
["2010-08-29",{"$f":"- Debit","v":{"$error":"#NAME?"}},{"$f":"- Debit","v":{"$error":"#NAME?"}},31,"credit","Income","ING Checking"]
["2010-08-29","Byu Creamery Ninth","BYU CREAMERY ON NINTH PROVO UT",3.09,"debit","Uncategorized","ING Checking"]
["2010-08-29","Byu Creamery Fountain","BYU CREAMERY FOUNTAIN PROVO UT",4.1900000000000004,"debit","Uncategorized","ING Checking"]
["2010-08-28","Byu Creamery Ninth","BYU CREAMERY ON NINTH PROVO UT",17.61,"debit","Uncategorized","Citi CC"]
["2010-08-28","Chevron","CHEVRON 0072882 Q61 GREEN RIVER UT",1.28,"debit","Gas & Fuel","Citi CC"]
["2010-08-28","Byu Creamery Ninth","BYU CREAMERY ON NINTH PROVO UT",7.67,"debit","Uncategorized","Citi CC"]
["2010-08-27","Deposit Byu Refundtype","Deposit BYU RefundTYPE: UCA CO: BYU Refund",4797,"credit","Income","MACU Checking"]
["2010-08-27","Target","TARGET T1754 OR 175 WEST CENTER",28.54,"debit","Miscellaneous","ING Checking"]
["2010-08-27","Target","TARGET T1754 OR 175 WEST CENTER",59.5,"debit","Miscellaneous","ING Checking"]
["2010-08-27","Byu Creamery Ninth","BYU CREAMERY ON NINTH PROVO UT",25.25,"debit","Uncategorized","ING Checking"]
["2010-08-26","Transfer to Checking","Withdrawal SWENSEN,AMBER MTYPE: ING DIRECT CO: SWENSEN,AMBER M",203,"debit","Transfer","MACU Checking"]
["2010-08-26","Consumer Reports","CR *CONSUMERREPORTS.OR 8003330663 NY",5.95,"debit","Books","Citi CC"]
["2010-08-26","Chevron","CHEVRON 0207391 Q61 PRICE UT",3.07,"debit","Gas & Fuel","Citi CC"]
["2010-08-26","Smiths","SMITHS 350 N. FREEDOM",21.57,"debit","Groceries","ING Checking"]
["2010-08-25","Transfer to Checking","Withdrawal SWENSEN,AMBER MTYPE: ING DIRECT CO: SWENSEN,AMBER M",376,"debit","Transfer","MACU Checking"]
["2010-08-25","Internetsafety Com Ga","INTERNETSAFETY COM INC 678-7976496 GA",39.96,"debit","Uncategorized","Citi CC"]
["2010-08-25","Chevron","CHEVRON/FAULKNE CHEVRON/FAULKNE",3.07,"debit","Gas & Fuel","ING Checking"]
["2010-08-25","Wal","WAL - Debit",53.95,"debit","Uncategorized","ING Checking"]
["2010-08-25","Amazon","AMAZON MKTPLACE PMTS AMZN COM B",40.159999999999997,"debit","Shopping","ING Checking"]
["2010-08-25","Transfer from FREE CHECKING","Internet Deposit MOUNTAIN AMERI",203,"credit","Transfer","ING Checking"]
["2010-08-24","Lowe's","LOWES #00178* Q01 OREM UT",2.52,"debit","Home Improvement","Citi CC"]
["2010-08-24","JCPenney","JCPENNEY STORE 2770 PROVO UT",91.8,"debit","Clothing","Citi CC"]
["2010-08-24","Iceberg Drive Inn","ICEBERG DRIVE INN -QPS OREM UT",4.7300000000000004,"debit","Restaurants","Citi CC"]
["2010-08-24","Rick's Muffler","RICK'S MUFFLER OREM UT",80.08,"debit","Auto & Transport","Citi CC"]
["2010-08-24","Chevron","CHEVRON 0203586 PROVO UT",43.84,"debit","Gas & Fuel","Citi CC"]
["2010-08-24","Chevron","CHEVRON 0203586 Q61 PROVO UT",2.97,"debit","Gas & Fuel","Citi CC"]
["2010-08-24","Scout Com Wa","SCOUT.COM              888-979-0979 WA",9.9499999999999993,"debit","Uncategorized","B of A CC"]
["2010-08-24","Nauvoo Cafe Qps","NAUVOO CAFE QPS SALT LAKE CI UT",19.34,"debit","Restaurants","ING Checking"]
["2010-08-24","Internet Deposit Addison","Internet Deposit ADDISON AVENUE",65,"credit","Transfer","ING Checking"]
["2010-08-24","Transfer from FREE CHECKING","Internet Deposit MOUNTAIN AMERI",376,"credit","Transfer","ING Checking"]
["2010-08-24","Veracity Network Veracity","External Electronic Withdrawal",48.28,"debit","Internet","ING Holding"]
["2010-08-23","Bingham Cyclery","BINGHAM CYCLERY PROVO UT",26.67,"debit","Sporting Goods","Citi CC"]
["2010-08-23","Boomerang Books","BOOMERANG BOOKS PROVO UT",65.12,"debit","Books","Citi CC"]
["2010-08-23","Costco","COSTCO WHSE #0484 0000 OREM         UT",97.21,"debit","Miscellaneous","B of A CC"]
["2010-08-22","Byu Creamery Ninth","BYU CREAMERY ON NINTH PROVO UT",23.83,"debit","Uncategorized","Citi CC"]
["2010-08-22","Harmons Grocery","HARMONS GROCERY 870 E 800 N",17.59,"debit","Groceries","ING Checking"]
["2010-08-20","Chevron","CHEVRON 0073049 PROVO UT",56.8,"debit","Gas & Fuel","Citi CC"]
["2010-08-20","Supersonic Car Wash","SUPERSONIC CAR WASHQPS OREM UT",11,"debit","Service & Parts","Citi CC"]
["2010-08-20","Home Depot","THE HOME DEPOT 4416 PROVO UT",31.99,"debit","Home Improvement","Citi CC"]
["2010-08-20","Savings Deposit Direct","Savings Deposit - Direct Deposit",187.8,"credit","Paycheck","ING Holding"]
["2010-08-19","McDonald's","MCDONALD'S F23720 0000 MERIDIAN     ID",15.55,"debit","Fast Food","B of A CC"]
["2010-08-19","Chevron","CHEVRON JACKSONS FOOD  MERIDIAN     ID",18.09,"debit","Gas & Fuel","B of A CC"]
["2010-08-19","Chevron","CHEVRON STINKER STORES BURLEY       ID",7.7,"debit","Gas & Fuel","B of A CC"]
["2010-08-19","Albertsons","#00177 ALBERTSONS 0000 BOISE        ID",21.18,"debit","Miscellaneous","B of A CC"]
["2010-08-19","Chevron","CHEVRON JACKSONS FOOD  MERIDIAN     ID",49.62,"debit","Gas & Fuel","B of A CC"]
["2010-08-18","Membership Fee Aug","MEMBERSHIP FEE AUG 10-JUL 11",75,"debit","Fees & Charges","Citi CC"]
["2010-08-18","Wal-Mart","WAL-MART  2861         BOISE        ID",10.48,"debit","Shopping","B of A CC"]
["2010-08-18","Albertsons","#00177 ALBERTSONS 0000 BOISE        ID",12.17,"debit","Miscellaneous","B of A CC"]
["2010-08-18","George's Cycles & Fitness","GEORGE'S CYCLES & FIT  BOISE        ID",4.24,"debit","Sporting Goods","B of A CC"]
["2010-08-18","McDonald's","MCDONALD S F6925 Q17 WINNEMUCCA",2.66,"debit","Fast Food","ING Checking"]
["2010-08-18","External Electronic Withdrawal","External Electronic Withdrawal",20.170000000000002,"debit","Uncategorized","ING Holding"]
["2010-08-17","Walgreen","WALGREENS #11452 00001 MERIDIAN     ID",3.17,"debit","Miscellaneous","B of A CC"]
["2010-08-17","Costco","COSTCO WHSE #0761 0000 BOISE        ID",197.3,"debit","Miscellaneous","B of A CC"]
["2010-08-17","Meridian Meridian","MERIDIAN #685 MERIDIAN MERIDIAN     ID",104.94,"debit","Uncategorized","B of A CC"]
["2010-08-16","Chevron","CHEVRON CHEVRON STATIO AUBURN       CA",3.77,"debit","Gas & Fuel","B of A CC"]
["2010-08-16","Chevron","CHEVRON CHEVRON STATIO AUBURN       CA",58,"debit","Gas & Fuel","B of A CC"]
["2010-08-16","McDonald's","MCDONALD'S F19926 0000 SPARKS       NV",14.74,"debit","Fast Food","B of A CC"]
["2010-08-16","McDonald's","MCDONALD'S F6925 00000 WINNEMUCCA   NV",2.77,"debit","Fast Food","B of A CC"]
["2010-08-16","Shell","SHELL OIL 64611220181  WINNEMUCCA   NV",40.21,"debit","Gas & Fuel","B of A CC"]
["2010-08-16","Raley's","RALEY'S #111 1125 W WINNEMUCCA",10.76,"debit","Groceries","ING Checking"]
["2010-08-14","Jamba Juice","JAMBA JUICE #361 QSR FOLSOM CA",8.5,"debit","Food & Dining","Citi CC"]
["2010-08-14","Raley's","RALEY'S #231 6119 HORSESHOE BAR",16.43,"debit","Groceries","ING Checking"]
["2010-08-13","McDonald's","MCDONALD S F6925 Q17 WINNEMUCCA",14.7,"debit","Fast Food","ING Checking"]
["2010-08-12",{"$f":"- Debit","v":{"$error":"#NAME?"}},{"$f":"- Debit","v":{"$error":"#NAME?"}},17.55,"credit","Income","ING Checking"]
["2010-08-12","Chevron","CHEVRON/KINGS B CHEVRON/KINGS B",7.54,"debit","Gas & Fuel","ING Checking"]
["2010-08-12","IHOP","IHOP 1746 MERIDIAN ID - Debit",31,"debit","Restaurants","ING Checking"]
["2010-08-11","Intelius","INT*INTELIUS CM 888-445-2727 WA",1.95,"debit","Personal Care","Citi CC"]
["2010-08-11","Transfer from Checking","ELECTRONIC PAYMENT-THANK YOU",41.68,"credit","Credit Card Payment","Citi CC"]
["2010-08-11","McDonald's","MCDONALD'S F6925 Q17 WINNEMUCCA NV",2.14,"debit","Fast Food","Citi CC"]
["2010-08-11","Marshalls","MARSHALLS #871 0000008 MERIDIAN     ID",27.54,"credit","Clothing","B of A CC"]
["2010-08-11","Gap","THE GAP #2524 THE GAP  BOISE        ID",21.19,"credit","Clothing","B of A CC"]
["2010-08-11","Kohl's","KOHL'S 1094 1094       MERIDIAN     ID",252.3,"credit","Clothing","B of A CC"]
["2010-08-11","Express Boise Id","EXPRESS#0645 00000645  BOISE        ID",68.69,"credit","Credit Card Payment","B of A CC"]
["2010-08-11","Mrs Z Mrs","MRS S Z MRS S Z",10.95,"debit","Uncategorized","ING Checking"]
["2010-08-10","Transfer to 7125","Electronic Payment to CITI CARDS",41.68,"debit","Credit Card Payment","ING Checking"]
["2010-08-10","Wal","WAL - Debit",35.06,"debit","Uncategorized","ING Checking"]
["2010-08-10","Paper Church Jesus","Paper Payment to CHURCH OF JESU",207.37,"debit","Charity","ING Checking"]
["2010-08-10","Dillard's","DILLARD S 934 BOISEQPS BOISE ID",15.9,"debit","Clothing","ING Checking"]
["2010-08-09","Claires","CLAIRES #6605 1400 NORTH EAGLE",12.99,"debit","Shopping","ING Checking"]
["2010-08-09","Dpps City Center","DPPS CITY CENTER BOISE ID - Deb",12,"debit","Uncategorized","ING Checking"]
["2010-08-09","Transfer to ING Savings","Internet Withdrawal",300,"debit","Transfer","ING Checking"]
["2010-08-09","Netflix","NFI WWW NETFLIX COM CC NETFLIX",11.65,"debit","Movies & DVDs","ING Checking"]
["2010-08-09","Transfer from ING Holding","Internet Deposit",1637,"credit","Transfer","ING Checking"]
["2010-08-09","Express","EXPRESS LLC 350 N MILWAUKEE",41.71,"debit","Clothing","ING Checking"]
["2010-08-09","Person Person Tyler","Person2Person Payment to Tyler",800,"debit","Money Transfer","ING Checking"]
["2010-08-09","- Debit 00","- Debit 00",15.9,"credit","Income","ING Checking"]
["2010-08-09","Kohl's","KOHL'S #1094 3275 N EAGLE RD",7.41,"debit","Clothing","ING Checking"]
["2010-08-09","Transfer to Checking","Internet Withdrawal",1637,"debit","Transfer","ING Holding"]
["2010-08-09","Transfer from Checking","Internet Deposit",300,"credit","Transfer","ING Savings"]
["2010-08-08","Westco Martinizing Dry Clnng","WESTCO MARTINIZING 83 BOISE ID",24.59,"debit","Laundry","ING Checking"]
["2010-08-07","Kohl's","KOHL'S 1094 1094       MERIDIAN     ID",32.840000000000003,"debit","Clothing","B of A CC"]
["2010-08-07","Jimmy John's","JIMMY JOHN'S # 1286 80 MERIDIAN     ID",10.6,"debit","Restaurants","B of A CC"]
["2010-08-07","Amazon","AMAZON.COM             AMZN.COM/BILLWA",39.979999999999997,"debit","Shopping","B of A CC"]
["2010-08-07","Quiznos","QUIZNOS SUB #1522 3000 EAGLE        ID",13.11,"debit","Fast Food","B of A CC"]
["2010-08-06","Kohl's","KOHL'S 1094 1094       MERIDIAN     ID",210.12,"debit","Clothing","B of A CC"]
["2010-08-06","Albertsons","#00177 ALBERTSONS 0000 BOISE        ID",44.41,"debit","Miscellaneous","B of A CC"]
["2010-08-06","Gap","THE GAP #2524 THE GAP  BOISE        ID",21.19,"debit","Clothing","B of A CC"]
["2010-08-06","Marshalls","MARSHALLS #871 0000008 MERIDIAN     ID",44.27,"debit","Clothing","B of A CC"]
["2010-08-06","Kohl's","KOHL'S 1094 1094       MERIDIAN     ID",54.9,"debit","Clothing","B of A CC"]
["2010-08-06","Express","EXPRESS#0645 00000645  BOISE        ID",132.18,"debit","Clothing","B of A CC"]
["2010-08-06",{"$f":"- Debit","v":{"$error":"#NAME?"}},{"$f":"- Debit","v":{"$error":"#NAME?"}},21.19,"credit","Income","ING Checking"]
["2010-08-06","Sonic","SONIC DRIVE IN 478Q63 MERIDIAN",4.2699999999999996,"debit","Fast Food","ING Checking"]
["2010-08-06","Old Navy","OLD NAVY USA 3401 E. FAIRVIEW",21.62,"debit","Clothing","ING Checking"]
["2010-08-06","Savings Deposit Direct","Savings Deposit - Direct Deposit",1773.65,"credit","Paycheck","ING Holding"]
["2010-08-05","iTunes","APL*ITUNES 866-712-7753 CA",1.06,"debit","Music","Citi CC"]
["2010-08-05","Sonic","SONIC DRIVE IN #4781 0 MERIDIAN     ID",2.4300000000000002,"debit","Fast Food","B of A CC"]
["2010-08-05","AT&amp;T","External Electronic Withdrawal",110.61,"debit","Mobile Phone","ING Holding"]
["2010-08-04","Albertsons","#00177 ALBERTSONS 0000 BOISE        ID",15.35,"debit","Miscellaneous","B of A CC"]
["2010-08-04","Target","TARGET T1230 BO 6280 N EAGLE RO",77.34,"debit","Miscellaneous","ING Checking"]
["2010-08-04","Hobby Lobby","HOBBY LOBBY STO HOBBY LOBBY #43",8.5500000000000007,"debit","Hobbies","ING Checking"]
["2010-08-04","Tree City Juice","TREE CITY JUICE SMOO MERIDIAN I",10.99,"debit","Uncategorized","ING Checking"]
["2010-08-03","Interest Charged Purchases","Interest Charged on Purchases",43.8,"debit","Finance Charge","B of A CC"]
["2010-08-02","Brigham Young University","BRIGHAM YOUNG UNIV WEB PROVO        UT",260,"debit","Education","B of A CC"]
["2010-08-02","Byu Ticket Office","BYU TICKET OFFICE WEB  PROVO        UT",265,"debit","Entertainment","B of A CC"]
["2010-08-02","Target","TARGET T1230 BO 6280 N EAGLE RO",10.59,"debit","Miscellaneous","ING Checking"]
["2010-08-02","Kohl's","KOHL'S #1094 3275 N EAGLE RD",33.06,"debit","Clothing","ING Checking",null,"sawyer clothes, amber swimsuit"]
["2010-08-02","Old Navy","OLD NAVY USA 3401 E. FAIRVIEW",18.53,"debit","Clothing","ING Checking",null,"swim shirt sawyer, sandals amelie, swimsuit btm amber"]
["2010-08-02","Deposit Transfer Aug","Deposit Transfer From 42344010 ,Aug. Rent",50,"credit","Transfer","Addison Avenue Checking"]
["2010-08-01","Target","TARGET T1230 BO 6280 N EAGLE RO",27.85,"debit","Miscellaneous","ING Checking",null,"wax strips, cetaphil, condoms, wipes"]
["2010-08-01","Expressions","QUILT EXPRESSIONS QPS GARDEN CI",16.34,"debit","Personal Care","ING Checking",null,"bike basket fabric and kids quilt pattern"]
["2010-08-01","Interest Paid For","Interest paid for overdraft Int",0.01,"debit","Bank Fee","ING Checking"]
["2010-08-01","Dillard's","DILLARD S 934 BOISEQPS BOISE ID",17.55,"debit","Clothing","ING Checking",null,"swim top"]
["2010-08-01","Carfax Vehicle His","CARFAX VEHICLE HIS 542 CENTREVILLE  VA",44.99,"debit","Auto & Transport","B of A CC"]
["2010-07-31","Interest Paid","Interest Paid",0.04,"credit","Interest Income","ING Checking"]
["2010-07-31","Cardtronics Ccsp","CARDTRONICS CCSP  BOISE, ID US",60,"debit","Uncategorized","ING Checking",null,"$50 for swimsuit and btm, $10 fast food"]
["2010-07-31","Interest Paid","Interest Paid",0.51,"credit","Interest Income","ING Holding"]
["2010-07-31","Interest Paid","Interest Paid",0.09,"credit","Interest Income","ING Savings"]
["2010-07-31","Boise Towne Square","BOISE TOWN SQUARE 3930 BOISE        ID",35.76,"credit","Reimbursement","B of A CC"]
["2010-07-30",{"$f":"- Debit","v":{"$error":"#NAME?"}},{"$f":"- Debit","v":{"$error":"#NAME?"}},14.82,"credit","Income","ING Checking"]
["2010-07-30","Diamonds Fine Jewelry","DIAMONDS FINE JEWELRY MERIDIAN",15,"debit","Miscellaneous","ING Checking",null,"ring resize"]
["2010-07-30","Albertsons","#00177 ALBERTSONS 0000 BOISE        ID",5.29,"debit","Miscellaneous","B of A CC"]
["2010-07-30","Eagle Hills Golf Course","EAGLE HILLS GOLF COURS EAGLE        ID",26.5,"debit","Sports","B of A CC"]
["2010-07-29","Albertsons","#00177 ALBERTSO 4700 NORTH EAGL",44.24,"debit","Miscellaneous","ING Checking"]
["2010-07-29","Quiznos","QUIZNOS SUB #1522 3000 EAGLE        ID",9.31,"debit","Fast Food","B of A CC"]
["2010-07-28","Cardtronics Ccsp","CARDTRONICS CCSP  BOISE, ID US",40,"debit","Uncategorized","ING Checking"]
["2010-07-28","Electronic Bank A","Electronic Payment to BANK OF A",79,"debit","Credit Card Payment","ING Checking"]
["2010-07-28","Quiznos","QUIZNOS SUB #1522 3000 EAGLE        ID",5.3,"debit","Fast Food","B of A CC"]
["2010-07-28","Transfer from Checking","PAYMENT - ELECTRONIC",79,"credit","Credit Card Payment","B of A CC"]
["2010-07-27","Paper Church Jesus","Paper Payment to CHURCH OF JESU",177.37,"debit","Charity","ING Checking"]
["2010-07-26","Consumer Reports","CR *CONSUMERREPORTS.OR 8003330663 NY",5.95,"debit","Books","Citi CC"]
["2010-07-26","Albertsons","#00177 ALBERTSO 4700 N. EAGLE R",16.28,"debit","Miscellaneous","ING Checking",null,"paper towels, oxy clean, ziploc bags"]
["2010-07-26","Transfer from ING Holding","Internet Deposit",1630,"credit","Transfer","ING Checking"]
["2010-07-26","Person Person Laura","Person2Person Payment to Laura",1075,"debit","Mortgage & Rent","ING Checking"]
["2010-07-26","J &amp; W Promotions","J AND W PROMOTIONS KENNEWICK WA",16.23,"debit","Shopping","ING Checking",null,"rick sunglasses"]
["2010-07-26","Kohl's","KOHL'S #1094 3275 N EAGLE RD",1.37,"debit","Clothing","ING Checking",null,"amelie's sandals that I returned"]
["2010-07-26","Transfer to Checking","Internet Withdrawal",1630,"debit","Transfer","ING Holding"]
["2010-07-26","Redbox","REDBOX DVD RENTAL      866-733-2693 IL",2.12,"debit","Movies & DVDs","B of A CC"]
["2010-07-26","Transfer to Checking","ACH Debit SWENSEN,AMBER M - ING DIRECT",100,"debit","Transfer","Addison Avenue Checking"]
["2010-07-25","Subway","SUBWAY        106310 2 BAKER CITY   OR",15.25,"debit","Fast Food","B of A CC"]
["2010-07-25","Tesoro","TESORO TRUCKSTOP TESO4 KENNEWICK    WA",26.64,"debit","Gas & Fuel","B of A CC"]
["2010-07-25","Exxon","EXXONMOBIL 89521747988 KENNEWICK    WA",11.9,"debit","Gas & Fuel","B of A CC"]
["2010-07-24","Scout Com Wa","SCOUT.COM              888-979-0979 WA",9.9499999999999993,"debit","Uncategorized","B of A CC"]
["2010-07-24","Courtyard","COURTYARD 13B          RICHLAND     WA",16.05,"debit","Food & Dining","B of A CC",null,"breakfast at hotel"]
["2010-07-24","Panda Express","PANDA EXPRESS 1742 542 KENNEWICK    WA",8.1199999999999992,"debit","Fast Food","B of A CC"]
["2010-07-23","iTunes","APL*ITUNES 866-712-7753 CA",5.32,"debit","Music","Citi CC"]
["2010-07-23","Family Meds","PIONEER FAMILY MEDIQPS BOISE ID",25,"debit","Doctor","ING Checking"]
["2010-07-23","Internet Deposit Addison","Internet Deposit ADDISON AVENUE",100,"credit","Transfer","ING Checking"]
["2010-07-23","Veracity Network Veracity","External Electronic Withdrawal",48.28,"debit","Internet","ING Holding"]
["2010-07-23","Savings Deposit Direct","Savings Deposit - Direct Deposit",1773.67,"credit","Paycheck","ING Holding"]
["2010-07-23","Redbox","REDBOX DVD RENTAL      OAKBRKTERRACEIL",1.06,"debit","Movies & DVDs","B of A CC"]
["2010-07-23","Arrowhead Travel Plaza","ARROWHEAD TRAVEL PLAZA PENDELTON    OR",35,"debit","Gas & Fuel","B of A CC"]
["2010-07-23","McDonald's","MCDONALD'S F33135 0000 PENDLETON    OR",5.18,"debit","Fast Food","B of A CC"]
["2010-07-23","Albertsons","#00177 ALBERTSONS 0000 BOISE        ID",25.85,"debit","Miscellaneous","B of A CC"]
["2010-07-23","McDonald's","MCDONALD'S F33135 0000 PENDLETON    OR",4.49,"debit","Fast Food","B of A CC"]
["2010-07-23","Co-Op Supply","NYSSA COOP SUPPLY DURK DURKEE       OR",4.37,"debit","Lawn & Garden","B of A CC"]
["2010-07-23","Jamba Juice","JAMBA JUICE # 252 0000 BOISE        ID",8.27,"debit","Food & Dining","B of A CC"]
["2010-07-22","Albertsons","#00177 ALBERTSO 4700 N. EAGLE R",15.87,"debit","Miscellaneous","ING Checking",null,"wipes, sunblock"]
["2010-07-22","Albertsons","#00182 ALBERTSONS 0000 EAGLE        ID",24.35,"debit","Miscellaneous","B of A CC"]
["2010-07-21","Albertsons","#00177 ALBERTSO 4700 NORTH EAGL",41.41,"debit","Miscellaneous","ING Checking"]
["2010-07-21","Electronic Withdrawal","Electronic Withdrawal",70,"debit","Miscellaneous","ING Checking",null,"Reunion"]
["2010-07-21","Albertsons","#00177 ALBERTSO 4700 N. EAGLE R",9.7100000000000009,"debit","Pharmacy","ING Checking",null,"flexiril"]
["2010-07-21","Boise Di Fairview","BOISE DI 10740 FAIRVIEW AVE",2.65,"debit","Clothing","ING Checking"]
["2010-07-21","Albertsons","#00177 ALBERTSONS 0000 BOISE        ID",2.12,"debit","Miscellaneous","B of A CC"]
["2010-07-21","Deposit Transfer July","Deposit Transfer From 42344010 ,July Rent",100,"credit","Transfer","Addison Avenue Checking"]
["2010-07-20","Jamba Juice","JAMBA JUICE 252 QPS BOISE ID -",3.76,"debit","Food & Dining","ING Checking"]
["2010-07-20","Target","TARGET 1230 1230       BOISE        ID",28.25,"debit","Clothing","B of A CC",null,"2 bras"]
["2010-07-19","External Electronic Withdrawal","External Electronic Withdrawal",30.95,"debit","Uncategorized","ING Holding"]
["2010-07-19","Cj Star Llc","CJ STAR LLC        Q41 BOISE        ID",5.29,"debit","Uncategorized","B of A CC"]
["2010-07-19","Chevron","CHEVRON SMITH'S EAGLE  EAGLE        ID",37.75,"debit","Gas & Fuel","B of A CC"]
["2010-07-19","Interest Charged Standard","INTEREST CHARGED TO STANDARD PURCH",1.17,"debit","Finance Charge","Citi CC"]
["2010-07-17","Wal-Mart","WAL-MART  2861         BOISE        ID",5.9,"debit","Shopping","B of A CC"]
["2010-07-17","N Eagle Road","6176 N. EAGLE ROAD  BOISE, ID U",2,"debit","Uncategorized","ING Checking"]
["2010-07-17","N Eagle Road","6176 N. EAGLE ROAD  BOISE, ID U",40,"debit","Uncategorized","ING Checking"]
["2010-07-17","iTunes","APL*ITUNES 866-712-7753 CA",5.32,"debit","Music","Citi CC"]
["2010-07-16","Jamba Juice","JAMBA JUICE 252 QPS BOISE ID -",7.95,"debit","Food & Dining","ING Checking"]
["2010-07-16","Five Guys Id","FIVE GUYS ID 10 QAE MERIDIAN ID",6.87,"debit","Food & Dining","ING Checking"]
["2010-07-16","Swensen Amber M","ACH Debit SWENSEN,AMBER M - ING DIRECT",128.94,"debit","Uncategorized","Addison Avenue Checking"]
["2010-07-15","Primary","PRIMARY HEALTH MEDIQPS 208 9556",189.08,"debit","Entertainment","ING Checking",null,"Sawyer's visits"]
["2010-07-15","Carl's Jr","CARL S JR 7611N Q11 MERIDIAN ID",15.34,"debit","Fast Food","ING Checking"]
["2010-07-15","Albertsons","#00177 ALBERTSO 4700 N. EAGLE R",4.75,"debit","Miscellaneous","ING Checking"]
["2010-07-15","Internet Deposit Addison","Internet Deposit ADDISON AVENUE",128.94,"credit","Transfer","ING Checking"]
["2010-07-14","Electronic Withdrawal","Electronic Withdrawal",592,"debit","Uncategorized","ING Checking"]
["2010-07-14","Person Person Tyler","Person2Person Payment to Tyler",736,"credit","Mortgage & Rent","ING Checking"]
["2010-07-14","Person Person Tyler","Person2Person Payment to Tyler",800,"credit","Mortgage & Rent","ING Checking"]
["2010-07-14","Person Person Tyler","Person2Person Payment to Tyler",736,"debit","Money Transfer","ING Checking"]
["2010-07-14","Jamba Juice","JAMBA JUICE 252 QPS BOISE ID -",4.6100000000000003,"debit","Food & Dining","ING Checking"]
["2010-07-14","Liberty Mutual","External Electronic Withdrawal",61.58,"debit","Auto Insurance","ING Holding"]
["2010-07-14","Amazon","AMAZON.COM             AMZN.COM/BILLWA",15.99,"credit","Shopping","B of A CC"]
["2010-07-14","Deposit","Deposit",923,"credit","Income","Addison Avenue Checking"]
["2010-07-14","Transfer to Checking","Descriptive Withdrawal to tyler",736,"debit","Transfer","Addison Avenue Checking"]
["2010-07-14","Transfer from Checking","ELECTRONIC PAYMENT-THANK YOU",485.98,"credit","Credit Card Payment","Citi CC"]
["2010-07-13","Transfer to 7125","Electronic Payment to CITI CARDS",485.98,"debit","Credit Card Payment","ING Checking"]
["2010-07-13","Paper Church Jesus","Paper Payment to CHURCH OF JESU",177.36,"debit","Charity","ING Checking"]
["2010-07-13","Yong In Master","YONG IN MASTER LEES TA BOISE ID",79.05,"debit","Kids Activities","ING Checking",null,"Tae Kwon Do"]
["2010-07-13","Toys 'R' Us","TOYS R US 1200 N EAGLE RD",11.65,"debit","Toys","ING Checking",null,"window shades"]
["2010-07-13","Hobby Lobby","HOBBY LOBBY STO HOBBY LOBBY #43",14.38,"debit","Hobbies","ING Checking",null,"fabric for baby blanket"]
["2010-07-13","ShopKo","0169 SHOPKO 3499 E FAIRVIEW AVE",17.350000000000001,"debit","Clothing","ING Checking",null,"leggings, socks"]
["2010-07-13","Haband","GRIDIRON REHAB AND ATH MERIDIAN     ID",40,"debit","Clothing","B of A CC"]
["2010-07-12","Person Person Tyler","Person2Person Payment to Tyler",222.05,"debit","Money Transfer","ING Checking"]
["2010-07-12","Carl's Jr","CARL S JR 7557N Q07 BOISE ID -",5.82,"debit","Fast Food","ING Checking"]
["2010-07-12","Albertsons","#00177 ALBERTSO 4700 NORTH EAGL",36.79,"debit","Miscellaneous","ING Checking"]
["2010-07-12","Albertsons","#00177 ALBERTSO 4700 N. EAGLE R",3.16,"debit","Miscellaneous","ING Checking"]
["2010-07-12","Transfer to ING Holding","Internet Withdrawal",80,"debit","Transfer","ING Checking"]
["2010-07-12","Transfer from ING Holding","Internet Deposit",1773,"credit","Transfer","ING Checking"]
["2010-07-12","Person Person Tyler","Person2Person Payment to Tyler",800,"debit","Money Transfer","ING Checking"]
["2010-07-12","Primary Health","PRIMARY HEALTH MEDIQPS BOISE ID",25,"debit","Doctor","ING Checking"]
["2010-07-12","Transfer from Checking","Internet Deposit",80,"credit","Transfer","ING Holding"]
["2010-07-12","Transfer to Checking","Internet Withdrawal",1773,"debit","Transfer","ING Holding"]
["2010-07-12","Reversed Paid Insufficient","Reversed Paid Insufficient Fee Reversal",25,"credit","Bank Fee","Addison Avenue Checking"]
["2010-07-12","Reversed Paid Insufficient","Reversed Paid Insufficient Fee Reversal",25,"credit","Bank Fee","Addison Avenue Checking"]
["2010-07-11","Netflix","NFI WWW NETFLIX COM CC NETFLIX",11.65,"debit","Movies & DVDs","ING Checking"]
["2010-07-11","Good Times Dr","GOOD TIMES DR THRU 128 BOISE ID",5.9,"debit","Fast Food","ING Checking"]
["2010-07-10","Randalls","J RANDALL PITMA J RANDALL PITMA",88,"debit","Eyecare","ING Checking",null,"rick's eye appt at costco"]
["2010-07-10","Wal","WAL - Debit",24.09,"debit","Uncategorized","ING Checking",null,"bike stuff"]
["2010-07-10","Costco","COSTCO WHSE #07 2051 S. COLE RD",68.59,"debit","Eyecare","ING Checking",null,"Rick's eye visit"]
["2010-07-10","Albertsons","#00177 ALBERTSO 4700 N. EAGLE R",21.69,"debit","Miscellaneous","ING Checking",null,"stuff for Sawyer being sick, sippy, bottle nipples, car shade"]
["2010-07-09","Albertsons","#00177 ALBERTSO 4700 N. EAGLE R",11.64,"debit","Miscellaneous","ING Checking",null,"handsoap..."]
["2010-07-09","Savings Deposit Direct","Savings Deposit - Direct Deposit",1773.65,"credit","Paycheck","ING Holding"]
["2010-07-08","Thomas D Myers PC","THOMAS D MYERS MD PC PROVO UT -",3,"debit","Doctor","ING Checking"]
["2010-07-08","Amazon","AMAZON MKTPLACE PMTS AMZN COM B",17.34,"debit","Shopping","ING Checking"]
["2010-07-08","Albertsons","#00177 ALBERTSO 4700 N. EAGLE R",4.29,"debit","Miscellaneous","ING Checking"]
["2010-07-07","Transfer from ING Savings","Internet Deposit",485,"credit","Transfer","ING Checking"]
["2010-07-07","Albertsons","#00177 ALBERTSO 4700 NORTH EAGL",21.02,"debit","Miscellaneous","ING Checking"]
["2010-07-07","Boise Pretzel Maker","BOISE PRETZELMAKER BOISE ID - D",4.34,"debit","Fast Food","ING Checking"]
["2010-07-07","Transfer to Checking","Internet Withdrawal",485,"debit","Transfer","ING Savings"]
["2010-07-06","Target","TARGET T1230 BO 6280 N EAGLE RO",44.23,"debit","Miscellaneous","ING Checking"]
["2010-07-06","Zurchers Party & Wedding","ZURCHERS PARTY 1330 N. EAGLE RD",22.29,"debit","Gift","ING Checking",null,"mom's bday"]
["2010-07-06","TGI Friday's","TGI FRIDAY S BOISE QPS BOISE ID",18.07,"debit","Restaurants","ING Checking"]
["2010-07-06","AT&amp;T","External Electronic Withdrawal",111.06,"debit","Mobile Phone","ING Holding"]
["2010-07-06","Ross Meridian Id","ROSS STORE 530 530     MERIDIAN     ID",26.48,"credit","Credit Card Payment","B of A CC"]
["2010-07-05","Marshalls","MARSHALLS MARSHALLS",14.82,"debit","Clothing","ING Checking"]
["2010-07-05","Payless ShoeSource","PAYLESS SHOESOU 350 N MILWAUKEE",6.35,"debit","Clothing","ING Checking"]
["2010-07-04","Yankee Stadium Concqps","YANKEE STADIUM CONCQPS BRONX NY",15,"debit","Uncategorized","ING Checking"]
["2010-07-04","Great Clips","GREAT CLIPS 2609 QPS BOISE ID -",10,"debit","Hair","ING Checking"]
["2010-07-03","Albertsons","#00164 ALBERTSONS 0000 MERIDIAN     ID",13.34,"debit","Miscellaneous","B of A CC"]
["2010-07-03","UPS","THE UPS STORE #2586 30 MERIDIAN     ID",63.82,"debit","Miscellaneous","B of A CC",null,"shipping for Tyler"]
["2010-07-02","Great Clips","GREAT CLIPS 2609 BOISE ID - Deb",15,"debit","Hair","ING Checking"]
["2010-07-02","Zoo Boise","ZOO BOISE BOISE ID - Debit",6.25,"debit","Entertainment","ING Checking"]
["2010-07-02","Wal","WAL - Debit",68.73,"debit","Uncategorized","ING Checking"]
["2010-07-02","Transfer from ING Savings","Internet Deposit",150,"credit","Transfer","ING Checking"]
["2010-07-02","Albertsons","#00177 ALBERTSO 4700 N. EAGLE R",4.2300000000000004,"debit","Miscellaneous","ING Checking"]
["2010-07-02","Transfer to Checking","Internet Withdrawal",150,"debit","Transfer","ING Savings"]
["2010-07-02","Haband","GRIDIRON REHAB AND ATH MERIDIAN     ID",40,"debit","Clothing","B of A CC"]
["2010-07-02","Interest Charged Purchases","Interest Charged on Purchases",36.61,"debit","Finance Charge","B of A CC"]
["2010-07-01","Person Person Laura","Person2Person Payment to Laura",1075,"debit","Mortgage & Rent","ING Checking",null,"2010-07-01"]
["2010-07-01","Interest Paid For","Interest paid for overdraft Int",0.02,"debit","Bank Fee","ING Checking"]
["2010-07-01","MTA","MTA MVM 42TH STREET 212 METROCA",10,"debit","Public Transportation","ING Checking"]
["2010-06-30","Paper Church Jesus","Paper Payment to CHURCH OF JESU",177.4,"debit","Charity","ING Checking"]
["2010-06-30","Electronic City","Electronic Payment to Provo City",76.5,"debit","Credit Card Payment","ING Checking"]
["2010-06-30","Interest Paid","Interest Paid",0.08,"credit","Interest Income","ING Checking"]
["2010-06-30","Target","TARGET T1230 BO 6280 N EAGLE RO",12.54,"debit","Miscellaneous","ING Checking"]
["2010-06-30","Interest Paid","Interest Paid",0.15,"credit","Interest Income","ING Holding"]
["2010-06-30","Interest Paid","Interest Paid",0.15,"credit","Interest Income","ING Savings"]
["2010-06-30","Walgreen","WALGREENS #11452 00001 MERIDIAN     ID",21.19,"credit","Miscellaneous","B of A CC"]
["2010-06-29","Transfer from ING Holding","Internet Deposit",76,"credit","Transfer","ING Checking",null,"to pay provo city bill"]
["2010-06-29","Veracity Network Veracity","External Electronic Withdrawal",47.98,"debit","Internet","ING Holding"]
["2010-06-29","Transfer to Checking","Internet Withdrawal",76,"debit","Transfer","ING Holding"]
["2010-06-29","Albertsons","ALBERTSONS #177 Q BOISE ID",27.69,"debit","Miscellaneous","Citi CC"]
["2010-06-29","Craft Warehouse","CRAFT WAREHOUSE 11 MERIDIAN ID",12.7,"debit","Hobbies","Citi CC"]
["2010-06-29","Albertsons","ALBERTSONS Q BOISE ID",31.54,"debit","Miscellaneous","Citi CC"]
["2010-06-29","Ave Americas N","1120 AVE. OF AMERICAS  N.Y.C, N",3,"debit","Uncategorized","ING Checking"]
["2010-06-29","Ave Americas N","1120 AVE. OF AMERICAS  N.Y.C, N",40,"debit","Uncategorized","ING Checking"]
["2010-06-28","Paradies","PARADIES SHOP 208 Q02 BOISE ID",16.940000000000001,"debit","Shopping","ING Checking"]
["2010-06-28","Duane Reade","DUANE READE INC 200 WATER STREE",5.99,"debit","Shopping","ING Checking"]
["2010-06-28","Brookstone Boise Id","BROOKSTONE 210002269 BOISE ID",63.55,"credit","Gift","Citi CC",null,"return"]
["2010-06-27","Transfer from ING Holding","Internet Deposit",1374,"credit","Transfer","ING Checking"]
["2010-06-27","Carl's Jr","CARL S JR 7611N Q11 MERIDIAN ID",5.82,"debit","Fast Food","ING Checking"]
["2010-06-27","Transfer to Checking","Internet Withdrawal",1374,"debit","Transfer","ING Holding"]
["2010-06-27","Apple","APPLE WEB STORE APPLE  AUSTIN       TX",255.13,"debit","Electronics & Software","B of A CC"]
["2010-06-26","Consumer Reports","CR *CONSUMERREPORTS.OR 8003330663 NY",5.95,"debit","Miscellaneous","Citi CC"]
["2010-06-26","Trudys Kitchen","POS Transaction TRUDYS KITCHEN IDAHO CITY IDUS",15.73,"debit","Fast Food","Addison Avenue Checking"]
["2010-06-26","Paid Nsf Fee","Paid POS NSF Fee",25,"debit","Fees & Charges","Addison Avenue Checking"]
["2010-06-25","Savings Deposit Direct","Savings Deposit - Direct Deposit",1773.66,"credit","Paycheck","ING Holding"]
["2010-06-24","Toys 'R' Us","TOYS R US 1200 N EAGLE RD",11.64,"debit","Baby Supplies","ING Checking",null,"bottle liners"]
["2010-06-24","Transfer to Amber Checking","Overdraft Transfer",3.4,"debit","Transfer","Addison Avenue Savings"]
["2010-06-24","Paid Nsf Fee","Paid POS NSF Fee",25,"debit","Fees & Charges","Addison Avenue Checking"]
["2010-06-24","Transfer from Amber Savings","Overdraft Transfer",3.4,"credit","Transfer","Addison Avenue Checking"]
["2010-06-24","Haband","POS Transaction GRIDIRON REHAB AND ATHLMERIDIAN IDUS",40,"debit","Doctor","Addison Avenue Checking"]
["2010-06-23","Costco","COSTCO WHSE #07 2051 S. COLE RD",23.31,"debit","Eyecare","ING Checking",null,"contacts"]
["2010-06-23","Albertsons","#00177 ALBERTSO 4700 NORTH EAGL",20.05,"debit","Miscellaneous","ING Checking"]
["2010-06-23","Scout Com Wa","SCOUT.COM              888-979-0979 WA",9.9499999999999993,"debit","Newspapers & Magazines","B of A CC"]
["2010-06-23","Subway","POS Transaction SUBWAY 00158857 BOISE IDUS",14.81,"debit","Fast Food","Addison Avenue Checking",null,"Dallin mowing lawn"]
["2010-06-23","Wal-Mart","POS Transaction Wal-Mart Super Center 2862 WAL-SAMS MERIDIAN ID",19.079999999999998,"debit","Shopping","Addison Avenue Checking",null,"scale"]
["2010-06-22","iTunes","APL*ITUNES 866-712-7753 CA",8.5299999999999994,"debit","Music","Citi CC"]
["2010-06-22","Albertsons","POS Transaction #00177 ALBERTSONS 4700 N. EAGLE RD. BOISE IDUS",23.4,"debit","Miscellaneous","Addison Avenue Checking",null,"moisturizer, toothpaste, laundry detergent, drano"]
["2010-06-22","Transfer to ING Savings","ACH Debit SWENSEN,AMBER M - ING DIRECT",635,"debit","Transfer","Addison Avenue Checking"]
["2010-06-22","Big 5 Sporting","POS Transaction BIG 5 SPORTING GOODS #2RICHLAND WAUS",18.399999999999999,"debit","Sporting Goods","Addison Avenue Checking"]
["2010-06-22","Boise Di Fairview","POS Transaction BOISE DI 10740 FAIRVIEW AVE BOISE IDUS",43.46,"debit","Clothing","Addison Avenue Checking"]
["2010-06-21","Paper Church Jesus","Paper Payment to CHURCH OF JESU",354,"debit","Charity","ING Checking"]
["2010-06-21","Internet Deposit Addison","Internet Deposit ADDISON AVENUE",635,"credit","Transfer","ING Savings"]
["2010-06-20","Zamzows","POS Transaction ZAMZOWS CHINDEN MERIDIAN IDUS",27.55,"debit","Lawn & Garden","Addison Avenue Checking"]
["2010-06-19","Banbury Golf Course","POS Transaction BANBURY GOLF COURSE EAGLE IDUS",2,"debit","Sports","Addison Avenue Checking"]
["2010-06-18","Yong In Master","YONG IN MASTER LEES TA BOISE ID",19.95,"debit","Uncategorized","ING Checking"]
["2010-06-18","Zurchers Party Meridian","ZURCHERS PARTY STORE MERIDIAN I",13.55,"debit","Uncategorized","ING Checking"]
["2010-06-18","Coldstone","COLDSTONE 0227 QPS MERIDAN ID -",4.34,"debit","Restaurants","ING Checking"]
["2010-06-18","Ross","ROSS STORE 530 530     MERIDIAN     ID",39.19,"debit","Clothing","B of A CC"]
["2010-06-18","Edwards Boise Stadium Imax","POS Transaction EDWARDS BOISE STADIUM 2BOISE IDUS",20,"debit","Gift","Addison Avenue Checking"]
["2010-06-18","Edwards Boise Stadium Imax","POS Transaction EDWARDS BOISE STADIUM 2BOISE IDUS",7.25,"debit","Gift","Addison Avenue Checking"]
["2010-06-18","Quiznos","POS Transaction QUIZNOS SUB #1522 EAGLE IDUS",5.3,"debit","Fast Food","Addison Avenue Checking"]
["2010-06-18","Carl's Jr","POS Transaction CARLS JR. #7611N Q11 MERIDIAN IDUS",5.82,"debit","Fast Food","Addison Avenue Checking"]
["2010-06-18","Jamba Juice","POS Transaction JAMBA JUICE # 252 BOISE IDUS",7.53,"debit","Food & Dining","Addison Avenue Checking"]
["2010-06-17","Electronic Withdrawal","Electronic Withdrawal",43.61,"debit","Uncategorized","ING Checking"]
["2010-06-17","Deseret Book","DESERET BOOK 81 MERIDIAN ID - D",20,"debit","Gift","ING Checking"]
["2010-06-17","Purchases Interest Charge","PURCHASES*INTEREST CHARGE*PERIODIC RATE",2.2999999999999998,"debit","Finance Charge","Citi CC"]
["2010-06-17","Chevron","POS Transaction CHEVRON 00207403 EAGLE IDUS",44.45,"debit","Gas & Fuel","Addison Avenue Checking"]
["2010-06-17","Haband","POS Transaction GRIDIRON REHAB AND ATHLMERIDIAN IDUS",40,"debit","Doctor","Addison Avenue Checking"]
["2010-06-16","Kohl's","KOHL'S #1094 3275 N EAGLE RD",8.89,"debit","Gift","ING Checking",null,"Chase t-shirt"]
["2010-06-16","Electronic Withdrawal","Electronic Withdrawal",19.95,"debit","Uncategorized","ING Checking"]
["2010-06-16","Electronic Withdrawal","Electronic Withdrawal",592,"debit","Health Insurance","ING Checking"]
["2010-06-16","ShopKo","0169 SHOPKO 3499 E FAIRVIEW AVE",6.35,"debit","Shopping","ING Checking",null,"dora Tee"]
["2010-06-16","Albertsons","#00177 ALBERTSO 4700 N. EAGLE R",35.36,"debit","Miscellaneous","ING Checking",null,"formula, drawing pad, L'oreal stuff, deodorant, shav cream"]
["2010-06-16","Albertsons","#00177 ALBERTSO 4700 N. EAGLE R",2.11,"debit","Gift","ING Checking",null,"balloons"]
["2010-06-16",{"$f":"- Debit","v":{"$error":"#NAME?"}},{"$f":"- Debit","v":{"$error":"#NAME?"}},17.79,"credit","Income","ING Checking",null,"return helmet, lock"]
["2010-06-16","Deposit","Deposit",162.93,"credit","Check","Addison Avenue Checking"]
["2010-06-16","Deposit","Deposit",900,"credit","Mortgage & Rent","Addison Avenue Checking"]
["2010-06-16","Albertsons","#00177 ALBERTSO 4700 N. EAGLE R",19.07,"debit","Gift","ING Checking",null,"cake"]
["2010-06-16","Albertsons","#00177 ALBERTSO 4700 N. EAGLE R",30,"debit","Movies & DVDs","ING Checking",null,"karate kid"]
["2010-06-16","Paid Nsf Fee","Paid POS NSF Fee",25,"debit","Fees & Charges","Addison Avenue Checking"]
["2010-06-15","Albertsons","#00177 ALBERTSO 4700 N. EAGLE R",2.16,"debit","Miscellaneous","ING Checking"]
["2010-06-15","Target","TARGET T1230 BO 6280 N EAGLE RO",17.79,"debit","Miscellaneous","ING Checking",null,"helmet, lock"]
["2010-06-15","Electronic Bank A","Electronic Payment to BANK OF A",38,"debit","Credit Card Payment","ING Checking"]
["2010-06-15","Transfer from Checking","PAYMENT - ELECTRONIC",38,"credit","Credit Card Payment","B of A CC"]
["2010-06-15","Shutterfly","POS Transaction SFI*PHOTOSBYSHUTTERFLY 800-986-1065 CAUS",109.16,"debit","Hobbies","Addison Avenue Checking"]
["2010-06-15","Swensen Amber M","ACH Debit SWENSEN,AMBER M - ING DIRECT",290,"debit","Uncategorized","Addison Avenue Checking"]
["2010-06-14","Target","TARGET T1230 BO 6280 N EAGLE RO",32.520000000000003,"debit","Miscellaneous","ING Checking"]
["2010-06-14","Transfer to 7125","Electronic Withdrawal",500,"debit","Credit Card Payment","ING Checking"]
["2010-06-14","Internet Deposit Addison","Internet Deposit ADDISON AVENUE",290,"credit","Transfer","ING Checking"]
["2010-06-14","Liberty Mutual","Electronic Withdrawal",61.58,"debit","Auto Insurance","ING Checking"]
["2010-06-14","Haband","GRIDIRON REHAB AND ATH MERIDIAN     ID",40,"debit","Doctor","B of A CC"]
["2010-06-14","Transfer to Checking","ACH Debit SWENSEN,AMBER M - ING DIRECT",900,"debit","Transfer","Addison Avenue Checking"]
["2010-06-13","Transfer from Checking","CLICK-TO-PAY PAYMENT, THANK YOU",500,"credit","Credit Card Payment","Citi CC"]
["2010-06-12","Person Person Karl","Person2Person Payment to Karl o",1000,"debit","Check","ING Checking",null,"pay back"]
["2010-06-12","Costco","POS Transaction COSTCO WHSE #0761 2051 S. COLE RD. BOISE IDUS",21.38,"debit","Miscellaneous","Addison Avenue Checking"]
["2010-06-12","Georges Cycles","POS Transaction GEORGES CYCLES FIT BOISE IDUS",14.83,"debit","Sporting Goods","Addison Avenue Checking"]
["2010-06-11","Transfer from ING Holding","Internet Deposit",1773,"credit","Transfer","ING Checking"]
["2010-06-11","Internet Deposit Addison","Internet Deposit ADDISON AVENUE",900,"credit","Transfer","ING Checking"]
["2010-06-11","Transfer to Checking","Internet Withdrawal",1773,"debit","Transfer","ING Holding"]
["2010-06-11","Savings Deposit Direct","Savings Deposit - Direct Deposit",1773.65,"credit","Paycheck","ING Holding"]
["2010-06-11","Five Guys Id","FIVE GUYS--ID # 10 542 MERIDIAN     ID",8.0399999999999991,"debit","Fast Food","B of A CC"]
["2010-06-11","Ryan Associates","POS Transaction KELLEY RYAN ASSOCIATE508-473-9660 MAUS",35.270000000000003,"debit","State Tax","Addison Avenue Checking"]
["2010-06-10","Walgreen","WALGREENS #11452 00001 MERIDIAN     ID",21.19,"debit","Miscellaneous","B of A CC",null,"glasses"]
["2010-06-10","Www Optical Less","WWW. OPTICAL4LESS.COM  TIN SHUI WAI",111.83,"debit","Eyecare","B of A CC"]
["2010-06-10","Deposit","Deposit",298.60000000000002,"credit","Reimbursement","Addison Avenue Checking",null,"BYU"]
["2010-06-10","Albertsons","POS Transaction #00177 ALBERTSONS 4700 N. EAGLE RD. BOISE IDUS",9.84,"debit","Miscellaneous","Addison Avenue Checking",null,"Miralax,colace"]
["2010-06-09","Lowe's","LOWE'S #2573 3400 NORTH EAGLE R",4.08,"debit","Miscellaneous","ING Checking",null,"screws, keys"]
["2010-06-09","Albertsons","#00177 ALBERTSONS 0000 BOISE        ID",7.09,"debit","Miscellaneous","B of A CC",null,"glasses"]
["2010-06-09","Hobby Lobby","HOBBY LOBBY # 433 MERIDIAN ID",8.7899999999999991,"debit","Hobbies","Citi CC",null,"bike seat buckle"]
["2010-06-09","Deposit","Deposit",1774.03,"credit","Paycheck","Addison Avenue Checking"]
["2010-06-09","Withdrawal","Withdrawal",800,"debit","Mortgage & Rent","Addison Avenue Checking"]
["2010-06-08","Netflix","NETFLIX                LOS GATOS    CA",11.65,"debit","Movies & DVDs","B of A CC"]
["2010-06-07","Costco","COSTCO WHSE #07 2051 S. COLE RD",41.97,"debit","Baby Supplies","ING Checking",null,"diapers"]
["2010-06-07","Target","TARGET T1230 BO 6280 N EAGLE RO",9.89,"debit","Miscellaneous","ING Checking",null,"return bike helmet"]
["2010-06-07",{"$f":"- Debit","v":{"$error":"#NAME?"}},{"$f":"- Debit","v":{"$error":"#NAME?"}},14.85,"credit","Shopping","ING Checking",null,"paper towels, bottle liners"]
["2010-06-06","AT&T Wireless","ATTM 265004344038 08003310500 G",112.22,"debit","Mobile Phone","ING Checking"]
["2010-06-03","Albertsons","#00177 ALBERTSO 4700 NORTH EAGL",30,"debit","Gas & Fuel","ING Checking"]
["2010-06-03","Albertsons","#00177 ALBERTSO 4700 N. EAGLE R",3.17,"debit","Miscellaneous","ING Checking"]
["2010-06-03","iTunes","APL*ITUNES 866-712-7753 CA",1.06,"debit","Music","Citi CC"]
["2010-06-01","Person Person Laura","Person2Person Payment to Laura",1075,"debit","Mortgage & Rent","ING Checking"]
["2010-06-01","Toys 'R' Us","TOYS R US 1200 N EAGLE RD",5.08,"debit","Shopping","ING Checking"]
["2010-06-01","Walgreen","WALGREEN COMPAN 3263 N EAGLE RD",19.05,"debit","Miscellaneous","ING Checking",null,"bandages"]
["2010-06-01","Electronic Bank A","Electronic Payment to BANK OF A",20,"debit","Credit Card Payment","ING Checking"]
["2010-06-01","Interest Paid For","Interest paid for overdraft Int",7.0000000000000007E-2,"debit","Bank Fee","ING Checking"]
["2010-06-01","Paper Church Jesus","Paper Payment to CHURCH OF JESU",177.4,"debit","Charity","ING Checking"]
["2010-06-01","Amazon","AMAZON MKTPLACE PMTS   AMZN.COM/BILLWA",6.48,"debit","Shopping","B of A CC"]
["2010-06-01","Transfer from Checking","PAYMENT - ELECTRONIC",20,"credit","Credit Card Payment","B of A CC"]
["2010-05-31","Stinker W Ustick","STINKER #59 10677 W USTICK RD",25.06,"debit","Gas & Fuel","ING Checking"]
["2010-05-31","Interest Paid","Interest Paid",0.1,"credit","Interest Income","ING Checking"]
["2010-05-31","Provo City Utilities","PROVO CITY UTILITIES PROVO UT -",81.41,"debit","Utilities","ING Checking"]
["2010-05-31","iTunes","APL*ITUNES 866-712-7753 CA",1.06,"debit","Shopping","Citi CC"]
["2010-05-31","Wal-Mart","WAL - Debit",1.44,"debit","Shopping","ING Checking"]
["2010-05-31","Wal-Mart","WAL - Debit",40,"debit","Cash & ATM","ING Checking"]
["2010-05-29","Target","TARGET T1230 BO 6280 N EAGLE RO",36.04,"debit","Shopping","ING Checking"]
["2010-05-29","Wal","WAL - Debit",53.86,"debit","Shopping","ING Checking"]
["2010-05-29","Wal-Mart","WAL-MART  2862         MERIDIAN     ID",27,"debit","Shopping","B of A CC"]
["2010-05-28","Albertsons","#00177 ALBERTSO 4700 N. EAGLE R",4.2300000000000004,"debit","Miscellaneous","ING Checking"]
["2010-05-28","Transfer from ING Holding","Internet Deposit",1779,"credit","Transfer","ING Checking"]
["2010-05-28","Person Person Tyler","Person2Person Payment to Tyler",800,"debit","Mortgage & Rent","ING Checking"]
["2010-05-28","Transfer to Checking","Internet Withdrawal",1779,"debit","Transfer","ING Holding"]
["2010-05-28","Savings Deposit Direct","Savings Deposit - Direct Deposit",1774.04,"credit","Paycheck","ING Holding"]
["2010-05-27","Veracity Network Veracity","Electronic Withdrawal",47.98,"debit","Internet","ING Checking"]
["2010-05-27","Chevron","CHEVRON JACKSONS FOOD  BOISE        ID",21.21,"debit","Gas & Fuel","B of A CC"]
["2010-05-27","Albertsons","#00177 ALBERTSONS 0000 BOISE        ID",11.95,"debit","Miscellaneous","B of A CC"]
["2010-05-27","REI","REI #47 00047          BOISE        ID",22.99,"debit","Shopping","B of A CC"]
["2010-05-26","iTunes","APL*ITUNES 866-712-7753 CA",3.18,"debit","Miscellaneous","Citi CC"]
["2010-05-26","Consumer Reports","CR *CONSUMERREPORTS.OR 8003330663 NY",5.95,"debit","Miscellaneous","Citi CC"]
["2010-05-26","Walgreen","WALGREENS #11452 00001 MERIDIAN     ID",42.39,"debit","Miscellaneous","B of A CC"]
["2010-05-26","Costco","COSTCO WHSE #0761 0000 BOISE        ID",22.79,"debit","Miscellaneous","B of A CC"]
["2010-05-26","Albertsons","#00177 ALBERTSONS 0000 BOISE        ID",1.69,"debit","Miscellaneous","B of A CC"]
["2010-05-26","Shell","SHELL OIL 57441947306  MERIDIAN     ID",17.010000000000002,"debit","Gas & Fuel","B of A CC"]
["2010-05-26","Kmart","KMART 3298 KMART #0329 BOISE        ID",10.85,"debit","Shopping","B of A CC"]
["2010-05-25","Primary Health","PRIMARY HEALTH MEDICAL BOISE        ID",25,"debit","Doctor","B of A CC"]
["2010-05-25","Albertsons","#00177 ALBERTSONS 0000 BOISE        ID",59.6,"debit","Pharmacy","B of A CC"]
["2010-05-25","Albertsons","#00177 ALBERTSONS 0000 BOISE        ID",3.81,"debit","Miscellaneous","B of A CC"]
["2010-05-25","Albertsons","#00177 ALBERTSONS 0000 BOISE        ID",12.41,"debit","Miscellaneous","B of A CC"]
["2010-05-24","Amazon","AMAZON.COM             AMZN.COM/BILLWA",19.989999999999998,"debit","Shopping","B of A CC"]
["2010-05-24","Amazon","AMAZON.COM             AMZN.COM/BILLWA",34.950000000000003,"debit","Shopping","B of A CC"]
["2010-05-24","Albertsons","#00182 ALBERTSONS 0000 EAGLE        ID",17.54,"debit","Miscellaneous","B of A CC"]
["2010-05-24","Babies 'R' Us","BABIES 'R' US          MERIDIAN     ID",45.76,"credit","Shopping","B of A CC"]
["2010-05-23","Amazon","AMAZON MKTPLACE PMTS   AMZN.COM/BILLWA",8.3800000000000008,"debit","Shopping","B of A CC"]
["2010-05-23","Scout Com Wa","SCOUT.COM              888-979-0979 WA",9.9499999999999993,"debit","Miscellaneous","B of A CC"]
["2010-05-22","Costco","COSTCO WHSE #0761 0000 BOISE        ID",58.27,"debit","Miscellaneous","B of A CC"]
["2010-05-22","George's Cycles & Fitness","GEORGE'S CYCLES & FIT  BOISE        ID",611.54999999999995,"debit","Shopping","B of A CC"]
["2010-05-21","Primary Health","PRIMARY HEALTH MEDICAL BOISE        ID",25,"debit","Doctor","B of A CC"]
["2010-05-21","Albertsons","#00177 ALBERTSONS 0000 BOISE        ID",11.43,"debit","Miscellaneous","B of A CC"]
["2010-05-21","Savers","SAVERS 1033 2270520099 BOISE        ID",16.91,"debit","Shopping","B of A CC"]
["2010-05-21","Boise Di","BOISE DI 3000034365390 BOISE        ID",25.97,"debit","Shopping","B of A CC"]
["2010-05-20","Target","TARGET 1230 1230       BOISE        ID",5.3,"debit","Miscellaneous","B of A CC"]
["2010-05-20","Griddle","THE GRIDDLE EAGLE 6500 EAGLE        ID",23.09,"debit","Restaurants","B of A CC"]
["2010-05-19","Purchases Interest Charge","PURCHASES*INTEREST CHARGE*PERIODIC RATE",2.4700000000000002,"debit","Finance Charge","Citi CC"]
["2010-05-19","Todd Stewart Salon","TODD STEWART SALON     EAGLE        ID",25,"debit","Personal Care","B of A CC"]
["2010-05-19","Albertsons","#00177 ALBERTSONS 0000 BOISE        ID",4.42,"debit","Miscellaneous","B of A CC"]
["2010-05-19","Albertsons","#00177 ALBERTSONS 0000 BOISE        ID",10.59,"debit","Miscellaneous","B of A CC"]
["2010-05-19","Jamba Juice","JAMBA JUICE # 252 0000 BOISE        ID",8.3699999999999992,"debit","Food & Dining","B of A CC"]
["2010-05-19","Target","TARGET STORE 617 0617  BOISE        ID",21.72,"debit","Miscellaneous","B of A CC"]
["2010-05-18","Five Guys Id","FIVE GUYS--ID # 10 542 MERIDIAN     ID",13.86,"debit","Fast Food","B of A CC"]
["2010-05-18","Wal-Mart","WAL-MART  2862         MERIDIAN     ID",68.900000000000006,"debit","Miscellaneous","B of A CC"]
["2010-05-17","Boise Di","BOISE DI 3000034365390 BOISE        ID",9.5399999999999991,"debit","Miscellaneous","B of A CC"]
["2010-05-17","Transfer to Amber","Electronic Withdrawal from CITI CARD ONLINE PAYMENT",20,"debit","Credit Card Payment","ING Checking"]
["2010-05-15","Chevron","CHEVRON JACKSONS FOOD  BOISE        ID",1.9,"debit","Gas & Fuel","B of A CC"]
["2010-05-15","Albertsons","#00177 ALBERTSONS 0000 BOISE        ID",16.399999999999999,"debit","Miscellaneous","B of A CC"]
["2010-05-15","Chevron","CHEVRON JACKSONS FOOD  BOISE        ID",3.9,"debit","Gas & Fuel","B of A CC"]
["2010-05-15","Albertsons","#00177 ALBERTSONS 0000 BOISE        ID",4.43,"debit","Miscellaneous","B of A CC"]
["2010-05-15","Subway","SUBWAY        222976 2 BOISE        ID",12.72,"debit","Fast Food","B of A CC"]
["2010-05-14","Transfer from Checking","CLICK-TO-PAY PAYMENT, THANK YOU",20,"credit","Credit Card Payment","Citi CC"]
["2010-05-13","iTunes","APL*ITUNES 866-712-7753 CA",1.06,"debit","Miscellaneous","Citi CC"]
["2010-05-13","Shell","SHELL OIL 57441947306  MERIDIAN     ID",45.97,"debit","Gas & Fuel","B of A CC"]
["2010-05-13","Wal-Mart","WAL-MART  2862         MERIDIAN     ID",25.78,"debit","Shopping","B of A CC"]
["2010-05-13","Babies 'R' Us","BABIES 'R' US          MERIDIAN     ID",93.25,"debit","Shopping","B of A CC"]
["2010-05-12","Kid To Kid","KID TO KID BOISE ID",14.83,"debit","Shopping","Citi CC"]
["2010-05-12","Albertsons","#00177 ALBERTSONS 0000 BOISE        ID",29.46,"debit","Miscellaneous","B of A CC"]
["2010-05-12","Ross","ROSS STORES 217 217    BOISE        ID",15.87,"debit","Shopping","B of A CC"]
["2010-05-12","Target","TARGET STORE 617 0617  BOISE        ID",11.12,"debit","Miscellaneous","B of A CC"]
["2010-05-11","Albertsons","#00177 ALBERTSONS 0000 BOISE        ID",4,"debit","Miscellaneous","B of A CC"]
["2010-05-10","Transfer to Checking","ACH Debit SWENSEN,AMBER M - ING DIRECT",880,"debit","Transfer","Addison Avenue Checking"]
["2010-05-10","Albertsons","#00177 ALBERTSONS 0000 BOISE        ID",14.29,"debit","Miscellaneous","B of A CC"]
["2010-05-10","Target","TARGET 1230 1230       BOISE        ID",6.66,"credit","Miscellaneous","B of A CC"]
["2010-05-10","George's Cycles & Fitness","GEORGE'S CYCLES & FIT  BOISE        ID",50,"debit","Miscellaneous","B of A CC"]
["2010-05-10","Primary Health","PRIMARY HEALTH MEDICAL BOISE        ID",25,"debit","Doctor","B of A CC"]
["2010-05-10","Amazon","AMAZON MKTPLACE PMTS   AMZN.COM/BILLWA",9.3800000000000008,"debit","Shopping","B of A CC"]
["2010-05-10","Amazon","AMAZON.COM             AMZN.COM/BILLWA",16.489999999999998,"debit","Shopping","B of A CC"]
["2010-05-09","Amazon","AMAZON MKTPLACE PMTS   AMZN.COM/BILLWA",32.950000000000003,"debit","Shopping","B of A CC"]
["2010-05-09","Amazon","AMAZON MKTPLACE PMTS   AMZN.COM/BILLWA",40.78,"debit","Shopping","B of A CC"]
["2010-05-08","Brookstone","BROOKSTONE CO 226 0022 BOISE        ID",69.540000000000006,"debit","Shopping","B of A CC"]
["2010-05-08","Netflix","NETFLIX                LOS GATOS    CA",3.18,"debit","Movies & DVDs","B of A CC"]
["2010-05-08","Netflix","NETFLIX                LOS GATOS    CA",14.83,"debit","Movies & DVDs","B of A CC"]
["2010-05-08","Boise Co-op","BOISECOOP              BOISE        ID",2.0499999999999998,"debit","Groceries","B of A CC"]
["2010-05-08","Jamba Juice","JAMBA JUICE # 252 0000 BOISE        ID",9.9600000000000009,"debit","Food & Dining","B of A CC"]
["2010-05-08","Amazon","AMAZON MKTPLACE PMTS   AMZN.COM/BILLWA",23.86,"debit","Shopping","B of A CC"]
["2010-05-08","TJ Maxx","TJMAXX #0415 000000415 BOISE        ID",46.78,"debit","Shopping","B of A CC"]
["2010-05-07","Target","TARGET 1230 1230       BOISE        ID",25.91,"debit","Miscellaneous","B of A CC"]
["2010-05-07","Amazon","AMAZON MKTPLACE PMTS   AMZN.COM/BILLWA",99.9,"debit","Shopping","B of A CC"]
["2010-05-07","UPS","UPS STORE #4537 300004 BOISE        ID",14.45,"debit","Miscellaneous","B of A CC"]
["2010-05-07","Target","TARGET 1230 1230       BOISE        ID",6.66,"debit","Miscellaneous","B of A CC"]
["2010-05-07","Person Person Laura","Person2Person Payment to Laura or Clayne Larsen",1045,"debit","Mortgage & Rent","ING Checking"]
["2010-05-07","Transfer from Amber Checking","Internet Deposit ADDISON AVENUE FEDERAL CREDIT UNION checking account XXXXXX9908",880,"credit","Mortgage & Rent","ING Checking"]
["2010-05-06","Transfer to Checking","ACH Debit SWENSEN,AMBER M - ING DIRECT",1050,"debit","Transfer","Addison Avenue Checking"]
["2010-05-06","ShopKo","SHOPKO        401695 5 MERIDIAN     ID",31.62,"debit","Shopping","B of A CC"]
["2010-05-06","USPS","USPS 150931955500604 4 BOISE        ID",7.92,"debit","Miscellaneous","B of A CC"]
["2010-05-06","Ross","ROSS STORE 530 530     MERIDIAN     ID",4.2300000000000004,"debit","Shopping","B of A CC"]
["2010-05-05","Deposit","Deposit",1200,"credit","Income","Addison Avenue Checking"]
["2010-05-05","Withdrawal","Withdrawal",320,"debit","Uncategorized","Addison Avenue Checking"]
["2010-05-05","Kidz","KIDZ AGAIN BOISE ID",6.31,"debit","Shopping","Citi CC"]
["2010-05-05","Chevron","CHEVRON JACKSONS FOOD  BOISE        ID",35.5,"debit","Gas & Fuel","B of A CC"]
["2010-05-05","Quiznos","QUIZNOS SUB #1522 3000 EAGLE        ID",12.7,"debit","Fast Food","B of A CC"]
["2010-05-05","Transfer from Amber Checking","Internet Deposit ADDISON AVENUE FEDERAL CREDIT UNION checking account XXXXXX9908",1050,"credit","Bonus","ING Checking",null,"borrowed from Swensens"]
["2010-05-04","Deposit Direct Ing","ACH Deposit DIRECT,ING - ING DIRECT",0.12,"credit","Income","Addison Avenue Checking"]
["2010-05-04","Deposit Direct Ing","ACH Deposit DIRECT,ING - ING DIRECT",0.12,"credit","Income","Addison Avenue Checking"]
["2010-05-04","Albertsons","#00177 ALBERTSONS 0000 BOISE        ID",11.63,"debit","Miscellaneous","B of A CC"]
["2010-05-04","Redbox","Debit Card Purchase - REDBOX DVD RENTAL 866 733 2693 IL",5.34,"debit","Movies & DVDs","ING Checking"]
["2010-05-03","Questar Gas Company","QUESTAR GAS COMPANY 800-323-5517 UT",83.51,"debit","Utilities","Citi CC"]
["2010-05-03","Liberty Mutual","LIBERTYMUTUALINSURAN   800-225-8285 MA",60.75,"debit","Auto Insurance","B of A CC"]
["2010-05-03","Albertsons","#00177 ALBERTSONS 0000 BOISE        ID",14.16,"debit","Miscellaneous","B of A CC"]
["2010-05-03","Costco","COSTCO WHSE #0761 0000 BOISE        ID",39.200000000000003,"debit","Miscellaneous","B of A CC"]
["2010-05-03","Minimum Interest Charge","MINIMUM INTEREST CHARGE",1.5,"debit","Finance Charge","B of A CC"]
["2010-05-01","AT&T Wireless","ATTM*265004344038MTZ 3 ALPHARETTA   GA",116.69,"debit","Mobile Phone","B of A CC"]
["2010-05-01","Boise Towne Square","BOISE TOWN SQUARE 3930 BOISE        ID",71.540000000000006,"debit","Shopping","B of A CC"]
["2010-05-01","Kohl's","KOHL'S 1094 1094       MERIDIAN     ID",7.41,"debit","Shopping","B of A CC"]
["2010-05-01","Boise Towne Square","BOISE TOWN SQUARE 3930 BOISE        ID",75.5,"debit","Shopping","B of A CC"]
["2010-05-01","Redbox","REDBOX DVD RENTAL      866-733-2693 IL",2.14,"debit","Movies & DVDs","B of A CC"]
["2010-05-01","Boise Towne Square","BOISE TOWN SQUARE 3930 BOISE        ID",55.64,"debit","Shopping","B of A CC"]
["2010-05-01","T G I","T G I FRIDAY'S BOISE 1 BOISE        ID",18.05,"debit","Restaurants","B of A CC"]
["2010-04-30","Periodic Finance Charge","Finance Charge Paid for Overdraft",0.08,"debit","Finance Charge","ING Checking"]
["2010-04-30","Monthly Interest Paid","Monthly Interest Paid",0.02,"credit","Interest Income","ING Checking"]
["2010-04-30","Chevron","CHEVRON JACKSONS FOOD  MERIDIAN     ID",43.39,"debit","Gas & Fuel","B of A CC"]
["2010-04-30","Wal-Mart","WAL-MART  2862         MERIDIAN     ID",32.72,"debit","Shopping","B of A CC"]
["2010-04-30","Wal-Mart","WAL-MART  2862         MERIDIAN     ID",41.15,"debit","Shopping","B of A CC"]
["2010-04-28","Provo City Utilities","Debit Card Purchase - PROVO CITY UTILITIES PROVO UT",81.069999999999993,"debit","Utilities","ING Checking"]
["2010-04-28","Chevron","CHEVRON GOLDN SPIKE TR TREMONTON    UT",39.69,"debit","Gas & Fuel","B of A CC"]
["2010-04-28","Carl's Jr","CARL'S JR #1101363 QPS PROVO        UT",20.76,"debit","Fast Food","B of A CC"]
["2010-04-27","Smith's Food","SMITHS FOOD #4136 0000 PROVO        UT",5.33,"debit","Groceries","B of A CC"]
["2010-04-27","Domino's Pizza","DOMINOS PIZZA #7501 30 PROVO        UT",16.850000000000001,"debit","Fast Food","B of A CC"]
["2010-04-27","UPS","THE UPS STORE #5266 30 PROUD        UT",10.76,"debit","Shipping","B of A CC"]
["2010-04-27","Camera","KEWS CAMERA REPAIR KEW PROVO        UT",95.23,"debit","Hobbies","B of A CC"]
["2010-04-26","Consumer Reports","CR *CONSUMERREPORTS.OR 8003330663 NY",5.95,"debit","Books","Citi CC"]
["2010-04-26","Kmart","KMART 3765 KMART #0376 PROVO        UT",31.93,"debit","Shopping","B of A CC"]
["2010-04-26","USPS","USPS CHANGE OF100959 4 MEMPHIS      TN",1,"debit","Shipping","B of A CC"]
["2010-04-25","Veracity Networks Ut","Debit Card Purchase - VERACITY NETWORKS 801 6915800 UT",47.98,"debit","Uncategorized","ING Checking"]
["2010-04-24","Costco","COSTCO WHSE #0484 0000 OREM         UT",22.31,"debit","Miscellaneous","B of A CC"]
["2010-04-24","Chevron","CHEVRON PWI #912 - SAL SALT LAKE CITUT",41.69,"debit","Gas & Fuel","B of A CC"]
["2010-04-24","Target","TARGET 1814 1814       AMERICAN FORKUT",26.68,"debit","Miscellaneous","B of A CC"]
["2010-04-24","Melting Pot","THE MELTING POT OF UTA SALT LAKE CITUT",24.86,"debit","Restaurants","B of A CC"]
["2010-04-23","Texaco","TEXACO PWI #968-OREM 0 OREM         UT",15.2,"debit","Gas & Fuel","B of A CC"]
["2010-04-22","Scout Com Wa","SCOUT.COM              888-979-0979 WA",9.9499999999999993,"debit","Uncategorized","B of A CC"]
["2010-04-22","Costco","COSTCO WHSE #0484 0000 OREM         UT",17.73,"debit","Miscellaneous","B of A CC"]
["2010-04-22","Byu Cougar Creations","BYU COUGAR CREATIONS 3 PROVO        UT",298.60000000000002,"debit","Uncategorized","B of A CC"]
["2010-04-22","Carl's Jr","CARL'S JR #1101146 QPS OREM         UT",5.49,"debit","Fast Food","B of A CC"]
["2010-04-21","Byu Signature Web","Debit Card Purchase - BYU SIGNATURE CRD WEB 08014223867 UT",10,"debit","Uncategorized","ING Checking"]
["2010-04-20","Fresh Market Provo","FRESH MARKET PROVO 000 PROVO        UT",9.19,"debit","Groceries","B of A CC"]
["2010-04-20","Inspection Station","THE INSPECTION STATION OREM         UT",555.63,"debit","Parking","B of A CC"]
["2010-04-19","Purchases Interest Charge","PURCHASES*INTEREST CHARGE*PERIODIC RATE",7.88,"debit","Finance Charge","Citi CC"]
["2010-04-19","Panda Express","PANDA EXPRESS 724 5429 PROVO        UT",14.33,"debit","Fast Food","B of A CC"]
["2010-04-19","Questar Gas","Electronic Withdrawal from Questar Gas Co. QGC",82.7,"debit","Utilities","ING Checking"]
["2010-04-19","PayPal","Electronic Withdrawal from PAYPAL INST XFER",44.95,"debit","Shopping","ING Checking"]
["2010-04-19","Home Depot","Debit Card Purchase - THE HOME DEPOT 1550 S UNIVERSITY AVEN",6.37,"debit","Home Improvement","ING Checking"]
["2010-04-15","Marketplace Cafe","Debit Card Purchase - MARKETPLACE CAFE PROVO UT",8.17,"debit","Restaurants","ING Checking"]
["2010-04-14","Liberty Mutual","Electronic Withdrawal from LIBERTY MUTUAL PAYMENT",60.75,"debit","Auto Insurance","ING Checking"]
["2010-04-13","Costa","Debit Card Purchase - COSTA VIDA OF PROVOQPS PROVO UT",8.26,"debit","Fast Food","ING Checking"]
["2010-04-12","GameStop","GAMESTOP #201 00000020 OREM         UT",28.84,"credit","Electronics & Software","B of A CC"]
["2010-04-12","Hogi Yogi","Debit Card Purchase - HOGI YOGI TERIYAKI S PROVO UT",5.69,"debit","Restaurants","ING Checking"]
["2010-04-12","Malt Shoppe","Debit Card Purchase - THE MALT SHOPPE QPS PROVO UT",3.76,"debit","Restaurants","ING Checking"]
["2010-04-08","ATM Fee","ATM Withdrawal - BRIGHAM UNIVERSITY PROVO, UT US",1,"debit","ATM Fee","ING Checking"]
["2010-04-08","ATM Withdrawal","ATM Withdrawal - BRIGHAM UNIVERSITY PROVO, UT US",20,"debit","Cash & ATM","ING Checking"]
["2010-04-06","Paper Church Jesus","Paper Payment to CHURCH OF JESUS CHRIST OF LDS",819,"debit","Charity","ING Checking"]
["2010-04-05","Byu Marketplace","BYU MARKETPLACE 301010 PROVO        UT",4.62,"debit","Groceries","B of A CC"]
["2010-04-05","Byu Marketplace","BYU MARKETPLACE 301010 PROVO        UT",2.99,"debit","Groceries","B of A CC"]
["2010-04-05","GameStop","GAMESTOP #201 00000020 OREM         UT",110.02,"credit","Electronics & Software","B of A CC"]
["2010-04-05","AT&T Wireless","Debit Card Purchase - ATTM xxxxxxxxxxxx3310500 GA",111.73,"debit","Mobile Phone","ING Checking"]
["2010-04-03","Electronic Thank You","ELECTRONIC PAYMENT-THANK YOU",4000,"credit","Credit Card Payment","Citi CC"]
["2010-04-03","Chevron","CHEVRON PWI #955 - PRO PROVO        UT",32.32,"debit","Gas & Fuel","B of A CC"]
["2010-04-03","Pmt Bill Payer","PMT FROM BILL PAYER SERVICE",1311.07,"credit","Credit Card Payment","B of A CC"]
["2010-04-02","Internet Deposit Mountain","Internet Deposit MOUNTAIN AMERICA FCU checking account XXXXXXXX1875",1185,"credit","Income","ING Checking"]
["2010-04-02","Interest Charged Purchases","Interest Charged on Purchases",9.2799999999999994,"debit","Finance Charge","B of A CC"]
["2010-04-01","Byu Marketplace","BYU MARKETPLACE 301010 PROVO        UT",2.14,"debit","Groceries","B of A CC"]
["2010-03-31","Electronic Thank You","ELECTRONIC PAYMENT-THANK YOU",73,"credit","Credit Card Payment","Citi CC"]
["2010-03-31","Monthly Interest Paid","Monthly Interest Paid",0.02,"credit","Interest Income","ING Checking"]
["2010-03-31","Periodic Finance Charge","Finance Charge Paid for Overdraft",0.06,"debit","Finance Charge","ING Checking"]
["2010-03-31","Monthly Interest Paid","Monthly Interest Paid",0.02,"credit","Interest Income","ING Savings"]
["2010-03-31","Brigham Young University","BRIGHAM YOUNG UNIV WEB PROVO        UT",5,"debit","Education","B of A CC"]
["2010-03-31","Hawaiian Bbq","HAWAIIAN BBQ 000000163 PROVO        UT",10.1,"debit","Restaurants","B of A CC"]
["2010-03-31","Pmt Bill Payer","PMT FROM BILL PAYER SERVICE",15,"credit","Credit Card Payment","B of A CC"]
["2010-03-31","Byu Marketplace","BYU MARKETPLACE 301010 PROVO        UT",1.72,"debit","Groceries","B of A CC"]
["2010-03-30","Provo City Utilities","Debit Card Purchase - PROVO CITY UTILITIES PROVO UT",106.78,"debit","Utilities","ING Checking"]
["2010-03-30","Byu Marketplace","BYU MARKETPLACE 301010 PROVO        UT",2.14,"debit","Groceries","B of A CC"]
["2010-03-29","Cinemark 10","Debit Card Purchase - CINEMARK 1041 Q34 OREM UT",11.25,"debit","Movies & DVDs","ING Checking"]
["2010-03-29","Internet Deposit Mountain","Internet Deposit MOUNTAIN AMERICA FCU checking account XXXXXXXX1875",200,"credit","Income","ING Checking"]
["2010-03-29","Provo City Library","PROVO CITY LIBRARY PRO PROVO        UT",8.6,"debit","Books & Supplies","B of A CC"]
["2010-03-29","Scout Com Wa","SCOUT.COM              888-979-0979 WA",9.9499999999999993,"debit","Uncategorized","B of A CC"]
["2010-03-28","Net Works","Debit Card Purchase - BROADWEAVE NETWORKS IN 801 8783200 UT",47.98,"debit","Business Services","ING Checking"]
["2010-03-27","Maverik Country Store","MAVERIK COUNTRY STORE3 OREM         UT",2.77,"debit","Groceries","B of A CC"]
["2010-03-27","Five Guys Ut","FIVE GUYS--UT # 04 542 OREM         UT",11.08,"debit","Uncategorized","B of A CC"]
["2010-03-26","Consumer Reports","CR *CONSUMERREPORTS.OR 8003330663 NY",5.95,"debit","Books","Citi CC"]
["2010-03-26","GameStop","GAMESTOP #201 00000020 OREM         UT",138.86000000000001,"debit","Electronics & Software","B of A CC"]
["2010-03-26","Byu Wsc Sugar","BYU WSC SUGAR & SPICE  PROVO        UT",2.04,"debit","Uncategorized","B of A CC"]
["2010-03-26","Byu Wsc L","BYU WSC L&T PRODUCE 30 PROVO        UT",5.7,"debit","Groceries","B of A CC"]
["2010-03-25","Chevron","CHEVRON PWI #950-PROVO PROVO        UT",8.35,"debit","Gas & Fuel","B of A CC"]
["2010-03-24","Gas N Go","GAS N GO #2 10019016   PROVO        UT",41.21,"debit","Service & Parts","B of A CC"]
["2010-03-23","Wal-Mart","WAL-MART  2862         MERIDIAN     ID",18.36,"debit","Shopping","B of A CC"]
["2010-03-21","McDonald's","MCDONALD'S F23720 0000 MERIDIAN     ID",2.64,"debit","Fast Food","B of A CC"]
["2010-03-21","McDonald's","MCDONALD'S F15710 0000 TREMONTON    UT",7.36,"debit","Fast Food","B of A CC"]
["2010-03-21","Chevron","CHEVRON JACKSONS FOOD  MERIDIAN     ID",37.46,"debit","Gas & Fuel","B of A CC"]
["2010-03-21","Chevron","CHEVRON JACKSONS FOOD  MERIDIAN     ID",7.7,"debit","Gas & Fuel","B of A CC"]
["2010-03-21","Chevron","Debit Card Purchase - CHEVRON 0301414 TREMONTON UT",13.09,"debit","Gas & Fuel","ING Checking"]
["2010-03-20","Wal-Mart","WAL-MART  2862         MERIDIAN     ID",15.27,"debit","Shopping","B of A CC"]
["2010-03-19","Staples","Debit Card Purchase - STAPLES, INC. 13853 WEST CHINDEN BLV 0",1.06,"debit","Office Supplies","ING Checking"]
["2010-03-18","Steve Crest","STEVE'S CREST 00000000 PROVO        UT",1.06,"debit","Uncategorized","B of A CC"]
["2010-03-18","Kent's Market","KENT'S MARKET 00000000 TREMONTON    UT",6.03,"debit","Groceries","B of A CC"]
["2010-03-18","Steve Crest","STEVE'S CREST 00000000 PROVO        UT",37.450000000000003,"debit","Uncategorized","B of A CC"]
["2010-03-18","Purchases Interest Charge","PURCHASES*INTEREST CHARGE*PERIODIC RATE",12.71,"debit","Finance Charge","Citi CC"]
["2010-03-18","Insta Care","Debit Card Purchase - PROVO INSTACARE PROVO UT",3,"debit","Doctor","ING Checking"]
["2010-03-17","Netflix","NETFLIX                LOS GATOS    CA",14.88,"debit","Movies & DVDs","B of A CC"]
["2010-03-17","Costco","COSTCO WHSE #0484 0000 OREM         UT",13.88,"debit","Shopping","B of A CC"]
["2010-03-17","Questar Gas","Electronic Withdrawal from Questar Gas Co. QGC",91.59,"debit","Utilities","ING Checking"]
["2010-03-16","Gas N Go","GAS N GO #2 10019016   PROVO        UT",10.039999999999999,"debit","Service & Parts","B of A CC"]
["2010-03-15","Ross","ROSS STORES 751 751    OREM         UT",9.61,"debit","Clothing","B of A CC"]
["2010-03-15","Malt Shoppe","Debit Card Purchase - THE MALT SHOPPE QPS PROVO UT",3.76,"debit","Restaurants","ING Checking"]
["2010-03-14","Rite Aid","RITE AID 6148 RITE AID PROVO        UT",24.92,"debit","Pharmacy","B of A CC"]
["2010-03-14","Gas N Go","GAS N GO #2 10019016   PROVO        UT",6.24,"debit","Service & Parts","B of A CC"]
["2010-03-13","ShopKo","SHOPKO        500868 5 PROVO        UT",6.91,"debit","Shopping","B of A CC"]
["2010-03-13","Batteries","BATTERIES PLUS #35 542 OREM         UT",10.67,"debit","Electronics & Software","B of A CC"]
["2010-03-13","Smith's Food","SMITHS FOOD #4136 0000 PROVO        UT",24.93,"debit","Groceries","B of A CC"]
["2010-03-12","Costco","Debit Card Purchase - COSTCO WHSE #04 648 EAST 800 SOUTH",19.22,"debit","Miscellaneous","ING Checking"]
["2010-03-12","Liberty Mutual","Electronic Withdrawal from LIBERTY MUTUAL PAYMENT",60.75,"debit","Auto Insurance","ING Checking"]
["2010-03-12","Rite Aid","Debit Card Purchase - RITE AID CORP. RIVERSIDE PLAZA",11.07,"debit","Pharmacy","ING Checking"]
["2010-03-11","7-Eleven","7-ELEVEN 20028 0007200 PROVO        UT",2.08,"debit","Fast Food","B of A CC"]
["2010-03-11","Byu Marketplace","BYU MARKETPLACE 301010 PROVO        UT",1.72,"debit","Fast Food","B of A CC"]
["2010-03-11","Kid To Kid","KID TO KID PROVO UT",15.99,"debit","Shopping","Citi CC"]
["2010-03-11","Marketplace Cafe","Debit Card Purchase - MARKETPLACE CAFE PROVO UT",1.07,"debit","Restaurants","ING Checking"]
["2010-03-09","Bed Bath & Beyond","BED BATH & BEYOND 292  OREM         UT",16.02,"debit","Shopping","B of A CC"]
["2010-03-09","eBay","EBAY INC. 08862858380 CA",8.94,"debit","Shopping","Citi CC"]
["2010-03-09","Amazon","Debit Card Purchase - AMAZON COM AMZN COM BIL WA",9.98,"debit","Shopping","ING Checking"]
["2010-03-09","Person Person Kelden","Person2Person Payment to Kelden Goulding",40,"debit","Spa & Massage","ING Checking"]
["2010-03-08","Utah Valley Hospital","UTAH VALLEY HOSPITAL U PROVO        UT",25.44,"debit","Health & Fitness","B of A CC"]
["2010-03-08","Internet Deposit Mountain","Internet Deposit MOUNTAIN AMERICA FCU checking account XXXXXXXX1875",50,"credit","Income","ING Checking"]
["2010-03-08","Electronic Deposit Paypal","Electronic Deposit from PAYPAL TRANSFER",163.79,"credit","Transfer","ING Checking"]
["2010-03-07","Marketplace Cafe","Debit Card Purchase - MARKETPLACE CAFE PROVO UT",2.79,"debit","Restaurants","ING Checking"]
["2010-03-07","Marketplace Cafe","Debit Card Purchase - MARKETPLACE CAFE PROVO UT",5.71,"debit","Restaurants","ING Checking"]
["2010-03-07","Transfer from ING Savings","Internet Deposit transferred from OSA XXXX3822",100,"credit","Transfer","ING Checking"]
["2010-03-07","AT&T Wireless","Debit Card Purchase - ATTM xxxxxxxxxxxx3310500 GA",177.22,"debit","Mobile Phone","ING Checking"]
["2010-03-07","Transfer to Checking","Internet Withdrawal transferred to EO XXXX4669",100,"debit","Transfer","ING Savings"]
["2010-03-06","Target","Debit Card Purchase - TARGET T1754 OR 175 WEST CENTER STREET",7.3,"debit","Miscellaneous","ING Checking"]
["2010-03-06","Smiths","Debit Card Purchase - SMITHS 45 SOUTH STATE 0000 ORE",31.09,"debit","Groceries","ING Checking"]
["2010-03-05","Chevron","Debit Card Purchase - CHEVRON 0203586 PROVO UT",34.22,"debit","Gas & Fuel","ING Checking"]
["2010-03-05","McDonald's","Debit Card Purchase - MCDONALDS F10437 Q17 PROVO UT",2.9,"debit","Fast Food","ING Checking"]
["2010-03-05","Rite Aid","Debit Card Purchase - RITE AID CORP. RIVERSIDE PLAZA",28.14,"debit","Pharmacy","ING Checking"]
["2010-03-04","Hawaiian Bbq","Debit Card Purchase - HAWAIIAN BBQ PROVO UT",10.210000000000001,"debit","Restaurants","ING Checking"]
["2010-03-04","Gas N Go","Debit Card Purchase - GAS N GO 2 10019QPS PROVO UT",6.17,"debit","Service & Parts","ING Checking"]
["2010-03-04","Marketplace Cafe","Debit Card Purchase - MARKETPLACE CAFE PROVO UT",1.92,"debit","Restaurants","ING Checking"]
["2010-03-03","Marketplace Cafe","Debit Card Purchase - MARKETPLACE CAFE PROVO UT",3.86,"debit","Restaurants","ING Checking"]
["2010-03-03","Marketplace Cafe","Debit Card Purchase - MARKETPLACE CAFE PROVO UT",1.07,"debit","Restaurants","ING Checking"]
["2010-03-03","Chevron","Debit Card Purchase - CHEVRON/BELL BR CHEVRON/BELL BROTHERS",3.07,"debit","Gas & Fuel","ING Checking"]
["2010-03-03","Maceys","Debit Card Purchase - MACEYS PROVO 1400 N STATE 00",1.27,"debit","Groceries","ING Checking"]
["2010-03-02","PayPal","Electronic Withdrawal from PAYPAL INST XFER",19,"debit","Shopping","ING Checking"]
["2010-03-02","Provo City Utilities","Debit Card Purchase - PROVO CITY UTILITIES PROVO UT",107.87,"debit","Utilities","ING Checking"]
["2010-03-02","Amazon","Debit Card Purchase - AMAZON MKTPLACE PMTS AMZN COM BIL WA",6.85,"debit","Shopping","ING Checking"]
["2010-03-02","Bk Amer Vi","Electronic Withdrawal from BK OF AMER VI/MC ONLINE PMT",15,"debit","Credit Card Payment","ING Checking"]
["2010-03-02","Interest Charged Purchases","Interest Charged on Purchases",6.4,"debit","Finance Charge","B of A CC"]
["2010-03-01","Amazon","Debit Card Purchase - AMAZON COM AMZN COM BIL WA",31,"debit","Shopping","ING Checking"]
["2010-03-01","Citi Online","Electronic Withdrawal from CITI CARD ONLINE PAYMENT",74,"debit","Credit Card Payment","ING Checking"]
["2010-03-01","Net Works","Debit Card Purchase - BROADWEAVE NETWORKS IN 801 8783200 UT",37.97,"debit","Business Services","ING Checking"]
["2010-02-28","Rite Aid","Debit Card Purchase - RITE AID CORP. RIVERSIDE PLAZA",13,"debit","Pharmacy","ING Checking"]
["2010-02-28","Monthly Interest Paid","Monthly Interest Paid",0.08,"credit","Interest Income","ING Checking"]
["2010-02-28","Marketplace Cafe","Debit Card Purchase - MARKETPLACE CAFE PROVO UT",1.07,"debit","Restaurants","ING Checking"]
["2010-02-28","Monthly Interest Paid","Monthly Interest Paid",0.49,"credit","Interest Income","ING Savings"]
["2010-02-27","Transfer from Checking","CLICK-TO-PAY PAYMENT, THANK YOU",74,"credit","Credit Card Payment","Citi CC"]
["2010-02-27","Transfer from Checking","BA ELECTRONIC PAYMENT",15,"credit","Credit Card Payment","B of A CC"]
["2010-02-27","Lowe's","Debit Card Purchase - LOWE'S #178 140 W UNIVERSITY PKWY 000",31.35,"debit","Home Improvement","ING Checking"]
["2010-02-26","Consumer Reports","CR *CONSUMERREPORTS.OR 8003330663 NY",5.95,"debit","Books","Citi CC"]
["2010-02-25","Marketplace Cafe","Debit Card Purchase - MARKETPLACE CAFE PROVO UT",1.07,"debit","Restaurants","ING Checking"]
["2010-02-25","UPS","Debit Card Purchase - THE UPS STORE 5266 PROUD UT",16.559999999999999,"debit","Shipping","ING Checking"]
["2010-02-25","Electronic Deposit Paypal","Electronic Deposit from PAYPAL TRANSFER",157.99,"credit","Transfer","ING Checking"]
["2010-02-24","Byu Creamery Fountain","Debit Card Purchase - BYU CREAMERY FOUNTAIN PROVO UT",6.63,"debit","Uncategorized","ING Checking"]
["2010-02-23","Shutterfly","Debit Card Purchase - SFI PHOTOSBYSHUTTERFLY 800 986 1065 CA",2.0499999999999998,"debit","Hobbies","ING Checking"]
["2010-02-22","Byu Creamery Fountain","Debit Card Purchase - BYU CREAMERY FOUNTAIN PROVO UT",4.82,"debit","Uncategorized","ING Checking"]
["2010-02-22","Malt Shoppe","Debit Card Purchase - THE MALT SHOPPE QPS PROVO UT",11.17,"debit","Restaurants","ING Checking"]
["2010-02-21","Marketplace Cafe","Debit Card Purchase - MARKETPLACE CAFE PROVO UT",1.07,"debit","Restaurants","ING Checking"]
["2010-02-20","Costco","Debit Card Purchase - COSTCO WHSE #04 648 EAST 800 SOUTH",38.46,"debit","Miscellaneous","ING Checking"]
["2010-02-18","Marketplace Cafe","Debit Card Purchase - MARKETPLACE CAFE PROVO UT",2.99,"debit","Restaurants","ING Checking"]
["2010-02-18","Byu Signature Web","Debit Card Purchase - BYU SIGNATURE CRD WEB 08014223867 UT",10,"debit","Uncategorized","ING Checking"]
["2010-02-18","Questar Gas","Electronic Withdrawal from Questar Gas Co. QGC",113.28,"debit","Utilities","ING Checking"]
["2010-02-18","Teamfanshop Com Fl","Debit Card Purchase - TEAMFANSHOP COM 866 687 3305 FL",1.94,"debit","Uncategorized","ING Checking"]
["2010-02-17","Foreign Fee","FOREIGN TRANSACTION FEE",20.89,"debit","Service Fee","Citi CC"]
["2010-02-17","Purchases Interest Charge","PURCHASES*INTEREST CHARGE*PERIODIC RATE",12.35,"debit","Finance Charge","Citi CC"]
["2010-02-16","Chili's","Debit Card Purchase - CHILI S GRI90900009092 OREM UT",2,"debit","Restaurants","ING Checking"]
["2010-02-16","Electronic Deposit Paypal","Electronic Deposit from PAYPAL TRANSFER",458.57,"credit","Transfer","ING Checking"]
["2010-02-14","Harmons Grocery","Debit Card Purchase - HARMONS GROCERY 870 E 800 N",10.67,"debit","Groceries","ING Checking"]
["2010-02-13","Lds Orem Center","Debit Card Purchase - LDS OREM CENTER 232 E UNIVERSITY PKWY",3,"debit","Uncategorized","ING Checking"]
["2010-02-13","Costco","Debit Card Purchase - COSTCO WHSE #04 648 EAST 800 SOUTH",10.78,"debit","Miscellaneous","ING Checking"]
["2010-02-12","Land's End","LEI*LANDS END CLOTHING 8003324700 WI",55.65,"credit","Clothing","Citi CC"]
["2010-02-12","Maverik Country Store","Debit Card Purchase - MAVERIK COUNTRY 307 S 700 E",1.43,"debit","Groceries","ING Checking"]
["2010-02-12","Liberty Mutual","Electronic Withdrawal from LIBERTY MUTUAL PAYMENT",60.75,"debit","Auto Insurance","ING Checking"]
["2010-02-11","Byu Creamery Fountain","Debit Card Purchase - BYU CREAMERY FOUNTAIN PROVO UT",6.63,"debit","Uncategorized","ING Checking"]
["2010-02-10","eBay","EBAY INC. 08862858380 CA",6.99,"debit","Shopping","Citi CC"]
["2010-02-10","J Dawgs","Debit Card Purchase - J DAWGS RESTAURANTS LL PROVO UT",8,"debit","Restaurants","ING Checking"]
["2010-02-10","J Dawgs","Debit Card Purchase - J DAWGS RESTAURANTS LL PROVO UT",2,"debit","Restaurants","ING Checking"]
["2010-02-10","ATM Withdrawal","ATM Withdrawal - CT 7-11 PROVO, UT US",80,"debit","Cash & ATM","ING Checking"]
["2010-02-09","Rick's Muffler","Debit Card Purchase - RICK'S MUFFLER 227 W 990 N",80.08,"debit","Auto & Transport","ING Checking"]
["2010-02-09","United","Debit Card Purchase - UNITED BURBANK CA",25,"debit","Air Travel","ING Checking"]
["2010-02-08","Byu Marketplace","BYU MARKETPLACE 301010 PROVO        UT",2.79,"debit","Groceries","B of A CC"]
["2010-02-08","Chevron","Debit Card Purchase - CHEVRON 0072863 OREM UT",36.729999999999997,"debit","Gas & Fuel","ING Checking"]
["2010-02-08","Paradies San Fra","Debit Card Purchase - PARADIES 9415 SAN FRA SAN FRANCISC CA",10.23,"debit","Uncategorized","ING Checking"]
["2010-02-08","Burbank Airpt Food","Debit Card Purchase - BURBANK AIRPT FOOD B BURBANK CA",22.27,"debit","Food & Dining","ING Checking"]
["2010-02-07","Quiznos","Debit Card Purchase - QUIZNOS LOW E 30554QPS SALT LAKECIT UT",4.2,"debit","Fast Food","ING Checking"]
["2010-02-07","Delta","Debit Card Purchase - DELTA SALT LAKE CT UT",25,"debit","Air Travel","ING Checking"]
["2010-02-06","Chevron","Debit Card Purchase - CHEVRON/TOP STO CHEVRON/TOP STOP C-53",1.53,"debit","Gas & Fuel","ING Checking"]
["2010-02-05","Shakers","Debit Card Purchase - SHAKERS GLENDALE GLENDALE CA",11.91,"debit","Food & Dining","ING Checking"]
["2010-02-05","AT&T Wireless","Debit Card Purchase - ATTM xxxxxxxxxxxx3310500 GA",121.08,"debit","Mobile Phone","ING Checking"]
["2010-02-04","Netflix","NETFLIX                LOS GATOS    CA",9.5500000000000007,"debit","Movies & DVDs","B of A CC"]
["2010-02-04","Rite Aid","Debit Card Purchase - RITE AID CORP. RIVERSIDE PLAZA",20,"debit","Cash & ATM","ING Checking"]
["2010-02-04","Rite Aid","Debit Card Purchase - RITE AID CORP. RIVERSIDE PLAZA",5.54,"debit","Personal Care","ING Checking"]
["2010-02-04","Transfer from ING Savings","Internet Deposit transferred from OSA XXXX3822",3872.42,"credit","Transfer","ING Checking"]
["2010-02-04","Person Person Laura","Person2Person Payment to Laura or Clayne Larsen",3205,"debit","Mortgage & Rent","ING Checking"]
["2010-02-04","Transfer to Checking","Internet Withdrawal transferred to EO XXXX4669",3872.42,"debit","Transfer","ING Savings"]
["2010-02-03","Amazon","Amazon.com AMZN.COM/BILL WA",10.19,"debit","Shopping","Citi CC"]
["2010-02-03","ATM Withdrawal","ATM Withdrawal - 1900 N CANYON RD PROVO, UT US",31,"debit","Cash & ATM","ING Checking"]
["2010-02-02","BYU Bookstore","BYU BOOKSTORE 29302066 PROVO        UT",16,"debit","Books","B of A CC"]
["2010-02-02","Byu Marketplace","BYU MARKETPLACE 301010 PROVO        UT",2.14,"debit","Groceries","B of A CC"]
["2010-02-02","Person Person Tyler","Person2Person Payment to Tyler or Kindra McAllister",22,"debit","Kids","ING Checking"]
["2010-02-02","Rite Aid","Debit Card Purchase - RITE AID CORP. RIVERSIDE PLAZA",23.32,"debit","Uncategorized","ING Checking"]
["2010-02-02","Provo City Utilities","Debit Card Purchase - PROVO CITY UTILITIES PROVO UT",125.59,"debit","Utilities","ING Checking"]
["2010-02-01","Marketplace Cafe","MARKETPLACE CAFE PROVO UT",4.46,"debit","Restaurants","Citi CC"]
["2010-02-01","JCPenney","Electric Orange Card Adjustment (Credit) JCPENNEY STORE 2770 PROVO UT",15.89,"credit","Kids","ING Checking"]
["2010-02-01","Chevron","Debit Card Purchase - CHEVRON 0072863 OREM UT",35.92,"debit","Gas & Fuel","ING Checking"]
["2010-02-01","UPS","Debit Card Purchase - THE UPS STORE 5266 PROUD UT",12.7,"debit","Shipping","ING Checking"]
["2010-02-01","Children's Place","Electric Orange Card Adjustment (Credit) THE CHILDRENS PLACE 0 OREM UT",10.86,"credit","Clothing","ING Checking"]
["2010-02-01","Chevron","Debit Card Purchase - CHEVRON 0212224 MOUNTAIN HOM ID",28.8,"debit","Gas & Fuel","ING Checking"]
["2010-02-01","Love","Debit Card Purchase - LOVE S 534 HEYBURN ID",8.18,"debit","Uncategorized","ING Checking"]
["2010-01-31","Air France","AIR FRANCE ROISSY CH DE FRA",75.7,"debit","Air Travel","Citi CC"]
["2010-01-31","Busgate Z Rich","Busgate 110 Z rich CHE CHE,19.50 SWISS FRANC",18.45,"debit","Uncategorized","Citi CC"]
["2010-01-31","Renaissance Homes","RENAISSANCE HOTEL ZUER GLATTBRUGG CHE CHE,15.00 SWISS FRANC",14.19,"debit","Home Improvement","Citi CC"]
["2010-01-31","Periodic Finance Charge","Finance Charge Paid for Overdraft",0.03,"debit","Finance Charge","ING Checking"]
["2010-01-31","Monthly Interest Paid","Monthly Interest Paid",0.1,"credit","Interest Income","ING Checking"]
["2010-01-31","Fresh Market Bo","Debit Card Purchase - FRESH MARKET BO 535 SOUTH 200 WEST",13.12,"debit","Groceries","ING Checking"]
["2010-01-31","Monthly Interest Paid","Monthly Interest Paid",1.34,"credit","Interest Income","ING Holding"]
["2010-01-31","Monthly Interest Paid","Monthly Interest Paid",3.5,"credit","Interest Income","ING Savings"]
["2010-01-30","Coop Zh Hofwi","Coop-1417 ZH Hofwi Z rich CHE CHE,08.90 SWISS FRANC",8.44,"debit","Uncategorized","Citi CC"]
["2010-01-30","Merkur Confiserien Ag","MERKUR CONFISERIEN AG ZUERICH CHE CHE,06.25 SWISS FRANC",5.93,"debit","Uncategorized","Citi CC"]
["2010-01-30","Metzgerei Kauffmann Z","Metzgerei Kauffmann Z Z rich CHE CHE,15.50 SWISS FRANC",14.71,"debit","Uncategorized","Citi CC"]
["2010-01-30","C A Mode","C & A MODE AG Z rich CHE CHE,19.90 SWISS FRANC",18.88,"debit","Uncategorized","Citi CC"]
["2010-01-30","JCPenney","JCPENNEY STORE 2770 PROVO UT",22.82,"credit","Clothing","Citi CC"]
["2010-01-30","Coop Zh Bahnh","Coop-1905 ZH Bahnh Z rich CHE CHE,03.25 SWISS FRANC",3.08,"debit","Uncategorized","Citi CC"]
["2010-01-30","Zuerich Hb Sbb","ZUERICH HB SBB ZUERICH CHE",45.2,"debit","Uncategorized","Citi CC"]
["2010-01-30","C A Mode","C & A MODE AG Z rich CHE CHE,49.90 SWISS FRANC",47.34,"debit","Uncategorized","Citi CC"]
["2010-01-30","iTunes","APL*ITUNES 866-712-7753 CA",19.149999999999999,"debit","Music","Citi CC"]
["2010-01-30","Cachet","Au Cachet Luzern CHE CHE,02.30 SWISS FRANC",2.15,"debit","Business Services","Citi CC"]
["2010-01-30","JCPenney","JCPENNEY STORE 2770 PROVO UT",9.6,"debit","Clothing","Citi CC"]
["2010-01-30","TJ Maxx","Debit Card Purchase - TJ TJ MAXX 0000 OREM, U",13.88,"debit","Clothing","ING Checking"]
["2010-01-30","Childrens P East","Debit Card Purchase - THE CHILDRENS P 575 EAST UNIVERSITY PK",6.39,"debit","Kids","ING Checking"]
["2010-01-29","Coop Baar Got","Coop-2244 Baar Got Baar CHE CHE,02.60 SWISS FRANC",2.4700000000000002,"debit","Uncategorized","Citi CC"]
["2010-01-29","McDonald's","McDonald's Restaurant Freienbach CHE CHE,02.00 SWISS FRANC",1.89,"debit","Fast Food","Citi CC"]
["2010-01-29","Transfer to Amber","Electronic Withdrawal from CITI CARD ONLINE PAYMENT",300,"debit","Credit Card Payment","ING Checking"]
["2010-01-29","Chevron","Debit Card Purchase - CHEVRON/NICK WA CHEVRON/NICK WARLIA",4.3099999999999996,"debit","Gas & Fuel","ING Checking"]
["2010-01-28","Nestl Suisse Sa","Nestl Suisse SA Vevey CHE CHE,01.90 SWISS FRANC",1.8,"debit","Travel","Citi CC"]
["2010-01-28","Transfer from Checking","CLICK-TO-PAY PAYMENT, THANK YOU",300,"credit","Credit Card Payment","Citi CC"]
["2010-01-28","Transfer from ING Savings","Internet Deposit transferred from OSA XXXX3822",300,"credit","Transfer","ING Checking"]
["2010-01-28","Transfer to Checking","Internet Withdrawal transferred to EO XXXX4669",300,"debit","Transfer","ING Savings"]
["2010-01-27","Coop Ge Champ","Coop-1144 GE Champ Gen ve CHE CHE,22.00 SWISS FRANC",20.98,"debit","Travel","Citi CC"]
["2010-01-27","Coop Blandonnet Vernier","Coop-4261 Blandonnet Vernier CHE CHE,03.60 SWISS FRANC",3.43,"debit","Travel","Citi CC"]
["2010-01-26","Consumer Reports","CR *CONSUMERREPORTS.OR 8003330663 NY",5.95,"debit","Books","Citi CC"]
["2010-01-26","Tfl Tom Kilburn","TFL TOM KILBURN PARK GBR GBR,07.20 POUND STERLING",11.61,"debit","Travel","Citi CC"]
["2010-01-26","Formule Viry Fra","FORMULE 1 1166 VIRY FRA FRA,71.20 EURO",99.9,"debit","Travel","Citi CC"]
["2010-01-26","Masala Zone Fs","MASALA ZONE (FS) LONDON WC2E GBR GBR,12.00 POUND STERLING",19.41,"debit","Travel","Citi CC"]
["2010-01-26","Childrens P N","Debit Card Purchase - THE CHILDRENS P 350 N MILWAUKEE, STE #",5.87,"debit","Kids","ING Checking"]
["2010-01-26","Childrens P N","Debit Card Purchase - THE CHILDRENS P 350 N MILWAUKEE, STE #",10,"debit","Gift","ING Checking"]
["2010-01-26","JCPenney","Debit Card Purchase - JCPENNEY STORE 300 N MILWAUKEE ST",15.42,"debit","Gift","ING Checking"]
["2010-01-26","JCPenney","Debit Card Purchase - JCPENNEY STORE 300 N MILWAUKEE ST",10,"debit","Kids","ING Checking"]
["2010-01-26","Childrens P N","Debit Card Purchase - THE CHILDRENS P 350 N MILWAUKEE, STE #",47.6,"debit","Kids","ING Checking"]
["2010-01-26","Sephora","Debit Card Purchase - SEPHORA #142 BO 350 NORTH MILWAUKEE ST",26.5,"debit","Personal Care","ING Checking"]
["2010-01-25","Sunrise Food Stop","SUNRISE FOOD STOP LONDON NW6 GBR GBR,06.16 POUND STERLING",9.92,"debit","Travel","Citi CC"]
["2010-01-25","Delfont Mackintosh London","DELFONT MACKINTOSH LONDON GBR GBR,05.00 POUND STERLING",8.06,"debit","Travel","Citi CC"]
["2010-01-25","Tfl Tom Kilburn","TFL TOM KILBURN PARK GBR GBR,07.20 POUND STERLING",11.58,"debit","Travel","Citi CC"]
["2010-01-25","Westminster Abbey London","WESTMINSTER ABBEY LONDON SW1P GBR GBR,15.00 POUND STERLING",24.19,"debit","Travel","Citi CC"]
["2010-01-25","Knightsbridge","HARRODS KNIGHTSBRIDGE LONDON GBR",6.56,"debit","Travel","Citi CC"]
["2010-01-25","Children's Place","Debit Card Purchase - TCP CHILDRENSPLACE COM 877 PLACEUS NJ",49.34,"debit","Clothing","ING Checking"]
["2010-01-25","Chevron","Debit Card Purchase - CHEVRON 0073034 TWIN FALLS ID",38.19,"debit","Gas & Fuel","ING Checking"]
["2010-01-25","Transfer to Amber","Electronic Withdrawal from CITI CARD ONLINE PAYMENT",1300,"debit","Credit Card Payment","ING Checking"]
["2010-01-25","Flying J","Debit Card Purchase - FLYING J C STORE INSID WILLARD BAY UT",5.69,"debit","Fast Food","ING Checking"]
["2010-01-25","Fridal Mountain View","Debit Card Purchase - FRIDAL MOUNTAIN VIEW80 MALTA ID",7.37,"debit","Fast Food","ING Checking"]
["2010-01-24","Boots London Gbr","BOOTS 0873 LONDON GBR GBR,02.59 POUND STERLING",4.18,"debit","Travel","Citi CC"]
["2010-01-24","Wendy's","Debit Card Purchase - WENDYS 3540 Q25 OREM UT",2.78,"debit","Fast Food","ING Checking"]
["2010-01-23","Sncf Paris Fra","SNCF PARIS 15 FRA FRA,05.90 EURO",8.32,"debit","Travel","Citi CC"]
["2010-01-23","Tfl Mfm Kings","TFL MFM KINGS CROSS GBR GBR,04.00 POUND STERLING",6.43,"debit","Travel","Citi CC"]
["2010-01-23","Villa","VILLA TOKYO PARIS 1 FRA FRA,06.50 EURO",9.17,"debit","Travel","Citi CC"]
["2010-01-23","Musee Orsay Paris","MUSEE ORSAY PARIS7 FRA FRA,09.50 EURO",13.4,"debit","Travel","Citi CC"]
["2010-01-23","Costco","COSTCO WHSE #0484 0000 OREM         UT",18.149999999999999,"credit","Miscellaneous","B of A CC"]
["2010-01-22","Transfer from Checking","CLICK-TO-PAY PAYMENT, THANK YOU",1300,"credit","Credit Card Payment","Citi CC"]
["2010-01-22","Transfer from ING Savings","Internet Deposit transferred from OSA XXXX3822",300,"credit","Transfer","ING Checking"]
["2010-01-22","Transfer from ING Savings","Internet Deposit transferred from OSA XXXX3822",1000,"credit","Transfer","ING Checking"]
["2010-01-22","Transfer from FREE CHECKING","Internet Deposit MOUNTAIN AMERICA FCU checking account XXXXXXXX1875",160,"credit","Transfer","ING Checking"]
["2010-01-22","Transfer to Checking","Internet Withdrawal transferred to EO XXXX4669",300,"debit","Transfer","ING Savings"]
["2010-01-22","Transfer to Checking","Internet Withdrawal transferred to EO XXXX4669",1000,"debit","Transfer","ING Savings"]
["2010-01-21","As Du Fallafel","AS DU FALLAFEL PARIS 04 FRA FRA,50.00 EURO",70.3,"debit","Travel","Citi CC"]
["2010-01-21","Sncf Roissy C","SNCF ROISSY C D G FRA FRA,18.90 EURO",26.57,"debit","Travel","Citi CC"]
["2010-01-21","Celio Paris Fra","CELIO PARIS FRA FRA,89.94 EURO",126.46,"debit","Travel","Citi CC"]
["2010-01-21","Bert Rest Paris","BERT'S REST520 PARIS 08 FRA FRA,08.80 EURO",12.37,"debit","Travel","Citi CC"]
["2010-01-21","Fresh Market","Debit Card Purchase - FRESH MARKET UN 2255 NORTH UNIVERSITY",17.579999999999998,"debit","Uncategorized","ING Checking"]
["2010-01-21","Costco","Debit Card Purchase - COSTCO WHSE #04 648 EAST 800 SOUTH",20.29,"debit","Baby Supplies","ING Checking"]
["2010-01-20","Rite Aid","RITE AID STORE 6148Q05 PROVO UT",31.58,"debit","Pharmacy","Citi CC"]
["2010-01-20","Laundry Plus","LAUNDRY PLUS PROVO UT",13.85,"debit","Laundry","Citi CC"]
["2010-01-20","Gas N Go","GAS N GO #2 10019016 PROVO UT",41.73,"debit","Groceries","Citi CC"]
["2010-01-20","Gas N Go","GAS N GO #2 10019QPS PROVO UT",2.0499999999999998,"debit","Fast Food","Citi CC"]
["2010-01-20","Copy Center","BYU TNRB COPY CENTER PROVO UT",0.75,"debit","Printing","Citi CC"]
["2010-01-20","Burger King","MAIN BURGER KI30552QPS SALT LAKECITY UT",12.15,"debit","Fast Food","Citi CC"]
["2010-01-20","Purchase Finance Charge","PURCHASES*FINANCE CHARGE*PERIODIC RATE",14.59,"debit","Finance Charge","Citi CC"]
["2010-01-19","Invisible Shield","INVISIBLE SHIELD OREM UT",10,"debit","Uncategorized","Citi CC"]
["2010-01-19","Five Guys Ut","FIVE GUYS--UT # 04 QAE OREM UT",4.09,"debit","Uncategorized","Citi CC"]
["2010-01-19","Priceline","PLN*PRICELINE.COM HTL 800-657-9168 CT",192.12,"debit","Travel","Citi CC"]
["2010-01-19","Costa","COSTA VIDA OF PROVOQPS PROVO UT",11.83,"debit","Fast Food","Citi CC"]
["2010-01-19","Questar Gas","Electronic Withdrawal from Questar Gas Co. QGC",68.400000000000006,"debit","Utilities","ING Checking"]
["2010-01-17","Priceline","PLN*PRICELINE.COM HTL 800-657-9168 CT",170.29,"debit","Travel","Citi CC"]
["2010-01-17","Holiday Oil","Debit Card Purchase - HOLIDAY OIL 49 MIDVALE UT",10.199999999999999,"debit","Gas & Fuel","ING Checking"]
["2010-01-16","Provo Di North","Debit Card Purchase - PROVO DI 1415 NORTH STATE ST 0000 P",9,"debit","Uncategorized","ING Checking"]
["2010-01-15","Insta Care","PROVO INSTACARE PROVO UT",3,"debit","Doctor","Citi CC"]
["2010-01-15","Rite Aid","RITE AID STORE 6148Q05 PROVO UT",6,"debit","Pharmacy","Citi CC"]
["2010-01-15","Childrens P East","Debit Card Purchase - THE CHILDRENS P 575 EAST UNIVERSITY PK",19.760000000000002,"debit","Kids","ING Checking"]
["2010-01-15","Carl's Jr","Debit Card Purchase - CARL S JR 1101363 QPS PROVO UT",11.93,"debit","Fast Food","ING Checking"]
["2010-01-14","Byu Wsc L","BYU WSC L&T PRODUCE PROVO UT",5.7,"debit","Fast Food","Citi CC"]
["2010-01-14","Marketplace Cafe","MARKETPLACE CAFE PROVO UT",0.85,"debit","Restaurants","Citi CC"]
["2010-01-14","Marketplace Cafe","MARKETPLACE CAFE PROVO UT",1.92,"debit","Restaurants","Citi CC"]
["2010-01-13","Marketplace Cafe","MARKETPLACE CAFE PROVO UT",1.82,"debit","Restaurants","Citi CC"]
["2010-01-13","Land's End","LEI*LANDS END CLOTHING 8003324700 WI",55.7,"credit","Clothing","Citi CC"]
["2010-01-13","Marketplace Cafe","MARKETPLACE CAFE PROVO UT",8.17,"debit","Restaurants","Citi CC"]
["2010-01-13","Liberty Mutual","Electronic Withdrawal from LIBERTY MUTUAL PAYMENT",60.75,"debit","Auto Insurance","ING Checking"]
["2010-01-13","Wal-Mart","Debit Card Purchase - WAL-MART #1768 1355 S SANDHILL RD",37.96,"debit","Shopping","ING Checking"]
["2010-01-12","BYU Bookstore","BYU BOOKSTORE PROVO UT",7.7,"debit","Books","Citi CC"]
["2010-01-12","Marketplace Cafe","MARKETPLACE CAFE PROVO UT",1.92,"debit","Restaurants","Citi CC"]
["2010-01-12","Transfer to Bank of America","Electronic Withdrawal from BK OF AMER VI/MC ONLINE PMT",15,"debit","Credit Card Payment","ING Checking"]
["2010-01-12","Transfer to Amber","Electronic Withdrawal from CITI CARD ONLINE PAYMENT",46,"debit","Credit Card Payment","ING Checking"]
["2010-01-12","Transfer to FREE CHECKING","Internet Withdrawal MOUNTAIN AMERICA FCU checking account XXXXXXXX1875",180,"debit","Transfer","ING Holding"]
["2010-01-11","Transfer from Checking","CLICK-TO-PAY PAYMENT, THANK YOU",46,"credit","Credit Card Payment","Citi CC"]
["2010-01-11","Marketplace Cafe","MARKETPLACE CAFE PROVO UT",1.71,"debit","Restaurants","Citi CC"]
["2010-01-11","Marketplace Cafe","MARKETPLACE CAFE PROVO UT",1.07,"debit","Restaurants","Citi CC"]
["2010-01-11","Transfer from Checking","BA ELECTRONIC PAYMENT",15,"credit","Credit Card Payment","B of A CC"]
["2010-01-11","Jo-Ann Stores","Debit Card Purchase - JOANN STORES, I 1666 S STATE ST",18.649999999999999,"debit","Miscellaneous","ING Checking"]
["2010-01-11","Transfer from ING Holding","Internet Deposit transferred from OSA XXXX4516",30,"credit","Transfer","ING Checking"]
["2010-01-11","Transfer from ING Holding","Internet Deposit transferred from OSA XXXX4516",1856,"credit","Transfer","ING Checking"]
["2010-01-11","Person Person Laura","Person2Person Payment to Laura or Clayne Larsen",1075,"debit","Mortgage & Rent","ING Checking"]
["2010-01-11","Transfer to Checking","Internet Withdrawal transferred to EO XXXX4669",1856,"debit","Transfer","ING Holding"]
["2010-01-11","Transfer to Checking","Internet Withdrawal transferred to EO XXXX4669",30,"debit","Transfer","ING Holding"]
["2010-01-11","Transfer to ING Savings","Internet Withdrawal transferred to OSA XXXX3822",5568,"debit","Transfer","ING Holding"]
["2010-01-11","Transfer from ING Holding","Internet Deposit transferred from OSA XXXX4516",5568,"credit","Transfer","ING Savings"]
["2010-01-09","eBay","EBAY INC. 08862858380 CA",22.3,"debit","Shopping","Citi CC"]
["2010-01-08","Subway","SUBWAY 00024QPS PROVO UT",12.12,"debit","Fast Food","Citi CC"]
["2010-01-08","iTunes","APL*ITUNES 866-712-7753 CA",7.47,"debit","Music","Citi CC"]
["2010-01-08","Land's End","LEI*LANDS END CLOTHING 8003324700 WI",55.65,"debit","Clothing","Citi CC"]
["2010-01-08","BYU Bookstore","BYU BOOKSTORE PROVO UT",196.7,"credit","Books","Citi CC"]
["2010-01-08","Costco","Debit Card Purchase - COSTCO WHSE #04 648 EAST 800 SOUTH",40.19,"debit","Uncategorized","ING Checking"]
["2010-01-07","Marketplace Cafe","MARKETPLACE CAFE PROVO UT",2.4700000000000002,"debit","Restaurants","Citi CC"]
["2010-01-07","Marketplace Cafe","MARKETPLACE CAFE PROVO UT",2.14,"debit","Restaurants","Citi CC"]
["2010-01-06","Amazon","Amazon.com AMZN.COM/BILL WA",58.99,"credit","Shopping","Citi CC"]
["2010-01-06","Amazon","AMAZON MKTPLACE PMTS AMZN.COM/BILL WA",22.87,"debit","Shopping","Citi CC"]
["2010-01-06","Tomasso Italian Ice","TOMASSO'S ITALIAN ICE PROVO UT",5.65,"debit","Restaurants","Citi CC"]
["2010-01-06","Marketplace Cafe","MARKETPLACE CAFE PROVO UT",6.45,"debit","Restaurants","Citi CC"]
["2010-01-06","UPS","THE UPS STORE #5266 PROUD UT",0.03,"debit","Shipping","Citi CC"]
["2010-01-06","UPS","THE UPS STORE #5266 PROUD UT",21.59,"debit","Shipping","Citi CC"]
["2010-01-05","Eacademyinc De","EACADEMYINC 6135263005 DE",35,"debit","Uncategorized","Citi CC"]
["2010-01-05","JCPenney","JCPENNEY STORE 2770 PROVO UT",22.82,"debit","Clothing","Citi CC"]
["2010-01-05","Marketplace Cafe","MARKETPLACE CAFE PROVO UT",4.62,"debit","Restaurants","Citi CC"]
["2010-01-05","Amazon","AMAZON MKTPLACE PMTS AMZN.COM/BILL WA",56.98,"debit","Shopping","Citi CC"]
["2010-01-05","Target","Debit Card Purchase - TARGET T1754 OR 175 WEST CENTER STREET",15.31,"debit","Miscellaneous","ING Checking"]
["2010-01-05","AT&T Wireless","Debit Card Purchase - ATTM xxxxxxxxxxxx3310500 GA",107.96,"debit","Mobile Phone","ING Checking"]
["2010-01-04","BYU Bookstore","BYU BOOKSTORE PROVO UT",283,"debit","Books","Citi CC"]
["2010-01-04","Netflix","NETFLIX                LOS GATOS    CA",9.5500000000000007,"debit","Movies & DVDs","B of A CC"]
["2010-01-04","Costco","COSTCO WHSE #0484 0000 OREM         UT",49.4,"credit","Miscellaneous","B of A CC"]
["2010-01-04","Transfer from FREE CHECKING","Internet Deposit MOUNTAIN AMERICA FCU checking account XXXXXXXX1875",7554.44,"credit","Transfer","ING Holding"]
["2010-01-02","Target","TARGET 00017541 OREM UT",44.36,"debit","Miscellaneous","Citi CC"]
["2010-01-02","Chevron","CHEVRON 0204058 PROVO UT",32.979999999999997,"debit","Gas & Fuel","Citi CC"]
["2010-01-02","Costco","COSTCO WHSE #0484 0000 OREM         UT",4.79,"debit","Miscellaneous","B of A CC"]
["2010-01-02","Costco","COSTCO WHSE #0484 0000 OREM         UT",49.4,"debit","Miscellaneous","B of A CC"]
["2010-01-01","Dri Windows Us","DRI*WINDOWS7US ORDERFIND.COM MN",29.99,"debit","Uncategorized","Citi CC"]
["2010-01-01","Playon Ny","PAYPAL *PLAYON 4029357733 NY",39.99,"debit","Uncategorized","Citi CC"]
["2010-01-01","Exxon","EXXONMOBIL 45470226 BOUNTIFUL UT",10.01,"debit","Gas & Fuel","Citi CC"]
["2009-12-31","Amazon","AMAZON MKTPLACE PMTS AMZN.COM/BILL WA",122.99,"debit","Shopping","Citi CC"]
["2009-12-31","Amazon","AMAZON MKTPLACE PMTS AMZN.COM/BILL WA",63.94,"debit","Shopping","Citi CC"]
["2009-12-31","Monthly Interest Paid","Monthly Interest Paid",0.05,"credit","Interest Income","ING Checking"]
["2009-12-31","Monthly Interest Paid","Monthly Interest Paid",7.0000000000000007E-2,"credit","Interest Income","ING Holding"]
["2009-12-30","University Parkway","UNIVERSITY PARKWAY PROVO UT",2.75,"debit","Uncategorized","Citi CC"]
["2009-12-30","Pizza Factory","PIZZA FACTORY COTTONTR PROVO UT",134.62,"debit","Restaurants","Citi CC"]
["2009-12-30","Provo City Utilities","Debit Card Purchase - PROVO CITY UTILITIES PROVO UT",98.87,"debit","Utilities","ING Checking"]
["2009-12-29","Amazon","Amazon.com AMZN.COM/BILL WA",57,"debit","Shopping","Citi CC"]
["2009-12-29","Cinemark USA","CINEMARK USA Q36 PROVO UT",17,"debit","Movies & DVDs","Citi CC"]
["2009-12-29","Inspection Station","THE INSPECTION STATION OREM UT",70.680000000000007,"debit","Parking","Citi CC"]
["2009-12-28","Supersonic Car Wash","SUPERSONIC CAR WASH OREM UT",15.6,"debit","Service & Parts","Citi CC"]
["2009-12-28","Smith's Food","SMITHS FOOD #4144 OREM UT",28.25,"debit","Groceries","Citi CC"]
["2009-12-26","Flaming Wok Q","FLAMING WOK Q62 OREM UT",6.44,"debit","Uncategorized","Citi CC"]
["2009-12-26","Chick-Fil-A","CHICK-FIL-A #367 Q05 OREM UT",1.61,"debit","Fast Food","Citi CC"]
["2009-12-26","Arctic Circle","ARCTIC CIRCLE 515 OREM OREM UT",6.76,"debit","Restaurants","Citi CC"]
["2009-12-26","Consumer Reports","CR *CONSUMERREPORTS.OR 8003330663 NY",5.95,"debit","Books","Citi CC"]
["2009-12-25","iTunes","APL*ITUNES 866-712-7753 CA",5.32,"debit","Music","Citi CC"]
["2009-12-24","Cinemark USA","CINEMARK USA Q36 PROVO UT",35,"debit","Movies & DVDs","Citi CC"]
["2009-12-24","Cinemark USA","CINEMARK USA Q36 PROVO UT",10.5,"debit","Movies & DVDs","Citi CC"]
["2009-12-24","Smith's Food","SMITHS FOOD #4136 PROVO UT",13.19,"debit","Groceries","Citi CC"]
["2009-12-23","Amazon","Amazon.com AMZN.COM/BILL WA",58.99,"debit","Shopping","Citi CC"]
["2009-12-22","Radioshack Cor Orem","RADIOSHACK COR00140293 OREM UT",43.44,"credit","Credit Card Payment","Citi CC"]
["2009-12-22","Amazon","Amazon.com AMZN.COM/BILL WA",9.99,"debit","Shopping","Citi CC"]
["2009-12-22","Amazon","Amazon.com AMZN.COM/BILL WA",17.21,"debit","Shopping","Citi CC"]
["2009-12-22","Target","TARGET 00017541 OREM UT",16.39,"debit","Miscellaneous","Citi CC"]
["2009-12-22","Good Earth Natural Foods","GOOD EARTH NATURAL FOO OREM UT",16.02,"debit","Food & Dining","Citi CC"]
["2009-12-22","Target","TARGET 00017541 OREM UT",4.26,"credit","Miscellaneous","Citi CC"]
["2009-12-22","JCPenney","JCPENNEY STORE 2770 PROVO UT",33.04,"debit","Clothing","Citi CC"]
["2009-12-22","Costco","COSTCO WHSE #0484 0000 OREM         UT",95.72,"debit","Miscellaneous","B of A CC"]
["2009-12-21","UPS","THE UPS STORE #5266 PROUD UT",27.9,"debit","Shipping","Citi CC"]
["2009-12-21","Wal-Mart","WAL-MART #1768 OREM UT",11.63,"debit","Shopping","Citi CC"]
["2009-12-21","Amazon","Amazon.com AMZN.COM/BILL WA",20,"debit","Shopping","Citi CC"]
["2009-12-21","Amazon","Amazon.com AMZN.COM/BILL WA",14.99,"debit","Shopping","Citi CC"]
["2009-12-21","Wal-Mart","WAL-MART #1768 OREM UT",26.68,"credit","Shopping","Citi CC"]
["2009-12-21","UPS","THE UPS STORE #5266 PROUD UT",23.13,"debit","Shipping","Citi CC"]
["2009-12-20","Redbox","REDBOX *DVD RENTAL 866-733-2693 IL",8.5399999999999991,"debit","Movies & DVDs","Citi CC"]
["2009-12-20","Home Depot","THE HOME DEPOT 4416 PROVO UT",3.39,"debit","Home Improvement","Citi CC"]
["2009-12-19","Harmon's","HARMON'S - OREM OREM UT",33.130000000000003,"debit","Groceries","Citi CC"]
["2009-12-19","Toys \"R\" Us","TOYS R US #5689 OREM UT",34.369999999999997,"debit","Toys","Citi CC"]
["2009-12-19","Amazon","Amazon.com AMZN.COM/BILL WA",18,"debit","Shopping","Citi CC"]
["2009-12-19","Tie One On","TIE ONE ON #3 OREM UT",9.61,"debit","Clothing","Citi CC"]
["2009-12-19","Dick's Sporting","WWW.DICKSSPORTNGGOODS. 877-846-9997 PA",640.49,"debit","Sporting Goods","Citi CC"]
["2009-12-19","Amazon","Amazon.com AMZN.COM/BILL WA",68.5,"debit","Shopping","Citi CC"]
["2009-12-19","Texaco","TEXACO 0305131 OREM UT",39.39,"debit","Gas & Fuel","Citi CC"]
["2009-12-19","Build-A-Bear","BUILDABEAR WRKSHP 0237 OREM UT",17.100000000000001,"debit","Gift","Citi CC"]
["2009-12-19","Unique Gifts","UNIQUE GIFTS OREM UT",5.29,"debit","Gift","Citi CC"]
["2009-12-18","Ezkliquidat Ca","PAYPAL *EZKLIQUIDAT 4029357733 CA",5.24,"debit","Uncategorized","Citi CC"]
["2009-12-18","Shutterfly","SFI*PHOTOSBYSHUTTERFLY 800-986-1065 CA",18.93,"debit","Hobbies","Citi CC"]
["2009-12-18","Sonic","SONIC DRIVE IN #476Q63 SALT LAKE CIT UT",4.46,"debit","Fast Food","Citi CC"]
["2009-12-18","Wal-Mart","WAL-MART #1768 OREM UT",82.35,"debit","Shopping","Citi CC"]
["2009-12-09","Savings Deposit Direct","Savings Deposit - Direct Deposit from ELI LILLY AND CO ELI LILLY",82.07,"credit","Paycheck","ING Holding"]
["2009-12-07","Electronic Citi Cards","Electronic Payment to CITI CARDS",20,"debit","Credit Card Payment","ING Checking"]
["2009-12-07","Electronic Bank","Electronic Payment to BANK OF AMERICA",15,"debit","Credit Card Payment","ING Checking"]
["2009-12-03","Person Person Laura","Person2Person Payment to Laura or Clayne Larsen",1075,"debit","Mortgage & Rent","ING Checking"]
["2009-12-01","Transfer from FREE CHECKING","Internet Deposit MOUNTAIN AMERICA FCU checking account XXXXXXXX1875",650,"credit","Transfer","ING Checking"]
["2009-11-30","Monthly Interest Paid","Monthly Interest Paid",0.06,"credit","Interest Income","ING Checking"]
["2009-11-30","Monthly Interest Paid","Monthly Interest Paid",0.7,"credit","Interest Income","ING Holding"]
["2009-11-29","Transfer from ING Holding","Internet Deposit transferred from OSA XXXX4516",655,"credit","Transfer","ING Checking"]
["2009-11-29","Transfer from ING Savings","Internet Deposit transferred from OSA XXXX3822",1,"credit","Transfer","ING Checking"]
["2009-11-29","Transfer to Checking","Internet Withdrawal transferred to EO XXXX4669",655,"debit","Transfer","ING Holding"]
["2009-11-29","Transfer to Checking","Internet Withdrawal transferred to EO XXXX4669",1,"debit","Transfer","ING Savings"]
["2009-11-15","McDonald's","Debit Card Purchase - MCDONALD S F29589 Q17 OREM UT",6.56,"debit","Fast Food","ING Checking"]
["2009-11-13","Bk Amer Vi","Electronic Withdrawal from BK OF AMER VI/MC ONLINE PMT",42.46,"debit","Credit Card Payment","ING Checking"]
["2009-11-12","Electronic Us Bank","Electronic Payment to US Bank Credit Card",40.85,"debit","Credit Card Payment","ING Checking"]
["2009-11-12","Transfer to FREE CHECKING","Internet Withdrawal MOUNTAIN AMERICA FCU checking account XXXXXXXX1875",750,"debit","Transfer","ING Checking"]
["2009-11-10","Transfer from ING Holding","Internet Deposit transferred from OSA XXXX4516",135,"credit","Transfer","ING Checking"]
["2009-11-10","Transfer to Checking","Internet Withdrawal transferred to EO XXXX4669",135,"debit","Transfer","ING Holding"]
["2009-11-06","PayPal","Electronic Withdrawal from PAYPAL INST XFER",48.49,"debit","Shopping","ING Checking"]
["2009-11-03","Adjustment For Amber","Credit Adjustment for payment to Amber Swensen",750,"credit","Income","ING Checking"]
["2009-11-02","Transfer to FREE CHECKING","Internet Withdrawal MOUNTAIN AMERICA FCU checking account XXXXXXXX1875",75,"debit","Transfer","ING Holding"]
["2009-10-31","Monthly Interest Paid","Monthly Interest Paid",0.04,"credit","Interest Income","ING Checking"]
["2009-10-31","Monthly Interest Paid","Monthly Interest Paid",3.24,"credit","Interest Income","ING Holding"]
["2009-10-29","Citi Online","Electronic Withdrawal from CITI CARD ONLINE PAYMENT",1058.3499999999999,"debit","Credit Card Payment","ING Checking"]
["2009-10-28","Internet Withdrawal Mountain","Internet Withdrawal MOUNTAIN AMERICA FCU checking account XXXXXXXX1875",1300,"debit","Transfer","ING Holding"]
["2009-10-27","Transfer from ING Holding","Internet Deposit transferred from OSA XXXX4516",1058,"credit","Transfer","ING Checking"]
["2009-10-27","Transfer to Checking","Internet Withdrawal transferred to EO XXXX4669",1058,"debit","Transfer","ING Holding"]
["2009-10-18","Wall Street Journal","Debit Card Purchase - D J WALL STREET JOURNA 800 568 7625 MA",179,"debit","Printing","ING Checking"]
["2009-10-07","Citi Online","Electronic Withdrawal from CITI CARD ONLINE PAYMENT",282.22000000000003,"debit","Credit Card Payment","ING Checking"]
["2009-10-06","Transfer from ING Holding","Internet Deposit transferred from OSA XXXX4516",282,"credit","Transfer","ING Checking"]
["2009-10-06","Transfer from ING Holding","Internet Deposit transferred from OSA XXXX4516",180,"credit","Transfer","ING Checking"]
["2009-10-06","Transfer to Checking","Internet Withdrawal transferred to EO XXXX4669",282,"debit","Transfer","ING Holding"]
["2009-10-06","Transfer to Checking","Internet Withdrawal transferred to EO XXXX4669",180,"debit","Transfer","ING Holding"]
["2009-09-30","Monthly Interest Paid","Monthly Interest Paid",0.04,"credit","Interest Income","ING Checking"]
["2009-09-30","Periodic Finance Charge","Finance Charge Paid for Overdraft",7.0000000000000007E-2,"debit","Finance Charge","ING Checking"]
["2009-09-30","Internet Withdrawal Mountain","Internet Withdrawal MOUNTAIN AMERICA FCU checking account XXXXXXXX1875",625,"debit","Transfer","ING Holding"]
["2009-09-30","Savings Deposit Direct","Savings Deposit - Direct Deposit from ELI LILLY AND CO TER TRAVEL",177.51,"credit","Paycheck","ING Holding"]
["2009-09-30","Monthly Interest Paid","Monthly Interest Paid",4.55,"credit","Interest Income","ING Holding"]
["2009-09-29","Internet Deposit Transferred","Internet Deposit transferred from OSA XXXX4516",1075,"credit","Income","ING Checking"]
["2009-09-29","Person Person Laura","Person2Person Payment to Laura or Clayne Larsen",1075,"debit","Mortgage & Rent","ING Checking"]
["2009-09-17","Citi Online","Electronic Withdrawal from CITI CARD ONLINE PAYMENT",3716.77,"debit","Credit Card Payment","ING Checking"]
["2009-09-17","Paper Church Jesus","Paper Payment to CHURCH OF JESUS CHRIST OF LDS",148,"debit","Charity","ING Checking"]
["2009-09-16","Citi Online","Electronic Withdrawal from CITI CARD ONLINE PAYMENT",1000,"debit","Credit Card Payment","ING Checking"]
["2009-09-16","Internet Deposit Transferred","Internet Deposit transferred from OSA XXXX4516",148,"credit","Income","ING Checking"]
["2009-09-16","Internet Deposit Transferred","Internet Deposit transferred from OSA XXXX4516",3716,"credit","Income","ING Checking"]
["2009-09-16","PayPal","Electronic Withdrawal from PAYPAL INST XFER",5,"debit","Shopping","ING Checking"]
["2009-09-15","Internet Deposit Transferred","Internet Deposit transferred from OSA XXXX4516",1050,"credit","Income","ING Checking"]
["2009-09-08","Internet Deposit Mountain","Internet Deposit MOUNTAIN AMERICA FCU checking account XXXXXXXX1875",60,"credit","Income","ING Checking"]
["2009-09-08","Liberty Mutual","Electronic Withdrawal from LIBERTY MUTUAL PAYMENT",68.03,"debit","Auto Insurance","ING Checking"]
["2009-09-04","Electric Orange Adjustment","Electric Orange Card Adjustment (Credit) EBAYS HALF COM 08005459857 CA",18.059999999999999,"credit","Income","ING Checking"]
["2009-09-04","Electric Orange Adjustment","Electric Orange Card Adjustment (Credit) EBAYS HALF COM 08005459857 CA",26.94,"credit","Income","ING Checking"]
["2009-09-01","Internet Deposit Rbs","Internet Deposit RBS CITIZENS, NATIONAL ASSOCIATION checking account XXXXXX1929",22.26,"credit","Income","ING Checking"]
["2009-08-31","Periodic Finance Charge","Finance Charge Paid for Overdraft",0.11,"debit","Finance Charge","ING Checking"]
["2009-08-31","Consumer Reports","Debit Card Purchase - CR CONSUMERREPORTS OR 800 333 0663 NY",5.95,"debit","Books","ING Checking"]
["2009-08-31","Monthly Interest Paid","Monthly Interest Paid",0.18,"credit","Interest Income","ING Checking"]
["2009-08-27","Byu Creamery Ninth","Debit Card Purchase - BYU CREAMERY ON NINTH PROVO UT",10.59,"debit","Uncategorized","ING Checking"]
["2009-08-26","Brigham Young University","Debit Card Purchase - BRIGHAM YOUNG UNIV WEB 01111111111 UT",60,"debit","Education","ING Checking"]
["2009-08-26","Electronic Citi Cards","Electronic Payment to CITI CARDS",400,"debit","Credit Card Payment","ING Checking"]
["2009-08-25","Costco","Debit Card Purchase - COSTCO WHSE #0484 648 EAST 800 SOUTH",81.17,"debit","Miscellaneous","ING Checking"]
["2009-08-25","Costco","Debit Card Purchase - COSTCO WHSE #0484 648 EAST 800 SOUTH",17.09,"debit","Miscellaneous","ING Checking"]
["2009-08-25","Paper Church Jesus","Paper Payment to Church of Jesus Christ of LDS",140,"debit","Charity","ING Checking"]
["2009-08-24","Big Lots","Debit Card Purchase - BIG LOTS #04116 1290 N STATE ST",34.26,"debit","Shopping","ING Checking"]
["2009-08-24","Person Person Laura","Person2Person Payment to Laura or Clayne Larsen",555,"debit","Mortgage & Rent","ING Checking"]
["2009-08-24","Subway","Debit Card Purchase - BYU WSC SUBWAY PROVO UT",7.54,"debit","Fast Food","ING Checking"]
["2009-08-24","Byu Signature Web","Debit Card Purchase - BYU SIGNATURE CRD WEB 08014223867 UT",20,"debit","Uncategorized","ING Checking"]
["2009-08-24","Maceys","Debit Card Purchase - MACEYS PROVO 1400 N STATE 00",8.5,"debit","Groceries","ING Checking"]
["2009-08-24","Maceys","Debit Card Purchase - MACEYS PROVO 1400 N STATE 00",51.92,"debit","Groceries","ING Checking"]
["2009-08-20","Lowe's","Debit Card Purchase - LOWE'S #178 140 W UNIVERSITY PKWY 000",7.67,"debit","Home Improvement","ING Checking"]
["2009-08-20","Wal-Mart","Debit Card Purchase - WAL-MART #1768 1355 S SANDHILL RD",54.58,"debit","Shopping","ING Checking"]
["2009-08-20","Sports Authority","Debit Card Purchase - SPORTS AUTHORI 643 E UNIVERSITY PKWY",12,"debit","Sporting Goods","ING Checking"]
["2009-08-20","Wal-Mart","Debit Card Purchase - WAL-MART #1768 1355 S SANDHILL RD",13.66,"debit","Shopping","ING Checking"]
["2009-08-20","Internet Deposit Transferred","Internet Deposit transferred from OSA XXXX4516",1444,"credit","Income","ING Checking"]
["2009-08-19","Genzyme Corp","Debit Card Purchase - GENZYME CORPORATION 508 3896605 MA",387.1,"debit","Doctor","ING Checking"]
["2009-08-18","Maverik","Debit Card Purchase - MAVERIK CTRY STRE 339 OREM UT",35.03,"debit","Gas & Fuel","ING Checking"]
["2009-08-17","Burger King","Debit Card Purchase - BURGER KING 10646 Q07 OREM UT",2.69,"debit","Fast Food","ING Checking"]
["2009-08-14","Target","Debit Card Purchase - TARGET T1754 OREM STAT 175 WEST CENTER S",11.23,"debit","Miscellaneous","ING Checking"]
["2009-08-13","Mount Auburn Hospital","Debit Card Purchase - MOUNT AUBURN HOSPITAL CAMBRIDGE MA",252.48,"debit","Doctor","ING Checking"]
["2009-08-13","Target","Debit Card Purchase - TARGET T1754 OREM STAT 175 WEST CENTER S",1.03,"debit","Miscellaneous","ING Checking"]
["2009-08-12","E Cnty Rd","Debit Card Purchase - 506 4004 E CNTY RD 700 N 0000 ROLLIN",80.62,"debit","Uncategorized","ING Checking"]
["2009-07-31","Internet Withdrawal Transferred","Internet Withdrawal transferred to EO XXXX4669",750,"debit","Transfer","ING Savings"]
["2009-07-31","Monthly Interest Paid","Monthly Interest Paid",1.47,"credit","Interest Income","ING Savings"]
["2009-07-31","Internet Deposit Transferred","Internet Deposit transferred from OSA XXXX4516",750,"credit","Income","ING Savings"]

{"sheet":"List","index":1,"n_rows":2056,"n_cols":8,"rows_kept":2056,"cut":false,"hidden":false,"merged":[]}
["Date","Description","Original Description","Amount","Transaction Type","Category","Account Name","Fix Cats"]
["2011-04-15","PayPal","Electronic Withdrawal from PAYPA",-25,"debit","Shopping","ING Checking",{"$f":"VLOOKUP(TestTable[[#This Row],[Category]],Table11[],2,FALSE)","v":"Misc"}]
["2011-04-15","Citi","Electronic Withdrawal from CITI",-73,"debit","Uncategorized","ING Checking",{"$f":"VLOOKUP(TestTable[[#This Row],[Category]],Table11[],2,FALSE)","v":"Misc"}]
["2011-04-15","PayPal","Electronic Withdrawal from PAYPA",-60,"debit","Shopping","ING Checking",{"$f":"VLOOKUP(TestTable[[#This Row],[Category]],Table11[],2,FALSE)","v":"Misc"}]
["2011-04-15","External Electronic Withdrawal","External Electronic Withdrawal f",-113.16,"debit","Bank Fee","ING Holding",{"$f":"VLOOKUP(TestTable[[#This Row],[Category]],Table11[],2,FALSE)","v":"Misc"}]
["2011-04-15","Children's Place","Withdrawal #110507014385THE CHILDRENS PLACE #0941 575 EAST UNIVERSITY PKY OREM UT %% Card 08 #4748",-18.11,"debit","Clothing","MACU Checking",{"$f":"VLOOKUP(TestTable[[#This Row],[Category]],Table11[],2,FALSE)","v":"Misc"}]
["2011-04-14","Marketplace","Debit Card Purchase - MARKETPLAC",-3.86,"debit","Fast Food","ING Checking",{"$f":"VLOOKUP(TestTable[[#This Row],[Category]],Table11[],2,FALSE)","v":"Food"}]
["2011-04-14","PayPal","Electronic Withdrawal from PAYPA",-32,"debit","Shopping","ING Checking",{"$f":"VLOOKUP(TestTable[[#This Row],[Category]],Table11[],2,FALSE)","v":"Misc"}]
["2011-04-14","Byu Creame","Debit Card Purchase - BYU CREAME",-6.43,"debit","Fast Food","ING Checking",{"$f":"VLOOKUP(TestTable[[#This Row],[Category]],Table11[],2,FALSE)","v":"Food"}]
["2011-04-14","Subway","Debit Card Purchase - SUBWAY 030",-1.82,"debit","Fast Food","ING Checking",{"$f":"VLOOKUP(TestTable[[#This Row],[Category]],Table11[],2,FALSE)","v":"Food"}]
["2011-04-14","Byu Creame","Debit Card Purchase - BYU CREAME",-12.34,"debit","Fast Food","ING Checking",{"$f":"VLOOKUP(TestTable[[#This Row],[Category]],Table11[],2,FALSE)","v":"Food"}]
["2011-04-14","Chevron","WithdrawalCHEVRON 00072863 OREM UT Date 04/13/11 24046031103000178964034 5542",-62.71,"debit","Gas & Fuel","MACU Checking",{"$f":"VLOOKUP(TestTable[[#This Row],[Category]],Table11[],2,FALSE)","v":"Auto"}]
["2011-04-13","Chevron","Debit Card Purchase - CHEVRON/WI",-3.28,"debit","Gas & Fuel","ING Checking",{"$f":"VLOOKUP(TestTable[[#This Row],[Category]],Table11[],2,FALSE)","v":"Auto"}]
["2011-04-13","Target","Withdrawal #012425TARGET T1754 OREM STAT 175 West Center Street Orem UT %% Card 08 #4748",-42.33,"debit","Miscellaneous","MACU Checking",{"$f":"VLOOKUP(TestTable[[#This Row],[Category]],Table11[],2,FALSE)","v":"Misc"}]
["2011-04-12","Daisy Mart","Debit Card Purchase - DAISY MAY",-22.59,"debit","Groceries","ING Checking",{"$f":"VLOOKUP(TestTable[[#This Row],[Category]],Table11[],2,FALSE)","v":"Food"}]
["2011-04-12","Byu Creame","Debit Card Purchase - BYU CREAME",-2.9,"debit","Fast Food","ING Checking",{"$f":"VLOOKUP(TestTable[[#This Row],[Category]],Table11[],2,FALSE)","v":"Food"}]
["2011-04-12","Nyc Taxi Q","Debit Card Purchase - NYC TAXI Q",-8.1999999999999993,"debit","Rental Car & Taxi","ING Checking",{"$f":"VLOOKUP(TestTable[[#This Row],[Category]],Table11[],2,FALSE)","v":"Misc"}]
["2011-04-11","Rite Aid","RITE AID 6148 RITE AID",98.59,"credit","Pharmacy","B of A CC",{"$f":"VLOOKUP(TestTable[[#This Row],[Category]],Table11[],2,FALSE)","v":"Medical"}]
["2011-04-11","Timpview Pharmacy","TIMPVIEW PHARMACY 3000",53.95,"credit","Pharmacy","B of A CC",{"$f":"VLOOKUP(TestTable[[#This Row],[Category]],Table11[],2,FALSE)","v":"Medical"}]
["2011-04-11","Transfer to B of A CC","Electronic Withdrawal from BK OF",-100,"debit","Credit Card Payment","ING Checking",{"$f":"VLOOKUP(TestTable[[#This Row],[Category]],Table11[],2,FALSE)","v":"Debt"}]
["2011-04-11","Max Brenne","Debit Card Purchase - MAX BRENNE",-14.04,"debit","Uncategorized","ING Checking",{"$f":"VLOOKUP(TestTable[[#This Row],[Category]],Table11[],2,FALSE)","v":"Misc"}]
["2011-04-11","Byu O","Electronic Withdrawal from BYU O",-5.3,"debit","Uncategorized","ING Checking",{"$f":"VLOOKUP(TestTable[[#This Row],[Category]],Table11[],2,FALSE)","v":"Misc"}]
["2011-04-11","Nyc Taxi Q","Debit Card Purchase - NYC TAXI Q",-7.4,"debit","Rental Car & Taxi","ING Checking",{"$f":"VLOOKUP(TestTable[[#This Row],[Category]],Table11[],2,FALSE)","v":"Misc"}]
["2011-04-11","Nyc Taxi M","Debit Card Purchase - NYC TAXI M",-14.16,"debit","Rental Car & Taxi","ING Checking",{"$f":"VLOOKUP(TestTable[[#This Row],[Category]],Table11[],2,FALSE)","v":"Misc"}]
["2011-04-11","Byu T","Electronic Withdrawal from BYU T",-10,"debit","Uncategorized","ING Checking",{"$f":"VLOOKUP(TestTable[[#This Row],[Category]],Table11[],2,FALSE)","v":"Misc"}]
["2011-04-11","Grove","Debit Card Purchase - THE GROVE",-11.29,"debit","Uncategorized","ING Checking",{"$f":"VLOOKUP(TestTable[[#This Row],[Category]],Table11[],2,FALSE)","v":"Misc"}]
["2011-04-11","Orpheum","Debit Card Purchase - ORPHEUM 07",-12.5,"debit","Uncategorized","ING Checking",{"$f":"VLOOKUP(TestTable[[#This Row],[Category]],Table11[],2,FALSE)","v":"Misc"}]
["2011-04-11","Byu H","Electronic Withdrawal from BYU H",-194,"debit","Uncategorized","ING Checking",{"$f":"VLOOKUP(TestTable[[#This Row],[Category]],Table11[],2,FALSE)","v":"Misc"}]
["2011-04-11","Byu H","Electronic Withdrawal from BYU H",-30,"debit","Uncategorized","ING Checking",{"$f":"VLOOKUP(TestTable[[#This Row],[Category]],Table11[],2,FALSE)","v":"Misc"}]
["2011-04-11","Withdrawal Adjustmentonline Tax","Withdrawal AdjustmentONLINE TAX PRODUCT KANSAS CITY MO Date 04/10/11 74108381100083001747554 8931",79.900000000000006,"credit","Income","MACU Checking",{"$f":"VLOOKUP(TestTable[[#This Row],[Category]],Table11[],2,FALSE)","v":"income"}]
["2011-04-11","Circle K","WithdrawalARCTIC CIRCLE 515 OREM OREM UT Date 04/09/11 24071051100987111476499 5814",-12.63,"debit","Gas & Fuel","MACU Checking",{"$f":"VLOOKUP(TestTable[[#This Row],[Category]],Table11[],2,FALSE)","v":"Auto"}]
["2011-04-11","H&R Block","WithdrawalONLINE TAX PRODUCT HRBLOCK.COM MO Date 04/10/11 24108381100083731323721 8931",-114.85,"debit","Taxes","MACU Checking",{"$f":"VLOOKUP(TestTable[[#This Row],[Category]],Table11[],2,FALSE)","v":"Misc"}]
["2011-04-11","Blockbuster","WithdrawalBLOCKBUSTER INC#49096 801-373-9688 UT Date 04/10/11 24692161100000331994485 7841",-7.46,"debit","Movies & DVDs","MACU Checking",{"$f":"VLOOKUP(TestTable[[#This Row],[Category]],Table11[],2,FALSE)","v":"Misc"}]
["2011-04-10","MTA","Debit Card Purchase - MTA VENDIN",-10,"debit","Public Transportation","ING Checking",{"$f":"VLOOKUP(TestTable[[#This Row],[Category]],Table11[],2,FALSE)","v":"Misc"}]
["2011-04-10","Costco","Debit Card Purchase - COSTCO COM",-170.79,"debit","Miscellaneous","ING Checking",{"$f":"VLOOKUP(TestTable[[#This Row],[Category]],Table11[],2,FALSE)","v":"Misc"}]
["2011-04-10","Shake Shack","Debit Card Purchase - SHAKE SHAC",-6.53,"debit","Restaurants","ING Checking",{"$f":"VLOOKUP(TestTable[[#This Row],[Category]],Table11[],2,FALSE)","v":"Food"}]
["2011-04-09","Jo-Ann Stores","Withdrawal #109987953813JOANN STORES, INC. 1666 S STATE ST OREM UT %% Card 08 #4748",-5.32,"debit","Miscellaneous","MACU Checking",{"$f":"VLOOKUP(TestTable[[#This Row],[Category]],Table11[],2,FALSE)","v":"Misc"}]
["2011-04-08","Transfer from ING Checking","BA ELECTRONIC PAYMENT",100,"credit","Credit Card Payment","B of A CC",{"$f":"VLOOKUP(TestTable[[#This Row],[Category]],Table11[],2,FALSE)","v":"Debt"}]
["2011-04-08","Brigham Yo","Debit Card Purchase - BRIGHAM YO",-10,"debit","Uncategorized","ING Checking",{"$f":"VLOOKUP(TestTable[[#This Row],[Category]],Table11[],2,FALSE)","v":"Misc"}]
["2011-04-08","Brigham Yo","Debit Card Purchase - BRIGHAM YO",-30,"debit","Uncategorized","ING Checking",{"$f":"VLOOKUP(TestTable[[#This Row],[Category]],Table11[],2,FALSE)","v":"Misc"}]
["2011-04-08","MTA","Debit Card Purchase - MTA VENDIN",-10,"debit","Public Transportation","ING Checking",{"$f":"VLOOKUP(TestTable[[#This Row],[Category]],Table11[],2,FALSE)","v":"Misc"}]
["2011-04-08","ATM Fee","ATM Withdrawal - *MIDTOWN NORTH",-2,"debit","ATM Fee","ING Checking",{"$f":"VLOOKUP(TestTable[[#This Row],[Category]],Table11[],2,FALSE)","v":"Misc"}]
["2011-04-08","ATM Withdrawal","ATM Withdrawal - *MIDTOWN NORTH",-40,"debit","Cash & ATM","ING Checking",{"$f":"VLOOKUP(TestTable[[#This Row],[Category]],Table11[],2,FALSE)","v":"Misc"}]
["2011-04-08","Interest Charge","PURCHASE INTEREST CHARGE",-42.96,"debit","Finance Charge","Chase CC",{"$f":"VLOOKUP(TestTable[[#This Row],[Category]],Table11[],2,FALSE)","v":"Misc"}]
["2011-04-08","Cash","CASH ADVANCE INTEREST CHA",-0.1,"debit","Business Services","Chase CC",{"$f":"VLOOKUP(TestTable[[#This Row],[Category]],Table11[],2,FALSE)","v":"Misc"}]
["2011-04-08","Rite Aid","Withdrawal #109876823369RITE AID CORP. RIVERSIDE PLAZA PROVO UT %% Card 08 #4748",-7.46,"debit","Pharmacy","MACU Checking",{"$f":"VLOOKUP(TestTable[[#This Row],[Category]],Table11[],2,FALSE)","v":"Medical"}]
["2011-04-08","Metrocard","Debit Card Purchase - METROCARD",-10,"debit","Uncategorized","ING Checking",{"$f":"VLOOKUP(TestTable[[#This Row],[Category]],Table11[],2,FALSE)","v":"Misc"}]
["2011-04-08","Electronic Deposit Brigham","Electronic Deposit from BRIGHAM",14.5,"credit","Income","ING Checking",{"$f":"VLOOKUP(TestTable[[#This Row],[Category]],Table11[],2,FALSE)","v":"income"}]
["2011-04-08","Super Sonic Car Wash","WithdrawalSUPERSONIC CAR WASH - PROVO UT Date 04/06/11 24071051097158142668273 7542",-10.55,"debit","Service & Parts","MACU Checking",{"$f":"VLOOKUP(TestTable[[#This Row],[Category]],Table11[],2,FALSE)","v":"Auto"}]
["2011-04-07","Microsoft XBox Live","MICROSOFT   *XBOX LIVE 080038655",-9.99,"debit","Electronics & Software","Citi CC",{"$f":"VLOOKUP(TestTable[[#This Row],[Category]],Table11[],2,FALSE)","v":"Misc"}]
["2011-04-07","Withdrawal","Withdrawal #000000000003",-57.68,"debit","Uncategorized","MACU Checking",{"$f":"VLOOKUP(TestTable[[#This Row],[Category]],Table11[],2,FALSE)","v":"Misc"}]
["2011-04-07","Carl's Jr","WithdrawalCARL'S JR #1101363 QPS PROVO UT Date 04/05/11 24492151096207499500868 5814",-9.68,"debit","Fast Food","MACU Checking",{"$f":"VLOOKUP(TestTable[[#This Row],[Category]],Table11[],2,FALSE)","v":"Food"}]
["2011-04-07","Commentken Garff Honda","Transaction COMMENTKEN GARFF HONDA O 115 E UNIVERSITY P OREM UT %% Card 08 #4748",0,"credit","Income","MACU Checking",{"$f":"VLOOKUP(TestTable[[#This Row],[Category]],Table11[],2,FALSE)","v":"income"}]
["2011-04-06","Salt Lake","Debit Card Purchase - SALT LAKE",-35,"debit","Uncategorized","ING Checking",{"$f":"VLOOKUP(TestTable[[#This Row],[Category]],Table11[],2,FALSE)","v":"Misc"}]
["2011-04-06","Farmers Market","Withdrawal #471669SUNFLOWER FARMERS MARKET 1375 S. STATE ST. OREM UT %% Card 08 #4748",-12.81,"debit","Groceries","MACU Checking",{"$f":"VLOOKUP(TestTable[[#This Row],[Category]],Table11[],2,FALSE)","v":"Food"}]
["2011-04-06","Chase","Electronic Withdrawal from CHASE",-73,"debit","Uncategorized","ING Checking",{"$f":"VLOOKUP(TestTable[[#This Row],[Category]],Table11[],2,FALSE)","v":"Misc"}]
["2011-04-05","Hertz","Debit Card Purchase - HERTZ RENT",-67.5,"debit","Rental Car & Taxi","ING Checking",{"$f":"VLOOKUP(TestTable[[#This Row],[Category]],Table11[],2,FALSE)","v":"Misc"}]
["2011-04-05","La Roadhou","Debit Card Purchase - LA ROADHOU",-35.590000000000003,"debit","Uncategorized","ING Checking",{"$f":"VLOOKUP(TestTable[[#This Row],[Category]],Table11[],2,FALSE)","v":"Misc"}]
["2011-04-05","United","Debit Card Purchase - UNITED CHI",-2.5,"debit","Air Travel","ING Checking",{"$f":"VLOOKUP(TestTable[[#This Row],[Category]],Table11[],2,FALSE)","v":"Misc"}]
["2011-04-05","Chevron","Debit Card Purchase - CHEVRON 03",-38.590000000000003,"debit","Gas & Fuel","ING Checking",{"$f":"VLOOKUP(TestTable[[#This Row],[Category]],Table11[],2,FALSE)","v":"Auto"}]
["2011-04-05","Target","Withdrawal Adjustment #024114TARGET T1754 OREM STAT 175 West Center Street Orem UT %% Card 08 #4748",8.5299999999999994,"credit","Miscellaneous","MACU Checking",{"$f":"VLOOKUP(TestTable[[#This Row],[Category]],Table11[],2,FALSE)","v":"Misc"}]
["2011-04-05","Rite Aid","Withdrawal #109591359705RITE AID CORP. RIVERSIDE PLAZA PROVO UT %% Card 08 #4748",-6.07,"debit","Pharmacy","MACU Checking",{"$f":"VLOOKUP(TestTable[[#This Row],[Category]],Table11[],2,FALSE)","v":"Medical"}]
["2011-04-05","Transfer from ING Checking","AUTOMATIC PAYMENT - THANK",73,"credit","Credit Card Payment","Chase CC",{"$f":"VLOOKUP(TestTable[[#This Row],[Category]],Table11[],2,FALSE)","v":"Debt"}]
["2011-04-05","Baja Fresh","WithdrawalBAJA FRESH #130 LA CRENSTENTA CA Date 04/03/11 24425131094578002010819 5814",-10.62,"debit","Fast Food","MACU Checking",{"$f":"VLOOKUP(TestTable[[#This Row],[Category]],Table11[],2,FALSE)","v":"Food"}]
["2011-04-05","Kid To Kid","KID TO KID",-17.149999999999999,"debit","Shopping","Chase CC",{"$f":"VLOOKUP(TestTable[[#This Row],[Category]],Table11[],2,FALSE)","v":"Misc"}]
["2011-04-04","iTunes","APL*ITUNES             866-712-7",-6.37,"debit","Music","Citi CC",{"$f":"VLOOKUP(TestTable[[#This Row],[Category]],Table11[],2,FALSE)","v":"Misc"}]
["2011-04-04","Costco","Withdrawal #489299COSTCO WHSE #0484 648 EAST 800 SOUTH OREM UT %% Card 08 #3404",-7.45,"debit","Miscellaneous","MACU Checking",{"$f":"VLOOKUP(TestTable[[#This Row],[Category]],Table11[],2,FALSE)","v":"Misc"}]
["2011-04-04","Costco","Withdrawal #188106COSTCO WHSE #0484 648 EAST 800 SOUTH OREM UT %% Card 08 #3404",-56.61,"debit","Miscellaneous","MACU Checking",{"$f":"VLOOKUP(TestTable[[#This Row],[Category]],Table11[],2,FALSE)","v":"Misc"}]
["2011-04-04","Withdrawalbyu Cougar Creations","WithdrawalBYU COUGAR CREATIONS PROVO UT Date 04/01/11 24323011092575604010998 8220",-1.49,"debit","Uncategorized","MACU Checking",{"$f":"VLOOKUP(TestTable[[#This Row],[Category]],Table11[],2,FALSE)","v":"Misc"}]
["2011-04-04","Carl's Jr","WithdrawalCARLJR1100503 11005030 BAKERSFIELD CA Date 04/01/11 24164071093589362372230 5814",-7.23,"debit","Fast Food","MACU Checking",{"$f":"VLOOKUP(TestTable[[#This Row],[Category]],Table11[],2,FALSE)","v":"Food"}]
["2011-04-04","Transfer from ING Checking","Deposit SWENSEN,AMBER MTYPE: ING DIRECT CO: SWENSEN,AMBER M",730,"credit","Transfer","MACU Checking",{"$f":"VLOOKUP(TestTable[[#This Row],[Category]],Table11[],2,FALSE)","v":"Misc"}]
["2011-04-04","Withdrawal Sunflr Sunflr","Withdrawal #432732SUNFLR, INC. SUNFLR, INC23440 VALENC VALENCIA CA %% Card 08 #3404",-1.69,"debit","Uncategorized","MACU Checking",{"$f":"VLOOKUP(TestTable[[#This Row],[Category]],Table11[],2,FALSE)","v":"Misc"}]
["2011-04-03","IHOP","IHOP 763               BAKERSFIE",-11,"debit","Restaurants","Citi CC",{"$f":"VLOOKUP(TestTable[[#This Row],[Category]],Table11[],2,FALSE)","v":"Food"}]
["2011-04-03","Arby's","ARBY'S             Q99",-25.25,"debit","Fast Food","Chase CC",{"$f":"VLOOKUP(TestTable[[#This Row],[Category]],Table11[],2,FALSE)","v":"Food"}]
["2011-04-02","Person Person Laura","Person2Person Payment to Laura o",-1075,"debit","Mortgage & Rent","ING Checking",{"$f":"VLOOKUP(TestTable[[#This Row],[Category]],Table11[],2,FALSE)","v":"Housing"}]
["2011-04-02","Interest Charged Cash","Interest Charged on Cash Advances",0,"credit","Interest Income","B of A CC",{"$f":"VLOOKUP(TestTable[[#This Row],[Category]],Table11[],2,FALSE)","v":"Misc"}]
["2011-04-02","Interest Charged Purchases","Interest Charged on Purchases",-22.91,"debit","Finance Charge","B of A CC",{"$f":"VLOOKUP(TestTable[[#This Row],[Category]],Table11[],2,FALSE)","v":"Misc"}]
["2011-04-02","Interest Charged Balance","Interest Charged on Balance Transfers",0,"credit","Interest Income","B of A CC",{"$f":"VLOOKUP(TestTable[[#This Row],[Category]],Table11[],2,FALSE)","v":"Misc"}]
["2011-04-01","Black Angus","BLACK ANGUS BAKERSFIEL BAKERSFIE",-32.39,"debit","Restaurants","Citi CC",{"$f":"VLOOKUP(TestTable[[#This Row],[Category]],Table11[],2,FALSE)","v":"Food"}]
["2011-04-01","Transfer from ING Holding","Internet Deposit transferred fro",2979,"credit","Transfer","ING Checking",{"$f":"VLOOKUP(TestTable[[#This Row],[Category]],Table11[],2,FALSE)","v":"Misc"}]
["2011-04-01","Transfer to MACU Checking","Internet Withdrawal MOUNTAIN AME",-730,"debit","Transfer","ING Checking",{"$f":"VLOOKUP(TestTable[[#This Row],[Category]],Table11[],2,FALSE)","v":"Misc"}]
["2011-04-01","Transfer to ING Checking","Internet Withdrawal transferred",-2979,"debit","Transfer","ING Holding",{"$f":"VLOOKUP(TestTable[[#This Row],[Category]],Table11[],2,FALSE)","v":"Misc"}]
["2011-04-01","Costco","Withdrawal #180528COSTCO WHSE #0688 3800 ROSEDALE HIGHWAY BAKERSFIELD CA %% Card 08 #3404",-5.9,"debit","Miscellaneous","MACU Checking",{"$f":"VLOOKUP(TestTable[[#This Row],[Category]],Table11[],2,FALSE)","v":"Misc"}]
["2011-04-01","Subway","WithdrawalSUBWAY 00407841 BAKERFIELD CA Date 03/30/11 24164071090255908921335 5814",-3.24,"debit","Fast Food","MACU Checking",{"$f":"VLOOKUP(TestTable[[#This Row],[Category]],Table11[],2,FALSE)","v":"Food"}]
["2011-04-01","Target","Withdrawal #009566TARGET T1754 OREM STAT 175 West Center Street Orem UT %% Card 08 #4748",-12.45,"debit","Miscellaneous","MACU Checking",{"$f":"VLOOKUP(TestTable[[#This Row],[Category]],Table11[],2,FALSE)","v":"Misc"}]
["2011-04-01","Carl's Jr","WithdrawalCARLJR1100503 11005030 BAKERSFIELD CA Date 03/30/11 24164071090589360451229 5814",-3.12,"debit","Fast Food","MACU Checking",{"$f":"VLOOKUP(TestTable[[#This Row],[Category]],Table11[],2,FALSE)","v":"Food"}]
["2011-04-01","Baja Fresh","WithdrawalT7 BAJA FRESH 30052906 LOS ANGELES CA Date 03/30/11 24164071090531404290361 5814",-10.73,"debit","Fast Food","MACU Checking",{"$f":"VLOOKUP(TestTable[[#This Row],[Category]],Table11[],2,FALSE)","v":"Food"}]
["2011-04-01","BYU Bookstore","WithdrawalBYU BOOKSTORE PROVO UT Date 03/30/11 24337891090147015816826 8220",-10.62,"debit","Books","MACU Checking",{"$f":"VLOOKUP(TestTable[[#This Row],[Category]],Table11[],2,FALSE)","v":"Misc"}]
["2011-04-01","Carl's Jr","WithdrawalCARLJR1100503 11005030 BAKERSFIELD CA Date 03/30/11 24164071090589360451260 5814",-1.61,"debit","Fast Food","MACU Checking",{"$f":"VLOOKUP(TestTable[[#This Row],[Category]],Table11[],2,FALSE)","v":"Food"}]
["2011-04-01","Air Terminal Gifts","WithdrawalAIR TERMINAL GIFTS SALT LAKE CIT UT Date 03/30/11 24445001090100131790636 5999",-2.0499999999999998,"debit","Gift","MACU Checking",{"$f":"VLOOKUP(TestTable[[#This Row],[Category]],Table11[],2,FALSE)","v":"Misc"}]
["2011-03-31","Monthly Interest Paid","Monthly Interest Paid",0.03,"credit","Interest Income","ING Checking",{"$f":"VLOOKUP(TestTable[[#This Row],[Category]],Table11[],2,FALSE)","v":"Misc"}]
["2011-03-31","Periodic Finance Charge","Finance Charge Paid for Overdraf",-0.03,"debit","Finance Charge","ING Checking",{"$f":"VLOOKUP(TestTable[[#This Row],[Category]],Table11[],2,FALSE)","v":"Misc"}]
["2011-03-31","Monthly Interest Paid","Monthly Interest Paid",4.59,"credit","Interest Income","ING Holding",{"$f":"VLOOKUP(TestTable[[#This Row],[Category]],Table11[],2,FALSE)","v":"Misc"}]
["2011-03-31","Commentavg Checking Bal","Transaction COMMENTAvg Checking Bal for Mar $345.50",0,"credit","Income","MACU Checking",{"$f":"VLOOKUP(TestTable[[#This Row],[Category]],Table11[],2,FALSE)","v":"income"}]
["2011-03-31","Chevron","WithdrawalCHEVRON 00073049 PROVO UT Date 03/30/11 24046031089000108884516 5542",-35.07,"debit","Gas & Fuel","MACU Checking",{"$f":"VLOOKUP(TestTable[[#This Row],[Category]],Table11[],2,FALSE)","v":"Auto"}]
["2011-03-30","Trip Charges","TRIP CHARGES           208-429-2",-163.26,"debit","Uncategorized","Citi CC",{"$f":"VLOOKUP(TestTable[[#This Row],[Category]],Table11[],2,FALSE)","v":"Misc"}]
["2011-03-30","BYU Bookstore","Debit Card Purchase - BYU BOOKST",-34.950000000000003,"debit","Books","ING Checking",{"$f":"VLOOKUP(TestTable[[#This Row],[Category]],Table11[],2,FALSE)","v":"Misc"}]
["2011-03-30","Byu Wsc L","Debit Card Purchase - BYU WSC L",-5.91,"debit","Uncategorized","ING Checking",{"$f":"VLOOKUP(TestTable[[#This Row],[Category]],Table11[],2,FALSE)","v":"Misc"}]
["2011-03-30","Electric Orange Adjustment","Electric Orange Card Adjustment",21.95,"credit","Income","ING Checking",{"$f":"VLOOKUP(TestTable[[#This Row],[Category]],Table11[],2,FALSE)","v":"income"}]
["2011-03-30","Wal-Mart","Withdrawal #109078556473Wal-Mart Super Center 1768 WAL-SAMS OREM UT %% Card 08 #4748",-38.869999999999997,"debit","Shopping","MACU Checking",{"$f":"VLOOKUP(TestTable[[#This Row],[Category]],Table11[],2,FALSE)","v":"Misc"}]
["2011-03-30","Chevron","WithdrawalCHEVRON 00208662 PROVO UT Date 03/29/11 24046031088000177391204 5542",-71.41,"debit","Gas & Fuel","MACU Checking",{"$f":"VLOOKUP(TestTable[[#This Row],[Category]],Table11[],2,FALSE)","v":"Auto"}]
["2011-03-29","United","UNITED  0162122792730  CHICAGO",-5,"debit","Uncategorized","Citi CC",{"$f":"VLOOKUP(TestTable[[#This Row],[Category]],Table11[],2,FALSE)","v":"Misc"}]
["2011-03-29","Smdavis","PAYPAL *SMDAVIS        402935773",-84.66,"debit","Uncategorized","Citi CC",{"$f":"VLOOKUP(TestTable[[#This Row],[Category]],Table11[],2,FALSE)","v":"Misc"}]
["2011-03-29","Electric Orange Adjustment","Electric Orange Card Adjustment",44.62,"credit","Income","ING Checking",{"$f":"VLOOKUP(TestTable[[#This Row],[Category]],Table11[],2,FALSE)","v":"income"}]
["2011-03-29","External Electronic Withdrawal","External Electronic Withdrawal f",-89.49,"debit","Bank Fee","ING Holding",{"$f":"VLOOKUP(TestTable[[#This Row],[Category]],Table11[],2,FALSE)","v":"Misc"}]
["2011-03-29","Deposit By","Deposit by Check",167.11,"credit","Income","MACU Checking",{"$f":"VLOOKUP(TestTable[[#This Row],[Category]],Table11[],2,FALSE)","v":"income"}]
["2011-03-29","Withdrawal Smiths N","Withdrawal #002519SMITHS 350 N. FREEDOM PROVO UT %% Card 08 #3404",-9.0500000000000007,"debit","Uncategorized","MACU Checking",{"$f":"VLOOKUP(TestTable[[#This Row],[Category]],Table11[],2,FALSE)","v":"Misc"}]
["2011-03-28","El Salvado","Debit Card Purchase - EL SALVADO",-12.3,"debit","Uncategorized","ING Checking",{"$f":"VLOOKUP(TestTable[[#This Row],[Category]],Table11[],2,FALSE)","v":"Misc"}]
["2011-03-28","Verizon","Debit Card Purchase - VERIZON WR",-166.25,"debit","Home Phone","ING Checking",{"$f":"VLOOKUP(TestTable[[#This Row],[Category]],Table11[],2,FALSE)","v":"Phone"}]
["2011-03-28","Blockbuster","WithdrawalBLOCKBUSTER INC#49096 PROVO UT Date 03/26/11 24692161086000590912390 7841",-3.19,"debit","Movies & DVDs","MACU Checking",{"$f":"VLOOKUP(TestTable[[#This Row],[Category]],Table11[],2,FALSE)","v":"Misc"}]
["2011-03-28","Children's Place","Withdrawal AdjustmentTHE CHILDRENS PLACE #0941 OREM UT Date 03/25/11 74610431085004039107721 5641",21.77,"credit","Clothing","MACU Checking",{"$f":"VLOOKUP(TestTable[[#This Row],[Category]],Table11[],2,FALSE)","v":"Misc"}]
["2011-03-28","Withdrawal Adjustmentjcpenney Provo","Withdrawal AdjustmentJCPENNEY STORE 2770 PROVO UT Date 03/26/11 74299161086906926673351 5311",10.54,"credit","Income","MACU Checking",{"$f":"VLOOKUP(TestTable[[#This Row],[Category]],Table11[],2,FALSE)","v":"income"}]
["2011-03-27","Gold's Gym","GYM*GOLDS GYM",-54.4,"debit","Gym","Chase CC",{"$f":"VLOOKUP(TestTable[[#This Row],[Category]],Table11[],2,FALSE)","v":"Misc"}]
["2011-03-25","Southwest","SOUTHWES5262163670296  080043597",-157.4,"debit","Air Travel","Citi CC",{"$f":"VLOOKUP(TestTable[[#This Row],[Category]],Table11[],2,FALSE)","v":"Misc"}]
["2011-03-25","Electronic Deposit Brigham","Electronic Deposit from BRIGHAM",50.75,"credit","Income","ING Checking",{"$f":"VLOOKUP(TestTable[[#This Row],[Category]],Table11[],2,FALSE)","v":"income"}]
["2011-03-25","Transfer to Citi CC","Electronic Withdrawal from CITI",-500,"debit","Credit Card Payment","ING Checking",{"$f":"VLOOKUP(TestTable[[#This Row],[Category]],Table11[],2,FALSE)","v":"Debt"}]
["2011-03-25","Withdrawalbyu Pmpc Wsc","WithdrawalBYU PMPC WSC MAIL PROVO UT Date 03/23/11 24323011083572471011184 8220",-5.6,"debit","Uncategorized","MACU Checking",{"$f":"VLOOKUP(TestTable[[#This Row],[Category]],Table11[],2,FALSE)","v":"Misc"}]
["2011-03-24","Transfer from ING Checking","CLICK-TO-PAY PAYMENT, THANK YOU",500,"credit","Credit Card Payment","Citi CC",{"$f":"VLOOKUP(TestTable[[#This Row],[Category]],Table11[],2,FALSE)","v":"Debt"}]
["2011-03-24","Withdrawal Maceys Provo","Withdrawal #345130MACEYS PROVO 1400 N STATE PROVO UT %% Card 08 #4748",-6.78,"debit","Uncategorized","MACU Checking",{"$f":"VLOOKUP(TestTable[[#This Row],[Category]],Table11[],2,FALSE)","v":"Misc"}]
["2011-03-24","Withdrawal","Withdrawal",-10,"debit","Uncategorized","MACU Checking",{"$f":"VLOOKUP(TestTable[[#This Row],[Category]],Table11[],2,FALSE)","v":"Misc"}]
["2011-03-23","ATM Withdrawal","ATM Withdrawal - CARDTRONICS CCS",-140,"debit","Cash & ATM","ING Checking",{"$f":"VLOOKUP(TestTable[[#This Row],[Category]],Table11[],2,FALSE)","v":"Misc"}]
["2011-03-23","Transfer from ING Holding","Internet Deposit transferred fro",140,"credit","Transfer","ING Checking",{"$f":"VLOOKUP(TestTable[[#This Row],[Category]],Table11[],2,FALSE)","v":"Misc"}]
["2011-03-23","Transfer from ING Holding","Internet Deposit transferred fro",600,"credit","Transfer","ING Checking",{"$f":"VLOOKUP(TestTable[[#This Row],[Category]],Table11[],2,FALSE)","v":"Misc"}]
["2011-03-23","ATM Withdrawal","ATM Withdrawal - CARDTRONICS CCS",-20,"debit","Cash & ATM","ING Checking",{"$f":"VLOOKUP(TestTable[[#This Row],[Category]],Table11[],2,FALSE)","v":"Misc"}]
["2011-03-23","Transfer to ING Checking","Internet Withdrawal transferred",-600,"debit","Transfer","ING Holding",{"$f":"VLOOKUP(TestTable[[#This Row],[Category]],Table11[],2,FALSE)","v":"Misc"}]
["2011-03-23","External Electronic Withdrawal","External Electronic Withdrawal f",-48.28,"debit","Bank Fee","ING Holding",{"$f":"VLOOKUP(TestTable[[#This Row],[Category]],Table11[],2,FALSE)","v":"Misc"}]
["2011-03-23","Transfer to ING Checking","Internet Withdrawal transferred",-140,"debit","Transfer","ING Holding",{"$f":"VLOOKUP(TestTable[[#This Row],[Category]],Table11[],2,FALSE)","v":"Misc"}]
["2011-03-23","Children's Place","WithdrawalTHECHILDRENSPLACE.COM THECHILDRENSP NJ Date 03/22/11 24341291081083722495042 5641",-99.67,"debit","Clothing","MACU Checking",{"$f":"VLOOKUP(TestTable[[#This Row],[Category]],Table11[],2,FALSE)","v":"Misc"}]
["2011-03-23","Deposit","Deposit",160,"credit","Income","MACU Checking",{"$f":"VLOOKUP(TestTable[[#This Row],[Category]],Table11[],2,FALSE)","v":"income"}]
["2011-03-22","Priceline - Hotel","PLN*PRICELINE.COM HTL  800-657-9",-69.61,"debit","Hotel","Citi CC",{"$f":"VLOOKUP(TestTable[[#This Row],[Category]],Table11[],2,FALSE)","v":"Misc"}]
["2011-03-22","Bombay Hou","Debit Card Purchase - BOMBAY HOU",-45.02,"debit","Furnishings","ING Checking",{"$f":"VLOOKUP(TestTable[[#This Row],[Category]],Table11[],2,FALSE)","v":"Misc"}]
["2011-03-22","Pln Pricel","Debit Card Purchase - PLN PRICEL",-69.62,"debit","Uncategorized","ING Checking",{"$f":"VLOOKUP(TestTable[[#This Row],[Category]],Table11[],2,FALSE)","v":"Misc"}]
["2011-03-21","iTunes","APL*ITUNES             866-712-7",-7.47,"debit","Music","Citi CC",{"$f":"VLOOKUP(TestTable[[#This Row],[Category]],Table11[],2,FALSE)","v":"Misc"}]
["2011-03-21","External Electronic Withdrawal","External Electronic Withdrawal f",-50,"debit","Bank Fee","ING Holding",{"$f":"VLOOKUP(TestTable[[#This Row],[Category]],Table11[],2,FALSE)","v":"Misc"}]
["2011-03-21","Withdrawalfive Guys Ut","WithdrawalFIVE GUYS--UT # 04 OREM UT Date 03/18/11 24224431078104015097532 5814",-17.75,"debit","Bank Fee","MACU Checking",{"$f":"VLOOKUP(TestTable[[#This Row],[Category]],Table11[],2,FALSE)","v":"Misc"}]
["2011-03-21","Hibachi San","WithdrawalHIBACHI SAN 33 OREM UT Date 03/19/11 24224431079103019452916 5812",-6.42,"debit","Restaurants","MACU Checking",{"$f":"VLOOKUP(TestTable[[#This Row],[Category]],Table11[],2,FALSE)","v":"Food"}]
["2011-03-21","Nordstrom","Withdrawal Adjustment #003756NORDSTROM 038 693 UNIVERSITY PKWY OREM UT %% Card 08 #4748",51.29,"credit","Clothing","MACU Checking",{"$f":"VLOOKUP(TestTable[[#This Row],[Category]],Table11[],2,FALSE)","v":"Misc"}]
["2011-03-21","Withdrawalthe Sweet Tooth","WithdrawalTHE SWEET TOOTH FAIRY PROVO UT Date 03/18/11 24071051077158160459351 5814",-7.6,"debit","Cash & ATM","MACU Checking",{"$f":"VLOOKUP(TestTable[[#This Row],[Category]],Table11[],2,FALSE)","v":"Misc"}]
["2011-03-21","Transfer from MACU Savings 1","Deposit Transfer From Share 01",0.15,"credit","Transfer","MACU Checking",{"$f":"VLOOKUP(TestTable[[#This Row],[Category]],Table11[],2,FALSE)","v":"Misc"}]
["2011-03-21","Pretzelmaker","WithdrawalPRETZELMAKER OREM UT Date 03/19/11 24323011079572143010545 5814",-6.02,"debit","Fast Food","MACU Checking",{"$f":"VLOOKUP(TestTable[[#This Row],[Category]],Table11[],2,FALSE)","v":"Food"}]
["2011-03-21","Sally Beauty Supply","WithdrawalSALLY BEAUTY #1535 PROVO UT Date 03/17/11 24445001077200052259236 5977",-30.94,"debit","Personal Care","MACU Checking",{"$f":"VLOOKUP(TestTable[[#This Row],[Category]],Table11[],2,FALSE)","v":"Misc"}]
["2011-03-21","Chevron","WithdrawalCHEVRON 00208862 PROVO UT Date 03/18/11 24046031077000204490865 5542",-64.099999999999994,"debit","Gas & Fuel","MACU Checking",{"$f":"VLOOKUP(TestTable[[#This Row],[Category]],Table11[],2,FALSE)","v":"Auto"}]
["2011-03-21","Cinemark","WithdrawalCINEMARK 1041 Q34 OREM UT Date 03/18/11 24761971078251825013672 7832",-12.5,"debit","Movies & DVDs","MACU Checking",{"$f":"VLOOKUP(TestTable[[#This Row],[Category]],Table11[],2,FALSE)","v":"Misc"}]
["2011-03-21","Sally Beauty Supply","WithdrawalSALLY BEAUTY #1535 PROVO UT Date 03/17/11 24445001077200052259319 5977",-8.5299999999999994,"debit","Personal Care","MACU Checking",{"$f":"VLOOKUP(TestTable[[#This Row],[Category]],Table11[],2,FALSE)","v":"Misc"}]
["2011-03-21","Iceberg Drive Inn","WithdrawalICEBERG DRIVE INN OREM UT Date 03/19/11 24394681079980000107623 5814",-4.96,"debit","Restaurants","MACU Checking",{"$f":"VLOOKUP(TestTable[[#This Row],[Category]],Table11[],2,FALSE)","v":"Food"}]
["2011-03-21","Withdrawalbyu Creamery Ninth","WithdrawalBYU CREAMERY ON NINTH PROVO UT Date 03/18/11 24323011078575433014607 5499",-13.87,"debit","Uncategorized","MACU Checking",{"$f":"VLOOKUP(TestTable[[#This Row],[Category]],Table11[],2,FALSE)","v":"Misc"}]
["2011-03-21","Transfer to MACU Checking","Withdrawal Transfer To Share 50",-0.15,"debit","Transfer","MACU Savings 1",{"$f":"VLOOKUP(TestTable[[#This Row],[Category]],Table11[],2,FALSE)","v":"Misc"}]
["2011-03-19","Nordstrom","Withdrawal #005568NORDSTROM 038 693 UNIVERSITY PKWY OREM UT %% Card 08 #4748",-82.81,"debit","Clothing","MACU Checking",{"$f":"VLOOKUP(TestTable[[#This Row],[Category]],Table11[],2,FALSE)","v":"Misc"}]
["2011-03-19","Sports Authority","Withdrawal #013660SPORTS AUTHORI 643 E UNIVERSITY PKWY OREM UT %% Card 08 #3404",-2.12,"debit","Sporting Goods","MACU Checking",{"$f":"VLOOKUP(TestTable[[#This Row],[Category]],Table11[],2,FALSE)","v":"Misc"}]
["2011-03-19","Sports Aut","Debit Card Purchase - SPORTS AUT",-17.05,"debit","Uncategorized","ING Checking",{"$f":"VLOOKUP(TestTable[[#This Row],[Category]],Table11[],2,FALSE)","v":"Misc"}]
["2011-03-18","Transfer to MACU Savings 1","External Electronic Withdrawal f",-265,"debit","Transfer","ING Holding",{"$f":"VLOOKUP(TestTable[[#This Row],[Category]],Table11[],2,FALSE)","v":"Misc"}]
["2011-03-18","Wendy's","WithdrawalWENDYS #4710 Q25 PROVO UT Date 03/16/11 24445001076100132184241 5814",-14.4,"debit","Fast Food","MACU Checking",{"$f":"VLOOKUP(TestTable[[#This Row],[Category]],Table11[],2,FALSE)","v":"Food"}]
["2011-03-18","Bajio Mexican Grill","WithdrawalBAJIO MEXICAN GRILL 00001 PROVO UT Date 03/16/11 24717051076640761671600 5814",-10.42,"debit","Fast Food","MACU Checking",{"$f":"VLOOKUP(TestTable[[#This Row],[Category]],Table11[],2,FALSE)","v":"Food"}]
["2011-03-18","Withdrawal ATM Mountain","Withdrawal at ATM #000000008599MOUNTAIN AMERICA CU 88 N 500 W #2 PROVO UT COO332 %% Card 08 #4748",-80,"debit","Cash & ATM","MACU Checking",{"$f":"VLOOKUP(TestTable[[#This Row],[Category]],Table11[],2,FALSE)","v":"Misc"}]
["2011-03-18","Chevron","WithdrawalCHEVRON 00073049 PROVO UT Date 03/17/11 24046031077000026900851 5542",-20.21,"debit","Gas & Fuel","MACU Checking",{"$f":"VLOOKUP(TestTable[[#This Row],[Category]],Table11[],2,FALSE)","v":"Auto"}]
["2011-03-18","USPS","Withdrawal #107720001234USPS 4966310149 877 E 1200 S OREM UT %% Card 08 #3404",-4.49,"debit","Shipping","MACU Checking",{"$f":"VLOOKUP(TestTable[[#This Row],[Category]],Table11[],2,FALSE)","v":"Misc"}]
["2011-03-18","Transfer from ING Holding","Deposit ACH ORIGINATION",265,"credit","Transfer","MACU Savings 1",{"$f":"VLOOKUP(TestTable[[#This Row],[Category]],Table11[],2,FALSE)","v":"Misc"}]
["2011-03-18","Withdrawal Transfer Loan","Withdrawal Transfer To Loan 61",-265,"debit","Transfer","MACU Savings 1",{"$f":"VLOOKUP(TestTable[[#This Row],[Category]],Table11[],2,FALSE)","v":"Misc"}]
["2011-03-17","Interest Charged Pur","INTEREST CHARGED TO PUR PR-03/10",-11.93,"debit","Finance Charge","Citi CC",{"$f":"VLOOKUP(TestTable[[#This Row],[Category]],Table11[],2,FALSE)","v":"Misc"}]
["2011-03-17","Interest Charged Standard","INTEREST CHARGED TO STANDARD PUR",-0.01,"debit","Finance Charge","Citi CC",{"$f":"VLOOKUP(TestTable[[#This Row],[Category]],Table11[],2,FALSE)","v":"Misc"}]
["2011-03-17","Auth User Member","AUTH USER MEMBER FEE",-50,"debit","Fees & Charges","Citi CC",{"$f":"VLOOKUP(TestTable[[#This Row],[Category]],Table11[],2,FALSE)","v":"Misc"}]
["2011-03-17","Membership Fee Mar","MEMBERSHIP FEE MAR 11-FEB 12",-75,"debit","Fees & Charges","Citi CC",{"$f":"VLOOKUP(TestTable[[#This Row],[Category]],Table11[],2,FALSE)","v":"Misc"}]
["2011-03-17","JCPenney","Withdrawal #107662009776JCPENNEY STORE 2770 1200 TOWNE CENTRE BLVD PROVO UT %% Card 08 #4748",-25.6,"debit","Clothing","MACU Checking",{"$f":"VLOOKUP(TestTable[[#This Row],[Category]],Table11[],2,FALSE)","v":"Misc"}]
["2011-03-17","External Electronic Withdrawal","External Electronic Withdrawal f",-117.65,"debit","Bank Fee","ING Holding",{"$f":"VLOOKUP(TestTable[[#This Row],[Category]],Table11[],2,FALSE)","v":"Misc"}]
["2011-03-17","Children's Place","WithdrawalTHECHILDRENSPLACE.COM THECHILDRENSP NJ Date 03/16/11 24341291075083732037519 5641",-45.23,"debit","Clothing","MACU Checking",{"$f":"VLOOKUP(TestTable[[#This Row],[Category]],Table11[],2,FALSE)","v":"Misc"}]
["2011-03-16","External Electronic Withdrawal","External Electronic Withdrawal f",-113.16,"debit","Bank Fee","ING Holding",{"$f":"VLOOKUP(TestTable[[#This Row],[Category]],Table11[],2,FALSE)","v":"Misc"}]
["2011-03-16","Withdrawalbyu Creamery Fountain","WithdrawalBYU CREAMERY FOUNTAIN PROVO UT Date 03/14/11 24323011074575407010965 5814",-5.25,"debit","Uncategorized","MACU Checking",{"$f":"VLOOKUP(TestTable[[#This Row],[Category]],Table11[],2,FALSE)","v":"Misc"}]
["2011-03-15","Electric Orange Adjustment","Electric Orange Card Adjustment",37.340000000000003,"credit","Income","ING Checking",{"$f":"VLOOKUP(TestTable[[#This Row],[Category]],Table11[],2,FALSE)","v":"income"}]
["2011-03-15","Electric Orange Adjustment","Electric Orange Card Adjustment",37.340000000000003,"credit","Income","ING Checking",{"$f":"VLOOKUP(TestTable[[#This Row],[Category]],Table11[],2,FALSE)","v":"income"}]
["2011-03-14","Check 332","Draft 000332",-28,"debit","Check","MACU Checking",{"$f":"VLOOKUP(TestTable[[#This Row],[Category]],Table11[],2,FALSE)","v":"Income"}]
["2011-03-14","Withdrawalbyu Pmpc Wsc","WithdrawalBYU PMPC WSC MAIL PROVO UT Date 03/10/11 24323011070572462010927 8220",-1.05,"debit","Uncategorized","MACU Checking",{"$f":"VLOOKUP(TestTable[[#This Row],[Category]],Table11[],2,FALSE)","v":"Misc"}]
["2011-03-14","Wendy's","WithdrawalWENDYS #4710 Q25 PROVO UT Date 03/10/11 24445001070100126120231 5814",-7.95,"debit","Fast Food","MACU Checking",{"$f":"VLOOKUP(TestTable[[#This Row],[Category]],Table11[],2,FALSE)","v":"Food"}]
["2011-03-14","Bajio Mexican Grill","WithdrawalBAJIO MEXICAN GRILL 00001 PROVO UT Date 03/11/11 24717051071640711833107 5814",-12.89,"debit","Fast Food","MACU Checking",{"$f":"VLOOKUP(TestTable[[#This Row],[Category]],Table11[],2,FALSE)","v":"Food"}]
["2011-03-12","Costco","Withdrawal #441869COSTCO WHSE #0484 648 EAST 800 SOUTH OREM UT %% Card 08 #3404",-29.68,"debit","Miscellaneous","MACU Checking",{"$f":"VLOOKUP(TestTable[[#This Row],[Category]],Table11[],2,FALSE)","v":"Misc"}]
["2011-03-12","Transfer from ING Holding","Internet Deposit transferred fro",1100,"credit","Transfer","ING Checking",{"$f":"VLOOKUP(TestTable[[#This Row],[Category]],Table11[],2,FALSE)","v":"Misc"}]
["2011-03-12","Person Person Laura","Person2Person Payment to Laura o",-1075,"debit","Mortgage & Rent","ING Checking",{"$f":"VLOOKUP(TestTable[[#This Row],[Category]],Table11[],2,FALSE)","v":"Housing"}]
["2011-03-12","Transfer to ING Checking","Internet Withdrawal transferred",-1100,"debit","Transfer","ING Holding",{"$f":"VLOOKUP(TestTable[[#This Row],[Category]],Table11[],2,FALSE)","v":"Misc"}]
["2011-03-11","Withdrawal Blickenstaff N","Withdrawal #111351232598BLICKENSTAFF'S 4801 N UNIVERSITY AVE # PROVO UT %% Card 08 #4748",-6.93,"debit","Gift","MACU Checking",{"$f":"VLOOKUP(TestTable[[#This Row],[Category]],Table11[],2,FALSE)","v":"Misc"}]
["2011-03-11","Walgreen","Withdrawal #427162WALGREEN COMPANY 1315 N STATE ST PROVO UT %% Card 08 #4748",-43.47,"debit","Miscellaneous","MACU Checking",{"$f":"VLOOKUP(TestTable[[#This Row],[Category]],Table11[],2,FALSE)","v":"Misc"}]
["2011-03-11","Electronic Deposit Brigham","Electronic Deposit from BRIGHAM",116,"credit","Income","ING Checking",{"$f":"VLOOKUP(TestTable[[#This Row],[Category]],Table11[],2,FALSE)","v":"income"}]
["2011-03-11","Wendy's","WithdrawalWENDYS #4710 Q25 PROVO UT Date 03/09/11 24445001069100131071224 5814",-6.23,"debit","Fast Food","MACU Checking",{"$f":"VLOOKUP(TestTable[[#This Row],[Category]],Table11[],2,FALSE)","v":"Food"}]
["2011-03-11","Withdrawalbyu Creamery Fountain","WithdrawalBYU CREAMERY FOUNTAIN PROVO UT Date 03/09/11 24323011069575403010909 5814",-2.67,"debit","Fast Food","MACU Checking",{"$f":"VLOOKUP(TestTable[[#This Row],[Category]],Table11[],2,FALSE)","v":"Food"}]
["2011-03-10","Withdrawal Provo Di","Withdrawal #069001833638PROVO DI 1415 NORTH STATE ST PROVO UT %% Card 08 #4748",-18,"debit","Clothing","MACU Checking",{"$f":"VLOOKUP(TestTable[[#This Row],[Category]],Table11[],2,FALSE)","v":"Misc"}]
["2011-03-10","Kiddie Kandids","WithdrawalKIDDIE KANDIDS PORTRAITS PROVO UT Date 03/09/11 24231681069286000000084 7221",-25.59,"debit","Miscellaneous","MACU Checking",{"$f":"VLOOKUP(TestTable[[#This Row],[Category]],Table11[],2,FALSE)","v":"Misc"}]
["2011-03-09","Withdrawalbyu Creamery Fountain","WithdrawalBYU CREAMERY FOUNTAIN PROVO UT Date 03/07/11 24323011067575401010879 5814",-5.75,"debit","Fast Food","MACU Checking",{"$f":"VLOOKUP(TestTable[[#This Row],[Category]],Table11[],2,FALSE)","v":"Food"}]
["2011-03-09","Withdrawalbroiler Express Date","WithdrawalBROILER EXPRESS PROVO UT Date 03/07/11 24071051067158125055908 5814",-5.88,"debit","Restaurants","MACU Checking",{"$f":"VLOOKUP(TestTable[[#This Row],[Category]],Table11[],2,FALSE)","v":"Food"}]
["2011-03-09","Chevron","WithdrawalCHEVRON 00073049 PROVO UT Date 03/08/11 24046031067000206767692 5542",-15.22,"debit","Gas & Fuel","MACU Checking",{"$f":"VLOOKUP(TestTable[[#This Row],[Category]],Table11[],2,FALSE)","v":"Auto"}]
["2011-03-08","Cash","CASH ADVANCE INTEREST CHA",-0.08,"debit","Business Services","Chase CC",{"$f":"VLOOKUP(TestTable[[#This Row],[Category]],Table11[],2,FALSE)","v":"Misc"}]
["2011-03-08","Interest Charge","PURCHASE INTEREST CHARGE",-38.369999999999997,"debit","Finance Charge","Chase CC",{"$f":"VLOOKUP(TestTable[[#This Row],[Category]],Table11[],2,FALSE)","v":"Misc"}]
["2011-03-08","Tepanyaki Japanese Steakhouse","WithdrawalTEPANYAKI JAPANESE STEAKH LEHI UT Date 03/05/11 24019511066066283112503 5812",-46.92,"debit","Restaurants","MACU Checking",{"$f":"VLOOKUP(TestTable[[#This Row],[Category]],Table11[],2,FALSE)","v":"Food"}]
["2011-03-08","Smith's Food","WithdrawalSMITHS FOOD #4136 PROVO UT Date 03/07/11 24445001066300094288947 5411",-4.1500000000000004,"debit","Miscellaneous","MACU Checking",{"$f":"VLOOKUP(TestTable[[#This Row],[Category]],Table11[],2,FALSE)","v":"Misc"}]
["2011-03-08","Redbox","WithdrawalREDBOX *DVD RENTAL 866-733-2693 IL Date 03/07/11 24692161066000847354754 7841",-4.26,"debit","Movies & DVDs","MACU Checking",{"$f":"VLOOKUP(TestTable[[#This Row],[Category]],Table11[],2,FALSE)","v":"Misc"}]
["2011-03-07","Microsoft XBox Live","MICROSOFT   *XBOX LIVE 080038655",-9.99,"debit","Electronics & Software","Citi CC",{"$f":"VLOOKUP(TestTable[[#This Row],[Category]],Table11[],2,FALSE)","v":"Misc"}]
["2011-03-07","Papa John's","Debit Card Purchase - PAPA JOHNS",-31.55,"debit","Fast Food","ING Checking",{"$f":"VLOOKUP(TestTable[[#This Row],[Category]],Table11[],2,FALSE)","v":"Food"}]
["2011-03-07","Provo Beac","Debit Card Purchase - PROVO BEAC",-3,"debit","Uncategorized","ING Checking",{"$f":"VLOOKUP(TestTable[[#This Row],[Category]],Table11[],2,FALSE)","v":"Misc"}]
["2011-03-07","External Electronic Withdrawal","External Electronic Withdrawal f",-139.69,"debit","Bank Fee","ING Holding",{"$f":"VLOOKUP(TestTable[[#This Row],[Category]],Table11[],2,FALSE)","v":"Misc"}]
["2011-03-07","Withdrawaltricked Out Accessories","WithdrawalTRICKED OUT ACCESSORIES OREM UT Date 03/04/11 24019511064064178841908 5999",-21.35,"debit","Miscellaneous","MACU Checking",{"$f":"VLOOKUP(TestTable[[#This Row],[Category]],Table11[],2,FALSE)","v":"Misc"}]
["2011-03-07","Krispy Kreme","WithdrawalKRISPY KREME DONUTS OREM UT Date 03/03/11 24341291063206388100745 5814",-3.38,"debit","Fast Food","MACU Checking",{"$f":"VLOOKUP(TestTable[[#This Row],[Category]],Table11[],2,FALSE)","v":"Food"}]
["2011-03-04","Redbox","WithdrawalREDBOX *DVDRESERVATION 866-733-2693 IL Date 03/03/11 24692161062000064878091 7841",-1.07,"debit","Movies & DVDs","MACU Checking",{"$f":"VLOOKUP(TestTable[[#This Row],[Category]],Table11[],2,FALSE)","v":"Misc"}]
["2011-03-03","ShopKo","Withdrawal #0018920086 ShopKo 2266 North University P Provo UT %% Card 08 #4748",-9.33,"debit","Miscellaneous","MACU Checking",{"$f":"VLOOKUP(TestTable[[#This Row],[Category]],Table11[],2,FALSE)","v":"Misc"}]
["2011-03-03","ShopKo","Withdrawal #0018920086 ShopKo 2266 North University P Provo UT %% Card 08 #4748",-5,"debit","Gift","MACU Checking",{"$f":"VLOOKUP(TestTable[[#This Row],[Category]],Table11[],2,FALSE)","v":"Misc"}]
["2011-03-03","ShopKo","Withdrawal #0018920086 ShopKo 2266 North University P Provo UT %% Card 08 #4748",-10,"debit","Clothing","MACU Checking",{"$f":"VLOOKUP(TestTable[[#This Row],[Category]],Table11[],2,FALSE)","v":"Misc"}]
["2011-03-03","Transfer to Chase CC","Electronic Withdrawal from CHASE",-77,"debit","Credit Card Payment","ING Checking",{"$f":"VLOOKUP(TestTable[[#This Row],[Category]],Table11[],2,FALSE)","v":"Debt"}]
["2011-03-03","Transfer to Citi CC","Electronic Withdrawal from CITI",-61.63,"debit","Credit Card Payment","ING Checking",{"$f":"VLOOKUP(TestTable[[#This Row],[Category]],Table11[],2,FALSE)","v":"Debt"}]
["2011-03-03","Costa","Debit Card Purchase - COSTA VIDA",-15.9,"debit","Fast Food","ING Checking",{"$f":"VLOOKUP(TestTable[[#This Row],[Category]],Table11[],2,FALSE)","v":"Food"}]
["2011-03-03","Withdrawal Lds Orem","Withdrawal #062001532915LDS OREM CENTER #767 232 E UNIVERSITY PKWY OREM UT %% Card 08 #4748",-16.2,"debit","Clothing","MACU Checking",{"$f":"VLOOKUP(TestTable[[#This Row],[Category]],Table11[],2,FALSE)","v":"Misc"}]
["2011-03-03","Check 331","Draft 000331",-7,"debit","Arts","MACU Checking",{"$f":"VLOOKUP(TestTable[[#This Row],[Category]],Table11[],2,FALSE)","v":"Misc"}]
["2011-03-03","Chevron","WithdrawalCHEVRON 00208662 PROVO UT Date 03/02/11 24046031062000037935216 5542",-63.02,"debit","Gas & Fuel","MACU Checking",{"$f":"VLOOKUP(TestTable[[#This Row],[Category]],Table11[],2,FALSE)","v":"Auto"}]
["2011-03-02","Withdrawal Maceys Provo","Withdrawal #469278MACEYS PROVO 1400 N STATE PROVO UT %% Card 08 #4748",-20,"debit","Transfer for Cash Spending","MACU Checking",{"$f":"VLOOKUP(TestTable[[#This Row],[Category]],Table11[],2,FALSE)","v":"Misc"}]
["2011-03-02","Withdrawal Maceys Provo","Withdrawal #469278MACEYS PROVO 1400 N STATE PROVO UT %% Card 08 #4748",-4.5599999999999996,"debit","Miscellaneous","MACU Checking",{"$f":"VLOOKUP(TestTable[[#This Row],[Category]],Table11[],2,FALSE)","v":"Misc"}]
["2011-03-02","Interest Charged Balance","Interest Charged on Balance Transfers",0,"credit","Interest Income","B of A CC",{"$f":"VLOOKUP(TestTable[[#This Row],[Category]],Table11[],2,FALSE)","v":"Misc"}]
["2011-03-02","Interest Charged Purchases","Interest Charged on Purchases",-15.64,"debit","Finance Charge","B of A CC",{"$f":"VLOOKUP(TestTable[[#This Row],[Category]],Table11[],2,FALSE)","v":"Misc"}]
["2011-03-02","Interest Charged Cash","Interest Charged on Cash Advances",0,"credit","Interest Income","B of A CC",{"$f":"VLOOKUP(TestTable[[#This Row],[Category]],Table11[],2,FALSE)","v":"Misc"}]
["2011-03-02","Transfer from ING Checking","CLICK-TO-PAY PAYMENT, THANK YOU",61.63,"credit","Credit Card Payment","Citi CC",{"$f":"VLOOKUP(TestTable[[#This Row],[Category]],Table11[],2,FALSE)","v":"Debt"}]
["2011-03-02","Marketplace","Debit Card Purchase - MARKETPLAC",-0.85,"debit","Fast Food","ING Checking",{"$f":"VLOOKUP(TestTable[[#This Row],[Category]],Table11[],2,FALSE)","v":"Food"}]
["2011-03-02","Pretzelmaker","WithdrawalPRETZELMAKER OREM UT Date 03/01/11 24323011061572125010091 5814",-12.31,"debit","Fast Food","MACU Checking",{"$f":"VLOOKUP(TestTable[[#This Row],[Category]],Table11[],2,FALSE)","v":"Food"}]
["2011-03-02","Transfer from ING Checking","Payment - Thank You",77,"credit","Credit Card Payment","Chase CC",{"$f":"VLOOKUP(TestTable[[#This Row],[Category]],Table11[],2,FALSE)","v":"Debt"}]
["2011-03-01","Late Payment Fee","LATE FEE FOR PAYMENT DUE 03/01",-16,"debit","Late Fee","B of A CC",{"$f":"VLOOKUP(TestTable[[#This Row],[Category]],Table11[],2,FALSE)","v":"Misc"}]
["2011-03-01","Scout Com","SCOUT.COM",-9.9499999999999993,"debit","Uncategorized","B of A CC",{"$f":"VLOOKUP(TestTable[[#This Row],[Category]],Table11[],2,FALSE)","v":"Misc"}]
["2011-03-01","IHOP","Debit Card Purchase - IHOP 947 Q",-14.72,"debit","Restaurants","ING Checking",{"$f":"VLOOKUP(TestTable[[#This Row],[Category]],Table11[],2,FALSE)","v":"Food"}]
["2011-03-01","Dnc Travel","Debit Card Purchase - DNC TRAVEL",-7.88,"debit","Travel","ING Checking",{"$f":"VLOOKUP(TestTable[[#This Row],[Category]],Table11[],2,FALSE)","v":"Misc"}]
["2011-03-01","Chevron","Debit Card Purchase - CHEVRON 00",-10.01,"debit","Gas & Fuel","ING Checking",{"$f":"VLOOKUP(TestTable[[#This Row],[Category]],Table11[],2,FALSE)","v":"Auto"}]
["2011-03-01","Cal","Debit Card Purchase - CAL AND CO",-3.25,"debit","Uncategorized","ING Checking",{"$f":"VLOOKUP(TestTable[[#This Row],[Category]],Table11[],2,FALSE)","v":"Misc"}]
["2011-03-01","Subway","Debit Card Purchase - SUBWAY QPS",-11.44,"debit","Fast Food","ING Checking",{"$f":"VLOOKUP(TestTable[[#This Row],[Category]],Table11[],2,FALSE)","v":"Food"}]
["2011-03-01","External Electronic Withdrawal","External Electronic Withdrawal f",-46.11,"debit","Bank Fee","ING Holding",{"$f":"VLOOKUP(TestTable[[#This Row],[Category]],Table11[],2,FALSE)","v":"Misc"}]
["2011-03-01","Transfer from ING Holding","Deposit SWENSEN,AMBER MTYPE: ING DIRECT CO: SWENSEN,AMBER M",800,"credit","Transfer","MACU Checking",{"$f":"VLOOKUP(TestTable[[#This Row],[Category]],Table11[],2,FALSE)","v":"Misc"}]
["2011-02-28","Monthly Interest Paid","Monthly Interest Paid",0.06,"credit","Interest Income","ING Checking",{"$f":"VLOOKUP(TestTable[[#This Row],[Category]],Table11[],2,FALSE)","v":"Misc"}]
["2011-02-28","Baja Fresh","Debit Card Purchase - BAJA FRESH",-7.53,"debit","Fast Food","ING Checking",{"$f":"VLOOKUP(TestTable[[#This Row],[Category]],Table11[],2,FALSE)","v":"Food"}]
["2011-02-28","Wendy's","Debit Card Purchase - WENDY S OL",-7.99,"debit","Fast Food","ING Checking",{"$f":"VLOOKUP(TestTable[[#This Row],[Category]],Table11[],2,FALSE)","v":"Food"}]
["2011-02-28","Jack in the Box","Debit Card Purchase - JACK IN TH",-2.06,"debit","Fast Food","ING Checking",{"$f":"VLOOKUP(TestTable[[#This Row],[Category]],Table11[],2,FALSE)","v":"Food"}]
["2011-02-28","Baja Fresh","Debit Card Purchase - BAJA FRESH",-9.3699999999999992,"debit","Fast Food","ING Checking",{"$f":"VLOOKUP(TestTable[[#This Row],[Category]],Table11[],2,FALSE)","v":"Food"}]
["2011-02-28","Monthly Interest Paid","Monthly Interest Paid",6.52,"credit","Interest Income","ING Holding",{"$f":"VLOOKUP(TestTable[[#This Row],[Category]],Table11[],2,FALSE)","v":"Misc"}]
["2011-02-28","Transfer to MACU Checking","Internet Withdrawal MOUNTAIN AME",-800,"debit","Transfer","ING Holding",{"$f":"VLOOKUP(TestTable[[#This Row],[Category]],Table11[],2,FALSE)","v":"Misc"}]
["2011-02-28","Commentavg Checking Bal","Transaction COMMENTAvg Checking Bal for Feb $456.70",0,"credit","Income","MACU Checking",{"$f":"VLOOKUP(TestTable[[#This Row],[Category]],Table11[],2,FALSE)","v":"income"}]
["2011-02-28","Children's Place","Withdrawal AdjustmentTHE CHILDRENS PLACE #1220 BOISE ID Date 02/24/11 74610431056004059460179 5641",33.53,"credit","Clothing","MACU Checking",{"$f":"VLOOKUP(TestTable[[#This Row],[Category]],Table11[],2,FALSE)","v":"Misc"}]
["2011-02-27","Consumer Reports","CR *CONSUMERREPORTS.OR 800333066",-5.95,"debit","Books","Citi CC",{"$f":"VLOOKUP(TestTable[[#This Row],[Category]],Table11[],2,FALSE)","v":"Misc"}]
["2011-02-27","Southwest","SOUTHWES5262158027640  080043597",-9.5,"debit","Air Travel","Citi CC",{"$f":"VLOOKUP(TestTable[[#This Row],[Category]],Table11[],2,FALSE)","v":"Misc"}]
["2011-02-27","Chevron","Debit Card Purchase - CHEVRON/JA",-49.78,"debit","Gas & Fuel","ING Checking",{"$f":"VLOOKUP(TestTable[[#This Row],[Category]],Table11[],2,FALSE)","v":"Auto"}]
["2011-02-27","Gold's Gym","GYM*GOLDS GYM",-54.4,"debit","Gym","Chase CC",{"$f":"VLOOKUP(TestTable[[#This Row],[Category]],Table11[],2,FALSE)","v":"Misc"}]
["2011-02-26","iTunes","APL*ITUNES             866-712-7",-1.06,"debit","Music","Citi CC",{"$f":"VLOOKUP(TestTable[[#This Row],[Category]],Table11[],2,FALSE)","v":"Misc"}]
["2011-02-26","Paradies","PARADIES SHOP#208 Q02",-4.8600000000000003,"debit","Shopping","B of A CC",{"$f":"VLOOKUP(TestTable[[#This Row],[Category]],Table11[],2,FALSE)","v":"Misc"}]
["2011-02-26","Marshalls","Withdrawal #134234MARSHALLS MERIDIAN ID %% Card 08 #4748",-10.59,"debit","Miscellaneous","MACU Checking",{"$f":"VLOOKUP(TestTable[[#This Row],[Category]],Table11[],2,FALSE)","v":"Misc"}]
["2011-02-26","Withdrawal Boise Di","Withdrawal #057001662404BOISE DI 10740 FAIRVIEW AVE BOISE ID %% Card 08 #4748",-21.2,"debit","Clothing","MACU Checking",{"$f":"VLOOKUP(TestTable[[#This Row],[Category]],Table11[],2,FALSE)","v":"Misc"}]
["2011-02-25","Chipotle","Debit Card Purchase - CHIPOTLE 0",-16.86,"debit","Fast Food","ING Checking",{"$f":"VLOOKUP(TestTable[[#This Row],[Category]],Table11[],2,FALSE)","v":"Food"}]
["2011-02-25","Onta","Debit Card Purchase - 00110 ONTA",-38.06,"debit","Clothing","ING Checking",{"$f":"VLOOKUP(TestTable[[#This Row],[Category]],Table11[],2,FALSE)","v":"Misc"}]
["2011-02-25","Electronic Deposit Brigham","Electronic Deposit from BRIGHAM",145,"credit","Income","ING Checking",{"$f":"VLOOKUP(TestTable[[#This Row],[Category]],Table11[],2,FALSE)","v":"income"}]
["2011-02-25","Chevron","Debit Card Purchase - CHEVRON 00",-54.54,"debit","Gas & Fuel","ING Checking",{"$f":"VLOOKUP(TestTable[[#This Row],[Category]],Table11[],2,FALSE)","v":"Auto"}]
["2011-02-25","Arco","Debit Card Purchase - ARCO PAYPO",-6.41,"debit","Gas & Fuel","ING Checking",{"$f":"VLOOKUP(TestTable[[#This Row],[Category]],Table11[],2,FALSE)","v":"Auto"}]
["2011-02-25","Carl's Jr","Debit Card Purchase - CARLJR1100",-11.24,"debit","Fast Food","ING Checking",{"$f":"VLOOKUP(TestTable[[#This Row],[Category]],Table11[],2,FALSE)","v":"Food"}]
["2011-02-24","ATM Fee","ATM Withdrawal - 3445 SHELBY  ON",-2.5,"debit","ATM Fee","ING Checking",{"$f":"VLOOKUP(TestTable[[#This Row],[Category]],Table11[],2,FALSE)","v":"Misc"}]
["2011-02-24","ATM Withdrawal","ATM Withdrawal - 3445 SHELBY  ON",-80,"debit","Cash & ATM","ING Checking",{"$f":"VLOOKUP(TestTable[[#This Row],[Category]],Table11[],2,FALSE)","v":"Misc"}]
["2011-02-24","Children's Place","Withdrawal #105531023223THE CHILDRENS PLACE #1220 350 N MILWAUKEE, STE #1 BOISE ID %% Card 08 #4748",-33.71,"debit","Clothing","MACU Checking",{"$f":"VLOOKUP(TestTable[[#This Row],[Category]],Table11[],2,FALSE)","v":"Misc"}]
["2011-02-24","Albertsons","Withdrawal #323408#00161 ALBERTSONS 10700 USTICK RD. BOISE ID %% Card 08 #4748",-1.79,"debit","Miscellaneous","MACU Checking",{"$f":"VLOOKUP(TestTable[[#This Row],[Category]],Table11[],2,FALSE)","v":"Misc"}]
["2011-02-24","Chevron","Debit Card Purchase - CHEVRON/JA",-17.21,"debit","Gas & Fuel","ING Checking",{"$f":"VLOOKUP(TestTable[[#This Row],[Category]],Table11[],2,FALSE)","v":"Auto"}]
["2011-02-24","Invisible","Debit Card Purchase - INVISIBLE",-27.73,"debit","Electronics & Software","ING Checking",{"$f":"VLOOKUP(TestTable[[#This Row],[Category]],Table11[],2,FALSE)","v":"Misc"}]
["2011-02-23","Southwest","INTERNET 2621566867022",-528.29999999999995,"debit","Air Travel","B of A CC",{"$f":"VLOOKUP(TestTable[[#This Row],[Category]],Table11[],2,FALSE)","v":"Misc"}]
["2011-02-23","External Electronic Withdrawal","External Electronic Withdrawal f",-48.28,"debit","Bank Fee","ING Holding",{"$f":"VLOOKUP(TestTable[[#This Row],[Category]],Table11[],2,FALSE)","v":"Misc"}]
["2011-02-22","Chevron","Debit Card Purchase - CHEVRON 00",-21.41,"debit","Gas & Fuel","ING Checking",{"$f":"VLOOKUP(TestTable[[#This Row],[Category]],Table11[],2,FALSE)","v":"Auto"}]
["2011-02-22","Panda","Debit Card Purchase - PANDA EXPR",-9.31,"debit","Business Services","ING Checking",{"$f":"VLOOKUP(TestTable[[#This Row],[Category]],Table11[],2,FALSE)","v":"Misc"}]
["2011-02-22","Heather McAllister","Draft 000329",-45,"debit","Hair","MACU Checking",{"$f":"VLOOKUP(TestTable[[#This Row],[Category]],Table11[],2,FALSE)","v":"Misc"}]
["2011-02-22","Heather McAllister","Draft 000330",-15,"debit","Hair","MACU Checking",{"$f":"VLOOKUP(TestTable[[#This Row],[Category]],Table11[],2,FALSE)","v":"Misc"}]
["2011-02-22","Burger King","WithdrawalBURGER KING #10647 PROVO UT Date 02/18/11 24186161049206199000334 5814",-5.74,"debit","Fast Food","MACU Checking",{"$f":"VLOOKUP(TestTable[[#This Row],[Category]],Table11[],2,FALSE)","v":"Food"}]
["2011-02-22","Jo-Ann Stores","Withdrawal #105244741650JOANN STORES, INC. 1666 S STATE ST OREM UT %% Card 08 #4748",-24.51,"debit","Miscellaneous","MACU Checking",{"$f":"VLOOKUP(TestTable[[#This Row],[Category]],Table11[],2,FALSE)","v":"Misc"}]
["2011-02-20","Transfer to 7125","Debit Card Purchase - CITIBANK S",-72,"debit","Credit Card Payment","ING Checking",{"$f":"VLOOKUP(TestTable[[#This Row],[Category]],Table11[],2,FALSE)","v":"Debt"}]
["2011-02-19","Target","Withdrawal #060492TARGET T1754 OREM STAT 175 West Center Street Orem UT %% Card 08 #4748",-15,"debit","Gift","MACU Checking",{"$f":"VLOOKUP(TestTable[[#This Row],[Category]],Table11[],2,FALSE)","v":"Misc"}]
["2011-02-18","Transfer from Checking","DEBIT CARD PAYMENT - THANK YOU",72,"credit","Credit Card Payment","Citi CC",{"$f":"VLOOKUP(TestTable[[#This Row],[Category]],Table11[],2,FALSE)","v":"Debt"}]
["2011-02-18","Simply Mac","Debit Card Purchase - SIMPLY MAC",-37.340000000000003,"debit","Electronics & Software","ING Checking",{"$f":"VLOOKUP(TestTable[[#This Row],[Category]],Table11[],2,FALSE)","v":"Misc"}]
["2011-02-18","Marketplace","Debit Card Purchase - MARKETPLAC",-4.62,"debit","Fast Food","ING Checking",{"$f":"VLOOKUP(TestTable[[#This Row],[Category]],Table11[],2,FALSE)","v":"Food"}]
["2011-02-18","Transfer to PRIMARY SAVINGS","External Electronic Withdrawal f",-265,"debit","Auto Payment","ING Holding",{"$f":"VLOOKUP(TestTable[[#This Row],[Category]],Table11[],2,FALSE)","v":"Auto"}]
["2011-02-18","Deposit By","Deposit by Check",24.87,"credit","Income","MACU Checking",{"$f":"VLOOKUP(TestTable[[#This Row],[Category]],Table11[],2,FALSE)","v":"income"}]
["2011-02-18","Jo-Ann Stores","Withdrawal #104953408317JOANN STORES, INC. 1666 S STATE ST OREM UT %% Card 08 #4748",-28.83,"debit","Miscellaneous","MACU Checking",{"$f":"VLOOKUP(TestTable[[#This Row],[Category]],Table11[],2,FALSE)","v":"Misc"}]
["2011-02-18","Withdrawal Transfer Loan","Withdrawal Transfer To Loan 61",-265,"debit","Transfer","MACU Savings 1",{"$f":"VLOOKUP(TestTable[[#This Row],[Category]],Table11[],2,FALSE)","v":"Misc"}]
["2011-02-18","Transfer from ING Holding","Deposit ACH ORIGINATION",265,"credit","Transfer","MACU Savings 1",{"$f":"VLOOKUP(TestTable[[#This Row],[Category]],Table11[],2,FALSE)","v":"Misc"}]
["2011-02-17","Refund Late Fee","REFUND LATE FEE",25,"credit","Late Fee","Citi CC",{"$f":"VLOOKUP(TestTable[[#This Row],[Category]],Table11[],2,FALSE)","v":"Misc"}]
["2011-02-17","External Electronic Withdrawal","External Electronic Withdrawal f",-110.91,"debit","Bank Fee","ING Holding",{"$f":"VLOOKUP(TestTable[[#This Row],[Category]],Table11[],2,FALSE)","v":"Misc"}]
["2011-02-17","Interest Charged Standard","INTEREST CHARGED TO STANDARD PUR",-12.63,"debit","Finance Charge","Citi CC",{"$f":"VLOOKUP(TestTable[[#This Row],[Category]],Table11[],2,FALSE)","v":"Misc"}]
["2011-02-17","Late Payment Fee","LATE FEE - JAN PAYMENT PAST DUE",-25,"debit","Late Fee","Citi CC",{"$f":"VLOOKUP(TestTable[[#This Row],[Category]],Table11[],2,FALSE)","v":"Misc"}]
["2011-02-17","Bajio Mexican Grill","WithdrawalBAJIO MEXICAN GRILL 00001 PROVO UT Date 02/15/11 24717051047640471879770 5814",-6.28,"debit","Fast Food","MACU Checking",{"$f":"VLOOKUP(TestTable[[#This Row],[Category]],Table11[],2,FALSE)","v":"Food"}]
["2011-02-17","Smiths","Debit Card Purchase - SMITHS 350",-4.6900000000000004,"debit","Groceries","ING Checking",{"$f":"VLOOKUP(TestTable[[#This Row],[Category]],Table11[],2,FALSE)","v":"Food"}]
["2011-02-16","Rite Aid","Debit Card Purchase - RITE AID C",-22.58,"debit","Pharmacy","ING Checking",{"$f":"VLOOKUP(TestTable[[#This Row],[Category]],Table11[],2,FALSE)","v":"Medical"}]
["2011-02-16","Byu Creame","Debit Card Purchase - BYU CREAME",-13.53,"debit","Fast Food","ING Checking",{"$f":"VLOOKUP(TestTable[[#This Row],[Category]],Table11[],2,FALSE)","v":"Food"}]
["2011-02-16","External Electronic Withdrawal","External Electronic Withdrawal f",-113.16,"debit","Bank Fee","ING Holding",{"$f":"VLOOKUP(TestTable[[#This Row],[Category]],Table11[],2,FALSE)","v":"Misc"}]
["2011-02-16","Redbox","WithdrawalREDBOX *DVD RENTAL 866-733-2693 IL Date 02/15/11 24692161046000005434450 7841",-10.65,"debit","Movies & DVDs","MACU Checking",{"$f":"VLOOKUP(TestTable[[#This Row],[Category]],Table11[],2,FALSE)","v":"Misc"}]
["2011-02-16","Bath & Body Works","Withdrawal #104794719033BATH & BODY WORKS 4800 N. UNIVERSITY AVE PROVO UT %% Card 08 #4748",-21.35,"debit","Miscellaneous","MACU Checking",{"$f":"VLOOKUP(TestTable[[#This Row],[Category]],Table11[],2,FALSE)","v":"Misc"}]
["2011-02-15","Simply Mac","Debit Card Purchase - SIMPLY MAC",-37.340000000000003,"debit","Electronics & Software","ING Checking",{"$f":"VLOOKUP(TestTable[[#This Row],[Category]],Table11[],2,FALSE)","v":"Misc"}]
["2011-02-15","Withdrawal Swensen Amber","Withdrawal SWENSEN,AMBER MTYPE: ING DIRECT CO: SWENSEN,AMBER M",-474,"debit","Uncategorized","MACU Checking",{"$f":"VLOOKUP(TestTable[[#This Row],[Category]],Table11[],2,FALSE)","v":"Misc"}]
["2011-02-14","iTunes","APL*ITUNES             866-712-7",-3.19,"debit","Music","Citi CC",{"$f":"VLOOKUP(TestTable[[#This Row],[Category]],Table11[],2,FALSE)","v":"Misc"}]
["2011-02-14","Chevron","CHEVRON EXTRA MART #40",-63.07,"debit","Gas & Fuel","B of A CC",{"$f":"VLOOKUP(TestTable[[#This Row],[Category]],Table11[],2,FALSE)","v":"Auto"}]
["2011-02-14","Utah Valley Hospital","UTAH VALLEY HOSPITAL U",-1.83,"debit","Fast Food","B of A CC",{"$f":"VLOOKUP(TestTable[[#This Row],[Category]],Table11[],2,FALSE)","v":"Food"}]
["2011-02-14","Timpview Pharmacy","TIMPVIEW PHARMACY 3000",-53.95,"debit","Pharmacy","B of A CC",{"$f":"VLOOKUP(TestTable[[#This Row],[Category]],Table11[],2,FALSE)","v":"Medical"}]
["2011-02-14","Utah Valley Hospital","UTAH VALLEY HOSPITAL U",-4.1500000000000004,"debit","Fast Food","B of A CC",{"$f":"VLOOKUP(TestTable[[#This Row],[Category]],Table11[],2,FALSE)","v":"Food"}]
["2011-02-14","Utah Valley Hospital","UTAH VALLEY HOSPITAL U",-5.39,"debit","Fast Food","B of A CC",{"$f":"VLOOKUP(TestTable[[#This Row],[Category]],Table11[],2,FALSE)","v":"Food"}]
["2011-02-14","Rite Aid","RITE AID 6148 RITE AID",-50.99,"debit","Pharmacy","B of A CC",{"$f":"VLOOKUP(TestTable[[#This Row],[Category]],Table11[],2,FALSE)","v":"Medical"}]
["2011-02-14","Costco","Debit Card Purchase - COSTCO WHS",-2.15,"debit","Miscellaneous","ING Checking",{"$f":"VLOOKUP(TestTable[[#This Row],[Category]],Table11[],2,FALSE)","v":"Misc"}]
["2011-02-14","Smiths","Debit Card Purchase - SMITHS 350",-4.26,"debit","Gift","ING Checking",{"$f":"VLOOKUP(TestTable[[#This Row],[Category]],Table11[],2,FALSE)","v":"Misc"}]
["2011-02-14","Transfer from FREE CHECKING","Internet Deposit MOUNTAIN AMERIC",474,"credit","Transfer","ING Checking",{"$f":"VLOOKUP(TestTable[[#This Row],[Category]],Table11[],2,FALSE)","v":"Misc"}]
["2011-02-12","Verizon Wireless","VERIZON WRLS W0038-01",-381.08,"debit","Mobile Phone","B of A CC",{"$f":"VLOOKUP(TestTable[[#This Row],[Category]],Table11[],2,FALSE)","v":"Phone"}]
["2011-02-12","Rite Aid","RITE AID 6148 RITE AID",-172.8,"debit","Pharmacy","B of A CC",{"$f":"VLOOKUP(TestTable[[#This Row],[Category]],Table11[],2,FALSE)","v":"Medical"}]
["2011-02-12","Utah Valley Hospital","UTAH VALLEY HOSPITAL U",-4.58,"debit","Fast Food","B of A CC",{"$f":"VLOOKUP(TestTable[[#This Row],[Category]],Table11[],2,FALSE)","v":"Food"}]
["2011-02-12","Target","Withdrawal #086482TARGET T1754 OREM STAT 175 West Center Street Orem UT %% Card 08 #4748",-60.2,"debit","Miscellaneous","MACU Checking",{"$f":"VLOOKUP(TestTable[[#This Row],[Category]],Table11[],2,FALSE)","v":"Misc"}]
["2011-02-11","Electronic Deposit Brigham","Electronic Deposit from BRIGHAM",58,"credit","Income","ING Checking",{"$f":"VLOOKUP(TestTable[[#This Row],[Category]],Table11[],2,FALSE)","v":"income"}]
["2011-02-10","Utah Valle","Debit Card Purchase - UTAH VALLE",-4.58,"debit","Uncategorized","ING Checking",{"$f":"VLOOKUP(TestTable[[#This Row],[Category]],Table11[],2,FALSE)","v":"Misc"}]
["2011-02-10","Costa","Debit Card Purchase - COSTA VIDA",-9.14,"debit","Fast Food","ING Checking",{"$f":"VLOOKUP(TestTable[[#This Row],[Category]],Table11[],2,FALSE)","v":"Food"}]
["2011-02-10","Chevron","Debit Card Purchase - CHEVRON 00",-10.07,"debit","Gas & Fuel","ING Checking",{"$f":"VLOOKUP(TestTable[[#This Row],[Category]],Table11[],2,FALSE)","v":"Auto"}]
["2011-02-10","Redbox","WithdrawalREDBOX *DVD RENTAL OAKBRKTERRACE IL Date 02/09/11 24692161040000876934196 7841",-2.13,"debit","Movies & DVDs","MACU Checking",{"$f":"VLOOKUP(TestTable[[#This Row],[Category]],Table11[],2,FALSE)","v":"Misc"}]
["2011-02-09","Costco","COSTCO WHSE #0484 0000",-130.44999999999999,"debit","Miscellaneous","B of A CC",{"$f":"VLOOKUP(TestTable[[#This Row],[Category]],Table11[],2,FALSE)","v":"Misc"}]
["2011-02-09","Game Cente","Debit Card Purchase - GAME CENTE",-3,"debit","Amusement","ING Checking",{"$f":"VLOOKUP(TestTable[[#This Row],[Category]],Table11[],2,FALSE)","v":"Misc"}]
["2011-02-09","Byu Creame","Debit Card Purchase - BYU CREAME",-6.78,"debit","Fast Food","ING Checking",{"$f":"VLOOKUP(TestTable[[#This Row],[Category]],Table11[],2,FALSE)","v":"Food"}]
["2011-02-08","Cash","CASH ADVANCE INTEREST CHA",-0.09,"debit","Business Services","Chase CC",{"$f":"VLOOKUP(TestTable[[#This Row],[Category]],Table11[],2,FALSE)","v":"Misc"}]
["2011-02-08","Interest Charge","PURCHASE INTEREST CHARGE",-42.3,"debit","Finance Charge","Chase CC",{"$f":"VLOOKUP(TestTable[[#This Row],[Category]],Table11[],2,FALSE)","v":"Misc"}]
["2011-02-08","Chevron","WithdrawalCHEVRON 00208662 PROVO UT Date 02/07/11 24046031039000016819142 5542",-15.92,"debit","Gas & Fuel","MACU Checking",{"$f":"VLOOKUP(TestTable[[#This Row],[Category]],Table11[],2,FALSE)","v":"Auto"}]
["2011-02-08","Rite Aid","Withdrawal #103914720563RITE AID CORP. RIVERSIDE PLAZA PROVO UT %% Card 08 #4748",-25.37,"debit","Pharmacy","MACU Checking",{"$f":"VLOOKUP(TestTable[[#This Row],[Category]],Table11[],2,FALSE)","v":"Medical"}]
["2011-02-08","Pretzelmaker","WithdrawalPRETZELMAKER OREM UT Date 02/07/11 24323011039572105010425 5814",-6.43,"debit","Fast Food","MACU Checking",{"$f":"VLOOKUP(TestTable[[#This Row],[Category]],Table11[],2,FALSE)","v":"Food"}]
["2011-02-07","Papa John's","PAPA JOHNS 1566.COM 30",-22.9,"debit","Fast Food","B of A CC",{"$f":"VLOOKUP(TestTable[[#This Row],[Category]],Table11[],2,FALSE)","v":"Food"}]
["2011-02-07","Microsoft XBox Live","MICROSOFT   *XBOX LIVE 080038655",-9.99,"debit","Electronics & Software","Citi CC",{"$f":"VLOOKUP(TestTable[[#This Row],[Category]],Table11[],2,FALSE)","v":"Misc"}]
["2011-02-07","Build-A-Bear","Withdrawal #038001285678BUILDABEAR WRKSHP 0237 575 UNIVERSITY PKWY B32 OREM UT %% Card 08 #4748",-2.93,"debit","Gift","MACU Checking",{"$f":"VLOOKUP(TestTable[[#This Row],[Category]],Table11[],2,FALSE)","v":"Misc"}]
["2011-02-07","Withdrawal Smiths N","Withdrawal #007600SMITHS 350 N. FREEDOM PROVO UT %% Card 08 #4748",-1.69,"debit","Miscellaneous","MACU Checking",{"$f":"VLOOKUP(TestTable[[#This Row],[Category]],Table11[],2,FALSE)","v":"Misc"}]
["2011-02-07","Nordstrom","Withdrawal #007358NORDSTROM 038 693 UNIVERSITY PKWY OREM UT %% Card 08 #4748",-23.93,"debit","Miscellaneous","MACU Checking",{"$f":"VLOOKUP(TestTable[[#This Row],[Category]],Table11[],2,FALSE)","v":"Misc"}]
["2011-02-07","External Electronic Withdrawal","External Electronic Withdrawal f",-128.51,"debit","Bank Fee","ING Holding",{"$f":"VLOOKUP(TestTable[[#This Row],[Category]],Table11[],2,FALSE)","v":"Misc"}]
["2011-02-07","Wendy's","WithdrawalWENDYS #3540 OREM UT Date 02/04/11 24445001035200040838936 5814",-5.16,"debit","Fast Food","MACU Checking",{"$f":"VLOOKUP(TestTable[[#This Row],[Category]],Table11[],2,FALSE)","v":"Food"}]
["2011-02-07","Chevron","WithdrawalCHEVRON 00207403 EAGLE ID Date 02/05/11 24046031036000193855862 5542",-44.52,"debit","Gas & Fuel","MACU Checking",{"$f":"VLOOKUP(TestTable[[#This Row],[Category]],Table11[],2,FALSE)","v":"Auto"}]
["2011-02-07","Top Stop C3","Withdrawal #263553TOP STOP C-30 TOP STOP C-114 SOUTH 85 LEHI UT %% Card 08 #4748",-9.67,"debit","Gas & Fuel","MACU Checking",{"$f":"VLOOKUP(TestTable[[#This Row],[Category]],Table11[],2,FALSE)","v":"Auto"}]
["2011-02-07","Withdrawal Jacksons Food","Withdrawal #102061JACKSONS FOOD S JACKSONS FO3100 MAGICVI MERIDIAN ID %% Card 08 #4748",-40.76,"debit","Gas & Fuel","MACU Checking",{"$f":"VLOOKUP(TestTable[[#This Row],[Category]],Table11[],2,FALSE)","v":"Auto"}]
["2011-02-07","Carl's Jr","WithdrawalCARL'S JR #1101363 QPS PROVO UT Date 02/03/11 24492151035207499502876 5814",-8.7799999999999994,"debit","Fast Food","MACU Checking",{"$f":"VLOOKUP(TestTable[[#This Row],[Category]],Table11[],2,FALSE)","v":"Food"}]
["2011-02-06","Marketplace","Debit Card Purchase - MARKETPLAC",-1.72,"debit","Fast Food","ING Checking",{"$f":"VLOOKUP(TestTable[[#This Row],[Category]],Table11[],2,FALSE)","v":"Food"}]
["2011-02-05","Albertsons","Withdrawal #386265#00177 ALBERTSONS 4700 N. EAGLE RD. BOISE ID %% Card 08 #4748",-55.04,"debit","Groceries","MACU Checking",{"$f":"VLOOKUP(TestTable[[#This Row],[Category]],Table11[],2,FALSE)","v":"Food"}]
["2011-02-04","Children's Place","Withdrawal #103642011622THE CHILDRENS PLACE #1220 350 N MILWAUKEE, STE #1 BOISE ID %% Card 08 #4748",-114.27,"debit","Clothing","MACU Checking",{"$f":"VLOOKUP(TestTable[[#This Row],[Category]],Table11[],2,FALSE)","v":"Misc"}]
["2011-02-04","Withdrawal Motherhood","Withdrawal #103604400028MOTHERHOOD #506 BOISE ID %% Card 08 #4748",-60.36,"debit","Clothing","MACU Checking",{"$f":"VLOOKUP(TestTable[[#This Row],[Category]],Table11[],2,FALSE)","v":"Misc"}]
["2011-02-04","Wendy's","WithdrawalWENDYS #4710 Q25 PROVO UT Date 02/02/11 24445001034100105435357 5814",-12.01,"debit","Fast Food","MACU Checking",{"$f":"VLOOKUP(TestTable[[#This Row],[Category]],Table11[],2,FALSE)","v":"Food"}]
["2011-02-04","Chevron","WithdrawalCHEVRON 00305397 LEHI UT Date 02/03/11 24046031035000005854864 5542",-45.25,"debit","Gas & Fuel","MACU Checking",{"$f":"VLOOKUP(TestTable[[#This Row],[Category]],Table11[],2,FALSE)","v":"Auto"}]
["2011-02-03","Person Person Laura","Person2Person Payment to Laura o",-1075,"debit","Mortgage & Rent","ING Checking",{"$f":"VLOOKUP(TestTable[[#This Row],[Category]],Table11[],2,FALSE)","v":"Housing"}]
["2011-02-02","Interest Charged Balance","Interest Charged on Balance Transfers",0,"credit","Interest Income","B of A CC",{"$f":"VLOOKUP(TestTable[[#This Row],[Category]],Table11[],2,FALSE)","v":"Misc"}]
["2011-02-02","Interest Charged Cash","Interest Charged on Cash Advances",0,"credit","Interest Income","B of A CC",{"$f":"VLOOKUP(TestTable[[#This Row],[Category]],Table11[],2,FALSE)","v":"Misc"}]
["2011-02-02","Interest Charged Purchases","Interest Charged on Purchases",-6.71,"debit","Finance Charge","B of A CC",{"$f":"VLOOKUP(TestTable[[#This Row],[Category]],Table11[],2,FALSE)","v":"Misc"}]
["2011-02-02","Transfer to Bank of America","Electronic Withdrawal from BK OF",-25,"debit","Credit Card Payment","ING Checking",{"$f":"VLOOKUP(TestTable[[#This Row],[Category]],Table11[],2,FALSE)","v":"Debt"}]
["2011-02-02","Wendy's","Debit Card Purchase - WENDYS 471",-7.29,"debit","Fast Food","ING Checking",{"$f":"VLOOKUP(TestTable[[#This Row],[Category]],Table11[],2,FALSE)","v":"Food"}]
["2011-02-02","Disney","WithdrawalTHE DISNEY STORE #948 OREM UT Date 01/31/11 24210731032522002065101 5947",-4.8099999999999996,"debit","Miscellaneous","MACU Checking",{"$f":"VLOOKUP(TestTable[[#This Row],[Category]],Table11[],2,FALSE)","v":"Misc"}]
["2011-02-02","Withdrawalheindselmans Date","WithdrawalHEINDSELMANS INC PROVO UT Date 01/31/11 24512391032900019900023 5949",-4.25,"debit","Miscellaneous","MACU Checking",{"$f":"VLOOKUP(TestTable[[#This Row],[Category]],Table11[],2,FALSE)","v":"Misc"}]
["2011-02-02","Deposit Byu Refundtype","Deposit BYU RefundTYPE: UCA CO: BYU Refund",874,"credit","Income","MACU Checking",{"$f":"VLOOKUP(TestTable[[#This Row],[Category]],Table11[],2,FALSE)","v":"income"}]
["2011-02-02","Transfer from ING Holding","Deposit SWENSEN,AMBER MTYPE: ING DIRECT CO: SWENSEN,AMBER M",272,"credit","Transfer","MACU Checking",{"$f":"VLOOKUP(TestTable[[#This Row],[Category]],Table11[],2,FALSE)","v":"Misc"}]
["2011-02-01","Ba Electronic","BA ELECTRONIC PAYMENT",25,"credit","Credit Card Payment","B of A CC",{"$f":"VLOOKUP(TestTable[[#This Row],[Category]],Table11[],2,FALSE)","v":"Debt"}]
["2011-02-01","Costa","Debit Card Purchase - COSTA VIDA",-6.55,"debit","Fast Food","ING Checking",{"$f":"VLOOKUP(TestTable[[#This Row],[Category]],Table11[],2,FALSE)","v":"Food"}]
["2011-02-01","Transfer to FREE CHECKING","Internet Withdrawal MOUNTAIN AME",-272,"debit","Transfer","ING Holding",{"$f":"VLOOKUP(TestTable[[#This Row],[Category]],Table11[],2,FALSE)","v":"Misc"}]
["2011-02-01","External Electronic Withdrawal","External Electronic Withdrawal f",-211.51,"debit","Bank Fee","ING Holding",{"$f":"VLOOKUP(TestTable[[#This Row],[Category]],Table11[],2,FALSE)","v":"Misc"}]
["2011-02-01","Pretzelmaker","WithdrawalPRETZELMAKER OREM UT Date 01/31/11 24323011032572099010974 5814",-8.6300000000000008,"debit","Fast Food","MACU Checking",{"$f":"VLOOKUP(TestTable[[#This Row],[Category]],Table11[],2,FALSE)","v":"Food"}]
["2011-01-31","Payless ShoeSource","Withdrawal #007829PAYLESS SHOESOURCE 575 E UNIVERSITY MALL OREM UT %% Card 08 #4748",-19,"debit","Clothing","MACU Checking",{"$f":"VLOOKUP(TestTable[[#This Row],[Category]],Table11[],2,FALSE)","v":"Misc"}]
["2011-01-31","Icing By Claires","Withdrawal #728012ICING BY CLAIRE E 205 UNIVERSITY MALL OREM UT %% Card 08 #4748",-9.6199999999999992,"debit","Clothing","MACU Checking",{"$f":"VLOOKUP(TestTable[[#This Row],[Category]],Table11[],2,FALSE)","v":"Misc"}]
["2011-01-31","Commentavg Checking Bal","Transaction COMMENTAvg Checking Bal for Jan $1,473.25",0,"credit","Income","MACU Checking",{"$f":"VLOOKUP(TestTable[[#This Row],[Category]],Table11[],2,FALSE)","v":"income"}]
["2011-01-31","Monthly Interest Paid","Monthly Interest Paid",0.14000000000000001,"credit","Interest Income","ING Checking",{"$f":"VLOOKUP(TestTable[[#This Row],[Category]],Table11[],2,FALSE)","v":"Misc"}]
["2011-01-31","Monthly Interest Paid","Monthly Interest Paid",7.3,"credit","Interest Income","ING Holding",{"$f":"VLOOKUP(TestTable[[#This Row],[Category]],Table11[],2,FALSE)","v":"Misc"}]
["2011-01-31","Withdrawalmaceys Provo Date","WithdrawalMACEYS PROVO PROVO UT Date 01/29/11 24427331030710020071835 5411",-5.96,"debit","Uncategorized","MACU Checking",{"$f":"VLOOKUP(TestTable[[#This Row],[Category]],Table11[],2,FALSE)","v":"Misc"}]
["2011-01-30","Byu Wsc Su","Debit Card Purchase - BYU WSC SU",-4.51,"debit","Uncategorized","ING Checking",{"$f":"VLOOKUP(TestTable[[#This Row],[Category]],Table11[],2,FALSE)","v":"Misc"}]
["2011-01-30","Rite Aid","Debit Card Purchase - RITE AID C",-8.51,"debit","Pharmacy","ING Checking",{"$f":"VLOOKUP(TestTable[[#This Row],[Category]],Table11[],2,FALSE)","v":"Medical"}]
["2011-01-30","Amazon","AMAZON MKTPLACE PMTS",-4.9800000000000004,"debit","Shopping","Chase CC",{"$f":"VLOOKUP(TestTable[[#This Row],[Category]],Table11[],2,FALSE)","v":"Misc"}]
["2011-01-29","Rite Aid","Debit Card Purchase - RITE AID C",-27.19,"debit","Pharmacy","ING Checking",{"$f":"VLOOKUP(TestTable[[#This Row],[Category]],Table11[],2,FALSE)","v":"Medical"}]
["2011-01-28","Electronic Deposit Brigham","Electronic Deposit from BRIGHAM",79.75,"credit","Income","ING Checking",{"$f":"VLOOKUP(TestTable[[#This Row],[Category]],Table11[],2,FALSE)","v":"income"}]
["2011-01-28","Marketplace","Debit Card Purchase - MARKETPLAC",-6.24,"debit","Fast Food","ING Checking",{"$f":"VLOOKUP(TestTable[[#This Row],[Category]],Table11[],2,FALSE)","v":"Food"}]
["2011-01-28","Byu Creame","Debit Card Purchase - BYU CREAME",-2.12,"debit","Fast Food","ING Checking",{"$f":"VLOOKUP(TestTable[[#This Row],[Category]],Table11[],2,FALSE)","v":"Food"}]
["2011-01-28","Amazon","Amazon.com",-29.69,"debit","Shopping","Chase CC",{"$f":"VLOOKUP(TestTable[[#This Row],[Category]],Table11[],2,FALSE)","v":"Misc"}]
["2011-01-27","Scout Com","SCOUT.COM",-9.9499999999999993,"debit","Uncategorized","B of A CC",{"$f":"VLOOKUP(TestTable[[#This Row],[Category]],Table11[],2,FALSE)","v":"Misc"}]
["2011-01-27","Consumer Reports","CR *CONSUMERREPORTS.OR 800333066",-5.95,"debit","Books","Citi CC",{"$f":"VLOOKUP(TestTable[[#This Row],[Category]],Table11[],2,FALSE)","v":"Misc"}]
["2011-01-27","Withdrawal Motherhood Orem","Withdrawal #102803005014MOTHERHOOD #465 OREM UT %% Card 08 #4748",-80.08,"debit","Uncategorized","MACU Checking",{"$f":"VLOOKUP(TestTable[[#This Row],[Category]],Table11[],2,FALSE)","v":"Misc"}]
["2011-01-27","Check 327","Draft 000327",-75,"debit","Check","MACU Checking",{"$f":"VLOOKUP(TestTable[[#This Row],[Category]],Table11[],2,FALSE)","v":"Income"}]
["2011-01-27","Kohl's","Withdrawal #102700002939KOHL'S #1285 1281 S 800 EAST OREM UT %% Card 08 #4748",-5.98,"debit","Clothing","MACU Checking",{"$f":"VLOOKUP(TestTable[[#This Row],[Category]],Table11[],2,FALSE)","v":"Misc"}]
["2011-01-26","Scout Com Wa","SCOUT.COM              888-979-0979 WA",-9.9499999999999993,"debit","Uncategorized","B of A CC",{"$f":"VLOOKUP(TestTable[[#This Row],[Category]],Table11[],2,FALSE)","v":"Misc"}]
["2011-01-26","Bath & Body Works","Withdrawal #102684778517BATH & BODY WORKS 1300 S. STATE STREET S OREM UT %% Card 08 #4748",-13.89,"debit","Miscellaneous","MACU Checking",{"$f":"VLOOKUP(TestTable[[#This Row],[Category]],Table11[],2,FALSE)","v":"Misc"}]
["2011-01-26","Pretzelmaker","WithdrawalPRETZELMAKER OREM UT Date 01/25/11 24323011026572094010308 5814",-12.35,"debit","Fast Food","MACU Checking",{"$f":"VLOOKUP(TestTable[[#This Row],[Category]],Table11[],2,FALSE)","v":"Food"}]
["2011-01-25","External Electronic Withdrawal","External Electronic Withdrawal f",-48.28,"debit","Bank Fee","ING Holding",{"$f":"VLOOKUP(TestTable[[#This Row],[Category]],Table11[],2,FALSE)","v":"Misc"}]
["2011-01-25","Check 328","Draft 000328",-46.41,"debit","Check","MACU Checking",{"$f":"VLOOKUP(TestTable[[#This Row],[Category]],Table11[],2,FALSE)","v":"Income"}]
["2011-01-25","Withdrawal Lds Orem","Withdrawal #025001826867LDS OREM CENTER #767 232 E UNIVERSITY PKWY OREM UT %% Card 08 #4748",-9.6,"debit","Uncategorized","MACU Checking",{"$f":"VLOOKUP(TestTable[[#This Row],[Category]],Table11[],2,FALSE)","v":"Misc"}]
["2011-01-25","Withdrawal Motherhood Orem","Withdrawal #102523610223MOTHERHOOD #465 OREM UT %% Card 08 #4748",-12.8,"debit","Uncategorized","MACU Checking",{"$f":"VLOOKUP(TestTable[[#This Row],[Category]],Table11[],2,FALSE)","v":"Misc"}]
["2011-01-24","Withdrawal","Withdrawal",-65,"debit","Uncategorized","MACU Checking",{"$f":"VLOOKUP(TestTable[[#This Row],[Category]],Table11[],2,FALSE)","v":"Misc"}]
["2011-01-24","PayPal","Electronic Withdrawal from PAYPA",-10,"debit","Shopping","ING Checking",{"$f":"VLOOKUP(TestTable[[#This Row],[Category]],Table11[],2,FALSE)","v":"Misc"}]
["2011-01-24","Chevron","Debit Card Purchase - CHEVRON 00",-50.27,"debit","Gas & Fuel","ING Checking",{"$f":"VLOOKUP(TestTable[[#This Row],[Category]],Table11[],2,FALSE)","v":"Auto"}]
["2011-01-24","Coneys Fro","Debit Card Purchase - CONEYS FRO",-5.94,"debit","Uncategorized","ING Checking",{"$f":"VLOOKUP(TestTable[[#This Row],[Category]],Table11[],2,FALSE)","v":"Misc"}]
["2011-01-24","Best Buy","Best Buy      00007732",18.16,"credit","Credit Card Payment","Chase CC",{"$f":"VLOOKUP(TestTable[[#This Row],[Category]],Table11[],2,FALSE)","v":"Debt"}]
["2011-01-24","Radioshack Cor","RADIOSHACK COR00140293",43.48,"credit","Credit Card Payment","Chase CC",{"$f":"VLOOKUP(TestTable[[#This Row],[Category]],Table11[],2,FALSE)","v":"Debt"}]
["2011-01-22","Amazon","Amazon.com             AMZN.COM/",-45,"debit","Shopping","Citi CC",{"$f":"VLOOKUP(TestTable[[#This Row],[Category]],Table11[],2,FALSE)","v":"Misc"}]
["2011-01-22","Deposit ATM Mountain","Deposit at ATM #000000004391MOUNTAIN AMERICA CU 88 N 500 W #1 PROVO UT COO331 %% Card 08 #4748",25,"credit","Income","MACU Checking",{"$f":"VLOOKUP(TestTable[[#This Row],[Category]],Table11[],2,FALSE)","v":"income"}]
["2011-01-22","Lds Orem C","Debit Card Purchase - LDS OREM C",-18,"debit","Uncategorized","ING Checking",{"$f":"VLOOKUP(TestTable[[#This Row],[Category]],Table11[],2,FALSE)","v":"Misc"}]
["2011-01-22","Costco","Debit Card Purchase - COSTCO WHS",-37.520000000000003,"debit","Miscellaneous","ING Checking",{"$f":"VLOOKUP(TestTable[[#This Row],[Category]],Table11[],2,FALSE)","v":"Misc"}]
["2011-01-22","Comment Checks Cashed","Transaction COMMENT%% Checks Cashed 002 for 100.00",0,"credit","Income","MACU Savings 1",{"$f":"VLOOKUP(TestTable[[#This Row],[Category]],Table11[],2,FALSE)","v":"income"}]
["2011-01-21","Marketplace Iga","MARKETPLACE CAFE       PROVO",-3.86,"debit","Groceries","Citi CC",{"$f":"VLOOKUP(TestTable[[#This Row],[Category]],Table11[],2,FALSE)","v":"Food"}]
["2011-01-21","Marketplace Iga","MARKETPLACE CAFE       PROVO",-0.96,"debit","Groceries","Citi CC",{"$f":"VLOOKUP(TestTable[[#This Row],[Category]],Table11[],2,FALSE)","v":"Food"}]
["2011-01-21","800 970 88","Debit Card Purchase - 800 970 88",-10.99,"debit","Uncategorized","ING Checking",{"$f":"VLOOKUP(TestTable[[#This Row],[Category]],Table11[],2,FALSE)","v":"Misc"}]
["2011-01-21","Transfer from ING Holding","Deposit SWENSEN,AMBER MTYPE: ING DIRECT CO: SWENSEN,AMBER M",300,"credit","Transfer","MACU Checking",{"$f":"VLOOKUP(TestTable[[#This Row],[Category]],Table11[],2,FALSE)","v":"Misc"}]
["2011-01-20","Marketplace Iga","MARKETPLACE CAFE       PROVO",-6.24,"debit","Groceries","Citi CC",{"$f":"VLOOKUP(TestTable[[#This Row],[Category]],Table11[],2,FALSE)","v":"Food"}]
["2011-01-20","Check 326","Draft 000326",-50,"debit","Check","MACU Checking",{"$f":"VLOOKUP(TestTable[[#This Row],[Category]],Table11[],2,FALSE)","v":"Income"}]
["2011-01-20","Transfer from ING Holding","Deposit ACH ORIGINATION",265,"credit","Transfer","MACU Savings 1",{"$f":"VLOOKUP(TestTable[[#This Row],[Category]],Table11[],2,FALSE)","v":"Misc"}]
["2011-01-20","Withdrawal Transfer Loan","Withdrawal Transfer To Loan 61",-265,"debit","Transfer","MACU Savings 1",{"$f":"VLOOKUP(TestTable[[#This Row],[Category]],Table11[],2,FALSE)","v":"Misc"}]
["2011-01-20","Byu Cougar Creations","BYU COUGAR CREATIONS   PROVO",-3.68,"debit","Uncategorized","Citi CC",{"$f":"VLOOKUP(TestTable[[#This Row],[Category]],Table11[],2,FALSE)","v":"Misc"}]
["2011-01-20","Precision","Debit Card Purchase - PRECISION",-25.62,"debit","Home Improvement","ING Checking",{"$f":"VLOOKUP(TestTable[[#This Row],[Category]],Table11[],2,FALSE)","v":"Misc"}]
["2011-01-20","Dept Wo","Debit Card Purchase - DEPT OF WO",-331.5,"debit","Uncategorized","ING Checking",{"$f":"VLOOKUP(TestTable[[#This Row],[Category]],Table11[],2,FALSE)","v":"Misc"}]
["2011-01-20","PayPal","Debit Card Purchase - PAYPAL COV",-15,"debit","Shopping","ING Checking",{"$f":"VLOOKUP(TestTable[[#This Row],[Category]],Table11[],2,FALSE)","v":"Misc"}]
["2011-01-20","Transfer to FREE CHECKING","Internet Withdrawal MOUNTAIN AME",-300,"debit","Transfer","ING Holding",{"$f":"VLOOKUP(TestTable[[#This Row],[Category]],Table11[],2,FALSE)","v":"Misc"}]
["2011-01-20","Transfer to PRIMARY SAVINGS","External Electronic Withdrawal f",-265,"debit","Auto Payment","ING Holding",{"$f":"VLOOKUP(TestTable[[#This Row],[Category]],Table11[],2,FALSE)","v":"Auto"}]
["2011-01-20","External Electronic Withdrawal","External Electronic Withdrawal f",-93.41,"debit","Bank Fee","ING Holding",{"$f":"VLOOKUP(TestTable[[#This Row],[Category]],Table11[],2,FALSE)","v":"Misc"}]
["2011-01-19","Transfer to Checking","Withdrawal SWENSEN,AMBER MTYPE: ING DIRECT CO: SWENSEN,AMBER M",-1062,"debit","Transfer","MACU Checking",{"$f":"VLOOKUP(TestTable[[#This Row],[Category]],Table11[],2,FALSE)","v":"Misc"}]
["2011-01-19","Check 324","Draft 000324",-100,"debit","Check","MACU Checking",{"$f":"VLOOKUP(TestTable[[#This Row],[Category]],Table11[],2,FALSE)","v":"Income"}]
["2011-01-19","Interest Charged Standard","INTEREST CHARGED TO STANDARD PUR",-14.09,"debit","Finance Charge","Citi CC",{"$f":"VLOOKUP(TestTable[[#This Row],[Category]],Table11[],2,FALSE)","v":"Misc"}]
["2011-01-19","Pretzelmaker","Debit Card Purchase - PRETZELMAK",-5.91,"debit","Food & Dining","ING Checking",{"$f":"VLOOKUP(TestTable[[#This Row],[Category]],Table11[],2,FALSE)","v":"Food"}]
["2011-01-19","Jewelers M","Debit Card Purchase - JEWELERS M",-30,"debit","Uncategorized","ING Checking",{"$f":"VLOOKUP(TestTable[[#This Row],[Category]],Table11[],2,FALSE)","v":"Misc"}]
["2011-01-18","Transfer from FREE CHECKING","Internet Deposit MOUNTAIN AMERIC",1062,"credit","Transfer","ING Checking",{"$f":"VLOOKUP(TestTable[[#This Row],[Category]],Table11[],2,FALSE)","v":"Misc"}]
["2011-01-18","Transfer to CREDIT CARD","Electronic Withdrawal from CHASE",-68,"debit","Credit Card Payment","ING Checking",{"$f":"VLOOKUP(TestTable[[#This Row],[Category]],Table11[],2,FALSE)","v":"Debt"}]
["2011-01-18","Transfer to 7125","Electronic Withdrawal from CITI",-71,"debit","Credit Card Payment","ING Checking",{"$f":"VLOOKUP(TestTable[[#This Row],[Category]],Table11[],2,FALSE)","v":"Debt"}]
["2011-01-18","Bath Bod","Debit Card Purchase - BATH & BOD",-25.38,"debit","Uncategorized","ING Checking",{"$f":"VLOOKUP(TestTable[[#This Row],[Category]],Table11[],2,FALSE)","v":"Misc"}]
["2011-01-18","External Electronic Withdrawal","External Electronic Withdrawal f",-113.16,"debit","Bank Fee","ING Holding",{"$f":"VLOOKUP(TestTable[[#This Row],[Category]],Table11[],2,FALSE)","v":"Misc"}]
["2011-01-17","Buehler's Buy-Low","BUY LOW MARKET         PROVO",-1.48,"debit","Groceries","Citi CC",{"$f":"VLOOKUP(TestTable[[#This Row],[Category]],Table11[],2,FALSE)","v":"Food"}]
["2011-01-17","Transfer from Checking","CLICK-TO-PAY PAYMENT, THANK YOU",71,"credit","Credit Card Payment","Citi CC",{"$f":"VLOOKUP(TestTable[[#This Row],[Category]],Table11[],2,FALSE)","v":"Debt"}]
["2011-01-17","Amazon","Amazon.com",-9.99,"debit","Shopping","Chase CC",{"$f":"VLOOKUP(TestTable[[#This Row],[Category]],Table11[],2,FALSE)","v":"Misc"}]
["2011-01-17","Transfer from Checking","Payment - Thank You",68,"credit","Credit Card Payment","Chase CC",{"$f":"VLOOKUP(TestTable[[#This Row],[Category]],Table11[],2,FALSE)","v":"Debt"}]
["2011-01-15","Jamba Juice","JAMBA JUICE #201 00000 PROVO        UT",-11.64,"debit","Food & Dining","B of A CC",{"$f":"VLOOKUP(TestTable[[#This Row],[Category]],Table11[],2,FALSE)","v":"Food"}]
["2011-01-15","UPS","THE UPS STORE #5266 30 PROUD        UT",-15.37,"debit","Shipping","B of A CC",{"$f":"VLOOKUP(TestTable[[#This Row],[Category]],Table11[],2,FALSE)","v":"Misc"}]
["2011-01-15","Hilton","HILTON OMAHA 000000000 OMAHA        NE",-39.96,"debit","Hotel","B of A CC",{"$f":"VLOOKUP(TestTable[[#This Row],[Category]],Table11[],2,FALSE)","v":"Misc"}]
["2011-01-14","MS Pub","M'S PUB                OMAHA        NE",-47.44,"debit","Restaurants","B of A CC",{"$f":"VLOOKUP(TestTable[[#This Row],[Category]],Table11[],2,FALSE)","v":"Food"}]
["2011-01-14","Salt Lake City Dept Airports","SALT LAKE CITY DEPT OF SALT LAKE CTYUT",-14,"debit","Air Travel","B of A CC",{"$f":"VLOOKUP(TestTable[[#This Row],[Category]],Table11[],2,FALSE)","v":"Misc"}]
["2011-01-14","Nouvelle Eve","NOUVELLE EVE NOUVELLE  OMAHA        NE",-21.39,"debit","Clothing","B of A CC",{"$f":"VLOOKUP(TestTable[[#This Row],[Category]],Table11[],2,FALSE)","v":"Misc"}]
["2011-01-14","Hudson News","HUDSON NEWS - OMAHA 30 OMAHA        NE",-3.37,"debit","Gift","B of A CC",{"$f":"VLOOKUP(TestTable[[#This Row],[Category]],Table11[],2,FALSE)","v":"Misc"}]
["2011-01-14","Delta","DELTA AI 0625130673035 OMAHA        NE",-25,"debit","Air Travel","B of A CC",{"$f":"VLOOKUP(TestTable[[#This Row],[Category]],Table11[],2,FALSE)","v":"Misc"}]
["2011-01-14","Sq Coriander Ca","SQ *CORIANDER          877-417-4551 CA",-21.4,"debit","Uncategorized","B of A CC",{"$f":"VLOOKUP(TestTable[[#This Row],[Category]],Table11[],2,FALSE)","v":"Misc"}]
["2011-01-14","Kracy Mcgees Kracy","KRACY MCGEES KRACY MCG OMAHA        NE",-3,"debit","Uncategorized","B of A CC",{"$f":"VLOOKUP(TestTable[[#This Row],[Category]],Table11[],2,FALSE)","v":"Misc"}]
["2011-01-14","Nebraska Clothing","NEBRASKA CLOTHING COMP OMAHA        NE",-58.85,"debit","Clothing","B of A CC",{"$f":"VLOOKUP(TestTable[[#This Row],[Category]],Table11[],2,FALSE)","v":"Misc"}]
["2011-01-14","Ted Wallys Qps","TED AND WALLYS     QPS OMAHA",-8.9700000000000006,"debit","Uncategorized","Citi CC",{"$f":"VLOOKUP(TestTable[[#This Row],[Category]],Table11[],2,FALSE)","v":"Misc"}]
["2011-01-14","Person Person Laura","Person2Person Payment to Laura o",-1075,"debit","Mortgage & Rent","ING Checking",{"$f":"VLOOKUP(TestTable[[#This Row],[Category]],Table11[],2,FALSE)","v":"Housing"}]
["2011-01-14","Transfer from ING Holding","Internet Deposit transferred fro",2000,"credit","Transfer","ING Checking",{"$f":"VLOOKUP(TestTable[[#This Row],[Category]],Table11[],2,FALSE)","v":"Misc"}]
["2011-01-14","Provocityr","Debit Card Purchase - PROVOCITYR",-98.89,"debit","Uncategorized","ING Checking",{"$f":"VLOOKUP(TestTable[[#This Row],[Category]],Table11[],2,FALSE)","v":"Misc"}]
["2011-01-14","Transfer to Checking","Internet Withdrawal transferred",-2000,"debit","Transfer","ING Holding",{"$f":"VLOOKUP(TestTable[[#This Row],[Category]],Table11[],2,FALSE)","v":"Misc"}]
["2011-01-13","St Bag","1ST BAG  1645176115036 SALT LAKE CITUT",-25,"debit","Uncategorized","B of A CC",{"$f":"VLOOKUP(TestTable[[#This Row],[Category]],Table11[],2,FALSE)","v":"Misc"}]
["2011-01-13","Sara Lee","SARA LEE SANDWICH SHOP DENVER       CO",-8.51,"debit","Coffee Shops","B of A CC",{"$f":"VLOOKUP(TestTable[[#This Row],[Category]],Table11[],2,FALSE)","v":"Food"}]
["2011-01-13","Arby's","ARBYS 466     004663 9 OMAHA        NE",-12.91,"debit","Fast Food","B of A CC",{"$f":"VLOOKUP(TestTable[[#This Row],[Category]],Table11[],2,FALSE)","v":"Food"}]
["2011-01-13","Great Ame Bage","GREAT AME BAGE551303 5 SALT LAKE CITUT",-7.2,"debit","Fast Food","B of A CC",{"$f":"VLOOKUP(TestTable[[#This Row],[Category]],Table11[],2,FALSE)","v":"Food"}]
["2011-01-12","Quality Inn","QUALITY INN & SUITES 0 TAYLOR       MI",-99.09,"debit","Hotel","B of A CC",{"$f":"VLOOKUP(TestTable[[#This Row],[Category]],Table11[],2,FALSE)","v":"Misc"}]
["2011-01-12","Salt Lake City Dept Airports","SALT LAKE CITY DEPT OF SALT LAKE CTYUT",-102,"debit","Air Travel","B of A CC",{"$f":"VLOOKUP(TestTable[[#This Row],[Category]],Table11[],2,FALSE)","v":"Misc"}]
["2011-01-12","Kracy Mcgees Kracy","KRACY MCGEES KRACY MCG OMAHA        NE",-4.54,"debit","Uncategorized","B of A CC",{"$f":"VLOOKUP(TestTable[[#This Row],[Category]],Table11[],2,FALSE)","v":"Misc"}]
["2011-01-12","Snack","SNACK SODA VENDING SNA 8668995849   PA",-1.25,"debit","Fast Food","B of A CC",{"$f":"VLOOKUP(TestTable[[#This Row],[Category]],Table11[],2,FALSE)","v":"Food"}]
["2011-01-12","Chevron","CHEVRON EXTRA MART #40 PROVO        UT",-42.94,"debit","Gas & Fuel","B of A CC",{"$f":"VLOOKUP(TestTable[[#This Row],[Category]],Table11[],2,FALSE)","v":"Auto"}]
["2011-01-12","Kracy Mcgees Kracy","KRACY MCGEES KRACY MCG OMAHA        NE",-16.23,"debit","Uncategorized","B of A CC",{"$f":"VLOOKUP(TestTable[[#This Row],[Category]],Table11[],2,FALSE)","v":"Misc"}]
["2011-01-12","Metro","METRO CARS             TAYLOR       MI",-36,"debit","Groceries","B of A CC",{"$f":"VLOOKUP(TestTable[[#This Row],[Category]],Table11[],2,FALSE)","v":"Food"}]
["2011-01-11","Canteen Vending Svc","CANTEEN VENDING CANTEE 8668995849   PA",-1.5,"debit","Fast Food","B of A CC",{"$f":"VLOOKUP(TestTable[[#This Row],[Category]],Table11[],2,FALSE)","v":"Food"}]
["2011-01-11","Canteen Vending Svc","CANTEEN VENDING CANTEE 8668995849   PA",-3,"debit","Fast Food","B of A CC",{"$f":"VLOOKUP(TestTable[[#This Row],[Category]],Table11[],2,FALSE)","v":"Food"}]
["2011-01-11","Delta","DELTA AI 0682348037490 APPLETON     WI",-25,"debit","Air Travel","B of A CC",{"$f":"VLOOKUP(TestTable[[#This Row],[Category]],Table11[],2,FALSE)","v":"Misc"}]
["2011-01-11","Casa Blanca","CASABLANCA             APPLETON     WI",-42.27,"debit","Food & Dining","B of A CC",{"$f":"VLOOKUP(TestTable[[#This Row],[Category]],Table11[],2,FALSE)","v":"Food"}]
["2011-01-11","Copperleaf Boutique Hotel","COPPERLEAF BOUTIQUE HO APPLETON     WI",-35.950000000000003,"debit","Hotel","B of A CC",{"$f":"VLOOKUP(TestTable[[#This Row],[Category]],Table11[],2,FALSE)","v":"Misc"}]
["2011-01-11","PayPal","Electronic Withdrawal from PAYPA",-4.7,"debit","Shopping","ING Checking",{"$f":"VLOOKUP(TestTable[[#This Row],[Category]],Table11[],2,FALSE)","v":"Misc"}]
["2011-01-10","Gingerootz","GINGEROOTZ 000         APPLETON     WI",-42,"debit","Restaurants","B of A CC",{"$f":"VLOOKUP(TestTable[[#This Row],[Category]],Table11[],2,FALSE)","v":"Food"}]
["2011-01-10","Walgreen","WALGREENS #12019 00001 APPLETON     WI",-14.97,"debit","Miscellaneous","B of A CC",{"$f":"VLOOKUP(TestTable[[#This Row],[Category]],Table11[],2,FALSE)","v":"Misc"}]
["2011-01-10","iTunes","APL*ITUNES             866-712-7",-14.32,"debit","Music","Citi CC",{"$f":"VLOOKUP(TestTable[[#This Row],[Category]],Table11[],2,FALSE)","v":"Misc"}]
["2011-01-09","Grove Salt Lake","THE GROVE-SALT LAKE CI SALT LAKE CITUT",-2.0699999999999998,"debit","Uncategorized","B of A CC",{"$f":"VLOOKUP(TestTable[[#This Row],[Category]],Table11[],2,FALSE)","v":"Misc"}]
["2011-01-09","Detroit Metro Airport","DETROIT METRO AIRPORT  DETROIT      MI",-23.77,"debit","Air Travel","B of A CC",{"$f":"VLOOKUP(TestTable[[#This Row],[Category]],Table11[],2,FALSE)","v":"Misc"}]
["2011-01-09","Delta","DELTA AI 0682335786440 SALT LAKE CTYUT",-23,"debit","Air Travel","B of A CC",{"$f":"VLOOKUP(TestTable[[#This Row],[Category]],Table11[],2,FALSE)","v":"Misc"}]
["2011-01-09","Burger King","BURGER KING #3727 0438 APPLETON     WI",-6.49,"debit","Fast Food","B of A CC",{"$f":"VLOOKUP(TestTable[[#This Row],[Category]],Table11[],2,FALSE)","v":"Food"}]
["2011-01-09","Walgreen","WALGREENS #5102 000005 APPLETON     WI",-24.53,"debit","Miscellaneous","B of A CC",{"$f":"VLOOKUP(TestTable[[#This Row],[Category]],Table11[],2,FALSE)","v":"Misc"}]
["2011-01-09","F Town Taxi","S. F. TOWN TAXI INC",-71.349999999999994,"debit","Rental Car & Taxi","Chase CC",{"$f":"VLOOKUP(TestTable[[#This Row],[Category]],Table11[],2,FALSE)","v":"Misc"}]
["2011-01-09","Hilton Glendale","HILTON GLENDALE",150.84,"credit","Credit Card Payment","Chase CC",{"$f":"VLOOKUP(TestTable[[#This Row],[Category]],Table11[],2,FALSE)","v":"Debt"}]
["2011-01-09","BYU Bookstore","BYU BOOKSTORE",-92.5,"debit","Books","Chase CC",{"$f":"VLOOKUP(TestTable[[#This Row],[Category]],Table11[],2,FALSE)","v":"Misc"}]
["2011-01-09","Resort Spa","CLAREMONT RESORT & SPA",-73.88,"debit","Uncategorized","Chase CC",{"$f":"VLOOKUP(TestTable[[#This Row],[Category]],Table11[],2,FALSE)","v":"Misc"}]
["2011-01-09","Salt Lake City Dept Airports","SALT LAKE CITY DEPT OF AI",-21,"debit","Air Travel","Chase CC",{"$f":"VLOOKUP(TestTable[[#This Row],[Category]],Table11[],2,FALSE)","v":"Misc"}]
["2011-01-09","Wendy's","WENDY'S #2",-2.68,"debit","Fast Food","Chase CC",{"$f":"VLOOKUP(TestTable[[#This Row],[Category]],Table11[],2,FALSE)","v":"Food"}]
["2011-01-09","Oakland East B","OAKLAND EAST B31286701",-2.4700000000000002,"debit","Uncategorized","Chase CC",{"$f":"VLOOKUP(TestTable[[#This Row],[Category]],Table11[],2,FALSE)","v":"Misc"}]
["2011-01-09","Chili's","CHILI'S TOGO O31288160",-16.760000000000002,"debit","Restaurants","Chase CC",{"$f":"VLOOKUP(TestTable[[#This Row],[Category]],Table11[],2,FALSE)","v":"Food"}]
["2011-01-08","Chevron","CHEVRON 0208662        PROVO",-34.14,"debit","Gas & Fuel","Citi CC",{"$f":"VLOOKUP(TestTable[[#This Row],[Category]],Table11[],2,FALSE)","v":"Auto"}]
["2011-01-07","Microsoft XBox Live","MICROSOFT   *XBOX LIVE 080038655",-9.99,"debit","Electronics & Software","Citi CC",{"$f":"VLOOKUP(TestTable[[#This Row],[Category]],Table11[],2,FALSE)","v":"Misc"}]
["2011-01-07","iTunes","APL*ITUNES             866-712-7",-2.11,"debit","Music","Citi CC",{"$f":"VLOOKUP(TestTable[[#This Row],[Category]],Table11[],2,FALSE)","v":"Misc"}]
["2011-01-07","Costco","Debit Card Purchase - COSTCO WHSE #04 648 EAST 800 SOUTH",-17.09,"debit","Miscellaneous","ING Checking",{"$f":"VLOOKUP(TestTable[[#This Row],[Category]],Table11[],2,FALSE)","v":"Misc"}]
["2011-01-07","Interest Charge","PURCHASE INTEREST CHARGE",-25.68,"debit","Finance Charge","Chase CC",{"$f":"VLOOKUP(TestTable[[#This Row],[Category]],Table11[],2,FALSE)","v":"Misc"}]
["2011-01-07","Cash","CASH ADVANCE INTEREST CHA",-5.61,"debit","Business Services","Chase CC",{"$f":"VLOOKUP(TestTable[[#This Row],[Category]],Table11[],2,FALSE)","v":"Misc"}]
["2011-01-07","Hudson News","HUDSON NEWS- LOS ANGEL",-7.97,"debit","Uncategorized","Chase CC",{"$f":"VLOOKUP(TestTable[[#This Row],[Category]],Table11[],2,FALSE)","v":"Misc"}]
["2011-01-07","BART","BART ROCKRIDGE STA QPS",-7,"debit","Public Transportation","Chase CC",{"$f":"VLOOKUP(TestTable[[#This Row],[Category]],Table11[],2,FALSE)","v":"Misc"}]
["2011-01-07","Target","TARGET        00017541",-37.770000000000003,"debit","Miscellaneous","Chase CC",{"$f":"VLOOKUP(TestTable[[#This Row],[Category]],Table11[],2,FALSE)","v":"Misc"}]
["2011-01-07","Sunflower Farmers M","SUNFLOWER FARMERS M",-37.380000000000003,"debit","Uncategorized","Chase CC",{"$f":"VLOOKUP(TestTable[[#This Row],[Category]],Table11[],2,FALSE)","v":"Misc"}]
["2011-01-07","Primary","PRIMARY HEALTH MEDICAL GR",-24.98,"debit","Entertainment","Chase CC",{"$f":"VLOOKUP(TestTable[[#This Row],[Category]],Table11[],2,FALSE)","v":"Misc"}]
["2011-01-07","Hilton","HILTON GLENDALE",-150.84,"debit","Hotel","Chase CC",{"$f":"VLOOKUP(TestTable[[#This Row],[Category]],Table11[],2,FALSE)","v":"Misc"}]
["2011-01-07","Barbacco","BARBACCO",-19.239999999999998,"debit","Uncategorized","Chase CC",{"$f":"VLOOKUP(TestTable[[#This Row],[Category]],Table11[],2,FALSE)","v":"Misc"}]
["2011-01-07","Baja Fresh","T7 BAJA FRESH 30052906",-14.66,"debit","Fast Food","Chase CC",{"$f":"VLOOKUP(TestTable[[#This Row],[Category]],Table11[],2,FALSE)","v":"Food"}]
["2011-01-07","Hilton","HILTON GLENDALE",-5,"debit","Hotel","Chase CC",{"$f":"VLOOKUP(TestTable[[#This Row],[Category]],Table11[],2,FALSE)","v":"Misc"}]
["2011-01-06","Delta","DELTA   00625134642540 OAKLAND",-25,"debit","Air Travel","Citi CC",{"$f":"VLOOKUP(TestTable[[#This Row],[Category]],Table11[],2,FALSE)","v":"Misc"}]
["2011-01-06","ATM Fee","ATM Withdrawal - *MARKET & FREMONT  SAN FRANCISCO, CA US",-2,"debit","ATM Fee","ING Checking",{"$f":"VLOOKUP(TestTable[[#This Row],[Category]],Table11[],2,FALSE)","v":"Misc"}]
["2011-01-06","ATM Withdrawal","ATM Withdrawal - *MARKET & FREMONT  SAN FRANCISCO, CA US",-40,"debit","Cash & ATM","ING Checking",{"$f":"VLOOKUP(TestTable[[#This Row],[Category]],Table11[],2,FALSE)","v":"Misc"}]
["2011-01-06","Transfer from ING Holding","Internet Deposit transferred from OSA XXXX4516",93,"credit","Transfer","ING Checking",{"$f":"VLOOKUP(TestTable[[#This Row],[Category]],Table11[],2,FALSE)","v":"Misc"}]
["2011-01-06","Transfer to Checking","Internet Withdrawal transferred to EO XXXX4669",-93,"debit","Transfer","ING Holding",{"$f":"VLOOKUP(TestTable[[#This Row],[Category]],Table11[],2,FALSE)","v":"Misc"}]
["2011-01-06","Withdrawal Swensen Amber","Withdrawal SWENSEN,AMBER MTYPE: ING DIRECT CO: SWENSEN,AMBER M",-11544,"debit","Uncategorized","MACU Checking",{"$f":"VLOOKUP(TestTable[[#This Row],[Category]],Table11[],2,FALSE)","v":"Misc"}]
["2011-01-06","Air Terminal Gifts","AIR TERMINAL GIFTS",-1.84,"debit","Gift","Chase CC",{"$f":"VLOOKUP(TestTable[[#This Row],[Category]],Table11[],2,FALSE)","v":"Misc"}]
["2011-01-06","Kneaders","KNEADER'S PROVO",-9.25,"debit","Restaurants","Chase CC",{"$f":"VLOOKUP(TestTable[[#This Row],[Category]],Table11[],2,FALSE)","v":"Food"}]
["2011-01-06","Hilton","HILTON F&B",-21.46,"debit","Hotel","Chase CC",{"$f":"VLOOKUP(TestTable[[#This Row],[Category]],Table11[],2,FALSE)","v":"Misc"}]
["2011-01-06","Laundry Plus","LAUNDRY PLUS",-10.68,"debit","Laundry","Chase CC",{"$f":"VLOOKUP(TestTable[[#This Row],[Category]],Table11[],2,FALSE)","v":"Misc"}]
["2011-01-06","Costa","COSTA VIDA OF PROVO",-16.98,"debit","Fast Food","Chase CC",{"$f":"VLOOKUP(TestTable[[#This Row],[Category]],Table11[],2,FALSE)","v":"Food"}]
["2011-01-06","C Wolfgang Puc","C WOLFGANG PUC30558316",-7.86,"debit","Uncategorized","Chase CC",{"$f":"VLOOKUP(TestTable[[#This Row],[Category]],Table11[],2,FALSE)","v":"Misc"}]
["2011-01-06","Maceys","MACEYS PROVO",-21,"debit","Groceries","Chase CC",{"$f":"VLOOKUP(TestTable[[#This Row],[Category]],Table11[],2,FALSE)","v":"Food"}]
["2011-01-05","United","UNITED  0164517126583  LOS ANGEL",-25,"debit","Air Travel","Citi CC",{"$f":"VLOOKUP(TestTable[[#This Row],[Category]],Table11[],2,FALSE)","v":"Misc"}]
["2011-01-05","AT&amp;T","External Electronic Withdrawal from AT&T PAYMENT",-128.12,"debit","Mobile Phone","ING Holding",{"$f":"VLOOKUP(TestTable[[#This Row],[Category]],Table11[],2,FALSE)","v":"Phone"}]
["2011-01-05","Transfer from FREE CHECKING","Internet Deposit MOUNTAIN AMERICA FCU checking account XXXXXXXX1875",11544,"credit","Transfer","ING Holding",{"$f":"VLOOKUP(TestTable[[#This Row],[Category]],Table11[],2,FALSE)","v":"Misc"}]
["2011-01-05","Deposit Byu Refundtype","Deposit BYU RefundTYPE: UCA CO: BYU Refund",1262,"credit","Income","MACU Checking",{"$f":"VLOOKUP(TestTable[[#This Row],[Category]],Table11[],2,FALSE)","v":"income"}]
["2011-01-05","Check 325","Draft 000325",-20,"debit","Check","MACU Checking",{"$f":"VLOOKUP(TestTable[[#This Row],[Category]],Table11[],2,FALSE)","v":"Income"}]
["2011-01-05","Federal Express","FEDEX OFFICE #0154",-2.7,"debit","Shipping","Chase CC",{"$f":"VLOOKUP(TestTable[[#This Row],[Category]],Table11[],2,FALSE)","v":"Misc"}]
["2011-01-05","BYU Bookstore","BYU BOOKSTORE",-10.89,"debit","Books","Chase CC",{"$f":"VLOOKUP(TestTable[[#This Row],[Category]],Table11[],2,FALSE)","v":"Misc"}]
["2011-01-05","Delta","DELTA AIR   0068233722395",-23,"debit","Air Travel","Chase CC",{"$f":"VLOOKUP(TestTable[[#This Row],[Category]],Table11[],2,FALSE)","v":"Misc"}]
["2011-01-05","Byu Cougar Creations","BYU COUGAR CREATIONS",-3.23,"debit","Uncategorized","Chase CC",{"$f":"VLOOKUP(TestTable[[#This Row],[Category]],Table11[],2,FALSE)","v":"Misc"}]
["2011-01-04","Transfer to ING Holding","Internet Withdrawal transferred to OSA XXXX4516",-121,"debit","Transfer","ING Checking",{"$f":"VLOOKUP(TestTable[[#This Row],[Category]],Table11[],2,FALSE)","v":"Misc"}]
["2011-01-04","Transfer from Checking","Internet Deposit transferred from EO XXXX4669",121,"credit","Transfer","ING Holding",{"$f":"VLOOKUP(TestTable[[#This Row],[Category]],Table11[],2,FALSE)","v":"Misc"}]
["2011-01-04","Deposit Byu Refundtype","Deposit BYU RefundTYPE: UCA CO: BYU Refund",11519,"credit","Income","MACU Checking",{"$f":"VLOOKUP(TestTable[[#This Row],[Category]],Table11[],2,FALSE)","v":"income"}]
["2011-01-04","Amazon","Amazon.com",-81.569999999999993,"debit","Shopping","Chase CC",{"$f":"VLOOKUP(TestTable[[#This Row],[Category]],Table11[],2,FALSE)","v":"Misc"}]
["2011-01-03","Gold's Gym","GOLD'S GYM UNIVERSITY",-54.4,"debit","Gym","Chase CC",{"$f":"VLOOKUP(TestTable[[#This Row],[Category]],Table11[],2,FALSE)","v":"Misc"}]
["2011-01-03","Interest Charged Purchases","Interest Charged on Purchases",-22.63,"debit","Finance Charge","B of A CC",{"$f":"VLOOKUP(TestTable[[#This Row],[Category]],Table11[],2,FALSE)","v":"Misc"}]
["2011-01-02","Cinemark","CINEMARK 1041      Q34",-16.5,"debit","Movies & DVDs","Chase CC",{"$f":"VLOOKUP(TestTable[[#This Row],[Category]],Table11[],2,FALSE)","v":"Misc"}]
["2011-01-02","Chevron","CHEVRON 00073049",-51.27,"debit","Gas & Fuel","Chase CC",{"$f":"VLOOKUP(TestTable[[#This Row],[Category]],Table11[],2,FALSE)","v":"Auto"}]
["2011-01-02","Runners Corner","RUNNERS CORNER INC.",-96.14,"debit","Sporting Goods","Chase CC",{"$f":"VLOOKUP(TestTable[[#This Row],[Category]],Table11[],2,FALSE)","v":"Misc"}]
["2011-01-02","Hale Centre Theatre","HALE CENTRE THEATRE",-51,"debit","Entertainment","Chase CC",{"$f":"VLOOKUP(TestTable[[#This Row],[Category]],Table11[],2,FALSE)","v":"Misc"}]
["2010-12-31","Electronic Deposit Brigham","Electronic Deposit from BRIGHAM YOUNG UN DIR DEP",50.75,"credit","Paycheck","ING Checking",{"$f":"VLOOKUP(TestTable[[#This Row],[Category]],Table11[],2,FALSE)","v":"Income"}]
["2010-12-31","Monthly Interest Paid","Monthly Interest Paid",0.12,"credit","Interest Income","ING Checking",{"$f":"VLOOKUP(TestTable[[#This Row],[Category]],Table11[],2,FALSE)","v":"Misc"}]
["2010-12-31","Monthly Interest Paid","Monthly Interest Paid",0.15,"credit","Interest Income","ING Holding",{"$f":"VLOOKUP(TestTable[[#This Row],[Category]],Table11[],2,FALSE)","v":"Misc"}]
["2010-12-31","iTunes","APL*ITUNES 866-712-7753 CA",-7.43,"debit","Music","Citi CC",{"$f":"VLOOKUP(TestTable[[#This Row],[Category]],Table11[],2,FALSE)","v":"Misc"}]
["2010-12-31","Commentavg Checking Bal","Transaction COMMENTAvg Checking Bal for Dec $598.38",0,"credit","Income","MACU Checking",{"$f":"VLOOKUP(TestTable[[#This Row],[Category]],Table11[],2,FALSE)","v":"income"}]
["2010-12-31","Sizzler","SIZZLER 875",-28.36,"debit","Restaurants","Chase CC",{"$f":"VLOOKUP(TestTable[[#This Row],[Category]],Table11[],2,FALSE)","v":"Food"}]
["2010-12-31","Buehler's Buy-Low","BUY LOW MARKET",-2.75,"debit","Groceries","Chase CC",{"$f":"VLOOKUP(TestTable[[#This Row],[Category]],Table11[],2,FALSE)","v":"Food"}]
["2010-12-31","Redbox","REDBOX *DVD RENTAL",-1.6,"debit","Movies & DVDs","Chase CC",{"$f":"VLOOKUP(TestTable[[#This Row],[Category]],Table11[],2,FALSE)","v":"Misc"}]
["2010-12-31","Amazon","Amazon.com",-103.98,"debit","Shopping","Chase CC",{"$f":"VLOOKUP(TestTable[[#This Row],[Category]],Table11[],2,FALSE)","v":"Misc"}]
["2010-12-30","USPS","Debit Card Purchase - USPS 4971740605 936 S 250 E",-9.8000000000000007,"debit","Shipping","ING Checking",{"$f":"VLOOKUP(TestTable[[#This Row],[Category]],Table11[],2,FALSE)","v":"Misc"}]
["2010-12-30","Carl's Jr","CARL'S JR. #7224N  Q12",-14.07,"debit","Fast Food","Chase CC",{"$f":"VLOOKUP(TestTable[[#This Row],[Category]],Table11[],2,FALSE)","v":"Food"}]
["2010-12-30","Hardy","HARDY'S #48",-22.23,"debit","Uncategorized","Chase CC",{"$f":"VLOOKUP(TestTable[[#This Row],[Category]],Table11[],2,FALSE)","v":"Misc"}]
["2010-12-30","Apple","APPLE STORE R303",95.35,"credit","Electronics & Software","Chase CC",{"$f":"VLOOKUP(TestTable[[#This Row],[Category]],Table11[],2,FALSE)","v":"Misc"}]
["2010-12-30","Ross","ROSS STORE #501",-31.97,"debit","Clothing","Chase CC",{"$f":"VLOOKUP(TestTable[[#This Row],[Category]],Table11[],2,FALSE)","v":"Misc"}]
["2010-12-29","Transfer to ING Holding","Internet Withdrawal transferred to OSA XXXX4516",-10,"debit","Transfer","ING Checking",{"$f":"VLOOKUP(TestTable[[#This Row],[Category]],Table11[],2,FALSE)","v":"Misc"}]
["2010-12-29","Transfer from Checking","Internet Deposit transferred from EO XXXX4669",10,"credit","Transfer","ING Holding",{"$f":"VLOOKUP(TestTable[[#This Row],[Category]],Table11[],2,FALSE)","v":"Misc"}]
["2010-12-29","Chuck E. Cheese","CHUCK E CHEESE00009597",-38.14,"debit","Kids Activities","Chase CC",{"$f":"VLOOKUP(TestTable[[#This Row],[Category]],Table11[],2,FALSE)","v":"Misc"}]
["2010-12-29","Marshalls","MARSHALLS #871",-15.88,"debit","Clothing","Chase CC",{"$f":"VLOOKUP(TestTable[[#This Row],[Category]],Table11[],2,FALSE)","v":"Misc"}]
["2010-12-29","Marshalls","MARSHALLS #871",-47.68,"debit","Clothing","Chase CC",{"$f":"VLOOKUP(TestTable[[#This Row],[Category]],Table11[],2,FALSE)","v":"Misc"}]
["2010-12-29","Maverik","MAVERIK #394",-7.06,"debit","Gas & Fuel","Chase CC",{"$f":"VLOOKUP(TestTable[[#This Row],[Category]],Table11[],2,FALSE)","v":"Auto"}]
["2010-12-29","Microsoft","DRI*MICROSOFT HUP",-10.62,"debit","Electronics & Software","Chase CC",{"$f":"VLOOKUP(TestTable[[#This Row],[Category]],Table11[],2,FALSE)","v":"Misc"}]
["2010-12-29","ShopKo","SHOPKO        00501072",-10.65,"debit","Shopping","Chase CC",{"$f":"VLOOKUP(TestTable[[#This Row],[Category]],Table11[],2,FALSE)","v":"Misc"}]
["2010-12-29","Chevron","CHEVRON 00207403",-50.5,"debit","Gas & Fuel","Chase CC",{"$f":"VLOOKUP(TestTable[[#This Row],[Category]],Table11[],2,FALSE)","v":"Auto"}]
["2010-12-28","iTunes","APL*ITUNES 866-712-7753 CA",-2.1,"debit","Music","Citi CC",{"$f":"VLOOKUP(TestTable[[#This Row],[Category]],Table11[],2,FALSE)","v":"Misc"}]
["2010-12-28","Wendy's","WENDYS   13      Q25",-3.15,"debit","Fast Food","Chase CC",{"$f":"VLOOKUP(TestTable[[#This Row],[Category]],Table11[],2,FALSE)","v":"Food"}]
["2010-12-27","Costco","Debit Card Purchase - COSTCO WHSE #07 2051 S. COLE RD.",-61.05,"debit","Miscellaneous","ING Checking",{"$f":"VLOOKUP(TestTable[[#This Row],[Category]],Table11[],2,FALSE)","v":"Misc"}]
["2010-12-27","Scout Com Wa","SCOUT.COM              888-979-0979 WA",-9.9499999999999993,"debit","Uncategorized","B of A CC",{"$f":"VLOOKUP(TestTable[[#This Row],[Category]],Table11[],2,FALSE)","v":"Misc"}]
["2010-12-26","Consumer Reports","CR *CONSUMERREPORTS.OR 8003330663 NY",-5.95,"debit","Books","Citi CC",{"$f":"VLOOKUP(TestTable[[#This Row],[Category]],Table11[],2,FALSE)","v":"Misc"}]
["2010-12-26","Quiznos","QUIZNOS SUB #10120",-3.18,"debit","Fast Food","Chase CC",{"$f":"VLOOKUP(TestTable[[#This Row],[Category]],Table11[],2,FALSE)","v":"Food"}]
["2010-12-26","Garden Lanes","WESTY'S GARDEN LANES",-17.23,"debit","Amusement","Chase CC",{"$f":"VLOOKUP(TestTable[[#This Row],[Category]],Table11[],2,FALSE)","v":"Misc"}]
["2010-12-26","Hobby Lobby","HOBBY LOBBY # 433",-5.27,"debit","Hobbies","Chase CC",{"$f":"VLOOKUP(TestTable[[#This Row],[Category]],Table11[],2,FALSE)","v":"Misc"}]
["2010-12-26","Players","PLAYER'S PUB",-1.5,"debit","Fast Food","Chase CC",{"$f":"VLOOKUP(TestTable[[#This Row],[Category]],Table11[],2,FALSE)","v":"Food"}]
["2010-12-26","Garden Lanes","WESTY'S GARDEN LANES",-17.78,"debit","Amusement","Chase CC",{"$f":"VLOOKUP(TestTable[[#This Row],[Category]],Table11[],2,FALSE)","v":"Misc"}]
["2010-12-26","Walgreen","WALGREENS #11452",-10.59,"debit","Miscellaneous","Chase CC",{"$f":"VLOOKUP(TestTable[[#This Row],[Category]],Table11[],2,FALSE)","v":"Misc"}]
["2010-12-24","Dick's Sporting","DICKS SPORTING GOODS#685",-96.38,"debit","Sporting Goods","Chase CC",{"$f":"VLOOKUP(TestTable[[#This Row],[Category]],Table11[],2,FALSE)","v":"Misc"}]
["2010-12-24","Hallett Cinemas","HALLETT CINEMAS",-15,"debit","Movies & DVDs","Chase CC",{"$f":"VLOOKUP(TestTable[[#This Row],[Category]],Table11[],2,FALSE)","v":"Misc"}]
["2010-12-23","Fast","FAST LANE INDOOR KART RAC",-29.57,"debit","Air Travel","Chase CC",{"$f":"VLOOKUP(TestTable[[#This Row],[Category]],Table11[],2,FALSE)","v":"Misc"}]
["2010-12-23","Microsoft","DRI*MICROSOFT HUP",-10.62,"debit","Electronics & Software","Chase CC",{"$f":"VLOOKUP(TestTable[[#This Row],[Category]],Table11[],2,FALSE)","v":"Misc"}]
["2010-12-23","McDonald's","MCDONALD'S F13630",-5.89,"debit","Fast Food","Chase CC",{"$f":"VLOOKUP(TestTable[[#This Row],[Category]],Table11[],2,FALSE)","v":"Food"}]
["2010-12-23","Apple","APPLE STORE R303",-95.35,"debit","Electronics & Software","Chase CC",{"$f":"VLOOKUP(TestTable[[#This Row],[Category]],Table11[],2,FALSE)","v":"Misc"}]
["2010-12-22","Japan Express Qps","Debit Card Purchase - JAPAN EXPRESS QPS BOISE ID",-6.61,"debit","Uncategorized","ING Checking",{"$f":"VLOOKUP(TestTable[[#This Row],[Category]],Table11[],2,FALSE)","v":"Misc"}]
["2010-12-22","Transfer to CREDIT CARD","Electronic Payment to Chase Card Services",-1600,"debit","Credit Card Payment","ING Checking",{"$f":"VLOOKUP(TestTable[[#This Row],[Category]],Table11[],2,FALSE)","v":"Debt"}]
["2010-12-22","iTunes","APL*ITUNES 866-712-7753 CA",-1.06,"debit","Music","Citi CC",{"$f":"VLOOKUP(TestTable[[#This Row],[Category]],Table11[],2,FALSE)","v":"Misc"}]
["2010-12-22","Marshalls","MARSHALLS #871",-26.49,"debit","Clothing","Chase CC",{"$f":"VLOOKUP(TestTable[[#This Row],[Category]],Table11[],2,FALSE)","v":"Misc"}]
["2010-12-22","Transfer from Checking","Payment - Thank You",1600,"credit","Credit Card Payment","Chase CC",{"$f":"VLOOKUP(TestTable[[#This Row],[Category]],Table11[],2,FALSE)","v":"Debt"}]
["2010-12-22","Wal-Mart","WAL-MART #2862",-117.87,"debit","Shopping","Chase CC",{"$f":"VLOOKUP(TestTable[[#This Row],[Category]],Table11[],2,FALSE)","v":"Misc"}]
["2010-12-22","Amazon","Amazon.com",-36.99,"debit","Shopping","Chase CC",{"$f":"VLOOKUP(TestTable[[#This Row],[Category]],Table11[],2,FALSE)","v":"Misc"}]
["2010-12-21","Adjustment We Changed","Credit Adjustment - We changed how we applied your online payments and you got money back.",0.14000000000000001,"credit","Credit Card Payment","ING Checking",{"$f":"VLOOKUP(TestTable[[#This Row],[Category]],Table11[],2,FALSE)","v":"Debt"}]
["2010-12-21","Veracity Network Veracity","External Electronic Withdrawal from Veracity Network Veracity N",-48.28,"debit","Internet","ING Holding",{"$f":"VLOOKUP(TestTable[[#This Row],[Category]],Table11[],2,FALSE)","v":"Utilities"}]
["2010-12-21","Quiznos Sub","QUIZNO'S SUB #1522",-8.35,"debit","Restaurants","Chase CC",{"$f":"VLOOKUP(TestTable[[#This Row],[Category]],Table11[],2,FALSE)","v":"Food"}]
["2010-12-21","Amazon","Amazon.com",-215.5,"debit","Shopping","Chase CC",{"$f":"VLOOKUP(TestTable[[#This Row],[Category]],Table11[],2,FALSE)","v":"Misc"}]
["2010-12-21","Chevron","CHEVRON 00207403",-55.55,"debit","Gas & Fuel","Chase CC",{"$f":"VLOOKUP(TestTable[[#This Row],[Category]],Table11[],2,FALSE)","v":"Auto"}]
["2010-12-21","Amazon","AMAZON MKTPLACE PMTS",-59.95,"debit","Shopping","Chase CC",{"$f":"VLOOKUP(TestTable[[#This Row],[Category]],Table11[],2,FALSE)","v":"Misc"}]
["2010-12-21","Wendy's","WENDYS #7750       Q25",-3.41,"debit","Fast Food","Chase CC",{"$f":"VLOOKUP(TestTable[[#This Row],[Category]],Table11[],2,FALSE)","v":"Food"}]
["2010-12-21","Treasures","TREASURE VALLEY FAMILY YM",-37.1,"debit","Clothing","Chase CC",{"$f":"VLOOKUP(TestTable[[#This Row],[Category]],Table11[],2,FALSE)","v":"Misc"}]
["2010-12-21","Carl's Jr","CARLJR1100602 11006020",-9.9700000000000006,"debit","Fast Food","Chase CC",{"$f":"VLOOKUP(TestTable[[#This Row],[Category]],Table11[],2,FALSE)","v":"Food"}]
["2010-12-20","Byu Student Id","Debit Card Purchase - BYU STUDENT ID CENTER PROVO UT",-10,"debit","Uncategorized","ING Checking",{"$f":"VLOOKUP(TestTable[[#This Row],[Category]],Table11[],2,FALSE)","v":"Misc"}]
["2010-12-20","Orange Julius","Debit Card Purchase - ORANGE JULIUS 6169QPS OREM UT",-5.38,"debit","Food & Dining","ING Checking",{"$f":"VLOOKUP(TestTable[[#This Row],[Category]],Table11[],2,FALSE)","v":"Food"}]
["2010-12-20","Icing North","Debit Card Purchase - THE ICING #3471 350 NORTH MILWAUKEE",-20.67,"debit","Uncategorized","ING Checking",{"$f":"VLOOKUP(TestTable[[#This Row],[Category]],Table11[],2,FALSE)","v":"Misc"}]
["2010-12-20","Toys \"R\" Us","Debit Card Purchase - TOYS R US 350 NORTH MILWAUKEE      0000",-25.95,"debit","Toys","ING Checking",{"$f":"VLOOKUP(TestTable[[#This Row],[Category]],Table11[],2,FALSE)","v":"Misc"}]
["2010-12-20","Iceberg","Debit Card Purchase - ICEBERG DRIVE INN SAN SANDY UT",-9.9,"debit","Restaurants","ING Checking",{"$f":"VLOOKUP(TestTable[[#This Row],[Category]],Table11[],2,FALSE)","v":"Food"}]
["2010-12-20","Childrens P N","Debit Card Purchase - THE CHILDRENS P 350 N MILWAUKEE, STE #",-12.4,"debit","Kids","ING Checking",{"$f":"VLOOKUP(TestTable[[#This Row],[Category]],Table11[],2,FALSE)","v":"Misc"}]
["2010-12-20","Transfer to PRIMARY SAVINGS","External Electronic Withdrawal from MOUNTAIN AMERICA PAMT",-265,"debit","Auto Payment","ING Holding",{"$f":"VLOOKUP(TestTable[[#This Row],[Category]],Table11[],2,FALSE)","v":"Auto"}]
["2010-12-20","Withdrawal Transfer Loan","Withdrawal Transfer To Loan 61",-265,"debit","Transfer","MACU Savings 1",{"$f":"VLOOKUP(TestTable[[#This Row],[Category]],Table11[],2,FALSE)","v":"Misc"}]
["2010-12-20","Transfer from ING Holding","Deposit ACH ORIGINATION",265,"credit","Transfer","MACU Savings 1",{"$f":"VLOOKUP(TestTable[[#This Row],[Category]],Table11[],2,FALSE)","v":"Misc"}]
["2010-12-20","Harmon's","HARMON'S - OREM",-6.17,"debit","Groceries","Chase CC",{"$f":"VLOOKUP(TestTable[[#This Row],[Category]],Table11[],2,FALSE)","v":"Food"}]
["2010-12-20","Chevron","CHEVRON 00073049",-41.98,"debit","Gas & Fuel","Chase CC",{"$f":"VLOOKUP(TestTable[[#This Row],[Category]],Table11[],2,FALSE)","v":"Auto"}]
["2010-12-20","Amazon","AMAZON MKTPLACE PMTS",-11.97,"debit","Shopping","Chase CC",{"$f":"VLOOKUP(TestTable[[#This Row],[Category]],Table11[],2,FALSE)","v":"Misc"}]
["2010-12-20","Iceberg Drive Inn","ICEBERG DRIVE-INN- SAN",-8.09,"debit","Restaurants","Chase CC",{"$f":"VLOOKUP(TestTable[[#This Row],[Category]],Table11[],2,FALSE)","v":"Food"}]
["2010-12-19","Allens Super Save","ALLEN'S SUPER SAVE",-9.4700000000000006,"debit","Pharmacy","Chase CC",{"$f":"VLOOKUP(TestTable[[#This Row],[Category]],Table11[],2,FALSE)","v":"Medical"}]
["2010-12-19","Texaco","TEXACO 00305131",-2.5499999999999998,"debit","Gas & Fuel","Chase CC",{"$f":"VLOOKUP(TestTable[[#This Row],[Category]],Table11[],2,FALSE)","v":"Auto"}]
["2010-12-19","Apple","APL*APPLE ONLINE STORE",-34.42,"debit","Electronics & Software","Chase CC",{"$f":"VLOOKUP(TestTable[[#This Row],[Category]],Table11[],2,FALSE)","v":"Misc"}]
["2010-12-19","Amazon","AMAZON MKTPLACE PMTS",-2.59,"debit","Shopping","Chase CC",{"$f":"VLOOKUP(TestTable[[#This Row],[Category]],Table11[],2,FALSE)","v":"Misc"}]
["2010-12-19","Gap","GAP #8405/THE",8.3000000000000007,"credit","Clothing","Chase CC",{"$f":"VLOOKUP(TestTable[[#This Row],[Category]],Table11[],2,FALSE)","v":"Misc"}]
["2010-12-19","Bajio Mexican Grill","BAJIO MEXICAN GRILL 00001",-8.6,"debit","Fast Food","Chase CC",{"$f":"VLOOKUP(TestTable[[#This Row],[Category]],Table11[],2,FALSE)","v":"Food"}]
["2010-12-19","Deseret Book","DESERET BOOK CO #30",-4.26,"debit","Books","Chase CC",{"$f":"VLOOKUP(TestTable[[#This Row],[Category]],Table11[],2,FALSE)","v":"Misc"}]
["2010-12-19","Amazon","Amazon.com",-9.9600000000000009,"debit","Shopping","Chase CC",{"$f":"VLOOKUP(TestTable[[#This Row],[Category]],Table11[],2,FALSE)","v":"Misc"}]
["2010-12-19","Amazon","AMAZON MKTPLACE PMTS",-5.95,"debit","Shopping","Chase CC",{"$f":"VLOOKUP(TestTable[[#This Row],[Category]],Table11[],2,FALSE)","v":"Misc"}]
["2010-12-17","Mod Bod","Debit Card Purchase - THE MOD BOD 575 E UNIVERSITY PARKW   000",-10.87,"debit","Clothing","ING Checking",{"$f":"VLOOKUP(TestTable[[#This Row],[Category]],Table11[],2,FALSE)","v":"Misc"}]
["2010-12-17","Electronic Deposit Brigham","Electronic Deposit from BRIGHAM YOUNG UN DIR DEP",43.5,"credit","Paycheck","ING Checking",{"$f":"VLOOKUP(TestTable[[#This Row],[Category]],Table11[],2,FALSE)","v":"Income"}]
["2010-12-17","Questar Gas","External Electronic Withdrawal from Questar Gas Co. QGC",-37.94,"debit","Utilities","ING Holding",{"$f":"VLOOKUP(TestTable[[#This Row],[Category]],Table11[],2,FALSE)","v":"Utilities"}]
["2010-12-17","Interest Charged Standard","INTEREST CHARGED TO STANDARD PURCH",-12.61,"debit","Finance Charge","Citi CC",{"$f":"VLOOKUP(TestTable[[#This Row],[Category]],Table11[],2,FALSE)","v":"Misc"}]
["2010-12-17","Amazon","Amazon.com",-26.99,"debit","Shopping","Chase CC",{"$f":"VLOOKUP(TestTable[[#This Row],[Category]],Table11[],2,FALSE)","v":"Misc"}]
["2010-12-17","Best Buy","Best Buy      00007732",-18.16,"debit","Electronics & Software","Chase CC",{"$f":"VLOOKUP(TestTable[[#This Row],[Category]],Table11[],2,FALSE)","v":"Misc"}]
["2010-12-17","Rite Aid","RITE AID STORE 6148",-19.64,"debit","Pharmacy","Chase CC",{"$f":"VLOOKUP(TestTable[[#This Row],[Category]],Table11[],2,FALSE)","v":"Medical"}]
["2010-12-17","Amazon","Amazon.com",-69.489999999999995,"debit","Shopping","Chase CC",{"$f":"VLOOKUP(TestTable[[#This Row],[Category]],Table11[],2,FALSE)","v":"Misc"}]
["2010-12-17","Deposit By","Deposit by Check",100,"credit","Income","MACU Checking",{"$f":"VLOOKUP(TestTable[[#This Row],[Category]],Table11[],2,FALSE)","v":"income"}]
["2010-12-17","Transfer to Checking","Withdrawal SWENSEN,AMBER MTYPE: ING DIRECT CO: SWENSEN,AMBER M",-1140,"debit","Transfer","MACU Checking",{"$f":"VLOOKUP(TestTable[[#This Row],[Category]],Table11[],2,FALSE)","v":"Misc"}]
["2010-12-16","Transfer from FREE CHECKING","Internet Deposit MOUNTAIN AMERICA FCU checking account XXXXXXXX1875",1140,"credit","Transfer","ING Checking",{"$f":"VLOOKUP(TestTable[[#This Row],[Category]],Table11[],2,FALSE)","v":"Misc"}]
["2010-12-16","Toys \"R\" Us","TOYS 'R' US            OREM         UT",-88.66,"debit","Toys","B of A CC",{"$f":"VLOOKUP(TestTable[[#This Row],[Category]],Table11[],2,FALSE)","v":"Misc"}]
["2010-12-16","Costco","COSTCO WHSE #0484 0000 OREM         UT",-21.36,"debit","Miscellaneous","B of A CC",{"$f":"VLOOKUP(TestTable[[#This Row],[Category]],Table11[],2,FALSE)","v":"Misc"}]
["2010-12-16","Cafe Rio","CAFE RIO PROVO Q35",-9.5399999999999991,"debit","Restaurants","Chase CC",{"$f":"VLOOKUP(TestTable[[#This Row],[Category]],Table11[],2,FALSE)","v":"Food"}]
["2010-12-16","Wendy's","WENDYS #4710       Q25",-2.13,"debit","Fast Food","Chase CC",{"$f":"VLOOKUP(TestTable[[#This Row],[Category]],Table11[],2,FALSE)","v":"Food"}]
["2010-12-15","Liberty Mutual","External Electronic Withdrawal from LIBERTY MUTUAL PAYMENT",-113.16,"debit","Auto Insurance","ING Holding",{"$f":"VLOOKUP(TestTable[[#This Row],[Category]],Table11[],2,FALSE)","v":"Auto"}]
["2010-12-15","Transfer from Checking","ELECTRONIC PAYMENT-THANK YOU",59,"credit","Credit Card Payment","Citi CC",{"$f":"VLOOKUP(TestTable[[#This Row],[Category]],Table11[],2,FALSE)","v":"Debt"}]
["2010-12-15","Children's Place","THECHILDRENSPLACE.COM",-54.58,"debit","Clothing","Chase CC",{"$f":"VLOOKUP(TestTable[[#This Row],[Category]],Table11[],2,FALSE)","v":"Misc"}]
["2010-12-15","L & L Hawaiian Barbecue","L and  L Hawaiian Barbequ",-10.210000000000001,"debit","Restaurants","Chase CC",{"$f":"VLOOKUP(TestTable[[#This Row],[Category]],Table11[],2,FALSE)","v":"Food"}]
["2010-12-15","The Barber Shop","BYU BARBERSHOP",-15,"debit","Hair","Chase CC",{"$f":"VLOOKUP(TestTable[[#This Row],[Category]],Table11[],2,FALSE)","v":"Misc"}]
["2010-12-15","Blockbuster","BLOCKBUSTER INC#49096",-3.19,"debit","Movies & DVDs","Chase CC",{"$f":"VLOOKUP(TestTable[[#This Row],[Category]],Table11[],2,FALSE)","v":"Misc"}]
["2010-12-14","Transfer to Bank of America","Electronic Payment to BANK OF AMERICA",-6858.7,"debit","Credit Card Payment","ING Checking",{"$f":"VLOOKUP(TestTable[[#This Row],[Category]],Table11[],2,FALSE)","v":"Debt"}]
["2010-12-14","Paper Church Jesus","Paper Payment to CHURCH OF JESUS CHRIST OF LDS",-99.24,"debit","Charity","ING Checking",{"$f":"VLOOKUP(TestTable[[#This Row],[Category]],Table11[],2,FALSE)","v":"Misc"}]
["2010-12-14","Transfer to Amber","Electronic Payment to CITI CARDS",-59,"debit","Credit Card Payment","ING Checking",{"$f":"VLOOKUP(TestTable[[#This Row],[Category]],Table11[],2,FALSE)","v":"Debt"}]
["2010-12-14","Transfer from Checking","PAYMENT - ELECTRONIC",6858.7,"credit","Credit Card Payment","B of A CC",{"$f":"VLOOKUP(TestTable[[#This Row],[Category]],Table11[],2,FALSE)","v":"Debt"}]
["2010-12-14","Gas N Go","GAS N GO #2   10019016",-35.72,"debit","Groceries","Chase CC",{"$f":"VLOOKUP(TestTable[[#This Row],[Category]],Table11[],2,FALSE)","v":"Food"}]
["2010-12-14","Gas N Go","GAS N GO #2   10019016",-4.8099999999999996,"debit","Groceries","Chase CC",{"$f":"VLOOKUP(TestTable[[#This Row],[Category]],Table11[],2,FALSE)","v":"Food"}]
["2010-12-13","Transfer from ING Holding","Internet Deposit transferred from OSA XXXX4516",5667.72,"credit","Transfer","ING Checking",{"$f":"VLOOKUP(TestTable[[#This Row],[Category]],Table11[],2,FALSE)","v":"Misc"}]
["2010-12-13","Transfer to Checking","Internet Withdrawal transferred to EO XXXX4669",-5667.72,"debit","Transfer","ING Holding",{"$f":"VLOOKUP(TestTable[[#This Row],[Category]],Table11[],2,FALSE)","v":"Misc"}]
["2010-12-13","Savings Deposit Direct","Savings Deposit - Direct Deposit from BENEFIT PAYMENTS DEPOSIT",6218.77,"credit","Paycheck","ING Holding",{"$f":"VLOOKUP(TestTable[[#This Row],[Category]],Table11[],2,FALSE)","v":"Income"}]
["2010-12-13","Blockbuster","BLOCKBUSTER INC#49096",-3.19,"debit","Movies & DVDs","Chase CC",{"$f":"VLOOKUP(TestTable[[#This Row],[Category]],Table11[],2,FALSE)","v":"Misc"}]
["2010-12-13","Target","TARGET        00017541",-30.38,"debit","Miscellaneous","Chase CC",{"$f":"VLOOKUP(TestTable[[#This Row],[Category]],Table11[],2,FALSE)","v":"Misc"}]
["2010-12-12","Redbox","REDBOX *DVD RENTAL",-0.53,"debit","Movies & DVDs","Chase CC",{"$f":"VLOOKUP(TestTable[[#This Row],[Category]],Table11[],2,FALSE)","v":"Misc"}]
["2010-12-12","Teriyaki Stix","BYU WSC TERIYAKI STIX",-6.66,"debit","Restaurants","Chase CC",{"$f":"VLOOKUP(TestTable[[#This Row],[Category]],Table11[],2,FALSE)","v":"Food"}]
["2010-12-12","RadioShack","RADIOSHACK COR00140269",-43.44,"debit","Electronics & Software","Chase CC",{"$f":"VLOOKUP(TestTable[[#This Row],[Category]],Table11[],2,FALSE)","v":"Misc"}]
["2010-12-12","Gap","GAP #8412/THE",-55.82,"debit","Clothing","Chase CC",{"$f":"VLOOKUP(TestTable[[#This Row],[Category]],Table11[],2,FALSE)","v":"Misc"}]
["2010-12-12","Byu Wsc L","BYU WSC L&T PRODUCE",-10,"debit","Groceries","Chase CC",{"$f":"VLOOKUP(TestTable[[#This Row],[Category]],Table11[],2,FALSE)","v":"Food"}]
["2010-12-12","Marketplace Iga","MARKETPLACE CAFE",-6.62,"debit","Groceries","Chase CC",{"$f":"VLOOKUP(TestTable[[#This Row],[Category]],Table11[],2,FALSE)","v":"Food"}]
["2010-12-12","Wal-Mart","WALMART.COM",-46.64,"debit","Shopping","Chase CC",{"$f":"VLOOKUP(TestTable[[#This Row],[Category]],Table11[],2,FALSE)","v":"Misc"}]
["2010-12-12","Spicy Thai Restaurant","SPICY THAI RESTAURANT",-24,"debit","Restaurants","Chase CC",{"$f":"VLOOKUP(TestTable[[#This Row],[Category]],Table11[],2,FALSE)","v":"Food"}]
["2010-12-12","Subway","BYU WSC SUBWAY",-3.78,"debit","Fast Food","Chase CC",{"$f":"VLOOKUP(TestTable[[#This Row],[Category]],Table11[],2,FALSE)","v":"Food"}]
["2010-12-12","Chevron","CHEVRON 00208662",-46.65,"debit","Gas & Fuel","Chase CC",{"$f":"VLOOKUP(TestTable[[#This Row],[Category]],Table11[],2,FALSE)","v":"Auto"}]
["2010-12-10","Amazon","Debit Card Purchase - AMAZON COM AMZN COM BIL WA",-16.97,"debit","Shopping","ING Checking",{"$f":"VLOOKUP(TestTable[[#This Row],[Category]],Table11[],2,FALSE)","v":"Misc"}]
["2010-12-10","Deposit Byu Refundtype","Deposit BYU RefundTYPE: UCA CO: BYU Refund",1142,"credit","Income","MACU Checking",{"$f":"VLOOKUP(TestTable[[#This Row],[Category]],Table11[],2,FALSE)","v":"income"}]
["2010-12-10","Transfer to Checking","Withdrawal SWENSEN,AMBER MTYPE: ING DIRECT CO: SWENSEN,AMBER M",-1950,"debit","Transfer","MACU Checking",{"$f":"VLOOKUP(TestTable[[#This Row],[Category]],Table11[],2,FALSE)","v":"Misc"}]
["2010-12-10","L & L Hawaiian Barbecue","L and  L Hawaiian Barbequ",-10.210000000000001,"debit","Restaurants","Chase CC",{"$f":"VLOOKUP(TestTable[[#This Row],[Category]],Table11[],2,FALSE)","v":"Food"}]
["2010-12-09","Transfer from FREE CHECKING","Internet Deposit MOUNTAIN AMERICA FCU checking account XXXXXXXX1875",1950,"credit","Transfer","ING Checking",{"$f":"VLOOKUP(TestTable[[#This Row],[Category]],Table11[],2,FALSE)","v":"Misc"}]
["2010-12-09","Marketplace Iga","MARKETPLACE CAFE",-2.35,"debit","Groceries","Chase CC",{"$f":"VLOOKUP(TestTable[[#This Row],[Category]],Table11[],2,FALSE)","v":"Food"}]
["2010-12-08","Person Person Laura","Person2Person Payment to Laura or Clayne Larsen",-225,"debit","Mortgage & Rent","ING Checking",{"$f":"VLOOKUP(TestTable[[#This Row],[Category]],Table11[],2,FALSE)","v":"Housing"}]
["2010-12-08","Cash","CASH ADVANCE INTEREST CHA",-4.66,"debit","Business Services","Chase CC",{"$f":"VLOOKUP(TestTable[[#This Row],[Category]],Table11[],2,FALSE)","v":"Misc"}]
["2010-12-08","Withdrawal Byu Health","Withdrawal BYU Health PmtTYPE: Health CO: BYU Health Pmt",-51.3,"debit","Health & Fitness","MACU Checking",{"$f":"VLOOKUP(TestTable[[#This Row],[Category]],Table11[],2,FALSE)","v":"Misc"}]
["2010-12-08","Brigham Young University","BRIGHAM YOUNG UNIV WEB",-18,"debit","Education","Chase CC",{"$f":"VLOOKUP(TestTable[[#This Row],[Category]],Table11[],2,FALSE)","v":"Misc"}]
["2010-12-08","Alpine Electronics","ALPINE ELECTRONICS I",-50,"debit","Business Services","Chase CC",{"$f":"VLOOKUP(TestTable[[#This Row],[Category]],Table11[],2,FALSE)","v":"Misc"}]
["2010-12-07","Redbox","REDBOX *DVD RENTAL",-1.6,"debit","Movies & DVDs","Chase CC",{"$f":"VLOOKUP(TestTable[[#This Row],[Category]],Table11[],2,FALSE)","v":"Misc"}]
["2010-12-06","Cha Ching Here","Cha-ching! Here's your Cash Back",0.92,"credit","Income","ING Checking",{"$f":"VLOOKUP(TestTable[[#This Row],[Category]],Table11[],2,FALSE)","v":"income"}]
["2010-12-06","AT&amp;T","External Electronic Withdrawal from AT&T PAYMENT",-136.41,"debit","Mobile Phone","ING Holding",{"$f":"VLOOKUP(TestTable[[#This Row],[Category]],Table11[],2,FALSE)","v":"Phone"}]
["2010-12-06","Carl's Jr","CARL'S JR #1101363 QPS PROVO        UT",-11.81,"debit","Fast Food","B of A CC",{"$f":"VLOOKUP(TestTable[[#This Row],[Category]],Table11[],2,FALSE)","v":"Food"}]
["2010-12-06","Wal-Mart","WAL-MART  1768         OREM         UT",-135.72999999999999,"debit","Shopping","B of A CC",{"$f":"VLOOKUP(TestTable[[#This Row],[Category]],Table11[],2,FALSE)","v":"Misc"}]
["2010-12-06","Deposit Byu Refundtype","Deposit BYU RefundTYPE: UCA CO: BYU Refund",2023,"credit","Income","MACU Checking",{"$f":"VLOOKUP(TestTable[[#This Row],[Category]],Table11[],2,FALSE)","v":"income"}]
["2010-12-06","Papa John's","PAPA JOHNS 1566",-27.67,"debit","Fast Food","Chase CC",{"$f":"VLOOKUP(TestTable[[#This Row],[Category]],Table11[],2,FALSE)","v":"Food"}]
["2010-12-05","Cafe Paesan","CAFE PAESAN",-20.38,"debit","Restaurants","Chase CC",{"$f":"VLOOKUP(TestTable[[#This Row],[Category]],Table11[],2,FALSE)","v":"Food"}]
["2010-12-05","Redbox","REDBOX *DVDRESERVATION",-1.6,"debit","Movies & DVDs","Chase CC",{"$f":"VLOOKUP(TestTable[[#This Row],[Category]],Table11[],2,FALSE)","v":"Misc"}]
["2010-12-05","Marketplace Iga","MARKETPLACE CAFE",-7.75,"debit","Groceries","Chase CC",{"$f":"VLOOKUP(TestTable[[#This Row],[Category]],Table11[],2,FALSE)","v":"Food"}]
["2010-12-03","Person Person Laura","Person2Person Payment to Laura or Clayne Larsen",-850,"debit","Mortgage & Rent","ING Checking",{"$f":"VLOOKUP(TestTable[[#This Row],[Category]],Table11[],2,FALSE)","v":"Housing"}]
["2010-12-03","Electronic Deposit Brigham","Electronic Deposit from BRIGHAM YOUNG UN DIR DEP",43.5,"credit","Paycheck","ING Checking",{"$f":"VLOOKUP(TestTable[[#This Row],[Category]],Table11[],2,FALSE)","v":"Income"}]
["2010-12-03","Transfer to Bank of America","Electronic Withdrawal from BK OF AMER VI/MC ONLINE PMT",-118,"debit","Credit Card Payment","ING Checking",{"$f":"VLOOKUP(TestTable[[#This Row],[Category]],Table11[],2,FALSE)","v":"Debt"}]
["2010-12-03","JCPenney","JCPENNEY STORE 2770    PROVO        UT",14.93,"credit","Clothing","B of A CC",{"$f":"VLOOKUP(TestTable[[#This Row],[Category]],Table11[],2,FALSE)","v":"Misc"}]
["2010-12-03","Transfer to Checking","Withdrawal SWENSEN,AMBER MTYPE: ING DIRECT CO: SWENSEN,AMBER M",-245,"debit","Transfer","MACU Checking",{"$f":"VLOOKUP(TestTable[[#This Row],[Category]],Table11[],2,FALSE)","v":"Misc"}]
["2010-12-02","Transfer from FREE CHECKING","Internet Deposit MOUNTAIN AMERICA FCU checking account XXXXXXXX1875",245,"credit","Transfer","ING Checking",{"$f":"VLOOKUP(TestTable[[#This Row],[Category]],Table11[],2,FALSE)","v":"Misc"}]
["2010-12-02","Interest Charged Purchases","Interest Charged on Purchases",-57.81,"debit","Finance Charge","B of A CC",{"$f":"VLOOKUP(TestTable[[#This Row],[Category]],Table11[],2,FALSE)","v":"Misc"}]
["2010-12-01","Transfer to ING Holding","Internet Withdrawal transferred to OSA XXXX4516",-136,"debit","Transfer","ING Checking",{"$f":"VLOOKUP(TestTable[[#This Row],[Category]],Table11[],2,FALSE)","v":"Misc"}]
["2010-12-01","Transfer from Checking","Internet Deposit transferred from EO XXXX4669",136,"credit","Transfer","ING Holding",{"$f":"VLOOKUP(TestTable[[#This Row],[Category]],Table11[],2,FALSE)","v":"Misc"}]
["2010-12-01","Transfer from Checking","BA ELECTRONIC PAYMENT",118,"credit","Credit Card Payment","B of A CC",{"$f":"VLOOKUP(TestTable[[#This Row],[Category]],Table11[],2,FALSE)","v":"Debt"}]
["2010-12-01","Crazy Gym Orem","CRAZY 8 #6061 GYM60060 OREM         UT",21.43,"credit","Credit Card Payment","B of A CC",{"$f":"VLOOKUP(TestTable[[#This Row],[Category]],Table11[],2,FALSE)","v":"Debt"}]
["2010-12-01","Fee","TRANSACTION FEE",-11.4,"debit","Service Fee","Chase CC",{"$f":"VLOOKUP(TestTable[[#This Row],[Category]],Table11[],2,FALSE)","v":"Misc"}]
["2010-12-01","Cash","CASH CHASE-PROVO WMBFSB",-380,"debit","Business Services","Chase CC",{"$f":"VLOOKUP(TestTable[[#This Row],[Category]],Table11[],2,FALSE)","v":"Misc"}]
["2010-12-01","Transfer to Checking","Withdrawal SWENSEN,AMBER MTYPE: ING DIRECT CO: SWENSEN,AMBER M",-800,"debit","Transfer","MACU Checking",{"$f":"VLOOKUP(TestTable[[#This Row],[Category]],Table11[],2,FALSE)","v":"Misc"}]
["2010-11-30","Monthly Interest Paid","Monthly Interest Paid",0.02,"credit","Interest Income","ING Checking",{"$f":"VLOOKUP(TestTable[[#This Row],[Category]],Table11[],2,FALSE)","v":"Misc"}]
["2010-11-30","Periodic Finance Charge","Finance Charge Paid for Overdraft",-0.03,"debit","Finance Charge","ING Checking",{"$f":"VLOOKUP(TestTable[[#This Row],[Category]],Table11[],2,FALSE)","v":"Misc"}]
["2010-11-30","Transfer from FREE CHECKING","Internet Deposit MOUNTAIN AMERICA FCU checking account XXXXXXXX1875",800,"credit","Transfer","ING Checking",{"$f":"VLOOKUP(TestTable[[#This Row],[Category]],Table11[],2,FALSE)","v":"Misc"}]
["2010-11-30","Monthly Interest Paid","Monthly Interest Paid",0.1,"credit","Interest Income","ING Holding",{"$f":"VLOOKUP(TestTable[[#This Row],[Category]],Table11[],2,FALSE)","v":"Misc"}]
["2010-11-30","Provo City Utili","External Electronic Withdrawal from PROVO CITY UTILI UTIL PAYMT",-94.39,"debit","Uncategorized","ING Holding",{"$f":"VLOOKUP(TestTable[[#This Row],[Category]],Table11[],2,FALSE)","v":"Misc"}]
["2010-11-30","Monthly Interest Paid","Monthly Interest Paid",7.0000000000000007E-2,"credit","Interest Income","ING Savings",{"$f":"VLOOKUP(TestTable[[#This Row],[Category]],Table11[],2,FALSE)","v":"Misc"}]
["2010-11-30","Amazon","AMAZON.COM             AMZN.COM/BILLWA",-20,"debit","Shopping","B of A CC",{"$f":"VLOOKUP(TestTable[[#This Row],[Category]],Table11[],2,FALSE)","v":"Misc"}]
["2010-11-30","Deposit","Deposit",110,"credit","Income","MACU Checking",{"$f":"VLOOKUP(TestTable[[#This Row],[Category]],Table11[],2,FALSE)","v":"income"}]
["2010-11-30","Deposit By","Deposit by Check",132,"credit","Income","MACU Checking",{"$f":"VLOOKUP(TestTable[[#This Row],[Category]],Table11[],2,FALSE)","v":"income"}]
["2010-11-30","Commentavg Checking Bal","Transaction COMMENTAvg Checking Bal for Nov $569.74",0,"credit","Income","MACU Checking",{"$f":"VLOOKUP(TestTable[[#This Row],[Category]],Table11[],2,FALSE)","v":"income"}]
["2010-11-29","Kohl Orem Ut","KOHL'S #1285 OREM UT",79.849999999999994,"credit","Credit Card Payment","Citi CC",{"$f":"VLOOKUP(TestTable[[#This Row],[Category]],Table11[],2,FALSE)","v":"Debt"}]
["2010-11-29","Scout Com Wa","SCOUT.COM              888-979-0979 WA",-9.9499999999999993,"debit","Uncategorized","B of A CC",{"$f":"VLOOKUP(TestTable[[#This Row],[Category]],Table11[],2,FALSE)","v":"Misc"}]
["2010-11-29","Target","TARGET STORE T-1754 17 OREM         UT",-71.56,"debit","Miscellaneous","B of A CC",{"$f":"VLOOKUP(TestTable[[#This Row],[Category]],Table11[],2,FALSE)","v":"Misc"}]
["2010-11-29","Target","TARGET STORE T-1754 17 OREM         UT",-7.87,"debit","Miscellaneous","B of A CC",{"$f":"VLOOKUP(TestTable[[#This Row],[Category]],Table11[],2,FALSE)","v":"Misc"}]
["2010-11-29","Chevron","CHEVRON EXTRA MART #50 PROVO        UT",-51.04,"debit","Gas & Fuel","B of A CC",{"$f":"VLOOKUP(TestTable[[#This Row],[Category]],Table11[],2,FALSE)","v":"Auto"}]
["2010-11-29","Deposit","Deposit",780,"credit","Income","MACU Checking",{"$f":"VLOOKUP(TestTable[[#This Row],[Category]],Table11[],2,FALSE)","v":"income"}]
["2010-11-29","Chas Adv ATM","CHAS ADV ATM #UT1114  PRO",-400,"debit","Cash & ATM","Chase CC",{"$f":"VLOOKUP(TestTable[[#This Row],[Category]],Table11[],2,FALSE)","v":"Misc"}]
["2010-11-29","Fee","TRANSACTION FEE",-12,"debit","Service Fee","Chase CC",{"$f":"VLOOKUP(TestTable[[#This Row],[Category]],Table11[],2,FALSE)","v":"Misc"}]
["2010-11-29","Transfer to Checking","Withdrawal SWENSEN,AMBER MTYPE: ING DIRECT CO: SWENSEN,AMBER M",-180,"debit","Transfer","MACU Checking",{"$f":"VLOOKUP(TestTable[[#This Row],[Category]],Table11[],2,FALSE)","v":"Misc"}]
["2010-11-28","Best Buy","Bestbuy.com   00009944",-106.74,"debit","Electronics & Software","Chase CC",{"$f":"VLOOKUP(TestTable[[#This Row],[Category]],Table11[],2,FALSE)","v":"Misc"}]
["2010-11-27","Mod Bod","THE MOD BOD 0098001139 OREM         UT",-41.54,"debit","Clothing","B of A CC",{"$f":"VLOOKUP(TestTable[[#This Row],[Category]],Table11[],2,FALSE)","v":"Misc"}]
["2010-11-27","Crazy Gym","CRAZY 8 #6061 GYM60060 OREM         UT",-55.69,"debit","Gym","B of A CC",{"$f":"VLOOKUP(TestTable[[#This Row],[Category]],Table11[],2,FALSE)","v":"Misc"}]
["2010-11-27","Pretzelmaker","PRETZELMAKER 300001816 OREM         UT",-6.65,"debit","Fast Food","B of A CC",{"$f":"VLOOKUP(TestTable[[#This Row],[Category]],Table11[],2,FALSE)","v":"Food"}]
["2010-11-26","Blickenstaff","BLICKENSTAFF'S PROVO UT",-6.11,"debit","Uncategorized","Citi CC",{"$f":"VLOOKUP(TestTable[[#This Row],[Category]],Table11[],2,FALSE)","v":"Misc"}]
["2010-11-26","Consumer Reports","CR *CONSUMERREPORTS.OR 8003330663 NY",-5.95,"debit","Books","Citi CC",{"$f":"VLOOKUP(TestTable[[#This Row],[Category]],Table11[],2,FALSE)","v":"Misc"}]
["2010-11-26","Costco","COSTCO WHSE #0484 0000 OREM         UT",44.86,"credit","Miscellaneous","B of A CC",{"$f":"VLOOKUP(TestTable[[#This Row],[Category]],Table11[],2,FALSE)","v":"Misc"}]
["2010-11-26","Transfer from FREE CHECKING","amber bday money - Internet Deposit MOUNTAIN AMERICA FCU checking account XXXXXXXX1875",180,"credit","Transfer","ING Checking",{"$f":"VLOOKUP(TestTable[[#This Row],[Category]],Table11[],2,FALSE)","v":"Misc"}]
["2010-11-25","Chevron","CHEVRON 0203586 PROVO UT",-43.68,"debit","Gas & Fuel","Citi CC",{"$f":"VLOOKUP(TestTable[[#This Row],[Category]],Table11[],2,FALSE)","v":"Auto"}]
["2010-11-25","Harmon's","HARMON'S - OREM QPS OREM UT",-10.67,"debit","Groceries","Citi CC",{"$f":"VLOOKUP(TestTable[[#This Row],[Category]],Table11[],2,FALSE)","v":"Food"}]
["2010-11-24","Coffee Pod","COFFEE POD PROVO UT",-3.1,"debit","Coffee Shops","Citi CC",{"$f":"VLOOKUP(TestTable[[#This Row],[Category]],Table11[],2,FALSE)","v":"Food"}]
["2010-11-24","JCPenney","JCPENNEY STORE 2770    PROVO        UT",-22.4,"debit","Clothing","B of A CC",{"$f":"VLOOKUP(TestTable[[#This Row],[Category]],Table11[],2,FALSE)","v":"Misc"}]
["2010-11-24","JCPenney","JCPENNEY STORE 2770    PROVO        UT",-67.209999999999994,"debit","Clothing","B of A CC",{"$f":"VLOOKUP(TestTable[[#This Row],[Category]],Table11[],2,FALSE)","v":"Misc"}]
["2010-11-24","Deposit By","Deposit by Check",180,"credit","Income","MACU Checking",{"$f":"VLOOKUP(TestTable[[#This Row],[Category]],Table11[],2,FALSE)","v":"income"}]
["2010-11-23","Priceline - Hotel","PLN*PRICELINE.COM HTL 800-657-9168 CT",-58.2,"debit","Hotel","Citi CC",{"$f":"VLOOKUP(TestTable[[#This Row],[Category]],Table11[],2,FALSE)","v":"Misc"}]
["2010-11-23","Byu Creamery Ninth","BYU CREAMERY ON NINTH PROVO UT",-4.3,"debit","Uncategorized","Citi CC",{"$f":"VLOOKUP(TestTable[[#This Row],[Category]],Table11[],2,FALSE)","v":"Misc"}]
["2010-11-23","Mac Neil Automotive Products","MAP*MACNEIL AUTOMOTIVE 800-441-6287 IL",-79.95,"debit","Service & Parts","Citi CC",{"$f":"VLOOKUP(TestTable[[#This Row],[Category]],Table11[],2,FALSE)","v":"Auto"}]
["2010-11-23","Costco","COSTCO WHSE #0484 0000 OREM         UT",-90.79,"debit","Miscellaneous","B of A CC",{"$f":"VLOOKUP(TestTable[[#This Row],[Category]],Table11[],2,FALSE)","v":"Misc"}]
["2010-11-23","Costco","COSTCO WHSE #0484 0000 OREM         UT",-37.26,"debit","Miscellaneous","B of A CC",{"$f":"VLOOKUP(TestTable[[#This Row],[Category]],Table11[],2,FALSE)","v":"Misc"}]
["2010-11-23","Veracity Network Veracity","External Electronic Withdrawal from Veracity Network Veracity N",-48.28,"debit","Internet","ING Holding",{"$f":"VLOOKUP(TestTable[[#This Row],[Category]],Table11[],2,FALSE)","v":"Utilities"}]
["2010-11-22","Mod Bod","THE MOD BOD QPS OREM UT",-19.190000000000001,"debit","Clothing","Citi CC",{"$f":"VLOOKUP(TestTable[[#This Row],[Category]],Table11[],2,FALSE)","v":"Misc"}]
["2010-11-22","Kohl's","KOHL'S #1285 OREM UT",-201.37,"debit","Clothing","Citi CC",{"$f":"VLOOKUP(TestTable[[#This Row],[Category]],Table11[],2,FALSE)","v":"Misc"}]
["2010-11-22","Byu Creamery Ninth","BYU CREAMERY ON NINTH PROVO UT",-12.27,"debit","Uncategorized","Citi CC",{"$f":"VLOOKUP(TestTable[[#This Row],[Category]],Table11[],2,FALSE)","v":"Misc"}]
["2010-11-22","Hilton","HILTON HOTELS OMAHA OMAHA NE",-51.23,"debit","Hotel","Citi CC",{"$f":"VLOOKUP(TestTable[[#This Row],[Category]],Table11[],2,FALSE)","v":"Misc"}]
["2010-11-22","Panda Express","PANDA EXPRESS 455 QPS PROVO UT",-9.75,"debit","Fast Food","Citi CC",{"$f":"VLOOKUP(TestTable[[#This Row],[Category]],Table11[],2,FALSE)","v":"Food"}]
["2010-11-22","Orange Julius","ORANGE JULIUS #6164QPS PROVO UT",-3.76,"debit","Restaurants","Citi CC",{"$f":"VLOOKUP(TestTable[[#This Row],[Category]],Table11[],2,FALSE)","v":"Food"}]
["2010-11-21","Apple","APPLE STORE  #R125",-1281.08,"debit","Electronics & Software","Chase CC",{"$f":"VLOOKUP(TestTable[[#This Row],[Category]],Table11[],2,FALSE)","v":"Misc"}]
["2010-11-20","Smith's Food","SMITHS FOOD #4136 QPS PROVO UT",-4.78,"debit","Groceries","Citi CC",{"$f":"VLOOKUP(TestTable[[#This Row],[Category]],Table11[],2,FALSE)","v":"Food"}]
["2010-11-20","Sizzler","SIZZLER 875 PROVO UT",-28.37,"debit","Restaurants","Citi CC",{"$f":"VLOOKUP(TestTable[[#This Row],[Category]],Table11[],2,FALSE)","v":"Food"}]
["2010-11-20","Maceys","MACEYS PROVO PROVO UT",-24.6,"debit","Groceries","Citi CC",{"$f":"VLOOKUP(TestTable[[#This Row],[Category]],Table11[],2,FALSE)","v":"Food"}]
["2010-11-20","Provo Di","PROVO DI PROVO UT",-11,"debit","Uncategorized","Citi CC",{"$f":"VLOOKUP(TestTable[[#This Row],[Category]],Table11[],2,FALSE)","v":"Misc"}]
["2010-11-19","Chevron","CHEVRON 0203586 PROVO UT",-50.83,"debit","Gas & Fuel","Citi CC",{"$f":"VLOOKUP(TestTable[[#This Row],[Category]],Table11[],2,FALSE)","v":"Auto"}]
["2010-11-19","Wendy's","WENDYS #8261 Q25 SALT LAKE CIT UT",-3.2,"debit","Fast Food","Citi CC",{"$f":"VLOOKUP(TestTable[[#This Row],[Category]],Table11[],2,FALSE)","v":"Food"}]
["2010-11-19","Target American Fork","TARGET 00018143 AMERICAN FORK UT",5.12,"credit","Credit Card Payment","Citi CC",{"$f":"VLOOKUP(TestTable[[#This Row],[Category]],Table11[],2,FALSE)","v":"Debt"}]
["2010-11-19","Ken Garff Honda","KEN GARFF HONDA O OREM UT",-130.59,"debit","Service & Parts","Citi CC",{"$f":"VLOOKUP(TestTable[[#This Row],[Category]],Table11[],2,FALSE)","v":"Auto"}]
["2010-11-19","Kracy Mcgees Qps","KRACY MCGEES QPS OMAHA NE",-6,"debit","Uncategorized","Citi CC",{"$f":"VLOOKUP(TestTable[[#This Row],[Category]],Table11[],2,FALSE)","v":"Misc"}]
["2010-11-19","Salt Lake City Dept Airports","SALT LAKE CITY DEPT OF SALT LAKE CTY UT",-14,"debit","Air Travel","Citi CC",{"$f":"VLOOKUP(TestTable[[#This Row],[Category]],Table11[],2,FALSE)","v":"Misc"}]
["2010-11-19","Wendy's","WENDYS #8261 Q25 SALT LAKE CIT UT",-4.62,"debit","Fast Food","Citi CC",{"$f":"VLOOKUP(TestTable[[#This Row],[Category]],Table11[],2,FALSE)","v":"Food"}]
["2010-11-19","Delta","DELTA 00682304231066 OMAHA NE",-25,"debit","Air Travel","Citi CC",{"$f":"VLOOKUP(TestTable[[#This Row],[Category]],Table11[],2,FALSE)","v":"Misc"}]
["2010-11-19","Electronic Deposit Brigham","Electronic Deposit from BRIGHAM YOUNG UN DIR DEP",101.5,"credit","Paycheck","ING Checking",{"$f":"VLOOKUP(TestTable[[#This Row],[Category]],Table11[],2,FALSE)","v":"Income"}]
["2010-11-19","ATM Withdrawal","ATM Withdrawal - CARDTRONICSLPC  AMERICAN FORK, UT US",-40,"debit","Cash & ATM","ING Checking",{"$f":"VLOOKUP(TestTable[[#This Row],[Category]],Table11[],2,FALSE)","v":"Misc"}]
["2010-11-18","ATM Fee","ATM Withdrawal - 1219 SOUTH 800 EAST  OREM, UT US",-1.5,"debit","ATM Fee","ING Checking",{"$f":"VLOOKUP(TestTable[[#This Row],[Category]],Table11[],2,FALSE)","v":"Misc"}]
["2010-11-18","ATM Withdrawal","ATM Withdrawal - 1219 SOUTH 800 EAST  OREM, UT US",-80,"debit","Cash & ATM","ING Checking",{"$f":"VLOOKUP(TestTable[[#This Row],[Category]],Table11[],2,FALSE)","v":"Misc"}]
["2010-11-17","Great Ame Bage","GREAT AME BAGE30551303 SALT LAKECITY UT",-5.71,"debit","Fast Food","Citi CC",{"$f":"VLOOKUP(TestTable[[#This Row],[Category]],Table11[],2,FALSE)","v":"Food"}]
["2010-11-17","Maceys","MACEYS PROVO PROVO UT",-5.41,"debit","Groceries","Citi CC",{"$f":"VLOOKUP(TestTable[[#This Row],[Category]],Table11[],2,FALSE)","v":"Food"}]
["2010-11-17","Delta","DELTA 00682295957814 SALT LAKE CTY UT",-23,"debit","Air Travel","Citi CC",{"$f":"VLOOKUP(TestTable[[#This Row],[Category]],Table11[],2,FALSE)","v":"Misc"}]
["2010-11-17","Subway","SUBWAY 03024239 PROVO UT",-10.97,"debit","Fast Food","Citi CC",{"$f":"VLOOKUP(TestTable[[#This Row],[Category]],Table11[],2,FALSE)","v":"Food"}]
["2010-11-17","Air Terminal Gifts","AIR TERMINAL GIFTS QPS SALT LAKE CIT UT",-1.84,"debit","Gift","Citi CC",{"$f":"VLOOKUP(TestTable[[#This Row],[Category]],Table11[],2,FALSE)","v":"Misc"}]
["2010-11-17","Chevron","CHEVRON 0208662 PROVO UT",-28.62,"debit","Gas & Fuel","Citi CC",{"$f":"VLOOKUP(TestTable[[#This Row],[Category]],Table11[],2,FALSE)","v":"Auto"}]
["2010-11-17","Marketplace Iga","MARKETPLACE CAFE PROVO UT",-8.2799999999999994,"debit","Groceries","Citi CC",{"$f":"VLOOKUP(TestTable[[#This Row],[Category]],Table11[],2,FALSE)","v":"Food"}]
["2010-11-17","Costco","COSTCO WHSE #0484 0000 OREM         UT",-23.95,"debit","Miscellaneous","B of A CC",{"$f":"VLOOKUP(TestTable[[#This Row],[Category]],Table11[],2,FALSE)","v":"Misc"}]
["2010-11-17","Cascade Collision Repair","WithdrawalCASCADE COLLISION REPA OREM UT Date 11/15/10 24071050320987153980115 7531",-1000,"debit","Service & Parts","MACU Checking",{"$f":"VLOOKUP(TestTable[[#This Row],[Category]],Table11[],2,FALSE)","v":"Auto"}]
["2010-11-17","Newegg","WWW.NEWEGG.COM 800-390-1119 CA",-90.98,"debit","Electronics & Software","Citi CC",{"$f":"VLOOKUP(TestTable[[#This Row],[Category]],Table11[],2,FALSE)","v":"Misc"}]
["2010-11-17","Interest Charged Standard","INTEREST CHARGED TO STANDARD PURCH",-8.48,"debit","Finance Charge","Citi CC",{"$f":"VLOOKUP(TestTable[[#This Row],[Category]],Table11[],2,FALSE)","v":"Misc"}]
["2010-11-17","Liberty Mutual","External Electronic Withdrawal from LIBERTY MUTUAL PAYMENT",-113.16,"debit","Auto Insurance","ING Holding",{"$f":"VLOOKUP(TestTable[[#This Row],[Category]],Table11[],2,FALSE)","v":"Auto"}]
["2010-11-17","Questar Gas","External Electronic Withdrawal from Questar Gas Co. QGC",-24.02,"debit","Utilities","ING Holding",{"$f":"VLOOKUP(TestTable[[#This Row],[Category]],Table11[],2,FALSE)","v":"Utilities"}]
["2010-11-16","Marketplace Iga","MARKETPLACE CAFE PROVO UT",-2.0299999999999998,"debit","Groceries","Citi CC",{"$f":"VLOOKUP(TestTable[[#This Row],[Category]],Table11[],2,FALSE)","v":"Food"}]
["2010-11-16","Marketplace Iga","MARKETPLACE CAFE PROVO UT",-4.3099999999999996,"debit","Groceries","Citi CC",{"$f":"VLOOKUP(TestTable[[#This Row],[Category]],Table11[],2,FALSE)","v":"Food"}]
["2010-11-16","Transfer to Checking","Withdrawal SWENSEN,AMBER MTYPE: ING DIRECT CO: SWENSEN,AMBER M",-253,"debit","Transfer","MACU Checking",{"$f":"VLOOKUP(TestTable[[#This Row],[Category]],Table11[],2,FALSE)","v":"Misc"}]
["2010-11-15","Smith's Food","SMITHS FOOD #4136 QPS PROVO UT",-16,"debit","Groceries","Citi CC",{"$f":"VLOOKUP(TestTable[[#This Row],[Category]],Table11[],2,FALSE)","v":"Food"}]
["2010-11-15","Honks","HONKS 25 QPS PROVO UT",-9.61,"debit","Shopping","Citi CC",{"$f":"VLOOKUP(TestTable[[#This Row],[Category]],Table11[],2,FALSE)","v":"Misc"}]
["2010-11-15","Toys \"R\" Us","TOYS R US #5689 QPS OREM UT",-5.33,"debit","Toys","Citi CC",{"$f":"VLOOKUP(TestTable[[#This Row],[Category]],Table11[],2,FALSE)","v":"Misc"}]
["2010-11-15","Marketplace Iga","MARKETPLACE CAFE PROVO UT",-2.1,"debit","Groceries","Citi CC",{"$f":"VLOOKUP(TestTable[[#This Row],[Category]],Table11[],2,FALSE)","v":"Food"}]
["2010-11-15","Wendy's","WENDYS #4710 Q25 PROVO UT",-12.91,"debit","Fast Food","Citi CC",{"$f":"VLOOKUP(TestTable[[#This Row],[Category]],Table11[],2,FALSE)","v":"Food"}]
["2010-11-15","Transfer from FREE CHECKING","Internet Deposit MOUNTAIN AMERICA FCU checking account XXXXXXXX1875",253,"credit","Transfer","ING Checking",{"$f":"VLOOKUP(TestTable[[#This Row],[Category]],Table11[],2,FALSE)","v":"Misc"}]
["2010-11-15","Transfer to Amber","Electronic Withdrawal from CITI CARD ONLINE PAYMENT",-39,"debit","Credit Card Payment","ING Checking",{"$f":"VLOOKUP(TestTable[[#This Row],[Category]],Table11[],2,FALSE)","v":"Debt"}]
["2010-11-13","Steve Crest","STEVE'S CREST PROVO UT",-14.2,"debit","Uncategorized","Citi CC",{"$f":"VLOOKUP(TestTable[[#This Row],[Category]],Table11[],2,FALSE)","v":"Misc"}]
["2010-11-13","Immaculate Heart Relig","IMMACULATE HEART RELIG DRAPER UT",-3.73,"debit","Uncategorized","Citi CC",{"$f":"VLOOKUP(TestTable[[#This Row],[Category]],Table11[],2,FALSE)","v":"Misc"}]
["2010-11-12","Withdrawal Transfer Loan","Withdrawal Transfer To Loan 61",-265,"debit","Transfer","MACU Checking",{"$f":"VLOOKUP(TestTable[[#This Row],[Category]],Table11[],2,FALSE)","v":"Misc"}]
["2010-11-12","Chili's","CHILI'S TO GO 10338150 DETROIT MI",-12.01,"debit","Restaurants","Citi CC",{"$f":"VLOOKUP(TestTable[[#This Row],[Category]],Table11[],2,FALSE)","v":"Food"}]
["2010-11-12","Delta","DELTA 00625136381454 APPLETON WI",-25,"debit","Air Travel","Citi CC",{"$f":"VLOOKUP(TestTable[[#This Row],[Category]],Table11[],2,FALSE)","v":"Misc"}]
["2010-11-12","Chevron","CHEVRON 0305397 Q61 LEHI UT",-2.66,"debit","Gas & Fuel","Citi CC",{"$f":"VLOOKUP(TestTable[[#This Row],[Category]],Table11[],2,FALSE)","v":"Auto"}]
["2010-11-12","Salt Lake City Dept Airports","SALT LAKE CITY DEPT OF SALT LAKE CTY UT",-56,"debit","Air Travel","Citi CC",{"$f":"VLOOKUP(TestTable[[#This Row],[Category]],Table11[],2,FALSE)","v":"Misc"}]
["2010-11-12","Copperleaf Hotel","COPPERLEAF HOTEL QPS APPLETON WI",-17.149999999999999,"debit","Hotel","Citi CC",{"$f":"VLOOKUP(TestTable[[#This Row],[Category]],Table11[],2,FALSE)","v":"Misc"}]
["2010-11-12","Transfer from Checking","CLICK-TO-PAY PAYMENT, THANK YOU",39,"credit","Credit Card Payment","Citi CC",{"$f":"VLOOKUP(TestTable[[#This Row],[Category]],Table11[],2,FALSE)","v":"Debt"}]
["2010-11-12","Chs Atw Main","CHS @ ATW MAIN00995076 APPLETON WI",-3,"debit","Uncategorized","Citi CC",{"$f":"VLOOKUP(TestTable[[#This Row],[Category]],Table11[],2,FALSE)","v":"Misc"}]
["2010-11-12","Transfer from ING Savings","Internet Deposit transferred from OSA XXXX3822",223.44,"credit","Transfer","ING Holding",{"$f":"VLOOKUP(TestTable[[#This Row],[Category]],Table11[],2,FALSE)","v":"Misc"}]
["2010-11-12","Transfer to ING Holding","Internet Withdrawal transferred to OSA XXXX4516",-223.44,"debit","Transfer","ING Savings",{"$f":"VLOOKUP(TestTable[[#This Row],[Category]],Table11[],2,FALSE)","v":"Misc"}]
["2010-11-11","F Lakeside N","F15 LAKESIDE N20356093 ST PAUL MN",-2.46,"debit","Uncategorized","Citi CC",{"$f":"VLOOKUP(TestTable[[#This Row],[Category]],Table11[],2,FALSE)","v":"Misc"}]
["2010-11-11","Air Terminal Gifts","AIR TERMINAL GIFTS QPS SALT LAKE CIT UT",-1.84,"debit","Gift","Citi CC",{"$f":"VLOOKUP(TestTable[[#This Row],[Category]],Table11[],2,FALSE)","v":"Misc"}]
["2010-11-11","California Pizza Kitchen","CALIFORNIA PIZ30553218 SALT LAKECITY UT",-9.8000000000000007,"debit","Restaurants","Citi CC",{"$f":"VLOOKUP(TestTable[[#This Row],[Category]],Table11[],2,FALSE)","v":"Food"}]
["2010-11-11","Chili's","CHILI'S - M MS20350724 ST PAUL MN",-18,"debit","Restaurants","Citi CC",{"$f":"VLOOKUP(TestTable[[#This Row],[Category]],Table11[],2,FALSE)","v":"Food"}]
["2010-11-11","Delta","DELTA 00682299069583 SALT LAKE CTY UT",-23,"debit","Air Travel","Citi CC",{"$f":"VLOOKUP(TestTable[[#This Row],[Category]],Table11[],2,FALSE)","v":"Misc"}]
["2010-11-11","Wendy's","WENDYS #8260 Q25 DRAPER UT",-8.9600000000000009,"debit","Fast Food","Citi CC",{"$f":"VLOOKUP(TestTable[[#This Row],[Category]],Table11[],2,FALSE)","v":"Food"}]
["2010-11-11","McDonald's","MCDONALD'S F11655 MURRAY UT",-3.24,"debit","Fast Food","Citi CC",{"$f":"VLOOKUP(TestTable[[#This Row],[Category]],Table11[],2,FALSE)","v":"Food"}]
["2010-11-10","Buehler's Buy-Low","BUY LOW MARKET PROVO UT",-22.4,"debit","Groceries","Citi CC",{"$f":"VLOOKUP(TestTable[[#This Row],[Category]],Table11[],2,FALSE)","v":"Food"}]
["2010-11-10","Marketplace Iga","MARKETPLACE CAFE PROVO UT",-9.35,"debit","Groceries","Citi CC",{"$f":"VLOOKUP(TestTable[[#This Row],[Category]],Table11[],2,FALSE)","v":"Food"}]
["2010-11-10","Brigham Young Univ Senior","BRIGHAM YOUNG UNIV. PROVO UT",-2,"debit","Education","Citi CC",{"$f":"VLOOKUP(TestTable[[#This Row],[Category]],Table11[],2,FALSE)","v":"Misc"}]
["2010-11-10","Byu Barbershop","Debit Card Purchase - BYU BARBERSHOP PROVO UT",-15,"debit","Hair","ING Checking",{"$f":"VLOOKUP(TestTable[[#This Row],[Category]],Table11[],2,FALSE)","v":"Misc"}]
["2010-11-10","J Dawgs","Debit Card Purchase - J DAWGS RESTAURANTS LL PROVO UT",-4,"debit","Restaurants","ING Checking",{"$f":"VLOOKUP(TestTable[[#This Row],[Category]],Table11[],2,FALSE)","v":"Food"}]
["2010-11-10","Brigham Young University","Debit Card Purchase - BRIGHAM YOUNG UNIV WEB 01111111111 UT",-14,"debit","Education","ING Checking",{"$f":"VLOOKUP(TestTable[[#This Row],[Category]],Table11[],2,FALSE)","v":"Misc"}]
["2010-11-09","Marketplace Iga","MARKETPLACE CAFE PROVO UT",-1.72,"debit","Groceries","Citi CC",{"$f":"VLOOKUP(TestTable[[#This Row],[Category]],Table11[],2,FALSE)","v":"Food"}]
["2010-11-09","Target Orem Ut","TARGET 00017541 OREM UT",3.21,"credit","Credit Card Payment","Citi CC",{"$f":"VLOOKUP(TestTable[[#This Row],[Category]],Table11[],2,FALSE)","v":"Debt"}]
["2010-11-09","Spicy Thai Restauraqps","Debit Card Purchase - SPICY THAI RESTAURAQPS PROVO UT",-11.61,"debit","Restaurants","ING Checking",{"$f":"VLOOKUP(TestTable[[#This Row],[Category]],Table11[],2,FALSE)","v":"Food"}]
["2010-11-09","Redbox","Debit Card Purchase - REDBOX DVD RENTAL 866 733 2693 IL",-2.14,"debit","Movies & DVDs","ING Checking",{"$f":"VLOOKUP(TestTable[[#This Row],[Category]],Table11[],2,FALSE)","v":"Misc"}]
["2010-11-08","Costco","COSTCO WHSE #0484 0000 OREM         UT",-105.01,"debit","Miscellaneous","B of A CC",{"$f":"VLOOKUP(TestTable[[#This Row],[Category]],Table11[],2,FALSE)","v":"Misc"}]
["2010-11-08","Deposit","Deposit",1296.6300000000001,"credit","Income","MACU Checking",{"$f":"VLOOKUP(TestTable[[#This Row],[Category]],Table11[],2,FALSE)","v":"income"}]
["2010-11-08","Microsoft XBox Live","MICROSOFT *XBOX LIVE 08003865550 WA",-9.99,"debit","Electronics & Software","Citi CC",{"$f":"VLOOKUP(TestTable[[#This Row],[Category]],Table11[],2,FALSE)","v":"Misc"}]
["2010-11-08","Smith's Tix","SMITHS TIX WEB 801-4671055 UT",-51.6,"debit","Entertainment","Citi CC",{"$f":"VLOOKUP(TestTable[[#This Row],[Category]],Table11[],2,FALSE)","v":"Misc"}]
["2010-11-08","Target","TARGET 00017541 OREM UT",-80.069999999999993,"debit","Miscellaneous","Citi CC",{"$f":"VLOOKUP(TestTable[[#This Row],[Category]],Table11[],2,FALSE)","v":"Misc"}]
["2010-11-08","iTunes","APL*ITUNES 866-712-7753 CA",-6.33,"debit","Music","Citi CC",{"$f":"VLOOKUP(TestTable[[#This Row],[Category]],Table11[],2,FALSE)","v":"Misc"}]
["2010-11-08","Taylor's Bike Shop","Debit Card Purchase - TAYLOR S BIKE SHOP PROVO UT",-16,"debit","Sporting Goods","ING Checking",{"$f":"VLOOKUP(TestTable[[#This Row],[Category]],Table11[],2,FALSE)","v":"Misc"}]
["2010-11-08","Byu Creamery Ninth","Debit Card Purchase - BYU CREAMERY ON NINTH PROVO UT",-8.5299999999999994,"debit","Uncategorized","ING Checking",{"$f":"VLOOKUP(TestTable[[#This Row],[Category]],Table11[],2,FALSE)","v":"Misc"}]
["2010-11-08","Marketplace Iga","Debit Card Purchase - MARKETPLACE CAFE PROVO UT",-2.89,"debit","Groceries","ING Checking",{"$f":"VLOOKUP(TestTable[[#This Row],[Category]],Table11[],2,FALSE)","v":"Food"}]
["2010-11-07","Marketplace Iga","Debit Card Purchase - MARKETPLACE CAFE PROVO UT",-1.72,"debit","Groceries","ING Checking",{"$f":"VLOOKUP(TestTable[[#This Row],[Category]],Table11[],2,FALSE)","v":"Food"}]
["2010-11-06","AutoZone","AUTOZONE #0865 PROVO UT",-88.25,"debit","Service & Parts","Citi CC",{"$f":"VLOOKUP(TestTable[[#This Row],[Category]],Table11[],2,FALSE)","v":"Auto"}]
["2010-11-06","AutoZone","AUTOZONE #0865 QPS PROVO UT",-9.6,"debit","Service & Parts","Citi CC",{"$f":"VLOOKUP(TestTable[[#This Row],[Category]],Table11[],2,FALSE)","v":"Auto"}]
["2010-11-05","iTunes","APL*ITUNES 866-712-7753 CA",-7.47,"debit","Music","Citi CC",{"$f":"VLOOKUP(TestTable[[#This Row],[Category]],Table11[],2,FALSE)","v":"Misc"}]
["2010-11-05","Goodwood Barbecue","GOODWOOD BARBECUE CO OREM UT",-44,"debit","Restaurants","Citi CC",{"$f":"VLOOKUP(TestTable[[#This Row],[Category]],Table11[],2,FALSE)","v":"Food"}]
["2010-11-05","Electronic Deposit","Electronic Deposit",68.88,"credit","Income","ING Checking",{"$f":"VLOOKUP(TestTable[[#This Row],[Category]],Table11[],2,FALSE)","v":"income"}]
["2010-11-05","External Electronic Withdrawal","External Electronic Withdrawal",-76.680000000000007,"debit","Uncategorized","ING Holding",{"$f":"VLOOKUP(TestTable[[#This Row],[Category]],Table11[],2,FALSE)","v":"Misc"}]
["2010-11-03","Wendy's","WENDYS #5263 Q25 OREM UT",-3.53,"debit","Fast Food","Citi CC",{"$f":"VLOOKUP(TestTable[[#This Row],[Category]],Table11[],2,FALSE)","v":"Food"}]
["2010-11-03","Byu Creamery Ninth","BYU CREAMERY ON NINTH PROVO UT",-5.33,"debit","Uncategorized","ING Checking",{"$f":"VLOOKUP(TestTable[[#This Row],[Category]],Table11[],2,FALSE)","v":"Misc"}]
["2010-11-03","Cha Ching Here","Cha-ching! Here's your Cash Back",3.27,"credit","Income","ING Checking",{"$f":"VLOOKUP(TestTable[[#This Row],[Category]],Table11[],2,FALSE)","v":"income"}]
["2010-11-02","iTunes","APL*ITUNES 866-712-7753 CA",-10.65,"debit","Music","Citi CC",{"$f":"VLOOKUP(TestTable[[#This Row],[Category]],Table11[],2,FALSE)","v":"Misc"}]
["2010-11-02","Electronic Withdrawal","Electronic Withdrawal",-25,"debit","Uncategorized","ING Checking",{"$f":"VLOOKUP(TestTable[[#This Row],[Category]],Table11[],2,FALSE)","v":"Misc"}]
["2010-11-02","External Electronic Withdrawal","External Electronic Withdrawal",-112.13,"debit","Uncategorized","ING Holding",{"$f":"VLOOKUP(TestTable[[#This Row],[Category]],Table11[],2,FALSE)","v":"Misc"}]
["2010-11-02","Interest Charged Purchases","Interest Charged on Purchases",-57.06,"debit","Finance Charge","B of A CC",{"$f":"VLOOKUP(TestTable[[#This Row],[Category]],Table11[],2,FALSE)","v":"Misc"}]
["2010-11-01","Target","TARGET 00017541 OREM UT",-31.96,"debit","Miscellaneous","Citi CC",{"$f":"VLOOKUP(TestTable[[#This Row],[Category]],Table11[],2,FALSE)","v":"Misc"}]
["2010-11-01","Chevron","CHEVRON 0204564 LEHI UT",-50.94,"debit","Gas & Fuel","Citi CC",{"$f":"VLOOKUP(TestTable[[#This Row],[Category]],Table11[],2,FALSE)","v":"Auto"}]
["2010-11-01","Marketplace Iga","MARKETPLACE CAFE PROVO UT - Deb",-9.35,"debit","Groceries","ING Checking",{"$f":"VLOOKUP(TestTable[[#This Row],[Category]],Table11[],2,FALSE)","v":"Food"}]
["2010-11-01","Marketplace Iga","MARKETPLACE CAFE PROVO UT - Deb",-1.07,"debit","Groceries","ING Checking",{"$f":"VLOOKUP(TestTable[[#This Row],[Category]],Table11[],2,FALSE)","v":"Food"}]
["2010-11-01","Interest Paid For","Interest paid for overdraft Int",-0.03,"debit","Bank Fee","ING Checking",{"$f":"VLOOKUP(TestTable[[#This Row],[Category]],Table11[],2,FALSE)","v":"Misc"}]
["2010-10-31","Commentavg Checking Bal","Transaction COMMENTAvg Checking Bal for Oct $128.95",0,"credit","Income","MACU Checking",{"$f":"VLOOKUP(TestTable[[#This Row],[Category]],Table11[],2,FALSE)","v":"income"}]
["2010-10-31","Wendy's","WENDYS 12 Q25 MOUNTAIN HOME ID",-1.26,"debit","Fast Food","Citi CC",{"$f":"VLOOKUP(TestTable[[#This Row],[Category]],Table11[],2,FALSE)","v":"Food"}]
["2010-10-31","Pilot Travel Center","PILOT 00007740 SNOWVILLE UT",-3.94,"debit","Gas & Fuel","Citi CC",{"$f":"VLOOKUP(TestTable[[#This Row],[Category]],Table11[],2,FALSE)","v":"Auto"}]
["2010-10-31","Chevron","CHEVRON 0208859 Q61 MERIDIAN ID",-4,"debit","Gas & Fuel","Citi CC",{"$f":"VLOOKUP(TestTable[[#This Row],[Category]],Table11[],2,FALSE)","v":"Auto"}]
["2010-10-31","McDonald's","MCDONALD'S F23720 MERIDIAN ID",-4.6500000000000004,"debit","Fast Food","Citi CC",{"$f":"VLOOKUP(TestTable[[#This Row],[Category]],Table11[],2,FALSE)","v":"Food"}]
["2010-10-31","Chevron","CHEVRON 0208859 MERIDIAN ID",-49.97,"debit","Gas & Fuel","Citi CC",{"$f":"VLOOKUP(TestTable[[#This Row],[Category]],Table11[],2,FALSE)","v":"Auto"}]
["2010-10-31","Person Person Laura","Person2Person Payment to Laura",-1075,"debit","Mortgage & Rent","ING Checking",{"$f":"VLOOKUP(TestTable[[#This Row],[Category]],Table11[],2,FALSE)","v":"Housing"}]
["2010-10-31","Transfer from ING Savings","Internet Deposit",1001,"credit","Transfer","ING Checking",{"$f":"VLOOKUP(TestTable[[#This Row],[Category]],Table11[],2,FALSE)","v":"Misc"}]
["2010-10-31","Interest Paid","Interest Paid",0.04,"credit","Interest Income","ING Checking",{"$f":"VLOOKUP(TestTable[[#This Row],[Category]],Table11[],2,FALSE)","v":"Misc"}]
["2010-10-31","Interest Paid","Interest Paid",0.44,"credit","Interest Income","ING Holding",{"$f":"VLOOKUP(TestTable[[#This Row],[Category]],Table11[],2,FALSE)","v":"Misc"}]
["2010-10-31","Transfer to Checking","Internet Withdrawal",-1001,"debit","Transfer","ING Savings",{"$f":"VLOOKUP(TestTable[[#This Row],[Category]],Table11[],2,FALSE)","v":"Misc"}]
["2010-10-31","Interest Paid","Interest Paid",1.0900000000000001,"credit","Interest Income","ING Savings",{"$f":"VLOOKUP(TestTable[[#This Row],[Category]],Table11[],2,FALSE)","v":"Misc"}]
["2010-10-31","Transfer from Checking","BA ELECTRONIC PAYMENT",25,"credit","Credit Card Payment","B of A CC",{"$f":"VLOOKUP(TestTable[[#This Row],[Category]],Table11[],2,FALSE)","v":"Debt"}]
["2010-10-30","Savers","SAVERS 1033 BOISE ID",-60.95,"debit","Shopping","Citi CC",{"$f":"VLOOKUP(TestTable[[#This Row],[Category]],Table11[],2,FALSE)","v":"Misc"}]
["2010-10-30","Good Times Dr","GOOD TIMES DR THRU 128 BOISE ID",-8.14,"debit","Uncategorized","Citi CC",{"$f":"VLOOKUP(TestTable[[#This Row],[Category]],Table11[],2,FALSE)","v":"Misc"}]
["2010-10-30","Maverik","MAVERIK CTRY STRE #2 BOISE ID",-10.050000000000001,"debit","Gas & Fuel","Citi CC",{"$f":"VLOOKUP(TestTable[[#This Row],[Category]],Table11[],2,FALSE)","v":"Auto"}]
["2010-10-29","Arby's","ARBY'S QQ52 CENTERVILLE UT",-3.11,"debit","Fast Food","Citi CC",{"$f":"VLOOKUP(TestTable[[#This Row],[Category]],Table11[],2,FALSE)","v":"Food"}]
["2010-10-29","Chevron","CHEVRON 0073049 PROVO UT",-52.14,"debit","Gas & Fuel","Citi CC",{"$f":"VLOOKUP(TestTable[[#This Row],[Category]],Table11[],2,FALSE)","v":"Auto"}]
["2010-10-29","Carl's Jr","CARLJR1100602 11006020 CENTERVILLE UT",-4.72,"debit","Fast Food","Citi CC",{"$f":"VLOOKUP(TestTable[[#This Row],[Category]],Table11[],2,FALSE)","v":"Food"}]
["2010-10-29","Fsprg Com Ca","FSPRG.COM877-327-89 08773278914 CA",-29.95,"debit","Uncategorized","Citi CC",{"$f":"VLOOKUP(TestTable[[#This Row],[Category]],Table11[],2,FALSE)","v":"Misc"}]
["2010-10-29","Scera","SCERA THEATRE QPS OREM UT - Deb",-4.5,"debit","Charity","ING Checking",{"$f":"VLOOKUP(TestTable[[#This Row],[Category]],Table11[],2,FALSE)","v":"Misc"}]
["2010-10-29","Marketplace Iga","MARKETPLACE CAFE PROVO UT - Deb",-1.08,"debit","Fast Food","ING Checking",{"$f":"VLOOKUP(TestTable[[#This Row],[Category]],Table11[],2,FALSE)","v":"Food"}]
["2010-10-27","Marketplace Iga","MARKETPLACE CAFE PROVO UT - Deb",-1.72,"debit","Fast Food","ING Checking",{"$f":"VLOOKUP(TestTable[[#This Row],[Category]],Table11[],2,FALSE)","v":"Food"}]
["2010-10-26","ShopKo","SHOPKO 00500868 PROVO UT",-16.010000000000002,"debit","Shopping","Citi CC",{"$f":"VLOOKUP(TestTable[[#This Row],[Category]],Table11[],2,FALSE)","v":"Misc"}]
["2010-10-26","Children's Place","THE CHILDRENS PLACE #0 OREM UT",23.5,"credit","Clothing","Citi CC",{"$f":"VLOOKUP(TestTable[[#This Row],[Category]],Table11[],2,FALSE)","v":"Misc"}]
["2010-10-26","Wendy's","WENDYS #4710 Q25 PROVO UT",-7.95,"debit","Fast Food","Citi CC",{"$f":"VLOOKUP(TestTable[[#This Row],[Category]],Table11[],2,FALSE)","v":"Food"}]
["2010-10-26","Fabric.com","ACI*FABRIC.COM 888-455-2940 GA",-48.26,"debit","Arts","Citi CC",{"$f":"VLOOKUP(TestTable[[#This Row],[Category]],Table11[],2,FALSE)","v":"Misc"}]
["2010-10-26","Consumer Reports","CR *CONSUMERREPORTS.OR 8003330663 NY",-5.95,"debit","Books","Citi CC",{"$f":"VLOOKUP(TestTable[[#This Row],[Category]],Table11[],2,FALSE)","v":"Misc"}]
["2010-10-25","Rue 21","RUE 21 360 PROVO UT",-6.39,"debit","Clothing","Citi CC",{"$f":"VLOOKUP(TestTable[[#This Row],[Category]],Table11[],2,FALSE)","v":"Misc"}]
["2010-10-25","Chicago Transit Authority","CTA-MADISON/MONROE/DEA CHICAGO IL",-5,"debit","Public Transportation","Citi CC",{"$f":"VLOOKUP(TestTable[[#This Row],[Category]],Table11[],2,FALSE)","v":"Misc"}]
["2010-10-25","Children's Place","THE CHILDRENS PLACE #0 OREM UT",-9.08,"debit","Clothing","Citi CC",{"$f":"VLOOKUP(TestTable[[#This Row],[Category]],Table11[],2,FALSE)","v":"Misc"}]
["2010-10-25","Scout Com Wa","SCOUT.COM              888-979-0979 WA",-9.9499999999999993,"debit","Uncategorized","B of A CC",{"$f":"VLOOKUP(TestTable[[#This Row],[Category]],Table11[],2,FALSE)","v":"Misc"}]
["2010-10-24","United","UNITED 0164514454002 CHICAGO IL",-25,"debit","Uncategorized","Citi CC",{"$f":"VLOOKUP(TestTable[[#This Row],[Category]],Table11[],2,FALSE)","v":"Misc"}]
["2010-10-24","Chi Taxi Med","CHI TAXI MED 1445 QPS CHICAGO IL",-9.3000000000000007,"debit","Rental Car & Taxi","Citi CC",{"$f":"VLOOKUP(TestTable[[#This Row],[Category]],Table11[],2,FALSE)","v":"Misc"}]
["2010-10-24","Congress Plaza Hotel","CONGRESS PLAZA HOTEL C CHICAGO IL",-640.45000000000005,"debit","Home Improvement","Citi CC",{"$f":"VLOOKUP(TestTable[[#This Row],[Category]],Table11[],2,FALSE)","v":"Misc"}]
["2010-10-23","Mccormick Place","MCCORMICK PLAC10275402 CHICAGO IL",-10.82,"debit","Business Services","Citi CC",{"$f":"VLOOKUP(TestTable[[#This Row],[Category]],Table11[],2,FALSE)","v":"Misc"}]
["2010-10-23","Amazon","Amazon.com AMZN.COM/BILL WA",14.99,"credit","Shopping","Citi CC",{"$f":"VLOOKUP(TestTable[[#This Row],[Category]],Table11[],2,FALSE)","v":"Misc"}]
["2010-10-22","Mccormick Place","MCCORMICK PLAC10275402 CHICAGO IL",-12.49,"debit","Business Services","Citi CC",{"$f":"VLOOKUP(TestTable[[#This Row],[Category]],Table11[],2,FALSE)","v":"Misc"}]
["2010-10-22","Payless ShoeSource","PAYLESSSHOESOU00056879 PROVO UT",-16,"debit","Clothing","Citi CC",{"$f":"VLOOKUP(TestTable[[#This Row],[Category]],Table11[],2,FALSE)","v":"Misc"}]
["2010-10-22","Just Us","JUST US GIRLS, LLC QPS WEST JORDAN UT",-17.63,"debit","Electronics & Software","Citi CC",{"$f":"VLOOKUP(TestTable[[#This Row],[Category]],Table11[],2,FALSE)","v":"Misc"}]
["2010-10-22","Bewitched Bootique Qps","BEWITCHED BOOTIQUE QPS WEST JORDAN UT",-5.33,"debit","Uncategorized","Citi CC",{"$f":"VLOOKUP(TestTable[[#This Row],[Category]],Table11[],2,FALSE)","v":"Misc"}]
["2010-10-22","Federal Express","FEDEX OFFICE #5052 CHICAGO IL",-6.92,"debit","Shipping","Citi CC",{"$f":"VLOOKUP(TestTable[[#This Row],[Category]],Table11[],2,FALSE)","v":"Misc"}]
["2010-10-22","Dunkin Donuts","DUNKIN #339728 Q35 CHICAGO IL",-6.9,"debit","Coffee Shops","Citi CC",{"$f":"VLOOKUP(TestTable[[#This Row],[Category]],Table11[],2,FALSE)","v":"Food"}]
["2010-10-22","Hot Dog On A Stick","HOT DOG ON A STICK #17 PROVO UT",-9.9700000000000006,"debit","Restaurants","Citi CC",{"$f":"VLOOKUP(TestTable[[#This Row],[Category]],Table11[],2,FALSE)","v":"Food"}]
["2010-10-22","Electronic Deposit","Electronic Deposit",159.5,"credit","Income","ING Checking",{"$f":"VLOOKUP(TestTable[[#This Row],[Category]],Table11[],2,FALSE)","v":"income"}]
["2010-10-21","Priceline - Hotel","PLN*PRICELINE.COM HTL 800-657-9168 CT",679.64,"credit","Hotel","Citi CC",{"$f":"VLOOKUP(TestTable[[#This Row],[Category]],Table11[],2,FALSE)","v":"Misc"}]
["2010-10-21","Kraftemplstore","KRAFTEMPLSTORE30024913 GLENVIEW IL",-7.01,"debit","Uncategorized","Citi CC",{"$f":"VLOOKUP(TestTable[[#This Row],[Category]],Table11[],2,FALSE)","v":"Misc"}]
["2010-10-21","Subway","SUBWAY 00230896 MORTON GROVE IL",-5.61,"debit","Fast Food","Citi CC",{"$f":"VLOOKUP(TestTable[[#This Row],[Category]],Table11[],2,FALSE)","v":"Food"}]
["2010-10-21","Congress Plaza Hotel","CONGRESS PLAZA HOTEL C CHICAGO IL",-195.03,"debit","Home Improvement","Citi CC",{"$f":"VLOOKUP(TestTable[[#This Row],[Category]],Table11[],2,FALSE)","v":"Misc"}]
["2010-10-21","Panera Bread","PANERA BREAD #1004 CHICAGO IL",-6.32,"debit","Fast Food","Citi CC",{"$f":"VLOOKUP(TestTable[[#This Row],[Category]],Table11[],2,FALSE)","v":"Food"}]
["2010-10-21","Priceline - Hotel","PLN*PRICELINE.COM HTL 800-657-9168 CT",26.2,"credit","Hotel","Citi CC",{"$f":"VLOOKUP(TestTable[[#This Row],[Category]],Table11[],2,FALSE)","v":"Misc"}]
["2010-10-21","Federal Express","FEDEX OFFICE #5052 QPS CHICAGO IL",-8.65,"debit","Shipping","Citi CC",{"$f":"VLOOKUP(TestTable[[#This Row],[Category]],Table11[],2,FALSE)","v":"Misc"}]
["2010-10-21","Ross","ROSS STORES 751 OREM UT - Debit",-19.21,"debit","Clothing","ING Checking",{"$f":"VLOOKUP(TestTable[[#This Row],[Category]],Table11[],2,FALSE)","v":"Misc"}]
["2010-10-21","Regal Lager Ga","REGAL LAGER 07709555060 GA - De",-2.41,"debit","Uncategorized","ING Checking",{"$f":"VLOOKUP(TestTable[[#This Row],[Category]],Table11[],2,FALSE)","v":"Misc"}]
["2010-10-21","Laundry Plus","LAUNDRY PLUS PROVO UT - Debit",-37.36,"debit","Laundry","ING Checking",{"$f":"VLOOKUP(TestTable[[#This Row],[Category]],Table11[],2,FALSE)","v":"Misc"}]
["2010-10-21","Lds Orem Center","LDS OREM CENTER 767 OREM UT - D",-35.5,"debit","Uncategorized","ING Checking",{"$f":"VLOOKUP(TestTable[[#This Row],[Category]],Table11[],2,FALSE)","v":"Misc"}]
["2010-10-21","The Barber Shop","BYU BARBERSHOP PROVO UT - Debit",-15,"debit","Hair","ING Checking",{"$f":"VLOOKUP(TestTable[[#This Row],[Category]],Table11[],2,FALSE)","v":"Misc"}]
["2010-10-20","Withdrawal Transfer Loan","Withdrawal Transfer To Loan 61",-265,"debit","Transfer","MACU Savings 1",{"$f":"VLOOKUP(TestTable[[#This Row],[Category]],Table11[],2,FALSE)","v":"Misc"}]
["2010-10-20","Transfer from ING Holding","Deposit ACH ORIGINATION",265,"credit","Transfer","MACU Savings 1",{"$f":"VLOOKUP(TestTable[[#This Row],[Category]],Table11[],2,FALSE)","v":"Misc"}]
["2010-10-20","Air Terminal Gifts","AIR TERMINAL GIFTS QPS SALT LAKE CIT UT",-4.26,"debit","Gift","Citi CC",{"$f":"VLOOKUP(TestTable[[#This Row],[Category]],Table11[],2,FALSE)","v":"Misc"}]
["2010-10-20","Burger King","BURGER KING QPS SALT LAKECITY UT",-7.43,"debit","Fast Food","Citi CC",{"$f":"VLOOKUP(TestTable[[#This Row],[Category]],Table11[],2,FALSE)","v":"Food"}]
["2010-10-20","Chevron","CHEVRON 0357355 SALT LAKE CIT UT",-50.19,"debit","Gas & Fuel","Citi CC",{"$f":"VLOOKUP(TestTable[[#This Row],[Category]],Table11[],2,FALSE)","v":"Auto"}]
["2010-10-20","Amazon","AMAZON MKTPLACE PMTS AMZN COM B",-35.99,"debit","Shopping","ING Checking",{"$f":"VLOOKUP(TestTable[[#This Row],[Category]],Table11[],2,FALSE)","v":"Misc"}]
["2010-10-20","Amazon","AMAZON MKTPLACE PMTS AMZN COM B",-5.85,"debit","Shopping","ING Checking",{"$f":"VLOOKUP(TestTable[[#This Row],[Category]],Table11[],2,FALSE)","v":"Misc"}]
["2010-10-20","Transfer to PRIMARY SAVINGS","External Electronic Withdrawal",-265,"debit","Auto Payment","ING Holding",{"$f":"VLOOKUP(TestTable[[#This Row],[Category]],Table11[],2,FALSE)","v":"Auto"}]
["2010-10-19","Deposit","Deposit",231.28,"credit","Income","MACU Checking",{"$f":"VLOOKUP(TestTable[[#This Row],[Category]],Table11[],2,FALSE)","v":"income"}]
["2010-10-19","Interest Charged Standard","INTEREST CHARGED TO STANDARD PURCH",-4.7699999999999996,"debit","Finance Charge","Citi CC",{"$f":"VLOOKUP(TestTable[[#This Row],[Category]],Table11[],2,FALSE)","v":"Misc"}]
["2010-10-19","Panda Express","PANDA EXPRESS 724 QPS PROVO UT",-9,"debit","Fast Food","ING Checking",{"$f":"VLOOKUP(TestTable[[#This Row],[Category]],Table11[],2,FALSE)","v":"Food"}]
["2010-10-19","Veracity Network Veracity","External Electronic Withdrawal",-48.28,"debit","Internet","ING Holding",{"$f":"VLOOKUP(TestTable[[#This Row],[Category]],Table11[],2,FALSE)","v":"Utilities"}]
["2010-10-18","Central Utah Electroni","CENTRAL UTAH ELECTRONI PROVO UT",-20.29,"debit","Uncategorized","ING Checking",{"$f":"VLOOKUP(TestTable[[#This Row],[Category]],Table11[],2,FALSE)","v":"Misc"}]
["2010-10-18","Central Utah Electroni","CENTRAL UTAH ELECTRONI PROVO UT",-3.69,"debit","Uncategorized","ING Checking",{"$f":"VLOOKUP(TestTable[[#This Row],[Category]],Table11[],2,FALSE)","v":"Misc"}]
["2010-10-18","External Electronic Withdrawal","External Electronic Withdrawal",-21.06,"debit","Uncategorized","ING Holding",{"$f":"VLOOKUP(TestTable[[#This Row],[Category]],Table11[],2,FALSE)","v":"Misc"}]
["2010-10-17","iTunes","APL*ITUNES 866-712-7753 CA",-15.44,"debit","Music","Citi CC",{"$f":"VLOOKUP(TestTable[[#This Row],[Category]],Table11[],2,FALSE)","v":"Misc"}]
["2010-10-17","Chevron","CHEVRON 0305397 LEHI UT - Debit",-52.02,"debit","Gas & Fuel","ING Checking",{"$f":"VLOOKUP(TestTable[[#This Row],[Category]],Table11[],2,FALSE)","v":"Auto"}]
["2010-10-17","Marketplace Iga","MARKETPLACE CAFE PROVO UT - Deb",-1.72,"debit","Fast Food","ING Checking",{"$f":"VLOOKUP(TestTable[[#This Row],[Category]],Table11[],2,FALSE)","v":"Food"}]
["2010-10-17","RadioShack","RADIOSHACK COR00140293 OREM UT",-4.26,"debit","Electronics & Software","ING Checking",{"$f":"VLOOKUP(TestTable[[#This Row],[Category]],Table11[],2,FALSE)","v":"Misc"}]
["2010-10-15","IKEA","IKEA DRAPER DRAPER UT",-216.87,"debit","Furnishings","Citi CC",{"$f":"VLOOKUP(TestTable[[#This Row],[Category]],Table11[],2,FALSE)","v":"Misc"}]
["2010-10-15","Marketplace Iga","MARKETPLACE CAFE PROVO UT - Deb",-2.67,"debit","Fast Food","ING Checking",{"$f":"VLOOKUP(TestTable[[#This Row],[Category]],Table11[],2,FALSE)","v":"Food"}]
["2010-10-15","Byu Wsc L","BYU WSC L T PRODUCE PROVO UT -",-5.7,"debit","Groceries","ING Checking",{"$f":"VLOOKUP(TestTable[[#This Row],[Category]],Table11[],2,FALSE)","v":"Food"}]
["2010-10-15","Liberty Mutual","External Electronic Withdrawal",-113.16,"debit","Auto Insurance","ING Holding",{"$f":"VLOOKUP(TestTable[[#This Row],[Category]],Table11[],2,FALSE)","v":"Auto"}]
["2010-10-14","Amazon","Amazon.com AMZN.COM/BILL WA",-14.99,"debit","Shopping","Citi CC",{"$f":"VLOOKUP(TestTable[[#This Row],[Category]],Table11[],2,FALSE)","v":"Misc"}]
["2010-10-14","Amazon","Amazon.com AMZN.COM/BILL WA",-29.95,"debit","Shopping","Citi CC",{"$f":"VLOOKUP(TestTable[[#This Row],[Category]],Table11[],2,FALSE)","v":"Misc"}]
["2010-10-14","Wal-Mart","WAL-MART #1768 QPS OREM UT",-13.62,"debit","Shopping","Citi CC",{"$f":"VLOOKUP(TestTable[[#This Row],[Category]],Table11[],2,FALSE)","v":"Misc"}]
["2010-10-14","Marketplace Iga","MARKETPLACE CAFE PROVO UT - Deb",-1.08,"debit","Fast Food","ING Checking",{"$f":"VLOOKUP(TestTable[[#This Row],[Category]],Table11[],2,FALSE)","v":"Food"}]
["2010-10-14","Children's Place","THECHILDRENSPLACE COM 020155826",-52.46,"debit","Clothing","ING Checking",{"$f":"VLOOKUP(TestTable[[#This Row],[Category]],Table11[],2,FALSE)","v":"Misc"}]
["2010-10-13","Lenscrafters","LENSCRAFTERS  002442 5 PROVO        UT",-208.13,"debit","Eyecare","B of A CC",{"$f":"VLOOKUP(TestTable[[#This Row],[Category]],Table11[],2,FALSE)","v":"Medical"}]
["2010-10-12","Priceline - Hotel","PLN*PRICELINE.COM HTL 800-657-9168 CT",-705.84,"debit","Hotel","Citi CC",{"$f":"VLOOKUP(TestTable[[#This Row],[Category]],Table11[],2,FALSE)","v":"Misc"}]
["2010-10-12","Children's Place","THECHILDRENSPLACE COM 020155826",-19.649999999999999,"debit","Clothing","ING Checking",{"$f":"VLOOKUP(TestTable[[#This Row],[Category]],Table11[],2,FALSE)","v":"Misc"}]
["2010-10-12","Marketplace Iga","MARKETPLACE CAFE PROVO UT - Deb",-8.0500000000000007,"debit","Fast Food","ING Checking",{"$f":"VLOOKUP(TestTable[[#This Row],[Category]],Table11[],2,FALSE)","v":"Food"}]
["2010-10-10","Marketplace Iga","MARKETPLACE CAFE PROVO UT - Deb",-3.7,"debit","Fast Food","ING Checking",{"$f":"VLOOKUP(TestTable[[#This Row],[Category]],Table11[],2,FALSE)","v":"Food"}]
["2010-10-08","Electronic Deposit","Electronic Deposit",174,"credit","Income","ING Checking",{"$f":"VLOOKUP(TestTable[[#This Row],[Category]],Table11[],2,FALSE)","v":"income"}]
["2010-10-07","MCM Electronics","MCM ELECTRONICS INC CENTERVILLE OH",-30.45,"debit","Electronics & Software","Citi CC",{"$f":"VLOOKUP(TestTable[[#This Row],[Category]],Table11[],2,FALSE)","v":"Misc"}]
["2010-10-07","Natl Society Hispan","NATL SOCIETY OF HISPAN 877-469-4622 TX",-195,"debit","Uncategorized","Citi CC",{"$f":"VLOOKUP(TestTable[[#This Row],[Category]],Table11[],2,FALSE)","v":"Misc"}]
["2010-10-07","Marketplace Iga","MARKETPLACE CAFE PROVO UT - Deb",-1.72,"debit","Fast Food","ING Checking",{"$f":"VLOOKUP(TestTable[[#This Row],[Category]],Table11[],2,FALSE)","v":"Food"}]
["2010-10-06","Marketplace Iga","MARKETPLACE CAFE PROVO UT - Deb",-6.24,"debit","Fast Food","ING Checking",{"$f":"VLOOKUP(TestTable[[#This Row],[Category]],Table11[],2,FALSE)","v":"Food"}]
["2010-10-06","Chevron","CHEVRON 0073049 PROVO UT - Debit",-49.23,"debit","Gas & Fuel","ING Checking",{"$f":"VLOOKUP(TestTable[[#This Row],[Category]],Table11[],2,FALSE)","v":"Auto"}]
["2010-10-05","Transfer to ING Savings","Withdrawal SWENSEN,AMBER MTYPE: ING DIRECT CO: SWENSEN,AMBER M",-129,"debit","Transfer","MACU Checking",{"$f":"VLOOKUP(TestTable[[#This Row],[Category]],Table11[],2,FALSE)","v":"Misc"}]
["2010-10-05","Transfer from Checking","ELECTRONIC PAYMENT-THANK YOU",50,"credit","Credit Card Payment","Citi CC",{"$f":"VLOOKUP(TestTable[[#This Row],[Category]],Table11[],2,FALSE)","v":"Debt"}]
["2010-10-04","Transfer from FREE CHECKING","Internet Deposit MOUNTAIN AMERI",129,"credit","Transfer","ING Savings",{"$f":"VLOOKUP(TestTable[[#This Row],[Category]],Table11[],2,FALSE)","v":"Misc"}]
["2010-10-04","Marketplace Iga","MARKETPLACE CAFE PROVO UT - Deb",-0.96,"debit","Fast Food","ING Checking",{"$f":"VLOOKUP(TestTable[[#This Row],[Category]],Table11[],2,FALSE)","v":"Food"}]
["2010-10-04","Transfer to Bank of America","Electronic Payment to BANK OF A",-100,"debit","Credit Card Payment","ING Checking",{"$f":"VLOOKUP(TestTable[[#This Row],[Category]],Table11[],2,FALSE)","v":"Debt"}]
["2010-10-04","Smiths","SMITHS 45 SOUTH STATE",-15.47,"debit","Groceries","ING Checking",{"$f":"VLOOKUP(TestTable[[#This Row],[Category]],Table11[],2,FALSE)","v":"Food"}]
["2010-10-04","Transfer to Amber","Electronic Payment to CITI CARDS",-50,"debit","Credit Card Payment","ING Checking",{"$f":"VLOOKUP(TestTable[[#This Row],[Category]],Table11[],2,FALSE)","v":"Debt"}]
["2010-10-04","Marketplace Iga","MARKETPLACE CAFE PROVO UT - Deb",-1.82,"debit","Fast Food","ING Checking",{"$f":"VLOOKUP(TestTable[[#This Row],[Category]],Table11[],2,FALSE)","v":"Food"}]
["2010-10-04","Transfer from Checking","PAYMENT - ELECTRONIC",100,"credit","Credit Card Payment","B of A CC",{"$f":"VLOOKUP(TestTable[[#This Row],[Category]],Table11[],2,FALSE)","v":"Debt"}]
["2010-10-03","Pioneer Family Medicine","PIONEER FAMILY MEDICIN BOISE ID",-75.959999999999994,"debit","Doctor","ING Checking",{"$f":"VLOOKUP(TestTable[[#This Row],[Category]],Table11[],2,FALSE)","v":"Medical"}]
["2010-10-02","Interest Charged Purchases","Interest Charged on Purchases",-54.55,"debit","Finance Charge","B of A CC",{"$f":"VLOOKUP(TestTable[[#This Row],[Category]],Table11[],2,FALSE)","v":"Misc"}]
["2010-10-02","Cardtronics Ccsb","CARDTRONICS CCSB  OREM, UT US -",-400,"debit","Uncategorized","ING Checking",{"$f":"VLOOKUP(TestTable[[#This Row],[Category]],Table11[],2,FALSE)","v":"Misc"}]
["2010-10-02","Cardtronics Ccsb","CARDTRONICS CCSB  OREM, UT US -",-60,"debit","Uncategorized","ING Checking",{"$f":"VLOOKUP(TestTable[[#This Row],[Category]],Table11[],2,FALSE)","v":"Misc"}]
["2010-10-01","Transfer from ING Savings","Internet Deposit",60,"credit","Transfer","ING Checking",{"$f":"VLOOKUP(TestTable[[#This Row],[Category]],Table11[],2,FALSE)","v":"Misc"}]
["2010-10-01","Transfer from ING Savings","Internet Deposit",207,"credit","Transfer","ING Checking",{"$f":"VLOOKUP(TestTable[[#This Row],[Category]],Table11[],2,FALSE)","v":"Misc"}]
["2010-10-01","Person Person Laura","Person2Person Payment to Laura",-1075,"debit","Mortgage & Rent","ING Checking",{"$f":"VLOOKUP(TestTable[[#This Row],[Category]],Table11[],2,FALSE)","v":"Housing"}]
["2010-10-01","Smiths","SMITHS 350 N. FREEDOM",-12.79,"debit","Groceries","ING Checking",{"$f":"VLOOKUP(TestTable[[#This Row],[Category]],Table11[],2,FALSE)","v":"Food"}]
["2010-10-01","Transfer from ING Holding","Internet Deposit",1075,"credit","Transfer","ING Checking",{"$f":"VLOOKUP(TestTable[[#This Row],[Category]],Table11[],2,FALSE)","v":"Misc"}]
["2010-10-01","Interest Paid For","Interest paid for overdraft Int",-0.04,"debit","Bank Fee","ING Checking",{"$f":"VLOOKUP(TestTable[[#This Row],[Category]],Table11[],2,FALSE)","v":"Misc"}]
["2010-10-01","Transfer from ING Holding","Internet Deposit",150,"credit","Transfer","ING Checking",{"$f":"VLOOKUP(TestTable[[#This Row],[Category]],Table11[],2,FALSE)","v":"Misc"}]
["2010-10-01","Transfer from ING Savings","Internet Deposit",40,"credit","Transfer","ING Holding",{"$f":"VLOOKUP(TestTable[[#This Row],[Category]],Table11[],2,FALSE)","v":"Misc"}]
["2010-10-01","Transfer to Checking","Internet Withdrawal",-1075,"debit","Transfer","ING Holding",{"$f":"VLOOKUP(TestTable[[#This Row],[Category]],Table11[],2,FALSE)","v":"Misc"}]
["2010-10-01","Transfer to Checking","Internet Withdrawal",-150,"debit","Transfer","ING Holding",{"$f":"VLOOKUP(TestTable[[#This Row],[Category]],Table11[],2,FALSE)","v":"Misc"}]
["2010-10-01","Transfer to Checking","Internet Withdrawal",-207,"debit","Transfer","ING Savings",{"$f":"VLOOKUP(TestTable[[#This Row],[Category]],Table11[],2,FALSE)","v":"Misc"}]
["2010-10-01","Transfer to Checking","Internet Withdrawal",-60,"debit","Transfer","ING Savings",{"$f":"VLOOKUP(TestTable[[#This Row],[Category]],Table11[],2,FALSE)","v":"Misc"}]
["2010-10-01","Transfer to ING Holding","Internet Withdrawal",-40,"debit","Transfer","ING Savings",{"$f":"VLOOKUP(TestTable[[#This Row],[Category]],Table11[],2,FALSE)","v":"Misc"}]
["2010-09-30","Commentavg Checking Bal","Transaction COMMENTAvg Checking Bal for Sep $264.42",0,"credit","Income","MACU Checking",{"$f":"VLOOKUP(TestTable[[#This Row],[Category]],Table11[],2,FALSE)","v":"income"}]
["2010-09-30","Monthly Interest Paid","Monthly Interest Paid",0.13,"credit","Interest Income","ING Checking",{"$f":"VLOOKUP(TestTable[[#This Row],[Category]],Table11[],2,FALSE)","v":"Misc"}]
["2010-09-30","Monthly Interest Paid","Monthly Interest Paid",1.88,"credit","Interest Income","ING Holding",{"$f":"VLOOKUP(TestTable[[#This Row],[Category]],Table11[],2,FALSE)","v":"Misc"}]
["2010-09-30","Monthly Interest Paid","Monthly Interest Paid",1.35,"credit","Interest Income","ING Savings",{"$f":"VLOOKUP(TestTable[[#This Row],[Category]],Table11[],2,FALSE)","v":"Misc"}]
["2010-09-30","Interest Paid","Interest Paid",0.13,"credit","Interest Income","ING Checking",{"$f":"VLOOKUP(TestTable[[#This Row],[Category]],Table11[],2,FALSE)","v":"Misc"}]
["2010-09-30","Interest Paid","Interest Paid",1.88,"credit","Interest Income","ING Holding",{"$f":"VLOOKUP(TestTable[[#This Row],[Category]],Table11[],2,FALSE)","v":"Misc"}]
["2010-09-30","External Electronic Withdrawal","External Electronic Withdrawal",-161.91,"debit","Uncategorized","ING Holding",{"$f":"VLOOKUP(TestTable[[#This Row],[Category]],Table11[],2,FALSE)","v":"Misc"}]
["2010-09-30","Interest Paid","Interest Paid",1.35,"credit","Interest Income","ING Savings",{"$f":"VLOOKUP(TestTable[[#This Row],[Category]],Table11[],2,FALSE)","v":"Misc"}]
["2010-09-29","Amazon","AMAZON COM AMZN COM BIL WA - De",-35.54,"debit","Hair","ING Checking",{"$f":"VLOOKUP(TestTable[[#This Row],[Category]],Table11[],2,FALSE)","v":"Misc"}]
["2010-09-28","Deposit Half Comtype","Deposit HALF.COMTYPE: PAYMENTS CO: HALF.COM",129.08000000000001,"credit","Income","MACU Checking",{"$f":"VLOOKUP(TestTable[[#This Row],[Category]],Table11[],2,FALSE)","v":"income"}]
["2010-09-27","Airport","LAX AIRPORT BACKLOT DE LOS ANGE",-3.68,"debit","Air Travel","ING Checking",{"$f":"VLOOKUP(TestTable[[#This Row],[Category]],Table11[],2,FALSE)","v":"Misc"}]
["2010-09-27","Cafe Crepe","CAFE CREPE QPS SANTA MONICA CA",-21.19,"debit","Restaurants","ING Checking",{"$f":"VLOOKUP(TestTable[[#This Row],[Category]],Table11[],2,FALSE)","v":"Food"}]
["2010-09-27","Texaco","TEXACO 0305131 OREM UT - Debit",-32.840000000000003,"debit","Gas & Fuel","ING Checking",{"$f":"VLOOKUP(TestTable[[#This Row],[Category]],Table11[],2,FALSE)","v":"Auto"}]
["2010-09-27","El Paseo Cafe","EL PASEO CAFE TE LOS ANGELES CA",-12.01,"debit","Restaurants","ING Checking",{"$f":"VLOOKUP(TestTable[[#This Row],[Category]],Table11[],2,FALSE)","v":"Food"}]
["2010-09-27","Aramark","ARAMARK LOS ANGELES CO LOS ANGE",-4.66,"debit","Food & Dining","ING Checking",{"$f":"VLOOKUP(TestTable[[#This Row],[Category]],Table11[],2,FALSE)","v":"Food"}]
["2010-09-26","Consumer Reports","CR *CONSUMERREPORTS.OR 8003330663 NY",-5.95,"debit","Books","Citi CC",{"$f":"VLOOKUP(TestTable[[#This Row],[Category]],Table11[],2,FALSE)","v":"Misc"}]
["2010-09-26","Aramark","ARAMARK LOS ANGELES CO LOS ANGE",-24.69,"debit","Food & Dining","ING Checking",{"$f":"VLOOKUP(TestTable[[#This Row],[Category]],Table11[],2,FALSE)","v":"Food"}]
["2010-09-26","Domino's Pizza","DOMINO S PIZZA 08376 0111111111",-15.75,"debit","Fast Food","ING Checking",{"$f":"VLOOKUP(TestTable[[#This Row],[Category]],Table11[],2,FALSE)","v":"Food"}]
["2010-09-26","Smiths","SMITHS 350 N. FREEDOM",-11.27,"debit","Groceries","ING Checking",{"$f":"VLOOKUP(TestTable[[#This Row],[Category]],Table11[],2,FALSE)","v":"Food"}]
["2010-09-26","Aramark","ARAMARK LOS ANGELES CO LOS ANGE",-4.66,"debit","Food & Dining","ING Checking",{"$f":"VLOOKUP(TestTable[[#This Row],[Category]],Table11[],2,FALSE)","v":"Food"}]
["2010-09-25","Chevron","CHEVRON/PWI #95 CHEVRON/PWI #95",-7.06,"debit","Gas & Fuel","ING Checking",{"$f":"VLOOKUP(TestTable[[#This Row],[Category]],Table11[],2,FALSE)","v":"Auto"}]
["2010-09-25","H&M","H & M 1452 THIRD ST PROMENAD",-14.21,"debit","Clothing","ING Checking",{"$f":"VLOOKUP(TestTable[[#This Row],[Category]],Table11[],2,FALSE)","v":"Misc"}]
["2010-09-24","Southwest","SOUTHWES5xxxxxxxxxxxx4359792 TX",-80,"debit","Air Travel","Citi CC",{"$f":"VLOOKUP(TestTable[[#This Row],[Category]],Table11[],2,FALSE)","v":"Misc"}]
["2010-09-24","Scout Com Wa","SCOUT.COM              888-979-0979 WA",-9.9499999999999993,"debit","Uncategorized","B of A CC",{"$f":"VLOOKUP(TestTable[[#This Row],[Category]],Table11[],2,FALSE)","v":"Misc"}]
["2010-09-24","El Pollo Loco","EL POLLO LOCO 5400QPS ANAHEIM C",-6.51,"debit","Fast Food","ING Checking",{"$f":"VLOOKUP(TestTable[[#This Row],[Category]],Table11[],2,FALSE)","v":"Food"}]
["2010-09-24","Transfer to ING Savings","Internet Withdrawal",-326,"debit","Transfer","ING Checking",{"$f":"VLOOKUP(TestTable[[#This Row],[Category]],Table11[],2,FALSE)","v":"Misc"}]
["2010-09-24","Electronic Deposit","Electronic Deposit",145,"credit","Income","ING Checking",{"$f":"VLOOKUP(TestTable[[#This Row],[Category]],Table11[],2,FALSE)","v":"income"}]
["2010-09-24","Transfer to ING Savings","Internet Withdrawal",-1074,"debit","Transfer","ING Holding",{"$f":"VLOOKUP(TestTable[[#This Row],[Category]],Table11[],2,FALSE)","v":"Misc"}]
["2010-09-24","Transfer from Checking","Internet Deposit",326,"credit","Transfer","ING Savings",{"$f":"VLOOKUP(TestTable[[#This Row],[Category]],Table11[],2,FALSE)","v":"Misc"}]
["2010-09-24","Transfer from ING Holding","Internet Deposit",1074,"credit","Transfer","ING Savings",{"$f":"VLOOKUP(TestTable[[#This Row],[Category]],Table11[],2,FALSE)","v":"Misc"}]
["2010-09-23","CVS","CVS 09647 09647 - Debit",-35.75,"debit","Miscellaneous","ING Checking",{"$f":"VLOOKUP(TestTable[[#This Row],[Category]],Table11[],2,FALSE)","v":"Misc"}]
["2010-09-23","Ralphs","RALPHS 645 W. 9TH ST.",-31.23,"debit","Groceries","ING Checking",{"$f":"VLOOKUP(TestTable[[#This Row],[Category]],Table11[],2,FALSE)","v":"Food"}]
["2010-09-23","Federal Express","FEDEX OFFICE 3702 QPS GLENDALE",-4.97,"debit","Shipping","ING Checking",{"$f":"VLOOKUP(TestTable[[#This Row],[Category]],Table11[],2,FALSE)","v":"Misc"}]
["2010-09-23","Nestle","NESTLE C STORE12115002 GLENDALE",-2.46,"debit","Food & Dining","ING Checking",{"$f":"VLOOKUP(TestTable[[#This Row],[Category]],Table11[],2,FALSE)","v":"Food"}]
["2010-09-23","Marketplace Iga","MARKETPLACE CAFE PROVO UT - Deb",-6.45,"debit","Fast Food","ING Checking",{"$f":"VLOOKUP(TestTable[[#This Row],[Category]],Table11[],2,FALSE)","v":"Food"}]
["2010-09-23","Grenatos Deli Qps","GRENATOS DELI 30554QPS SALT LAK",-10.98,"debit","Restaurants","ING Checking",{"$f":"VLOOKUP(TestTable[[#This Row],[Category]],Table11[],2,FALSE)","v":"Food"}]
["2010-09-22","Marketplace Iga","MARKETPLACE CAFE PROVO UT - Deb",-2.66,"debit","Fast Food","ING Checking",{"$f":"VLOOKUP(TestTable[[#This Row],[Category]],Table11[],2,FALSE)","v":"Food"}]
["2010-09-21","Smiths","SMITHS 45 SOUTH STATE",-7.35,"debit","Groceries","ING Checking",{"$f":"VLOOKUP(TestTable[[#This Row],[Category]],Table11[],2,FALSE)","v":"Food"}]
["2010-09-21","Screamin Coupons Coqps","SCREAMIN COUPONS COQPS 800 6559",-25,"debit","Uncategorized","ING Checking",{"$f":"VLOOKUP(TestTable[[#This Row],[Category]],Table11[],2,FALSE)","v":"Misc"}]
["2010-09-21","Transfer to Amber","Electronic Withdrawal",-40,"debit","Credit Card Payment","ING Checking",{"$f":"VLOOKUP(TestTable[[#This Row],[Category]],Table11[],2,FALSE)","v":"Debt"}]
["2010-09-21","Rite Aid","RITE AID CORP. RIVERSIDE PLAZA",-12.04,"debit","Miscellaneous","ING Checking",{"$f":"VLOOKUP(TestTable[[#This Row],[Category]],Table11[],2,FALSE)","v":"Misc"}]
["2010-09-21","Veracity Network Veracity","External Electronic Withdrawal",-48.28,"debit","Internet","ING Holding",{"$f":"VLOOKUP(TestTable[[#This Row],[Category]],Table11[],2,FALSE)","v":"Utilities"}]
["2010-09-20","Transfer from Checking","CLICK-TO-PAY PAYMENT, THANK YOU",40,"credit","Credit Card Payment","Citi CC",{"$f":"VLOOKUP(TestTable[[#This Row],[Category]],Table11[],2,FALSE)","v":"Debt"}]
["2010-09-20","Costco","COSTCO WHSE #04 648 EAST 800 SO",-50,"debit","Personal Care","ING Checking",{"$f":"VLOOKUP(TestTable[[#This Row],[Category]],Table11[],2,FALSE)","v":"Misc"}]
["2010-09-20","Costco","COSTCO WHSE #04 648 EAST 800 SO",-39.450000000000003,"debit","Baby Supplies","ING Checking",{"$f":"VLOOKUP(TestTable[[#This Row],[Category]],Table11[],2,FALSE)","v":"Misc"}]
["2010-09-20","Marketplace Iga","MARKETPLACE CAFE PROVO UT - Deb",-8.2799999999999994,"debit","Fast Food","ING Checking",{"$f":"VLOOKUP(TestTable[[#This Row],[Category]],Table11[],2,FALSE)","v":"Food"}]
["2010-09-20","Chevron","CHEVRON 0305397 LEHI UT - Debit",-48.52,"debit","Gas & Fuel","ING Checking",{"$f":"VLOOKUP(TestTable[[#This Row],[Category]],Table11[],2,FALSE)","v":"Auto"}]
["2010-09-20","McDonald's","MCDONALD S F7490 Q17 CENTERVILL",-15.13,"debit","Fast Food","ING Checking",{"$f":"VLOOKUP(TestTable[[#This Row],[Category]],Table11[],2,FALSE)","v":"Food"}]
["2010-09-20","Costa","COSTA VIDA OF PROVOQPS PROVO UT",-22.14,"debit","Fast Food","ING Checking",{"$f":"VLOOKUP(TestTable[[#This Row],[Category]],Table11[],2,FALSE)","v":"Food"}]
["2010-09-19","Amazon","AMAZON COM AMZN COM BIL WA - De",-13.42,"debit","Hair","ING Checking",{"$f":"VLOOKUP(TestTable[[#This Row],[Category]],Table11[],2,FALSE)","v":"Misc"}]
["2010-09-19","Smiths","SMITHS 350 N. FREEDOM",-45.67,"debit","Groceries","ING Checking",{"$f":"VLOOKUP(TestTable[[#This Row],[Category]],Table11[],2,FALSE)","v":"Food"}]
["2010-09-19","Byu Creamery Ninth","BYU CREAMERY ON NINTH PROVO UT",-20.45,"debit","Groceries","ING Checking",{"$f":"VLOOKUP(TestTable[[#This Row],[Category]],Table11[],2,FALSE)","v":"Food"}]
["2010-09-19","Amazon","AMAZON COM AMZN COM BIL WA - De",-11.97,"debit","Hair","ING Checking",{"$f":"VLOOKUP(TestTable[[#This Row],[Category]],Table11[],2,FALSE)","v":"Misc"}]
["2010-09-18","Chevron","CHEVRON/PWI #92 CHEVRON/PWI #92",-4.5999999999999996,"debit","Gas & Fuel","ING Checking",{"$f":"VLOOKUP(TestTable[[#This Row],[Category]],Table11[],2,FALSE)","v":"Auto"}]
["2010-09-17","Maceys","MACEYS PROVO 1400 N STATE",-7.5,"debit","Groceries","ING Checking",{"$f":"VLOOKUP(TestTable[[#This Row],[Category]],Table11[],2,FALSE)","v":"Food"}]
["2010-09-17","Amazon","AMAZON MKTPLACE PMTS AMZN COM B",-48.47,"debit","Shopping","ING Checking",{"$f":"VLOOKUP(TestTable[[#This Row],[Category]],Table11[],2,FALSE)","v":"Misc"}]
["2010-09-17","External Electronic Withdrawal","External Electronic Withdrawal",-20.83,"debit","Uncategorized","ING Holding",{"$f":"VLOOKUP(TestTable[[#This Row],[Category]],Table11[],2,FALSE)","v":"Misc"}]
["2010-09-16","Target","TARGET T1754 OR 175 WEST CENTER",-64.14,"debit","Miscellaneous","ING Checking",{"$f":"VLOOKUP(TestTable[[#This Row],[Category]],Table11[],2,FALSE)","v":"Misc"}]
["2010-09-16","Ustc","USTC  - Debit",-78.5,"debit","Uncategorized","ING Checking",{"$f":"VLOOKUP(TestTable[[#This Row],[Category]],Table11[],2,FALSE)","v":"Misc"}]
["2010-09-15","Byu Barbershop","BYU BARBERSHOP PROVO UT",-15,"debit","Hair","Citi CC",{"$f":"VLOOKUP(TestTable[[#This Row],[Category]],Table11[],2,FALSE)","v":"Misc"}]
["2010-09-15","Marketplace Iga","MARKETPLACE CAFE PROVO UT",-8.2799999999999994,"debit","Groceries","Citi CC",{"$f":"VLOOKUP(TestTable[[#This Row],[Category]],Table11[],2,FALSE)","v":"Food"}]
["2010-09-15","Person Person Heathe","Person2Person Payment to Heathe",-65.540000000000006,"debit","Uncategorized","ING Checking",{"$f":"VLOOKUP(TestTable[[#This Row],[Category]],Table11[],2,FALSE)","v":"Misc"}]
["2010-09-15","Inspection Station","THE INSPECTION STATION OREM UT",-122.11,"debit","Parking","ING Checking",{"$f":"VLOOKUP(TestTable[[#This Row],[Category]],Table11[],2,FALSE)","v":"Misc"}]
["2010-09-15","ShopKo","0086 SHOPKO 2266 NORTH UNIVERSI",-45.41,"debit","Shopping","ING Checking",{"$f":"VLOOKUP(TestTable[[#This Row],[Category]],Table11[],2,FALSE)","v":"Misc"}]
["2010-09-15","Liberty Mutual","External Electronic Withdrawal",-108.58,"debit","Auto Insurance","ING Holding",{"$f":"VLOOKUP(TestTable[[#This Row],[Category]],Table11[],2,FALSE)","v":"Auto"}]
["2010-09-14","Deposit","Deposit",260,"credit","Income","MACU Checking",{"$f":"VLOOKUP(TestTable[[#This Row],[Category]],Table11[],2,FALSE)","v":"income"}]
["2010-09-14","Withdrawal","Withdrawal",-265,"debit","Uncategorized","MACU Checking",{"$f":"VLOOKUP(TestTable[[#This Row],[Category]],Table11[],2,FALSE)","v":"Misc"}]
["2010-09-14","Panda Express","PANDA EXPRESS 724 QAE PROVO UT",-9.27,"debit","Fast Food","Citi CC",{"$f":"VLOOKUP(TestTable[[#This Row],[Category]],Table11[],2,FALSE)","v":"Food"}]
["2010-09-14","Marketplace Iga","MARKETPLACE CAFE PROVO UT",-8.0500000000000007,"debit","Groceries","Citi CC",{"$f":"VLOOKUP(TestTable[[#This Row],[Category]],Table11[],2,FALSE)","v":"Food"}]
["2010-09-14","Marketplace Iga","MARKETPLACE CAFE PROVO UT",-1.82,"debit","Groceries","Citi CC",{"$f":"VLOOKUP(TestTable[[#This Row],[Category]],Table11[],2,FALSE)","v":"Food"}]
["2010-09-14","Marketplace Iga","MARKETPLACE CAFE PROVO UT",-2.67,"debit","Groceries","Citi CC",{"$f":"VLOOKUP(TestTable[[#This Row],[Category]],Table11[],2,FALSE)","v":"Food"}]
["2010-09-14","Provo City Just","PROVO CITY JUST PROVO CITY JUST",-30,"debit","Uncategorized","ING Checking",{"$f":"VLOOKUP(TestTable[[#This Row],[Category]],Table11[],2,FALSE)","v":"Misc"}]
["2010-09-14","Costco","COSTCO WHSE #04 648 EAST 800 SO",-8.5399999999999991,"debit","Miscellaneous","ING Checking",{"$f":"VLOOKUP(TestTable[[#This Row],[Category]],Table11[],2,FALSE)","v":"Misc"}]
["2010-09-14","Amazon","AMAZON COM AMZN COM BIL WA - De",-16.97,"debit","Shopping","ING Checking",{"$f":"VLOOKUP(TestTable[[#This Row],[Category]],Table11[],2,FALSE)","v":"Misc"}]
["2010-09-14","Ct Vcom ATM","CT VCOM  PROVO, UT US - ATM",-280,"debit","Uncategorized","ING Checking",{"$f":"VLOOKUP(TestTable[[#This Row],[Category]],Table11[],2,FALSE)","v":"Misc"}]
["2010-09-14","Provo City Just","PROVO CITY JUST PROVO CITY JUST",-90,"debit","Uncategorized","ING Checking",{"$f":"VLOOKUP(TestTable[[#This Row],[Category]],Table11[],2,FALSE)","v":"Misc"}]
["2010-09-14","Transfer to Amber","Electronic Withdrawal",-87.59,"debit","Credit Card Payment","ING Checking",{"$f":"VLOOKUP(TestTable[[#This Row],[Category]],Table11[],2,FALSE)","v":"Debt"}]
["2010-09-13","Bajio Mexican Grill","BAJIO MEXICAN GRILL 00 OREM UT",-11.3,"debit","Fast Food","Citi CC",{"$f":"VLOOKUP(TestTable[[#This Row],[Category]],Table11[],2,FALSE)","v":"Food"}]
["2010-09-13","Costa","COSTA VIDA OF PROVOQPS PROVO UT",-9.33,"debit","Fast Food","Citi CC",{"$f":"VLOOKUP(TestTable[[#This Row],[Category]],Table11[],2,FALSE)","v":"Food"}]
["2010-09-13","Toys \"R\" Us","TOYS R US 85 EAST 300 SOUTH",-17.71,"debit","Toys","ING Checking",{"$f":"VLOOKUP(TestTable[[#This Row],[Category]],Table11[],2,FALSE)","v":"Misc"}]
["2010-09-13","Malt Shoppe","THE MALT SHOPPE QPS PROVO UT -",-3.65,"debit","Fast Food","ING Checking",{"$f":"VLOOKUP(TestTable[[#This Row],[Category]],Table11[],2,FALSE)","v":"Food"}]
["2010-09-13","Smiths","SMITHS 45 SOUTH STATE",-20.59,"debit","Groceries","ING Checking",{"$f":"VLOOKUP(TestTable[[#This Row],[Category]],Table11[],2,FALSE)","v":"Food"}]
["2010-09-12","Transfer from Checking","CLICK-TO-PAY PAYMENT, THANK YOU",87.59,"credit","Credit Card Payment","Citi CC",{"$f":"VLOOKUP(TestTable[[#This Row],[Category]],Table11[],2,FALSE)","v":"Debt"}]
["2010-09-12","Error","Error",72.59,"credit","Income","ING Checking",{"$f":"VLOOKUP(TestTable[[#This Row],[Category]],Table11[],2,FALSE)","v":"income"}]
["2010-09-11","Allens Super Save","ALLEN'S SUPER S 655 EAST 300 SO",-8.83,"debit","Pharmacy","ING Checking",{"$f":"VLOOKUP(TestTable[[#This Row],[Category]],Table11[],2,FALSE)","v":"Medical"}]
["2010-09-10","Transfer to ING Savings","Withdrawal SWENSEN,RICHARDTYPE: ING DIRECT CO: SWENSEN,RICHARD",-2343,"debit","Transfer","MACU Checking",{"$f":"VLOOKUP(TestTable[[#This Row],[Category]],Table11[],2,FALSE)","v":"Misc"}]
["2010-09-10","Byu Creamery Fountain","BYU CREAMERY FOUNTAIN PROVO UT",-7.59,"debit","Uncategorized","Citi CC",{"$f":"VLOOKUP(TestTable[[#This Row],[Category]],Table11[],2,FALSE)","v":"Misc"}]
["2010-09-10","Marketplace Iga","MARKETPLACE CAFE PROVO UT",-2.14,"debit","Groceries","Citi CC",{"$f":"VLOOKUP(TestTable[[#This Row],[Category]],Table11[],2,FALSE)","v":"Food"}]
["2010-09-10","Byu Creamery Ninth","BYU CREAMERY ON NINTH PROVO UT",-2.58,"debit","Uncategorized","Citi CC",{"$f":"VLOOKUP(TestTable[[#This Row],[Category]],Table11[],2,FALSE)","v":"Misc"}]
["2010-09-10","Byu Creamery Ninth","BYU CREAMERY ON NINTH PROVO UT",-4.42,"debit","Uncategorized","Citi CC",{"$f":"VLOOKUP(TestTable[[#This Row],[Category]],Table11[],2,FALSE)","v":"Misc"}]
["2010-09-10","iTunes","APL*ITUNES 866-712-7753 CA",-21.26,"debit","Music","Citi CC",{"$f":"VLOOKUP(TestTable[[#This Row],[Category]],Table11[],2,FALSE)","v":"Misc"}]
["2010-09-10","Marketplace Iga","MARKETPLACE CAFE PROVO UT",-0.96,"debit","Groceries","Citi CC",{"$f":"VLOOKUP(TestTable[[#This Row],[Category]],Table11[],2,FALSE)","v":"Food"}]
["2010-09-10","Marketplace Iga","MARKETPLACE CAFE PROVO UT",-1.72,"debit","Groceries","Citi CC",{"$f":"VLOOKUP(TestTable[[#This Row],[Category]],Table11[],2,FALSE)","v":"Food"}]
["2010-09-10","Apl Mobileme Www","APL MOBILEME WWW ME COM CA - De",-99,"debit","Uncategorized","ING Checking",{"$f":"VLOOKUP(TestTable[[#This Row],[Category]],Table11[],2,FALSE)","v":"Misc"}]
["2010-09-09","Marketplace Iga","MARKETPLACE CAFE PROVO UT",-2.67,"debit","Groceries","Citi CC",{"$f":"VLOOKUP(TestTable[[#This Row],[Category]],Table11[],2,FALSE)","v":"Food"}]
["2010-09-09","Marketplace Iga","MARKETPLACE CAFE PROVO UT",-0.96,"debit","Groceries","Citi CC",{"$f":"VLOOKUP(TestTable[[#This Row],[Category]],Table11[],2,FALSE)","v":"Food"}]
["2010-09-09","National","NATIONAL BLACK MBA ASS 312-236-2622 IL",-60,"debit","Home Improvement","Citi CC",{"$f":"VLOOKUP(TestTable[[#This Row],[Category]],Table11[],2,FALSE)","v":"Misc"}]
["2010-09-09","National","NATIONAL BLACK MBA ASS 312-236-2622 IL",-100,"debit","Home Improvement","Citi CC",{"$f":"VLOOKUP(TestTable[[#This Row],[Category]],Table11[],2,FALSE)","v":"Misc"}]
["2010-09-09","Marketplace Iga","MARKETPLACE CAFE PROVO UT",-2.89,"debit","Groceries","Citi CC",{"$f":"VLOOKUP(TestTable[[#This Row],[Category]],Table11[],2,FALSE)","v":"Food"}]
["2010-09-09","Transfer from ING Savings","Deposit From Linked Account MOU",2343,"credit","Transfer","ING Checking",{"$f":"VLOOKUP(TestTable[[#This Row],[Category]],Table11[],2,FALSE)","v":"Misc"}]
["2010-09-09","Sunflower Farme State","SUNFLOWER FARME 1375 S. STATE S",-70.45,"debit","Uncategorized","ING Checking",{"$f":"VLOOKUP(TestTable[[#This Row],[Category]],Table11[],2,FALSE)","v":"Misc"}]
["2010-09-09","Sunflower Farme State","SUNFLOWER FARME 1375 S. STATE S",-13.38,"debit","Uncategorized","ING Checking",{"$f":"VLOOKUP(TestTable[[#This Row],[Category]],Table11[],2,FALSE)","v":"Misc"}]
["2010-09-09","Electronic Withdrawal","Electronic Withdrawal",-240,"debit","Uncategorized","ING Checking",{"$f":"VLOOKUP(TestTable[[#This Row],[Category]],Table11[],2,FALSE)","v":"Misc"}]
["2010-09-09","Transfer from ING Savings","Internet Deposit",3082.96,"credit","Transfer","ING Holding",{"$f":"VLOOKUP(TestTable[[#This Row],[Category]],Table11[],2,FALSE)","v":"Misc"}]
["2010-09-09","Transfer to ING Holding","Internet Withdrawal",-3082.96,"debit","Transfer","ING Savings",{"$f":"VLOOKUP(TestTable[[#This Row],[Category]],Table11[],2,FALSE)","v":"Misc"}]
["2010-09-08","Marketplace Iga","MARKETPLACE CAFE PROVO UT",-6.45,"debit","Groceries","Citi CC",{"$f":"VLOOKUP(TestTable[[#This Row],[Category]],Table11[],2,FALSE)","v":"Food"}]
["2010-09-08","Transfer to Checking","Internet Deposit   Reversal",-2343,"debit","Transfer","ING Savings",{"$f":"VLOOKUP(TestTable[[#This Row],[Category]],Table11[],2,FALSE)","v":"Misc"}]
["2010-09-08","Transfer from FREE CHECKING","Internet Deposit",2343,"credit","Transfer","ING Savings",{"$f":"VLOOKUP(TestTable[[#This Row],[Category]],Table11[],2,FALSE)","v":"Misc"}]
["2010-09-07","Allen's Super Save Markets","Withdrawal #416774ALLEN'S SUPER SAVE #1 655 EAST 300 SOUTH PROVO UT %% Card 08 #4748",-14.03,"debit","Groceries","MACU Checking",{"$f":"VLOOKUP(TestTable[[#This Row],[Category]],Table11[],2,FALSE)","v":"Food"}]
["2010-09-07","Deposit Byu Refundtype","Deposit BYU RefundTYPE: UCA CO: BYU Refund",2358,"credit","Income","MACU Checking",{"$f":"VLOOKUP(TestTable[[#This Row],[Category]],Table11[],2,FALSE)","v":"income"}]
["2010-09-07","Marketplace Iga","MARKETPLACE CAFE PROVO UT",-1.72,"debit","Groceries","Citi CC",{"$f":"VLOOKUP(TestTable[[#This Row],[Category]],Table11[],2,FALSE)","v":"Food"}]
["2010-09-07","Marketplace Iga","MARKETPLACE CAFE PROVO UT",-6.24,"debit","Groceries","Citi CC",{"$f":"VLOOKUP(TestTable[[#This Row],[Category]],Table11[],2,FALSE)","v":"Food"}]
["2010-09-07","JetBlue","JETBLUE 27xxxxxxxxxxxx5382583 UT",-104.7,"debit","Air Travel","Citi CC",{"$f":"VLOOKUP(TestTable[[#This Row],[Category]],Table11[],2,FALSE)","v":"Misc"}]
["2010-09-07","Dunn Oil","DUNN OIL, INC Q39 SALT LAKE CIT UT",-44.3,"debit","Gas & Fuel","Citi CC",{"$f":"VLOOKUP(TestTable[[#This Row],[Category]],Table11[],2,FALSE)","v":"Auto"}]
["2010-09-07","Southwest","SOUTHWES5xxxxxxxxxxxx4359792 TX",-112.7,"debit","Air Travel","Citi CC",{"$f":"VLOOKUP(TestTable[[#This Row],[Category]],Table11[],2,FALSE)","v":"Misc"}]
["2010-09-07","Pioneer Family Medicine","PIONEER FAMILY MEDICIN BOISE ID",-40.96,"debit","Doctor","ING Checking",{"$f":"VLOOKUP(TestTable[[#This Row],[Category]],Table11[],2,FALSE)","v":"Medical"}]
["2010-09-07","Taco Bell","TACO BELL 09595 SALT LAKE CI UT",-7.71,"debit","Fast Food","ING Checking",{"$f":"VLOOKUP(TestTable[[#This Row],[Category]],Table11[],2,FALSE)","v":"Food"}]
["2010-09-07","Internet Deposit","Internet Deposit",240,"credit","Income","ING Checking",{"$f":"VLOOKUP(TestTable[[#This Row],[Category]],Table11[],2,FALSE)","v":"income"}]
["2010-09-07","AT&amp;T","External Electronic Withdrawal",-325.95999999999998,"debit","Mobile Phone","ING Holding",{"$f":"VLOOKUP(TestTable[[#This Row],[Category]],Table11[],2,FALSE)","v":"Phone"}]
["2010-09-07","Transfer to Bank of America","Internet Withdrawal",-240,"debit","Credit Card Payment","ING Savings",{"$f":"VLOOKUP(TestTable[[#This Row],[Category]],Table11[],2,FALSE)","v":"Debt"}]
["2010-09-07","Transfer from ING Savings","BA ELECTRONIC PAYMENT",240,"credit","Credit Card Payment","B of A CC",{"$f":"VLOOKUP(TestTable[[#This Row],[Category]],Table11[],2,FALSE)","v":"Debt"}]
["2010-09-07","Transfer from ING Savings","Internet Deposit",1075,"credit","Transfer","ING Checking",{"$f":"VLOOKUP(TestTable[[#This Row],[Category]],Table11[],2,FALSE)","v":"Misc"}]
["2010-09-07","Person Person Laura","Person2Person Payment to Laura",-1075,"debit","Mortgage & Rent","ING Checking",{"$f":"VLOOKUP(TestTable[[#This Row],[Category]],Table11[],2,FALSE)","v":"Housing"}]
["2010-09-07","Transfer from ING Savings","Internet Deposit",400,"credit","Transfer","ING Holding",{"$f":"VLOOKUP(TestTable[[#This Row],[Category]],Table11[],2,FALSE)","v":"Misc"}]
["2010-09-07","Transfer to ING Holding","Internet Withdrawal",-400,"debit","Transfer","ING Savings",{"$f":"VLOOKUP(TestTable[[#This Row],[Category]],Table11[],2,FALSE)","v":"Misc"}]
["2010-09-07","Transfer to Checking","Internet Withdrawal",-1075,"debit","Transfer","ING Savings",{"$f":"VLOOKUP(TestTable[[#This Row],[Category]],Table11[],2,FALSE)","v":"Misc"}]
["2010-09-06","Chevron","CHEVRON 0201054 Q61 WELLINGTON UT",-3.99,"debit","Gas & Fuel","Citi CC",{"$f":"VLOOKUP(TestTable[[#This Row],[Category]],Table11[],2,FALSE)","v":"Auto"}]
["2010-09-04","Harmons Grocery","HARMONS GROCERY 870 E 800 N",-42.66,"debit","Groceries","ING Checking",{"$f":"VLOOKUP(TestTable[[#This Row],[Category]],Table11[],2,FALSE)","v":"Food"}]
["2010-09-02","ShopKo","0086 SHOPKO 2266 NORTH UNIVERSI",-16.25,"debit","Shopping","ING Checking",{"$f":"VLOOKUP(TestTable[[#This Row],[Category]],Table11[],2,FALSE)","v":"Misc"}]
["2010-09-02","Person Person Kimmi","Person2Person Payment to Kimmi",-65.540000000000006,"debit","Uncategorized","ING Checking",{"$f":"VLOOKUP(TestTable[[#This Row],[Category]],Table11[],2,FALSE)","v":"Misc"}]
["2010-09-02","Transfer from ING Savings","Internet Deposit",300,"credit","Transfer","ING Checking",{"$f":"VLOOKUP(TestTable[[#This Row],[Category]],Table11[],2,FALSE)","v":"Misc"}]
["2010-09-02","Transfer to Checking","Internet Withdrawal",-300,"debit","Transfer","ING Savings",{"$f":"VLOOKUP(TestTable[[#This Row],[Category]],Table11[],2,FALSE)","v":"Misc"}]
["2010-09-02","Interest Charged Purchases","Interest Charged on Purchases",-53.44,"debit","Finance Charge","B of A CC",{"$f":"VLOOKUP(TestTable[[#This Row],[Category]],Table11[],2,FALSE)","v":"Misc"}]
["2010-09-02","Late Charge Adjustment","LATE CHARGE ADJUSTMENT",25,"credit","Credit Card Payment","B of A CC",{"$f":"VLOOKUP(TestTable[[#This Row],[Category]],Table11[],2,FALSE)","v":"Debt"}]
["2010-09-01","Byu Creamery Fountain","BYU CREAMERY FOUNTAIN PROVO UT",-12.77,"debit","Uncategorized","ING Checking",{"$f":"VLOOKUP(TestTable[[#This Row],[Category]],Table11[],2,FALSE)","v":"Misc"}]
["2010-09-01","Interest Paid For","Interest paid for overdraft Int",-7.0000000000000007E-2,"debit","Bank Fee","ING Checking",{"$f":"VLOOKUP(TestTable[[#This Row],[Category]],Table11[],2,FALSE)","v":"Misc"}]
["2010-09-01","Gridiron Rehab Athle","GRIDIRON REHAB ATHLE MERIDIAN I",-347,"debit","Uncategorized","ING Checking",{"$f":"VLOOKUP(TestTable[[#This Row],[Category]],Table11[],2,FALSE)","v":"Misc"}]
["2010-09-01","Byu Creamery Ninth","BYU CREAMERY ON NINTH PROVO UT",-25.33,"debit","Uncategorized","ING Checking",{"$f":"VLOOKUP(TestTable[[#This Row],[Category]],Table11[],2,FALSE)","v":"Misc"}]
["2010-09-01","Target","TARGET T1754 OR 175 WEST CENTER",-39.58,"debit","Miscellaneous","ING Checking",{"$f":"VLOOKUP(TestTable[[#This Row],[Category]],Table11[],2,FALSE)","v":"Misc"}]
["2010-09-01","Late Payment Fee","LATE FEE FOR PAYMENT DUE 09/01",-25,"debit","Late Fee","B of A CC",{"$f":"VLOOKUP(TestTable[[#This Row],[Category]],Table11[],2,FALSE)","v":"Misc"}]
["2010-08-31","Commentavg Checking Bal","Transaction COMMENTAvg Checking Bal for Aug $1,545.00",0,"credit","Income","MACU Checking",{"$f":"VLOOKUP(TestTable[[#This Row],[Category]],Table11[],2,FALSE)","v":"income"}]
["2010-08-31","Transfer to ING Savings","Withdrawal SWENSEN,AMBER MTYPE: ING DIRECT CO: SWENSEN,AMBER M",-4797,"debit","Transfer","MACU Checking",{"$f":"VLOOKUP(TestTable[[#This Row],[Category]],Table11[],2,FALSE)","v":"Misc"}]
["2010-08-31","BYU Bookstore","BYU BOOKSTORE PROVO UT",-276.55,"debit","Books","Citi CC",{"$f":"VLOOKUP(TestTable[[#This Row],[Category]],Table11[],2,FALSE)","v":"Misc"}]
["2010-08-31","Byu Wsc L","BYU WSC L&T PRODUCE PROVO UT",-5.7,"debit","Groceries","Citi CC",{"$f":"VLOOKUP(TestTable[[#This Row],[Category]],Table11[],2,FALSE)","v":"Food"}]
["2010-08-31","iTunes","APL*ITUNES 866-712-7753 CA",-10.65,"debit","Music","Citi CC",{"$f":"VLOOKUP(TestTable[[#This Row],[Category]],Table11[],2,FALSE)","v":"Misc"}]
["2010-08-31","Wendy's","WENDYS #4710 Q25 PROVO UT",-11.8,"debit","Fast Food","Citi CC",{"$f":"VLOOKUP(TestTable[[#This Row],[Category]],Table11[],2,FALSE)","v":"Food"}]
["2010-08-31","Subway","BYU WSC SUBWAY PROVO UT",-5.39,"debit","Fast Food","Citi CC",{"$f":"VLOOKUP(TestTable[[#This Row],[Category]],Table11[],2,FALSE)","v":"Food"}]
["2010-08-31","Target","TARGET T1754 OR 175 WEST CENTER",-115.67,"debit","Miscellaneous","ING Checking",{"$f":"VLOOKUP(TestTable[[#This Row],[Category]],Table11[],2,FALSE)","v":"Misc"}]
["2010-08-31","Interest Paid","Interest Paid",0.02,"credit","Interest Income","ING Checking",{"$f":"VLOOKUP(TestTable[[#This Row],[Category]],Table11[],2,FALSE)","v":"Misc"}]
["2010-08-31","Street","Error",11.72,"credit","Income","ING Checking",{"$f":"VLOOKUP(TestTable[[#This Row],[Category]],Table11[],2,FALSE)","v":"income"}]
["2010-08-31","Interest Paid","Interest Paid",0.44,"credit","Interest Income","ING Holding",{"$f":"VLOOKUP(TestTable[[#This Row],[Category]],Table11[],2,FALSE)","v":"Misc"}]
["2010-08-31","Interest Paid","Interest Paid",0.21,"credit","Interest Income","ING Savings",{"$f":"VLOOKUP(TestTable[[#This Row],[Category]],Table11[],2,FALSE)","v":"Misc"}]
["2010-08-31","External Electronic Withdrawal","External Electronic Withdrawal",-289.2,"debit","Uncategorized","ING Holding",{"$f":"VLOOKUP(TestTable[[#This Row],[Category]],Table11[],2,FALSE)","v":"Misc"}]
["2010-08-30","Withdrawalfedex Tn Date","WithdrawalFEDEX 871332113332 800-4633339 TN Date 08/27/10 24164070239741178332620 4215",-26.66,"debit","Bank Fee","MACU Checking",{"$f":"VLOOKUP(TestTable[[#This Row],[Category]],Table11[],2,FALSE)","v":"Misc"}]
["2010-08-30","Deposit Transferfrom Swensen","Deposit TransferFrom SWENSEN,AMBER M 0008992288 Share 50",35,"credit","Income","MACU Checking",{"$f":"VLOOKUP(TestTable[[#This Row],[Category]],Table11[],2,FALSE)","v":"income"}]
["2010-08-30","Chevron","CHEVRON 0204058 PROVO UT - Debit",-54.09,"debit","Gas & Fuel","ING Checking",{"$f":"VLOOKUP(TestTable[[#This Row],[Category]],Table11[],2,FALSE)","v":"Auto"}]
["2010-08-30","Electronic Deposit","Electronic Deposit",111,"credit","Income","ING Checking",{"$f":"VLOOKUP(TestTable[[#This Row],[Category]],Table11[],2,FALSE)","v":"income"}]
["2010-08-30","Transfer from FREE CHECKING","Internet Deposit MOUNTAIN AMERI",4797,"credit","Transfer","ING Savings",{"$f":"VLOOKUP(TestTable[[#This Row],[Category]],Table11[],2,FALSE)","v":"Misc"}]
["2010-08-29","Error","Error",31,"credit","Income","ING Checking",{"$f":"VLOOKUP(TestTable[[#This Row],[Category]],Table11[],2,FALSE)","v":"income"}]
["2010-08-29","Byu Creamery Ninth","BYU CREAMERY ON NINTH PROVO UT",-3.09,"debit","Uncategorized","ING Checking",{"$f":"VLOOKUP(TestTable[[#This Row],[Category]],Table11[],2,FALSE)","v":"Misc"}]
["2010-08-29","Byu Creamery Fountain","BYU CREAMERY FOUNTAIN PROVO UT",-4.1900000000000004,"debit","Uncategorized","ING Checking",{"$f":"VLOOKUP(TestTable[[#This Row],[Category]],Table11[],2,FALSE)","v":"Misc"}]
["2010-08-28","Byu Creamery Ninth","BYU CREAMERY ON NINTH PROVO UT",-17.61,"debit","Uncategorized","Citi CC",{"$f":"VLOOKUP(TestTable[[#This Row],[Category]],Table11[],2,FALSE)","v":"Misc"}]
["2010-08-28","Chevron","CHEVRON 0072882 Q61 GREEN RIVER UT",-1.28,"debit","Gas & Fuel","Citi CC",{"$f":"VLOOKUP(TestTable[[#This Row],[Category]],Table11[],2,FALSE)","v":"Auto"}]
["2010-08-28","Byu Creamery Ninth","BYU CREAMERY ON NINTH PROVO UT",-7.67,"debit","Uncategorized","Citi CC",{"$f":"VLOOKUP(TestTable[[#This Row],[Category]],Table11[],2,FALSE)","v":"Misc"}]
["2010-08-27","Deposit Byu Refundtype","Deposit BYU RefundTYPE: UCA CO: BYU Refund",4797,"credit","Income","MACU Checking",{"$f":"VLOOKUP(TestTable[[#This Row],[Category]],Table11[],2,FALSE)","v":"income"}]
["2010-08-27","Target","TARGET T1754 OR 175 WEST CENTER",-28.54,"debit","Miscellaneous","ING Checking",{"$f":"VLOOKUP(TestTable[[#This Row],[Category]],Table11[],2,FALSE)","v":"Misc"}]
["2010-08-27","Target","TARGET T1754 OR 175 WEST CENTER",-59.5,"debit","Miscellaneous","ING Checking",{"$f":"VLOOKUP(TestTable[[#This Row],[Category]],Table11[],2,FALSE)","v":"Misc"}]
["2010-08-27","Byu Creamery Ninth","BYU CREAMERY ON NINTH PROVO UT",-25.25,"debit","Uncategorized","ING Checking",{"$f":"VLOOKUP(TestTable[[#This Row],[Category]],Table11[],2,FALSE)","v":"Misc"}]
["2010-08-26","Transfer to Checking","Withdrawal SWENSEN,AMBER MTYPE: ING DIRECT CO: SWENSEN,AMBER M",-203,"debit","Transfer","MACU Checking",{"$f":"VLOOKUP(TestTable[[#This Row],[Category]],Table11[],2,FALSE)","v":"Misc"}]
["2010-08-26","Consumer Reports","CR *CONSUMERREPORTS.OR 8003330663 NY",-5.95,"debit","Books","Citi CC",{"$f":"VLOOKUP(TestTable[[#This Row],[Category]],Table11[],2,FALSE)","v":"Misc"}]
["2010-08-26","Chevron","CHEVRON 0207391 Q61 PRICE UT",-3.07,"debit","Gas & Fuel","Citi CC",{"$f":"VLOOKUP(TestTable[[#This Row],[Category]],Table11[],2,FALSE)","v":"Auto"}]
["2010-08-26","Smiths","SMITHS 350 N. FREEDOM",-21.57,"debit","Groceries","ING Checking",{"$f":"VLOOKUP(TestTable[[#This Row],[Category]],Table11[],2,FALSE)","v":"Food"}]
["2010-08-25","Transfer to Checking","Withdrawal SWENSEN,AMBER MTYPE: ING DIRECT CO: SWENSEN,AMBER M",-376,"debit","Transfer","MACU Checking",{"$f":"VLOOKUP(TestTable[[#This Row],[Category]],Table11[],2,FALSE)","v":"Misc"}]
["2010-08-25","Internetsafety Com Ga","INTERNETSAFETY COM INC 678-7976496 GA",-39.96,"debit","Uncategorized","Citi CC",{"$f":"VLOOKUP(TestTable[[#This Row],[Category]],Table11[],2,FALSE)","v":"Misc"}]
["2010-08-25","Chevron","CHEVRON/FAULKNE CHEVRON/FAULKNE",-3.07,"debit","Gas & Fuel","ING Checking",{"$f":"VLOOKUP(TestTable[[#This Row],[Category]],Table11[],2,FALSE)","v":"Auto"}]
["2010-08-25","Wal","WAL - Debit",-53.95,"debit","Uncategorized","ING Checking",{"$f":"VLOOKUP(TestTable[[#This Row],[Category]],Table11[],2,FALSE)","v":"Misc"}]
["2010-08-25","Amazon","AMAZON MKTPLACE PMTS AMZN COM B",-40.159999999999997,"debit","Shopping","ING Checking",{"$f":"VLOOKUP(TestTable[[#This Row],[Category]],Table11[],2,FALSE)","v":"Misc"}]
["2010-08-25","Transfer from FREE CHECKING","Internet Deposit MOUNTAIN AMERI",203,"credit","Transfer","ING Checking",{"$f":"VLOOKUP(TestTable[[#This Row],[Category]],Table11[],2,FALSE)","v":"Misc"}]
["2010-08-24","Lowe's","LOWES #00178* Q01 OREM UT",-2.52,"debit","Home Improvement","Citi CC",{"$f":"VLOOKUP(TestTable[[#This Row],[Category]],Table11[],2,FALSE)","v":"Misc"}]
["2010-08-24","JCPenney","JCPENNEY STORE 2770 PROVO UT",-91.8,"debit","Clothing","Citi CC",{"$f":"VLOOKUP(TestTable[[#This Row],[Category]],Table11[],2,FALSE)","v":"Misc"}]
["2010-08-24","Iceberg Drive Inn","ICEBERG DRIVE INN -QPS OREM UT",-4.7300000000000004,"debit","Restaurants","Citi CC",{"$f":"VLOOKUP(TestTable[[#This Row],[Category]],Table11[],2,FALSE)","v":"Food"}]
["2010-08-24","Rick's Muffler","RICK'S MUFFLER OREM UT",-80.08,"debit","Auto & Transport","Citi CC",{"$f":"VLOOKUP(TestTable[[#This Row],[Category]],Table11[],2,FALSE)","v":"Auto"}]
["2010-08-24","Chevron","CHEVRON 0203586 PROVO UT",-43.84,"debit","Gas & Fuel","Citi CC",{"$f":"VLOOKUP(TestTable[[#This Row],[Category]],Table11[],2,FALSE)","v":"Auto"}]
["2010-08-24","Chevron","CHEVRON 0203586 Q61 PROVO UT",-2.97,"debit","Gas & Fuel","Citi CC",{"$f":"VLOOKUP(TestTable[[#This Row],[Category]],Table11[],2,FALSE)","v":"Auto"}]
["2010-08-24","Scout Com Wa","SCOUT.COM              888-979-0979 WA",-9.9499999999999993,"debit","Uncategorized","B of A CC",{"$f":"VLOOKUP(TestTable[[#This Row],[Category]],Table11[],2,FALSE)","v":"Misc"}]
["2010-08-24","Nauvoo Cafe Qps","NAUVOO CAFE QPS SALT LAKE CI UT",-19.34,"debit","Restaurants","ING Checking",{"$f":"VLOOKUP(TestTable[[#This Row],[Category]],Table11[],2,FALSE)","v":"Food"}]
["2010-08-24","Internet Deposit Addison","Internet Deposit ADDISON AVENUE",65,"credit","Transfer","ING Checking",{"$f":"VLOOKUP(TestTable[[#This Row],[Category]],Table11[],2,FALSE)","v":"Misc"}]
["2010-08-24","Transfer from FREE CHECKING","Internet Deposit MOUNTAIN AMERI",376,"credit","Transfer","ING Checking",{"$f":"VLOOKUP(TestTable[[#This Row],[Category]],Table11[],2,FALSE)","v":"Misc"}]
["2010-08-24","Veracity Network Veracity","External Electronic Withdrawal",-48.28,"debit","Internet","ING Holding",{"$f":"VLOOKUP(TestTable[[#This Row],[Category]],Table11[],2,FALSE)","v":"Utilities"}]
["2010-08-23","Bingham Cyclery","BINGHAM CYCLERY PROVO UT",-26.67,"debit","Sporting Goods","Citi CC",{"$f":"VLOOKUP(TestTable[[#This Row],[Category]],Table11[],2,FALSE)","v":"Misc"}]
["2010-08-23","Boomerang Books","BOOMERANG BOOKS PROVO UT",-65.12,"debit","Books","Citi CC",{"$f":"VLOOKUP(TestTable[[#This Row],[Category]],Table11[],2,FALSE)","v":"Misc"}]
["2010-08-23","Costco","COSTCO WHSE #0484 0000 OREM         UT",-97.21,"debit","Miscellaneous","B of A CC",{"$f":"VLOOKUP(TestTable[[#This Row],[Category]],Table11[],2,FALSE)","v":"Misc"}]
["2010-08-22","Byu Creamery Ninth","BYU CREAMERY ON NINTH PROVO UT",-23.83,"debit","Uncategorized","Citi CC",{"$f":"VLOOKUP(TestTable[[#This Row],[Category]],Table11[],2,FALSE)","v":"Misc"}]
["2010-08-22","Harmons Grocery","HARMONS GROCERY 870 E 800 N",-17.59,"debit","Groceries","ING Checking",{"$f":"VLOOKUP(TestTable[[#This Row],[Category]],Table11[],2,FALSE)","v":"Food"}]
["2010-08-20","Chevron","CHEVRON 0073049 PROVO UT",-56.8,"debit","Gas & Fuel","Citi CC",{"$f":"VLOOKUP(TestTable[[#This Row],[Category]],Table11[],2,FALSE)","v":"Auto"}]
["2010-08-20","Supersonic Car Wash","SUPERSONIC CAR WASHQPS OREM UT",-11,"debit","Service & Parts","Citi CC",{"$f":"VLOOKUP(TestTable[[#This Row],[Category]],Table11[],2,FALSE)","v":"Auto"}]
["2010-08-20","Home Depot","THE HOME DEPOT 4416 PROVO UT",-31.99,"debit","Home Improvement","Citi CC",{"$f":"VLOOKUP(TestTable[[#This Row],[Category]],Table11[],2,FALSE)","v":"Misc"}]
["2010-08-20","Savings Deposit Direct","Savings Deposit - Direct Deposit",187.8,"credit","Paycheck","ING Holding",{"$f":"VLOOKUP(TestTable[[#This Row],[Category]],Table11[],2,FALSE)","v":"Income"}]
["2010-08-19","McDonald's","MCDONALD'S F23720 0000 MERIDIAN     ID",-15.55,"debit","Fast Food","B of A CC",{"$f":"VLOOKUP(TestTable[[#This Row],[Category]],Table11[],2,FALSE)","v":"Food"}]
["2010-08-19","Chevron","CHEVRON JACKSONS FOOD  MERIDIAN     ID",-18.09,"debit","Gas & Fuel","B of A CC",{"$f":"VLOOKUP(TestTable[[#This Row],[Category]],Table11[],2,FALSE)","v":"Auto"}]
["2010-08-19","Chevron","CHEVRON STINKER STORES BURLEY       ID",-7.7,"debit","Gas & Fuel","B of A CC",{"$f":"VLOOKUP(TestTable[[#This Row],[Category]],Table11[],2,FALSE)","v":"Auto"}]
["2010-08-19","Albertsons","#00177 ALBERTSONS 0000 BOISE        ID",-21.18,"debit","Miscellaneous","B of A CC",{"$f":"VLOOKUP(TestTable[[#This Row],[Category]],Table11[],2,FALSE)","v":"Misc"}]
["2010-08-19","Chevron","CHEVRON JACKSONS FOOD  MERIDIAN     ID",-49.62,"debit","Gas & Fuel","B of A CC",{"$f":"VLOOKUP(TestTable[[#This Row],[Category]],Table11[],2,FALSE)","v":"Auto"}]
["2010-08-18","Membership Fee Aug","MEMBERSHIP FEE AUG 10-JUL 11",-75,"debit","Fees & Charges","Citi CC",{"$f":"VLOOKUP(TestTable[[#This Row],[Category]],Table11[],2,FALSE)","v":"Misc"}]
["2010-08-18","Wal-Mart","WAL-MART  2861         BOISE        ID",-10.48,"debit","Shopping","B of A CC",{"$f":"VLOOKUP(TestTable[[#This Row],[Category]],Table11[],2,FALSE)","v":"Misc"}]
["2010-08-18","Albertsons","#00177 ALBERTSONS 0000 BOISE        ID",-12.17,"debit","Miscellaneous","B of A CC",{"$f":"VLOOKUP(TestTable[[#This Row],[Category]],Table11[],2,FALSE)","v":"Misc"}]
["2010-08-18","George's Cycles & Fitness","GEORGE'S CYCLES & FIT  BOISE        ID",-4.24,"debit","Sporting Goods","B of A CC",{"$f":"VLOOKUP(TestTable[[#This Row],[Category]],Table11[],2,FALSE)","v":"Misc"}]
["2010-08-18","McDonald's","MCDONALD S F6925 Q17 WINNEMUCCA",-2.66,"debit","Fast Food","ING Checking",{"$f":"VLOOKUP(TestTable[[#This Row],[Category]],Table11[],2,FALSE)","v":"Food"}]
["2010-08-18","External Electronic Withdrawal","External Electronic Withdrawal",-20.170000000000002,"debit","Uncategorized","ING Holding",{"$f":"VLOOKUP(TestTable[[#This Row],[Category]],Table11[],2,FALSE)","v":"Misc"}]
["2010-08-17","Walgreen","WALGREENS #11452 00001 MERIDIAN     ID",-3.17,"debit","Miscellaneous","B of A CC",{"$f":"VLOOKUP(TestTable[[#This Row],[Category]],Table11[],2,FALSE)","v":"Misc"}]
["2010-08-17","Costco","COSTCO WHSE #0761 0000 BOISE        ID",-197.3,"debit","Miscellaneous","B of A CC",{"$f":"VLOOKUP(TestTable[[#This Row],[Category]],Table11[],2,FALSE)","v":"Misc"}]
["2010-08-17","Meridian Meridian","MERIDIAN #685 MERIDIAN MERIDIAN     ID",-104.94,"debit","Uncategorized","B of A CC",{"$f":"VLOOKUP(TestTable[[#This Row],[Category]],Table11[],2,FALSE)","v":"Misc"}]
["2010-08-16","Chevron","CHEVRON CHEVRON STATIO AUBURN       CA",-3.77,"debit","Gas & Fuel","B of A CC",{"$f":"VLOOKUP(TestTable[[#This Row],[Category]],Table11[],2,FALSE)","v":"Auto"}]
["2010-08-16","Chevron","CHEVRON CHEVRON STATIO AUBURN       CA",-58,"debit","Gas & Fuel","B of A CC",{"$f":"VLOOKUP(TestTable[[#This Row],[Category]],Table11[],2,FALSE)","v":"Auto"}]
["2010-08-16","McDonald's","MCDONALD'S F19926 0000 SPARKS       NV",-14.74,"debit","Fast Food","B of A CC","Error"]
["2010-08-16","McDonald's","MCDONALD'S F6925 00000 WINNEMUCCA   NV",-2.77,"debit","Fast Food","B of A CC",{"$f":"VLOOKUP(TestTable[[#This Row],[Category]],Table11[],2,FALSE)","v":"Food"}]
["2010-08-16","Shell","SHELL OIL 64611220181  WINNEMUCCA   NV",-40.21,"debit","Gas & Fuel","B of A CC",{"$f":"VLOOKUP(TestTable[[#This Row],[Category]],Table11[],2,FALSE)","v":"Auto"}]
["2010-08-16","Raley's","RALEY'S #111 1125 W WINNEMUCCA",-10.76,"debit","Groceries","ING Checking",{"$f":"VLOOKUP(TestTable[[#This Row],[Category]],Table11[],2,FALSE)","v":"Food"}]
["2010-08-14","Jamba Juice","JAMBA JUICE #361 QSR FOLSOM CA",-8.5,"debit","Food & Dining","Citi CC",{"$f":"VLOOKUP(TestTable[[#This Row],[Category]],Table11[],2,FALSE)","v":"Food"}]
["2010-08-14","Raley's","RALEY'S #231 6119 HORSESHOE BAR",-16.43,"debit","Groceries","ING Checking",{"$f":"VLOOKUP(TestTable[[#This Row],[Category]],Table11[],2,FALSE)","v":"Food"}]
["2010-08-13","McDonald's","MCDONALD S F6925 Q17 WINNEMUCCA",-14.7,"debit","Fast Food","ING Checking",{"$f":"VLOOKUP(TestTable[[#This Row],[Category]],Table11[],2,FALSE)","v":"Food"}]
["2010-08-12","Error","Error",17.55,"credit","Income","ING Checking",{"$f":"VLOOKUP(TestTable[[#This Row],[Category]],Table11[],2,FALSE)","v":"income"}]
["2010-08-12","Chevron","CHEVRON/KINGS B CHEVRON/KINGS B",-7.54,"debit","Gas & Fuel","ING Checking",{"$f":"VLOOKUP(TestTable[[#This Row],[Category]],Table11[],2,FALSE)","v":"Auto"}]
["2010-08-12","IHOP","IHOP 1746 MERIDIAN ID - Debit",-31,"debit","Restaurants","ING Checking",{"$f":"VLOOKUP(TestTable[[#This Row],[Category]],Table11[],2,FALSE)","v":"Food"}]
["2010-08-11","Intelius","INT*INTELIUS CM 888-445-2727 WA",-1.95,"debit","Personal Care","Citi CC",{"$f":"VLOOKUP(TestTable[[#This Row],[Category]],Table11[],2,FALSE)","v":"Misc"}]
["2010-08-11","Transfer from Checking","ELECTRONIC PAYMENT-THANK YOU",41.68,"credit","Credit Card Payment","Citi CC",{"$f":"VLOOKUP(TestTable[[#This Row],[Category]],Table11[],2,FALSE)","v":"Debt"}]
["2010-08-11","McDonald's","MCDONALD'S F6925 Q17 WINNEMUCCA NV",-2.14,"debit","Fast Food","Citi CC",{"$f":"VLOOKUP(TestTable[[#This Row],[Category]],Table11[],2,FALSE)","v":"Food"}]
["2010-08-11","Marshalls","MARSHALLS #871 0000008 MERIDIAN     ID",27.54,"credit","Clothing","B of A CC",{"$f":"VLOOKUP(TestTable[[#This Row],[Category]],Table11[],2,FALSE)","v":"Misc"}]
["2010-08-11","Gap","THE GAP #2524 THE GAP  BOISE        ID",21.19,"credit","Clothing","B of A CC",{"$f":"VLOOKUP(TestTable[[#This Row],[Category]],Table11[],2,FALSE)","v":"Misc"}]
["2010-08-11","Kohl's","KOHL'S 1094 1094       MERIDIAN     ID",252.3,"credit","Clothing","B of A CC","Error"]
["2010-08-11","Express Boise Id","EXPRESS#0645 00000645  BOISE        ID",68.69,"credit","Credit Card Payment","B of A CC","Error"]
["2010-08-11","Mrs Z Mrs","MRS S Z MRS S Z",-10.95,"debit","Uncategorized","ING Checking",{"$f":"VLOOKUP(TestTable[[#This Row],[Category]],Table11[],2,FALSE)","v":"Misc"}]
["2010-08-10","Transfer to 7125","Electronic Payment to CITI CARDS",-41.68,"debit","Credit Card Payment","ING Checking","Error"]
["2010-08-10","Wal","WAL - Debit",-35.06,"debit","Uncategorized","ING Checking",{"$f":"VLOOKUP(TestTable[[#This Row],[Category]],Table11[],2,FALSE)","v":"Misc"}]
["2010-08-10","Paper Church Jesus","Paper Payment to CHURCH OF JESU",-207.37,"debit","Charity","ING Checking",{"$f":"VLOOKUP(TestTable[[#This Row],[Category]],Table11[],2,FALSE)","v":"Misc"}]
["2010-08-10","Dillard's","DILLARD S 934 BOISEQPS BOISE ID",-15.9,"debit","Clothing","ING Checking",{"$f":"VLOOKUP(TestTable[[#This Row],[Category]],Table11[],2,FALSE)","v":"Misc"}]
["2010-08-09","Claires","CLAIRES #6605 1400 NORTH EAGLE",-12.99,"debit","Shopping","ING Checking",{"$f":"VLOOKUP(TestTable[[#This Row],[Category]],Table11[],2,FALSE)","v":"Misc"}]
["2010-08-09","Dpps City Center","DPPS CITY CENTER BOISE ID - Deb",-12,"debit","Uncategorized","ING Checking",{"$f":"VLOOKUP(TestTable[[#This Row],[Category]],Table11[],2,FALSE)","v":"Misc"}]
["2010-08-09","Transfer to ING Savings","Internet Withdrawal",-300,"debit","Transfer","ING Checking","Error"]
["2010-08-09","Netflix","NFI WWW NETFLIX COM CC NETFLIX",-11.65,"debit","Movies & DVDs","ING Checking",{"$f":"VLOOKUP(TestTable[[#This Row],[Category]],Table11[],2,FALSE)","v":"Misc"}]
["2010-08-09","Transfer from ING Holding","Internet Deposit",1637,"credit","Transfer","ING Checking",{"$f":"VLOOKUP(TestTable[[#This Row],[Category]],Table11[],2,FALSE)","v":"Misc"}]
["2010-08-09","Express","EXPRESS LLC 350 N MILWAUKEE",-41.71,"debit","Clothing","ING Checking",{"$f":"VLOOKUP(TestTable[[#This Row],[Category]],Table11[],2,FALSE)","v":"Misc"}]
["2010-08-09","Person Person Tyler","Person2Person Payment to Tyler",-800,"debit","Money Transfer","ING Checking","Error"]
["2010-08-09","- Debit 00","- Debit 00",15.9,"credit","Income","ING Checking",{"$f":"VLOOKUP(TestTable[[#This Row],[Category]],Table11[],2,FALSE)","v":"income"}]
["2010-08-09","Kohl's","KOHL'S #1094 3275 N EAGLE RD",-7.41,"debit","Clothing","ING Checking",{"$f":"VLOOKUP(TestTable[[#This Row],[Category]],Table11[],2,FALSE)","v":"Misc"}]
["2010-08-09","Transfer to Checking","Internet Withdrawal",-1637,"debit","Transfer","ING Holding",{"$f":"VLOOKUP(TestTable[[#This Row],[Category]],Table11[],2,FALSE)","v":"Misc"}]
["2010-08-09","Transfer from Checking","Internet Deposit",300,"credit","Transfer","ING Savings",{"$f":"VLOOKUP(TestTable[[#This Row],[Category]],Table11[],2,FALSE)","v":"Misc"}]
["2010-08-08","Westco Martinizing Dry Clnng","WESTCO MARTINIZING 83 BOISE ID",-24.59,"debit","Laundry","ING Checking",{"$f":"VLOOKUP(TestTable[[#This Row],[Category]],Table11[],2,FALSE)","v":"Misc"}]
["2010-08-07","Kohl's","KOHL'S 1094 1094       MERIDIAN     ID",-32.840000000000003,"debit","Clothing","B of A CC",{"$f":"VLOOKUP(TestTable[[#This Row],[Category]],Table11[],2,FALSE)","v":"Misc"}]
["2010-08-07","Jimmy John's","JIMMY JOHN'S # 1286 80 MERIDIAN     ID",-10.6,"debit","Restaurants","B of A CC",{"$f":"VLOOKUP(TestTable[[#This Row],[Category]],Table11[],2,FALSE)","v":"Food"}]
["2010-08-07","Amazon","AMAZON.COM             AMZN.COM/BILLWA",-39.979999999999997,"debit","Shopping","B of A CC",{"$f":"VLOOKUP(TestTable[[#This Row],[Category]],Table11[],2,FALSE)","v":"Misc"}]
["2010-08-07","Quiznos","QUIZNOS SUB #1522 3000 EAGLE        ID",-13.11,"debit","Fast Food","B of A CC",{"$f":"VLOOKUP(TestTable[[#This Row],[Category]],Table11[],2,FALSE)","v":"Food"}]
["2010-08-06","Kohl's","KOHL'S 1094 1094       MERIDIAN     ID",-210.12,"debit","Clothing","B of A CC",{"$f":"VLOOKUP(TestTable[[#This Row],[Category]],Table11[],2,FALSE)","v":"Misc"}]
["2010-08-06","Albertsons","#00177 ALBERTSONS 0000 BOISE        ID",-44.41,"debit","Miscellaneous","B of A CC",{"$f":"VLOOKUP(TestTable[[#This Row],[Category]],Table11[],2,FALSE)","v":"Misc"}]
["2010-08-06","Gap","THE GAP #2524 THE GAP  BOISE        ID",-21.19,"debit","Clothing","B of A CC",{"$f":"VLOOKUP(TestTable[[#This Row],[Category]],Table11[],2,FALSE)","v":"Misc"}]
["2010-08-06","Marshalls","MARSHALLS #871 0000008 MERIDIAN     ID",-44.27,"debit","Clothing","B of A CC",{"$f":"VLOOKUP(TestTable[[#This Row],[Category]],Table11[],2,FALSE)","v":"Misc"}]
["2010-08-06","Kohl's","KOHL'S 1094 1094       MERIDIAN     ID",-54.9,"debit","Clothing","B of A CC",{"$f":"VLOOKUP(TestTable[[#This Row],[Category]],Table11[],2,FALSE)","v":"Misc"}]
["2010-08-06","Express","EXPRESS#0645 00000645  BOISE        ID",-132.18,"debit","Clothing","B of A CC",{"$f":"VLOOKUP(TestTable[[#This Row],[Category]],Table11[],2,FALSE)","v":"Misc"}]
["2010-08-06","Error","Error",21.19,"credit","Income","ING Checking",{"$f":"VLOOKUP(TestTable[[#This Row],[Category]],Table11[],2,FALSE)","v":"income"}]
["2010-08-06","Sonic","SONIC DRIVE IN 478Q63 MERIDIAN",-4.2699999999999996,"debit","Fast Food","ING Checking",{"$f":"VLOOKUP(TestTable[[#This Row],[Category]],Table11[],2,FALSE)","v":"Food"}]
["2010-08-06","Old Navy","OLD NAVY USA 3401 E. FAIRVIEW",-21.62,"debit","Clothing","ING Checking",{"$f":"VLOOKUP(TestTable[[#This Row],[Category]],Table11[],2,FALSE)","v":"Misc"}]
["2010-08-06","Savings Deposit Direct","Savings Deposit - Direct Deposit",1773.65,"credit","Paycheck","ING Holding",{"$f":"VLOOKUP(TestTable[[#This Row],[Category]],Table11[],2,FALSE)","v":"Income"}]
["2010-08-05","iTunes","APL*ITUNES 866-712-7753 CA",-1.06,"debit","Music","Citi CC",{"$f":"VLOOKUP(TestTable[[#This Row],[Category]],Table11[],2,FALSE)","v":"Misc"}]
["2010-08-05","Sonic","SONIC DRIVE IN #4781 0 MERIDIAN     ID",-2.4300000000000002,"debit","Fast Food","B of A CC",{"$f":"VLOOKUP(TestTable[[#This Row],[Category]],Table11[],2,FALSE)","v":"Food"}]
["2010-08-05","AT&amp;T","External Electronic Withdrawal",-110.61,"debit","Mobile Phone","ING Holding",{"$f":"VLOOKUP(TestTable[[#This Row],[Category]],Table11[],2,FALSE)","v":"Phone"}]
["2010-08-04","Albertsons","#00177 ALBERTSONS 0000 BOISE        ID",-15.35,"debit","Miscellaneous","B of A CC",{"$f":"VLOOKUP(TestTable[[#This Row],[Category]],Table11[],2,FALSE)","v":"Misc"}]
["2010-08-04","Target","TARGET T1230 BO 6280 N EAGLE RO",-77.34,"debit","Miscellaneous","ING Checking",{"$f":"VLOOKUP(TestTable[[#This Row],[Category]],Table11[],2,FALSE)","v":"Misc"}]
["2010-08-04","Hobby Lobby","HOBBY LOBBY STO HOBBY LOBBY #43",-8.5500000000000007,"debit","Hobbies","ING Checking",{"$f":"VLOOKUP(TestTable[[#This Row],[Category]],Table11[],2,FALSE)","v":"Misc"}]
["2010-08-04","Tree City Juice","TREE CITY JUICE SMOO MERIDIAN I",-10.99,"debit","Uncategorized","ING Checking",{"$f":"VLOOKUP(TestTable[[#This Row],[Category]],Table11[],2,FALSE)","v":"Misc"}]
["2010-08-03","Interest Charged Purchases","Interest Charged on Purchases",-43.8,"debit","Finance Charge","B of A CC",{"$f":"VLOOKUP(TestTable[[#This Row],[Category]],Table11[],2,FALSE)","v":"Misc"}]
["2010-08-02","Brigham Young University","BRIGHAM YOUNG UNIV WEB PROVO        UT",-260,"debit","Education","B of A CC",{"$f":"VLOOKUP(TestTable[[#This Row],[Category]],Table11[],2,FALSE)","v":"Misc"}]
["2010-08-02","Byu Ticket Office","BYU TICKET OFFICE WEB  PROVO        UT",-265,"debit","Entertainment","B of A CC",{"$f":"VLOOKUP(TestTable[[#This Row],[Category]],Table11[],2,FALSE)","v":"Misc"}]
["2010-08-02","Target","TARGET T1230 BO 6280 N EAGLE RO",-10.59,"debit","Miscellaneous","ING Checking",{"$f":"VLOOKUP(TestTable[[#This Row],[Category]],Table11[],2,FALSE)","v":"Misc"}]
["2010-08-02","Kohl's","KOHL'S #1094 3275 N EAGLE RD",-33.06,"debit","Clothing","ING Checking",{"$f":"VLOOKUP(TestTable[[#This Row],[Category]],Table11[],2,FALSE)","v":"Misc"}]
["2010-08-02","Old Navy","OLD NAVY USA 3401 E. FAIRVIEW",-18.53,"debit","Clothing","ING Checking",{"$f":"VLOOKUP(TestTable[[#This Row],[Category]],Table11[],2,FALSE)","v":"Misc"}]
["2010-08-02","Deposit Transfer Aug","Deposit Transfer From 42344010 ,Aug. Rent",50,"credit","Transfer","Addison Avenue Checking",{"$f":"VLOOKUP(TestTable[[#This Row],[Category]],Table11[],2,FALSE)","v":"Misc"}]
["2010-08-01","Target","TARGET T1230 BO 6280 N EAGLE RO",-27.85,"debit","Miscellaneous","ING Checking",{"$f":"VLOOKUP(TestTable[[#This Row],[Category]],Table11[],2,FALSE)","v":"Misc"}]
["2010-08-01","Expressions","QUILT EXPRESSIONS QPS GARDEN CI",-16.34,"debit","Personal Care","ING Checking",{"$f":"VLOOKUP(TestTable[[#This Row],[Category]],Table11[],2,FALSE)","v":"Misc"}]
["2010-08-01","Interest Paid For","Interest paid for overdraft Int",-0.01,"debit","Bank Fee","ING Checking",{"$f":"VLOOKUP(TestTable[[#This Row],[Category]],Table11[],2,FALSE)","v":"Misc"}]
["2010-08-01","Dillard's","DILLARD S 934 BOISEQPS BOISE ID",-17.55,"debit","Clothing","ING Checking",{"$f":"VLOOKUP(TestTable[[#This Row],[Category]],Table11[],2,FALSE)","v":"Misc"}]
["2010-08-01","Carfax Vehicle His","CARFAX VEHICLE HIS 542 CENTREVILLE  VA",-44.99,"debit","Auto & Transport","B of A CC",{"$f":"VLOOKUP(TestTable[[#This Row],[Category]],Table11[],2,FALSE)","v":"Auto"}]
["2010-07-31","Interest Paid","Interest Paid",0.04,"credit","Interest Income","ING Checking",{"$f":"VLOOKUP(TestTable[[#This Row],[Category]],Table11[],2,FALSE)","v":"Misc"}]
["2010-07-31","Cardtronics Ccsp","CARDTRONICS CCSP  BOISE, ID US",-60,"debit","Uncategorized","ING Checking",{"$f":"VLOOKUP(TestTable[[#This Row],[Category]],Table11[],2,FALSE)","v":"Misc"}]
["2010-07-31","Interest Paid","Interest Paid",0.51,"credit","Interest Income","ING Holding",{"$f":"VLOOKUP(TestTable[[#This Row],[Category]],Table11[],2,FALSE)","v":"Misc"}]
["2010-07-31","Interest Paid","Interest Paid",0.09,"credit","Interest Income","ING Savings",{"$f":"VLOOKUP(TestTable[[#This Row],[Category]],Table11[],2,FALSE)","v":"Misc"}]
["2010-07-31","Boise Towne Square","BOISE TOWN SQUARE 3930 BOISE        ID",35.76,"credit","Reimbursement","B of A CC",{"$f":"VLOOKUP(TestTable[[#This Row],[Category]],Table11[],2,FALSE)","v":"Misc"}]
["2010-07-30","Error","Error",14.82,"credit","Income","ING Checking",{"$f":"VLOOKUP(TestTable[[#This Row],[Category]],Table11[],2,FALSE)","v":"income"}]
["2010-07-30","Diamonds Fine Jewelry","DIAMONDS FINE JEWELRY MERIDIAN",-15,"debit","Miscellaneous","ING Checking",{"$f":"VLOOKUP(TestTable[[#This Row],[Category]],Table11[],2,FALSE)","v":"Misc"}]
["2010-07-30","Albertsons","#00177 ALBERTSONS 0000 BOISE        ID",-5.29,"debit","Miscellaneous","B of A CC",{"$f":"VLOOKUP(TestTable[[#This Row],[Category]],Table11[],2,FALSE)","v":"Misc"}]
["2010-07-30","Eagle Hills Golf Course","EAGLE HILLS GOLF COURS EAGLE        ID",-26.5,"debit","Sports","B of A CC",{"$f":"VLOOKUP(TestTable[[#This Row],[Category]],Table11[],2,FALSE)","v":"Misc"}]
["2010-07-29","Albertsons","#00177 ALBERTSO 4700 NORTH EAGL",-44.24,"debit","Miscellaneous","ING Checking",{"$f":"VLOOKUP(TestTable[[#This Row],[Category]],Table11[],2,FALSE)","v":"Misc"}]
["2010-07-29","Quiznos","QUIZNOS SUB #1522 3000 EAGLE        ID",-9.31,"debit","Fast Food","B of A CC",{"$f":"VLOOKUP(TestTable[[#This Row],[Category]],Table11[],2,FALSE)","v":"Food"}]
["2010-07-28","Cardtronics Ccsp","CARDTRONICS CCSP  BOISE, ID US",-40,"debit","Uncategorized","ING Checking",{"$f":"VLOOKUP(TestTable[[#This Row],[Category]],Table11[],2,FALSE)","v":"Misc"}]
["2010-07-28","Electronic Bank A","Electronic Payment to BANK OF A",-79,"debit","Credit Card Payment","ING Checking",{"$f":"VLOOKUP(TestTable[[#This Row],[Category]],Table11[],2,FALSE)","v":"Debt"}]
["2010-07-28","Quiznos","QUIZNOS SUB #1522 3000 EAGLE        ID",-5.3,"debit","Fast Food","B of A CC",{"$f":"VLOOKUP(TestTable[[#This Row],[Category]],Table11[],2,FALSE)","v":"Food"}]
["2010-07-28","Transfer from Checking","PAYMENT - ELECTRONIC",79,"credit","Credit Card Payment","B of A CC",{"$f":"VLOOKUP(TestTable[[#This Row],[Category]],Table11[],2,FALSE)","v":"Debt"}]
["2010-07-27","Paper Church Jesus","Paper Payment to CHURCH OF JESU",-177.37,"debit","Charity","ING Checking",{"$f":"VLOOKUP(TestTable[[#This Row],[Category]],Table11[],2,FALSE)","v":"Misc"}]
["2010-07-26","Consumer Reports","CR *CONSUMERREPORTS.OR 8003330663 NY",-5.95,"debit","Books","Citi CC",{"$f":"VLOOKUP(TestTable[[#This Row],[Category]],Table11[],2,FALSE)","v":"Misc"}]
["2010-07-26","Albertsons","#00177 ALBERTSO 4700 N. EAGLE R",-16.28,"debit","Miscellaneous","ING Checking",{"$f":"VLOOKUP(TestTable[[#This Row],[Category]],Table11[],2,FALSE)","v":"Misc"}]
["2010-07-26","Transfer from ING Holding","Internet Deposit",1630,"credit","Transfer","ING Checking",{"$f":"VLOOKUP(TestTable[[#This Row],[Category]],Table11[],2,FALSE)","v":"Misc"}]
["2010-07-26","Person Person Laura","Person2Person Payment to Laura",-1075,"debit","Mortgage & Rent","ING Checking",{"$f":"VLOOKUP(TestTable[[#This Row],[Category]],Table11[],2,FALSE)","v":"Housing"}]
["2010-07-26","J &amp; W Promotions","J AND W PROMOTIONS KENNEWICK WA",-16.23,"debit","Shopping","ING Checking",{"$f":"VLOOKUP(TestTable[[#This Row],[Category]],Table11[],2,FALSE)","v":"Misc"}]
["2010-07-26","Kohl's","KOHL'S #1094 3275 N EAGLE RD",-1.37,"debit","Clothing","ING Checking",{"$f":"VLOOKUP(TestTable[[#This Row],[Category]],Table11[],2,FALSE)","v":"Misc"}]
["2010-07-26","Transfer to Checking","Internet Withdrawal",-1630,"debit","Transfer","ING Holding",{"$f":"VLOOKUP(TestTable[[#This Row],[Category]],Table11[],2,FALSE)","v":"Misc"}]
["2010-07-26","Redbox","REDBOX DVD RENTAL      866-733-2693 IL",-2.12,"debit","Movies & DVDs","B of A CC",{"$f":"VLOOKUP(TestTable[[#This Row],[Category]],Table11[],2,FALSE)","v":"Misc"}]
["2010-07-26","Transfer to Checking","ACH Debit SWENSEN,AMBER M - ING DIRECT",-100,"debit","Transfer","Addison Avenue Checking",{"$f":"VLOOKUP(TestTable[[#This Row],[Category]],Table11[],2,FALSE)","v":"Misc"}]
["2010-07-25","Subway","SUBWAY        106310 2 BAKER CITY   OR",-15.25,"debit","Fast Food","B of A CC",{"$f":"VLOOKUP(TestTable[[#This Row],[Category]],Table11[],2,FALSE)","v":"Food"}]
["2010-07-25","Tesoro","TESORO TRUCKSTOP TESO4 KENNEWICK    WA",-26.64,"debit","Gas & Fuel","B of A CC",{"$f":"VLOOKUP(TestTable[[#This Row],[Category]],Table11[],2,FALSE)","v":"Auto"}]
["2010-07-25","Exxon","EXXONMOBIL 89521747988 KENNEWICK    WA",-11.9,"debit","Gas & Fuel","B of A CC",{"$f":"VLOOKUP(TestTable[[#This Row],[Category]],Table11[],2,FALSE)","v":"Auto"}]
["2010-07-24","Scout Com Wa","SCOUT.COM              888-979-0979 WA",-9.9499999999999993,"debit","Uncategorized","B of A CC",{"$f":"VLOOKUP(TestTable[[#This Row],[Category]],Table11[],2,FALSE)","v":"Misc"}]
["2010-07-24","Courtyard","COURTYARD 13B          RICHLAND     WA",-16.05,"debit","Food & Dining","B of A CC",{"$f":"VLOOKUP(TestTable[[#This Row],[Category]],Table11[],2,FALSE)","v":"Food"}]
["2010-07-24","Panda Express","PANDA EXPRESS 1742 542 KENNEWICK    WA",-8.1199999999999992,"debit","Fast Food","B of A CC",{"$f":"VLOOKUP(TestTable[[#This Row],[Category]],Table11[],2,FALSE)","v":"Food"}]
["2010-07-23","iTunes","APL*ITUNES 866-712-7753 CA",-5.32,"debit","Music","Citi CC",{"$f":"VLOOKUP(TestTable[[#This Row],[Category]],Table11[],2,FALSE)","v":"Misc"}]
["2010-07-23","Family Meds","PIONEER FAMILY MEDIQPS BOISE ID",-25,"debit","Doctor","ING Checking",{"$f":"VLOOKUP(TestTable[[#This Row],[Category]],Table11[],2,FALSE)","v":"Medical"}]
["2010-07-23","Internet Deposit Addison","Internet Deposit ADDISON AVENUE",100,"credit","Transfer","ING Checking",{"$f":"VLOOKUP(TestTable[[#This Row],[Category]],Table11[],2,FALSE)","v":"Misc"}]
["2010-07-23","Veracity Network Veracity","External Electronic Withdrawal",-48.28,"debit","Internet","ING Holding",{"$f":"VLOOKUP(TestTable[[#This Row],[Category]],Table11[],2,FALSE)","v":"Utilities"}]
["2010-07-23","Savings Deposit Direct","Savings Deposit - Direct Deposit",1773.67,"credit","Paycheck","ING Holding",{"$f":"VLOOKUP(TestTable[[#This Row],[Category]],Table11[],2,FALSE)","v":"Income"}]
["2010-07-23","Redbox","REDBOX DVD RENTAL      OAKBRKTERRACEIL",-1.06,"debit","Movies & DVDs","B of A CC",{"$f":"VLOOKUP(TestTable[[#This Row],[Category]],Table11[],2,FALSE)","v":"Misc"}]
["2010-07-23","Arrowhead Travel Plaza","ARROWHEAD TRAVEL PLAZA PENDELTON    OR",-35,"debit","Gas & Fuel","B of A CC",{"$f":"VLOOKUP(TestTable[[#This Row],[Category]],Table11[],2,FALSE)","v":"Auto"}]
["2010-07-23","McDonald's","MCDONALD'S F33135 0000 PENDLETON    OR",-5.18,"debit","Fast Food","B of A CC",{"$f":"VLOOKUP(TestTable[[#This Row],[Category]],Table11[],2,FALSE)","v":"Food"}]
["2010-07-23","Albertsons","#00177 ALBERTSONS 0000 BOISE        ID",-25.85,"debit","Miscellaneous","B of A CC",{"$f":"VLOOKUP(TestTable[[#This Row],[Category]],Table11[],2,FALSE)","v":"Misc"}]
["2010-07-23","McDonald's","MCDONALD'S F33135 0000 PENDLETON    OR",-4.49,"debit","Fast Food","B of A CC",{"$f":"VLOOKUP(TestTable[[#This Row],[Category]],Table11[],2,FALSE)","v":"Food"}]
["2010-07-23","Co-Op Supply","NYSSA COOP SUPPLY DURK DURKEE       OR",-4.37,"debit","Lawn & Garden","B of A CC",{"$f":"VLOOKUP(TestTable[[#This Row],[Category]],Table11[],2,FALSE)","v":"Misc"}]
["2010-07-23","Jamba Juice","JAMBA JUICE # 252 0000 BOISE        ID",-8.27,"debit","Food & Dining","B of A CC",{"$f":"VLOOKUP(TestTable[[#This Row],[Category]],Table11[],2,FALSE)","v":"Food"}]
["2010-07-22","Albertsons","#00177 ALBERTSO 4700 N. EAGLE R",-15.87,"debit","Miscellaneous","ING Checking","Error"]
["2010-07-22","Albertsons","#00182 ALBERTSONS 0000 EAGLE        ID",-24.35,"debit","Miscellaneous","B of A CC",{"$f":"VLOOKUP(TestTable[[#This Row],[Category]],Table11[],2,FALSE)","v":"Misc"}]
["2010-07-21","Albertsons","#00177 ALBERTSO 4700 NORTH EAGL",-41.41,"debit","Miscellaneous","ING Checking",{"$f":"VLOOKUP(TestTable[[#This Row],[Category]],Table11[],2,FALSE)","v":"Misc"}]
["2010-07-21","Electronic Withdrawal","Electronic Withdrawal",-70,"debit","Miscellaneous","ING Checking",{"$f":"VLOOKUP(TestTable[[#This Row],[Category]],Table11[],2,FALSE)","v":"Misc"}]
["2010-07-21","Albertsons","#00177 ALBERTSO 4700 N. EAGLE R",-9.7100000000000009,"debit","Pharmacy","ING Checking",{"$f":"VLOOKUP(TestTable[[#This Row],[Category]],Table11[],2,FALSE)","v":"Medical"}]
["2010-07-21","Boise Di Fairview","BOISE DI 10740 FAIRVIEW AVE",-2.65,"debit","Clothing","ING Checking",{"$f":"VLOOKUP(TestTable[[#This Row],[Category]],Table11[],2,FALSE)","v":"Misc"}]
["2010-07-21","Albertsons","#00177 ALBERTSONS 0000 BOISE        ID",-2.12,"debit","Miscellaneous","B of A CC",{"$f":"VLOOKUP(TestTable[[#This Row],[Category]],Table11[],2,FALSE)","v":"Misc"}]
["2010-07-21","Deposit Transfer July","Deposit Transfer From 42344010 ,July Rent",100,"credit","Transfer","Addison Avenue Checking",{"$f":"VLOOKUP(TestTable[[#This Row],[Category]],Table11[],2,FALSE)","v":"Misc"}]
["2010-07-20","Jamba Juice","JAMBA JUICE 252 QPS BOISE ID -",-3.76,"debit","Food & Dining","ING Checking",{"$f":"VLOOKUP(TestTable[[#This Row],[Category]],Table11[],2,FALSE)","v":"Food"}]
["2010-07-20","Target","TARGET 1230 1230       BOISE        ID",-28.25,"debit","Clothing","B of A CC",{"$f":"VLOOKUP(TestTable[[#This Row],[Category]],Table11[],2,FALSE)","v":"Misc"}]
["2010-07-19","External Electronic Withdrawal","External Electronic Withdrawal",-30.95,"debit","Uncategorized","ING Holding",{"$f":"VLOOKUP(TestTable[[#This Row],[Category]],Table11[],2,FALSE)","v":"Misc"}]
["2010-07-19","Cj Star Llc","CJ STAR LLC        Q41 BOISE        ID",-5.29,"debit","Uncategorized","B of A CC",{"$f":"VLOOKUP(TestTable[[#This Row],[Category]],Table11[],2,FALSE)","v":"Misc"}]
["2010-07-19","Chevron","CHEVRON SMITH'S EAGLE  EAGLE        ID",-37.75,"debit","Gas & Fuel","B of A CC",{"$f":"VLOOKUP(TestTable[[#This Row],[Category]],Table11[],2,FALSE)","v":"Auto"}]
["2010-07-19","Interest Charged Standard","INTEREST CHARGED TO STANDARD PURCH",-1.17,"debit","Finance Charge","Citi CC",{"$f":"VLOOKUP(TestTable[[#This Row],[Category]],Table11[],2,FALSE)","v":"Misc"}]
["2010-07-17","Wal-Mart","WAL-MART  2861         BOISE        ID",-5.9,"debit","Shopping","B of A CC","Error"]
["2010-07-17","N Eagle Road","6176 N. EAGLE ROAD  BOISE, ID U",-2,"debit","Uncategorized","ING Checking","Error"]
["2010-07-17","N Eagle Road","6176 N. EAGLE ROAD  BOISE, ID U",-40,"debit","Uncategorized","ING Checking","Error"]
["2010-07-17","iTunes","APL*ITUNES 866-712-7753 CA",-5.32,"debit","Music","Citi CC",{"$f":"VLOOKUP(TestTable[[#This Row],[Category]],Table11[],2,FALSE)","v":"Misc"}]
["2010-07-16","Jamba Juice","JAMBA JUICE 252 QPS BOISE ID -",-7.95,"debit","Food & Dining","ING Checking","Error"]
["2010-07-16","Five Guys Id","FIVE GUYS ID 10 QAE MERIDIAN ID",-6.87,"debit","Food & Dining","ING Checking",{"$f":"VLOOKUP(TestTable[[#This Row],[Category]],Table11[],2,FALSE)","v":"Food"}]
["2010-07-16","Swensen Amber M","ACH Debit SWENSEN,AMBER M - ING DIRECT",-128.94,"debit","Uncategorized","Addison Avenue Checking","Error"]
["2010-07-15","Primary","PRIMARY HEALTH MEDIQPS 208 9556",-189.08,"debit","Entertainment","ING Checking",{"$f":"VLOOKUP(TestTable[[#This Row],[Category]],Table11[],2,FALSE)","v":"Misc"}]
["2010-07-15","Carl's Jr","CARL S JR 7611N Q11 MERIDIAN ID",-15.34,"debit","Fast Food","ING Checking",{"$f":"VLOOKUP(TestTable[[#This Row],[Category]],Table11[],2,FALSE)","v":"Food"}]
["2010-07-15","Albertsons","#00177 ALBERTSO 4700 N. EAGLE R",-4.75,"debit","Miscellaneous","ING Checking",{"$f":"VLOOKUP(TestTable[[#This Row],[Category]],Table11[],2,FALSE)","v":"Misc"}]
["2010-07-15","Internet Deposit Addison","Internet Deposit ADDISON AVENUE",128.94,"credit","Transfer","ING Checking","Error"]
["2010-07-14","Electronic Withdrawal","Electronic Withdrawal",-592,"debit","Uncategorized","ING Checking",{"$f":"VLOOKUP(TestTable[[#This Row],[Category]],Table11[],2,FALSE)","v":"Misc"}]
["2010-07-14","Person Person Tyler","Person2Person Payment to Tyler",736,"credit","Mortgage & Rent","ING Checking",{"$f":"VLOOKUP(TestTable[[#This Row],[Category]],Table11[],2,FALSE)","v":"Housing"}]
["2010-07-14","Person Person Tyler","Person2Person Payment to Tyler",800,"credit","Mortgage & Rent","ING Checking",{"$f":"VLOOKUP(TestTable[[#This Row],[Category]],Table11[],2,FALSE)","v":"Housing"}]
["2010-07-14","Person Person Tyler","Person2Person Payment to Tyler",-736,"debit","Money Transfer","ING Checking","Error"]
["2010-07-14","Jamba Juice","JAMBA JUICE 252 QPS BOISE ID -",-4.6100000000000003,"debit","Food & Dining","ING Checking","Error"]
["2010-07-14","Liberty Mutual","External Electronic Withdrawal",-61.58,"debit","Auto Insurance","ING Holding","Error"]
["2010-07-14","Amazon","AMAZON.COM             AMZN.COM/BILLWA",15.99,"credit","Shopping","B of A CC",{"$f":"VLOOKUP(TestTable[[#This Row],[Category]],Table11[],2,FALSE)","v":"Misc"}]
["2010-07-14","Deposit","Deposit",923,"credit","Income","Addison Avenue Checking","Error"]
["2010-07-14","Transfer to Checking","Descriptive Withdrawal to tyler",-736,"debit","Transfer","Addison Avenue Checking",{"$f":"VLOOKUP(TestTable[[#This Row],[Category]],Table11[],2,FALSE)","v":"Misc"}]
["2010-07-14","Transfer from Checking","ELECTRONIC PAYMENT-THANK YOU",485.98,"credit","Credit Card Payment","Citi CC",{"$f":"VLOOKUP(TestTable[[#This Row],[Category]],Table11[],2,FALSE)","v":"Debt"}]
["2010-07-13","Transfer to 7125","Electronic Payment to CITI CARDS",-485.98,"debit","Credit Card Payment","ING Checking","Error"]
["2010-07-13","Paper Church Jesus","Paper Payment to CHURCH OF JESU",-177.36,"debit","Charity","ING Checking","Error"]
["2010-07-13","Yong In Master","YONG IN MASTER LEES TA BOISE ID",-79.05,"debit","Kids Activities","ING Checking",{"$f":"VLOOKUP(TestTable[[#This Row],[Category]],Table11[],2,FALSE)","v":"Misc"}]
["2010-07-13","Toys 'R' Us","TOYS R US 1200 N EAGLE RD",-11.65,"debit","Toys","ING Checking","Error"]
["2010-07-13","Hobby Lobby","HOBBY LOBBY STO HOBBY LOBBY #43",-14.38,"debit","Hobbies","ING Checking",{"$f":"VLOOKUP(TestTable[[#This Row],[Category]],Table11[],2,FALSE)","v":"Misc"}]
["2010-07-13","ShopKo","0169 SHOPKO 3499 E FAIRVIEW AVE",-17.350000000000001,"debit","Clothing","ING Checking",{"$f":"VLOOKUP(TestTable[[#This Row],[Category]],Table11[],2,FALSE)","v":"Misc"}]
["2010-07-13","Haband","GRIDIRON REHAB AND ATH MERIDIAN     ID",-40,"debit","Clothing","B of A CC",{"$f":"VLOOKUP(TestTable[[#This Row],[Category]],Table11[],2,FALSE)","v":"Misc"}]
["2010-07-12","Person Person Tyler","Person2Person Payment to Tyler",-222.05,"debit","Money Transfer","ING Checking","Error"]
["2010-07-12","Carl's Jr","CARL S JR 7557N Q07 BOISE ID -",-5.82,"debit","Fast Food","ING Checking",{"$f":"VLOOKUP(TestTable[[#This Row],[Category]],Table11[],2,FALSE)","v":"Food"}]
["2010-07-12","Albertsons","#00177 ALBERTSO 4700 NORTH EAGL",-36.79,"debit","Miscellaneous","ING Checking","Error"]
["2010-07-12","Albertsons","#00177 ALBERTSO 4700 N. EAGLE R",-3.16,"debit","Miscellaneous","ING Checking",{"$f":"VLOOKUP(TestTable[[#This Row],[Category]],Table11[],2,FALSE)","v":"Misc"}]
["2010-07-12","Transfer to ING Holding","Internet Withdrawal",-80,"debit","Transfer","ING Checking",{"$f":"VLOOKUP(TestTable[[#This Row],[Category]],Table11[],2,FALSE)","v":"Misc"}]
["2010-07-12","Transfer from ING Holding","Internet Deposit",1773,"credit","Transfer","ING Checking",{"$f":"VLOOKUP(TestTable[[#This Row],[Category]],Table11[],2,FALSE)","v":"Misc"}]
["2010-07-12","Person Person Tyler","Person2Person Payment to Tyler",-800,"debit","Money Transfer","ING Checking","Error"]
["2010-07-12","Primary Health","PRIMARY HEALTH MEDIQPS BOISE ID",-25,"debit","Doctor","ING Checking",{"$f":"VLOOKUP(TestTable[[#This Row],[Category]],Table11[],2,FALSE)","v":"Medical"}]
["2010-07-12","Transfer from Checking","Internet Deposit",80,"credit","Transfer","ING Holding",{"$f":"VLOOKUP(TestTable[[#This Row],[Category]],Table11[],2,FALSE)","v":"Misc"}]
["2010-07-12","Transfer to Checking","Internet Withdrawal",-1773,"debit","Transfer","ING Holding",{"$f":"VLOOKUP(TestTable[[#This Row],[Category]],Table11[],2,FALSE)","v":"Misc"}]
["2010-07-12","Reversed Paid Insufficient","Reversed Paid Insufficient Fee Reversal",25,"credit","Bank Fee","Addison Avenue Checking",{"$f":"VLOOKUP(TestTable[[#This Row],[Category]],Table11[],2,FALSE)","v":"Misc"}]
["2010-07-12","Reversed Paid Insufficient","Reversed Paid Insufficient Fee Reversal",25,"credit","Bank Fee","Addison Avenue Checking",{"$f":"VLOOKUP(TestTable[[#This Row],[Category]],Table11[],2,FALSE)","v":"Misc"}]
["2010-07-11","Netflix","NFI WWW NETFLIX COM CC NETFLIX",-11.65,"debit","Movies & DVDs","ING Checking",{"$f":"VLOOKUP(TestTable[[#This Row],[Category]],Table11[],2,FALSE)","v":"Misc"}]
["2010-07-11","Good Times Dr","GOOD TIMES DR THRU 128 BOISE ID",-5.9,"debit","Fast Food","ING Checking",{"$f":"VLOOKUP(TestTable[[#This Row],[Category]],Table11[],2,FALSE)","v":"Food"}]
["2010-07-10","Randalls","J RANDALL PITMA J RANDALL PITMA",-88,"debit","Eyecare","ING Checking",{"$f":"VLOOKUP(TestTable[[#This Row],[Category]],Table11[],2,FALSE)","v":"Medical"}]
["2010-07-10","Wal","WAL - Debit",-24.09,"debit","Uncategorized","ING Checking",{"$f":"VLOOKUP(TestTable[[#This Row],[Category]],Table11[],2,FALSE)","v":"Misc"}]
["2010-07-10","Costco","COSTCO WHSE #07 2051 S. COLE RD",-68.59,"debit","Eyecare","ING Checking",{"$f":"VLOOKUP(TestTable[[#This Row],[Category]],Table11[],2,FALSE)","v":"Medical"}]
["2010-07-10","Albertsons","#00177 ALBERTSO 4700 N. EAGLE R",-21.69,"debit","Miscellaneous","ING Checking",{"$f":"VLOOKUP(TestTable[[#This Row],[Category]],Table11[],2,FALSE)","v":"Misc"}]
["2010-07-09","Albertsons","#00177 ALBERTSO 4700 N. EAGLE R",-11.64,"debit","Miscellaneous","ING Checking",{"$f":"VLOOKUP(TestTable[[#This Row],[Category]],Table11[],2,FALSE)","v":"Misc"}]
["2010-07-09","Savings Deposit Direct","Savings Deposit - Direct Deposit",1773.65,"credit","Paycheck","ING Holding",{"$f":"VLOOKUP(TestTable[[#This Row],[Category]],Table11[],2,FALSE)","v":"Income"}]
["2010-07-08","Thomas D Myers PC","THOMAS D MYERS MD PC PROVO UT -",-3,"debit","Doctor","ING Checking",{"$f":"VLOOKUP(TestTable[[#This Row],[Category]],Table11[],2,FALSE)","v":"Medical"}]
["2010-07-08","Amazon","AMAZON MKTPLACE PMTS AMZN COM B",-17.34,"debit","Shopping","ING Checking",{"$f":"VLOOKUP(TestTable[[#This Row],[Category]],Table11[],2,FALSE)","v":"Misc"}]
["2010-07-08","Albertsons","#00177 ALBERTSO 4700 N. EAGLE R",-4.29,"debit","Miscellaneous","ING Checking",{"$f":"VLOOKUP(TestTable[[#This Row],[Category]],Table11[],2,FALSE)","v":"Misc"}]
["2010-07-07","Transfer from ING Savings","Internet Deposit",485,"credit","Transfer","ING Checking",{"$f":"VLOOKUP(TestTable[[#This Row],[Category]],Table11[],2,FALSE)","v":"Misc"}]
["2010-07-07","Albertsons","#00177 ALBERTSO 4700 NORTH EAGL",-21.02,"debit","Miscellaneous","ING Checking",{"$f":"VLOOKUP(TestTable[[#This Row],[Category]],Table11[],2,FALSE)","v":"Misc"}]
["2010-07-07","Boise Pretzel Maker","BOISE PRETZELMAKER BOISE ID - D",-4.34,"debit","Fast Food","ING Checking",{"$f":"VLOOKUP(TestTable[[#This Row],[Category]],Table11[],2,FALSE)","v":"Food"}]
["2010-07-07","Transfer to Checking","Internet Withdrawal",-485,"debit","Transfer","ING Savings",{"$f":"VLOOKUP(TestTable[[#This Row],[Category]],Table11[],2,FALSE)","v":"Misc"}]
["2010-07-06","Target","TARGET T1230 BO 6280 N EAGLE RO",-44.23,"debit","Miscellaneous","ING Checking",{"$f":"VLOOKUP(TestTable[[#This Row],[Category]],Table11[],2,FALSE)","v":"Misc"}]
["2010-07-06","Zurchers Party & Wedding","ZURCHERS PARTY 1330 N. EAGLE RD",-22.29,"debit","Gift","ING Checking",{"$f":"VLOOKUP(TestTable[[#This Row],[Category]],Table11[],2,FALSE)","v":"Misc"}]
["2010-07-06","TGI Friday's","TGI FRIDAY S BOISE QPS BOISE ID",-18.07,"debit","Restaurants","ING Checking",{"$f":"VLOOKUP(TestTable[[#This Row],[Category]],Table11[],2,FALSE)","v":"Food"}]
["2010-07-06","AT&amp;T","External Electronic Withdrawal",-111.06,"debit","Mobile Phone","ING Holding",{"$f":"VLOOKUP(TestTable[[#This Row],[Category]],Table11[],2,FALSE)","v":"Phone"}]
["2010-07-06","Ross Meridian Id","ROSS STORE 530 530     MERIDIAN     ID",26.48,"credit","Credit Card Payment","B of A CC",{"$f":"VLOOKUP(TestTable[[#This Row],[Category]],Table11[],2,FALSE)","v":"Debt"}]
["2010-07-05","Marshalls","MARSHALLS MARSHALLS",-14.82,"debit","Clothing","ING Checking",{"$f":"VLOOKUP(TestTable[[#This Row],[Category]],Table11[],2,FALSE)","v":"Misc"}]
["2010-07-05","Payless ShoeSource","PAYLESS SHOESOU 350 N MILWAUKEE",-6.35,"debit","Clothing","ING Checking",{"$f":"VLOOKUP(TestTable[[#This Row],[Category]],Table11[],2,FALSE)","v":"Misc"}]
["2010-07-04","Yankee Stadium Concqps","YANKEE STADIUM CONCQPS BRONX NY",-15,"debit","Uncategorized","ING Checking",{"$f":"VLOOKUP(TestTable[[#This Row],[Category]],Table11[],2,FALSE)","v":"Misc"}]
["2010-07-04","Great Clips","GREAT CLIPS 2609 QPS BOISE ID -",-10,"debit","Hair","ING Checking",{"$f":"VLOOKUP(TestTable[[#This Row],[Category]],Table11[],2,FALSE)","v":"Misc"}]
["2010-07-03","Albertsons","#00164 ALBERTSONS 0000 MERIDIAN     ID",-13.34,"debit","Miscellaneous","B of A CC",{"$f":"VLOOKUP(TestTable[[#This Row],[Category]],Table11[],2,FALSE)","v":"Misc"}]
["2010-07-03","UPS","THE UPS STORE #2586 30 MERIDIAN     ID",-63.82,"debit","Miscellaneous","B of A CC",{"$f":"VLOOKUP(TestTable[[#This Row],[Category]],Table11[],2,FALSE)","v":"Misc"}]
["2010-07-02","Great Clips","GREAT CLIPS 2609 BOISE ID - Deb",-15,"debit","Hair","ING Checking",{"$f":"VLOOKUP(TestTable[[#This Row],[Category]],Table11[],2,FALSE)","v":"Misc"}]
["2010-07-02","Zoo Boise","ZOO BOISE BOISE ID - Debit",-6.25,"debit","Entertainment","ING Checking",{"$f":"VLOOKUP(TestTable[[#This Row],[Category]],Table11[],2,FALSE)","v":"Misc"}]
["2010-07-02","Wal","WAL - Debit",-68.73,"debit","Uncategorized","ING Checking",{"$f":"VLOOKUP(TestTable[[#This Row],[Category]],Table11[],2,FALSE)","v":"Misc"}]
["2010-07-02","Transfer from ING Savings","Internet Deposit",150,"credit","Transfer","ING Checking",{"$f":"VLOOKUP(TestTable[[#This Row],[Category]],Table11[],2,FALSE)","v":"Misc"}]
["2010-07-02","Albertsons","#00177 ALBERTSO 4700 N. EAGLE R",-4.2300000000000004,"debit","Miscellaneous","ING Checking",{"$f":"VLOOKUP(TestTable[[#This Row],[Category]],Table11[],2,FALSE)","v":"Misc"}]
["2010-07-02","Transfer to Checking","Internet Withdrawal",-150,"debit","Transfer","ING Savings",{"$f":"VLOOKUP(TestTable[[#This Row],[Category]],Table11[],2,FALSE)","v":"Misc"}]
["2010-07-02","Haband","GRIDIRON REHAB AND ATH MERIDIAN     ID",-40,"debit","Clothing","B of A CC",{"$f":"VLOOKUP(TestTable[[#This Row],[Category]],Table11[],2,FALSE)","v":"Misc"}]
["2010-07-02","Interest Charged Purchases","Interest Charged on Purchases",-36.61,"debit","Finance Charge","B of A CC",{"$f":"VLOOKUP(TestTable[[#This Row],[Category]],Table11[],2,FALSE)","v":"Misc"}]
["2010-07-01","Person Person Laura","Person2Person Payment to Laura",-1075,"debit","Mortgage & Rent","ING Checking",{"$f":"VLOOKUP(TestTable[[#This Row],[Category]],Table11[],2,FALSE)","v":"Housing"}]
["2010-07-01","Interest Paid For","Interest paid for overdraft Int",-0.02,"debit","Bank Fee","ING Checking",{"$f":"VLOOKUP(TestTable[[#This Row],[Category]],Table11[],2,FALSE)","v":"Misc"}]
["2010-07-01","MTA","MTA MVM 42TH STREET 212 METROCA",-10,"debit","Public Transportation","ING Checking",{"$f":"VLOOKUP(TestTable[[#This Row],[Category]],Table11[],2,FALSE)","v":"Misc"}]
["2010-06-30","Paper Church Jesus","Paper Payment to CHURCH OF JESU",-177.4,"debit","Charity","ING Checking",{"$f":"VLOOKUP(TestTable[[#This Row],[Category]],Table11[],2,FALSE)","v":"Misc"}]
["2010-06-30","Electronic City","Electronic Payment to Provo City",-76.5,"debit","Credit Card Payment","ING Checking",{"$f":"VLOOKUP(TestTable[[#This Row],[Category]],Table11[],2,FALSE)","v":"Debt"}]
["2010-06-30","Interest Paid","Interest Paid",0.08,"credit","Interest Income","ING Checking",{"$f":"VLOOKUP(TestTable[[#This Row],[Category]],Table11[],2,FALSE)","v":"Misc"}]
["2010-06-30","Target","TARGET T1230 BO 6280 N EAGLE RO",-12.54,"debit","Miscellaneous","ING Checking",{"$f":"VLOOKUP(TestTable[[#This Row],[Category]],Table11[],2,FALSE)","v":"Misc"}]
["2010-06-30","Interest Paid","Interest Paid",0.15,"credit","Interest Income","ING Holding",{"$f":"VLOOKUP(TestTable[[#This Row],[Category]],Table11[],2,FALSE)","v":"Misc"}]
["2010-06-30","Interest Paid","Interest Paid",0.15,"credit","Interest Income","ING Savings","Error"]
["2010-06-30","Walgreen","WALGREENS #11452 00001 MERIDIAN     ID",21.19,"credit","Miscellaneous","B of A CC",{"$f":"VLOOKUP(TestTable[[#This Row],[Category]],Table11[],2,FALSE)","v":"Misc"}]
["2010-06-29","Transfer from ING Holding","Internet Deposit",76,"credit","Transfer","ING Checking",{"$f":"VLOOKUP(TestTable[[#This Row],[Category]],Table11[],2,FALSE)","v":"Misc"}]
["2010-06-29","Veracity Network Veracity","External Electronic Withdrawal",-47.98,"debit","Internet","ING Holding",{"$f":"VLOOKUP(TestTable[[#This Row],[Category]],Table11[],2,FALSE)","v":"Utilities"}]
["2010-06-29","Transfer to Checking","Internet Withdrawal",-76,"debit","Transfer","ING Holding",{"$f":"VLOOKUP(TestTable[[#This Row],[Category]],Table11[],2,FALSE)","v":"Misc"}]
["2010-06-29","Albertsons","ALBERTSONS #177 Q BOISE ID",-27.69,"debit","Miscellaneous","Citi CC",{"$f":"VLOOKUP(TestTable[[#This Row],[Category]],Table11[],2,FALSE)","v":"Misc"}]
["2010-06-29","Craft Warehouse","CRAFT WAREHOUSE 11 MERIDIAN ID",-12.7,"debit","Hobbies","Citi CC",{"$f":"VLOOKUP(TestTable[[#This Row],[Category]],Table11[],2,FALSE)","v":"Misc"}]
["2010-06-29","Albertsons","ALBERTSONS Q BOISE ID",-31.54,"debit","Miscellaneous","Citi CC",{"$f":"VLOOKUP(TestTable[[#This Row],[Category]],Table11[],2,FALSE)","v":"Misc"}]
["2010-06-29","Ave Americas N","1120 AVE. OF AMERICAS  N.Y.C, N",-3,"debit","Uncategorized","ING Checking",{"$f":"VLOOKUP(TestTable[[#This Row],[Category]],Table11[],2,FALSE)","v":"Misc"}]
["2010-06-29","Ave Americas N","1120 AVE. OF AMERICAS  N.Y.C, N",-40,"debit","Uncategorized","ING Checking",{"$f":"VLOOKUP(TestTable[[#This Row],[Category]],Table11[],2,FALSE)","v":"Misc"}]
["2010-06-28","Paradies","PARADIES SHOP 208 Q02 BOISE ID",-16.940000000000001,"debit","Shopping","ING Checking",{"$f":"VLOOKUP(TestTable[[#This Row],[Category]],Table11[],2,FALSE)","v":"Misc"}]
["2010-06-28","Duane Reade","DUANE READE INC 200 WATER STREE",-5.99,"debit","Shopping","ING Checking",{"$f":"VLOOKUP(TestTable[[#This Row],[Category]],Table11[],2,FALSE)","v":"Misc"}]
["2010-06-28","Brookstone Boise Id","BROOKSTONE 210002269 BOISE ID",63.55,"credit","Gift","Citi CC",{"$f":"VLOOKUP(TestTable[[#This Row],[Category]],Table11[],2,FALSE)","v":"Misc"}]
["2010-06-27","Transfer from ING Holding","Internet Deposit",1374,"credit","Transfer","ING Checking",{"$f":"VLOOKUP(TestTable[[#This Row],[Category]],Table11[],2,FALSE)","v":"Misc"}]
["2010-06-27","Carl's Jr","CARL S JR 7611N Q11 MERIDIAN ID",-5.82,"debit","Fast Food","ING Checking",{"$f":"VLOOKUP(TestTable[[#This Row],[Category]],Table11[],2,FALSE)","v":"Food"}]
["2010-06-27","Transfer to Checking","Internet Withdrawal",-1374,"debit","Transfer","ING Holding","Error"]
["2010-06-27","Apple","APPLE WEB STORE APPLE  AUSTIN       TX",-255.13,"debit","Electronics & Software","B of A CC","Error"]
["2010-06-26","Consumer Reports","CR *CONSUMERREPORTS.OR 8003330663 NY",-5.95,"debit","Miscellaneous","Citi CC",{"$f":"VLOOKUP(TestTable[[#This Row],[Category]],Table11[],2,FALSE)","v":"Misc"}]
["2010-06-26","Trudys Kitchen","POS Transaction TRUDYS KITCHEN IDAHO CITY IDUS",-15.73,"debit","Fast Food","Addison Avenue Checking","Error"]
["2010-06-26","Paid Nsf Fee","Paid POS NSF Fee",-25,"debit","Fees & Charges","Addison Avenue Checking",{"$f":"VLOOKUP(TestTable[[#This Row],[Category]],Table11[],2,FALSE)","v":"Misc"}]
["2010-06-25","Savings Deposit Direct","Savings Deposit - Direct Deposit",1773.66,"credit","Paycheck","ING Holding",{"$f":"VLOOKUP(TestTable[[#This Row],[Category]],Table11[],2,FALSE)","v":"Income"}]
["2010-06-24","Toys 'R' Us","TOYS R US 1200 N EAGLE RD",-11.64,"debit","Baby Supplies","ING Checking",{"$f":"VLOOKUP(TestTable[[#This Row],[Category]],Table11[],2,FALSE)","v":"Misc"}]
["2010-06-24","Transfer to Amber Checking","Overdraft Transfer",-3.4,"debit","Transfer","Addison Avenue Savings",{"$f":"VLOOKUP(TestTable[[#This Row],[Category]],Table11[],2,FALSE)","v":"Misc"}]
["2010-06-24","Paid Nsf Fee","Paid POS NSF Fee",-25,"debit","Fees & Charges","Addison Avenue Checking",{"$f":"VLOOKUP(TestTable[[#This Row],[Category]],Table11[],2,FALSE)","v":"Misc"}]
["2010-06-24","Transfer from Amber Savings","Overdraft Transfer",3.4,"credit","Transfer","Addison Avenue Checking","Error"]
["2010-06-24","Haband","POS Transaction GRIDIRON REHAB AND ATHLMERIDIAN IDUS",-40,"debit","Doctor","Addison Avenue Checking",{"$f":"VLOOKUP(TestTable[[#This Row],[Category]],Table11[],2,FALSE)","v":"Medical"}]
["2010-06-23","Costco","COSTCO WHSE #07 2051 S. COLE RD",-23.31,"debit","Eyecare","ING Checking",{"$f":"VLOOKUP(TestTable[[#This Row],[Category]],Table11[],2,FALSE)","v":"Medical"}]
["2010-06-23","Albertsons","#00177 ALBERTSO 4700 NORTH EAGL",-20.05,"debit","Miscellaneous","ING Checking",{"$f":"VLOOKUP(TestTable[[#This Row],[Category]],Table11[],2,FALSE)","v":"Misc"}]
["2010-06-23","Scout Com Wa","SCOUT.COM              888-979-0979 WA",-9.9499999999999993,"debit","Newspapers & Magazines","B of A CC","Error"]
["2010-06-23","Subway","POS Transaction SUBWAY 00158857 BOISE IDUS",-14.81,"debit","Fast Food","Addison Avenue Checking",{"$f":"VLOOKUP(TestTable[[#This Row],[Category]],Table11[],2,FALSE)","v":"Food"}]
["2010-06-23","Wal-Mart","POS Transaction Wal-Mart Super Center 2862 WAL-SAMS MERIDIAN ID",-19.079999999999998,"debit","Shopping","Addison Avenue Checking",{"$f":"VLOOKUP(TestTable[[#This Row],[Category]],Table11[],2,FALSE)","v":"Misc"}]
["2010-06-22","iTunes","APL*ITUNES 866-712-7753 CA",-8.5299999999999994,"debit","Music","Citi CC",{"$f":"VLOOKUP(TestTable[[#This Row],[Category]],Table11[],2,FALSE)","v":"Misc"}]
["2010-06-22","Albertsons","POS Transaction #00177 ALBERTSONS 4700 N. EAGLE RD. BOISE IDUS",-23.4,"debit","Miscellaneous","Addison Avenue Checking",{"$f":"VLOOKUP(TestTable[[#This Row],[Category]],Table11[],2,FALSE)","v":"Misc"}]
["2010-06-22","Transfer to ING Savings","ACH Debit SWENSEN,AMBER M - ING DIRECT",-635,"debit","Transfer","Addison Avenue Checking",{"$f":"VLOOKUP(TestTable[[#This Row],[Category]],Table11[],2,FALSE)","v":"Misc"}]
["2010-06-22","Big 5 Sporting","POS Transaction BIG 5 SPORTING GOODS #2RICHLAND WAUS",-18.399999999999999,"debit","Sporting Goods","Addison Avenue Checking",{"$f":"VLOOKUP(TestTable[[#This Row],[Category]],Table11[],2,FALSE)","v":"Misc"}]
["2010-06-22","Boise Di Fairview","POS Transaction BOISE DI 10740 FAIRVIEW AVE BOISE IDUS",-43.46,"debit","Clothing","Addison Avenue Checking",{"$f":"VLOOKUP(TestTable[[#This Row],[Category]],Table11[],2,FALSE)","v":"Misc"}]
["2010-06-21","Paper Church Jesus","Paper Payment to CHURCH OF JESU",-354,"debit","Charity","ING Checking",{"$f":"VLOOKUP(TestTable[[#This Row],[Category]],Table11[],2,FALSE)","v":"Misc"}]
["2010-06-21","Internet Deposit Addison","Internet Deposit ADDISON AVENUE",635,"credit","Transfer","ING Savings",{"$f":"VLOOKUP(TestTable[[#This Row],[Category]],Table11[],2,FALSE)","v":"Misc"}]
["2010-06-20","Zamzows","POS Transaction ZAMZOWS CHINDEN MERIDIAN IDUS",-27.55,"debit","Lawn & Garden","Addison Avenue Checking",{"$f":"VLOOKUP(TestTable[[#This Row],[Category]],Table11[],2,FALSE)","v":"Misc"}]
["2010-06-19","Banbury Golf Course","POS Transaction BANBURY GOLF COURSE EAGLE IDUS",-2,"debit","Sports","Addison Avenue Checking",{"$f":"VLOOKUP(TestTable[[#This Row],[Category]],Table11[],2,FALSE)","v":"Misc"}]
["2010-06-18","Yong In Master","YONG IN MASTER LEES TA BOISE ID",-19.95,"debit","Uncategorized","ING Checking",{"$f":"VLOOKUP(TestTable[[#This Row],[Category]],Table11[],2,FALSE)","v":"Misc"}]
["2010-06-18","Zurchers Party Meridian","ZURCHERS PARTY STORE MERIDIAN I",-13.55,"debit","Uncategorized","ING Checking",{"$f":"VLOOKUP(TestTable[[#This Row],[Category]],Table11[],2,FALSE)","v":"Misc"}]
["2010-06-18","Coldstone","COLDSTONE 0227 QPS MERIDAN ID -",-4.34,"debit","Restaurants","ING Checking",{"$f":"VLOOKUP(TestTable[[#This Row],[Category]],Table11[],2,FALSE)","v":"Food"}]
["2010-06-18","Ross","ROSS STORE 530 530     MERIDIAN     ID",-39.19,"debit","Clothing","B of A CC",{"$f":"VLOOKUP(TestTable[[#This Row],[Category]],Table11[],2,FALSE)","v":"Misc"}]
["2010-06-18","Edwards Boise Stadium Imax","POS Transaction EDWARDS BOISE STADIUM 2BOISE IDUS",-20,"debit","Gift","Addison Avenue Checking",{"$f":"VLOOKUP(TestTable[[#This Row],[Category]],Table11[],2,FALSE)","v":"Misc"}]
["2010-06-18","Edwards Boise Stadium Imax","POS Transaction EDWARDS BOISE STADIUM 2BOISE IDUS",-7.25,"debit","Gift","Addison Avenue Checking",{"$f":"VLOOKUP(TestTable[[#This Row],[Category]],Table11[],2,FALSE)","v":"Misc"}]
["2010-06-18","Quiznos","POS Transaction QUIZNOS SUB #1522 EAGLE IDUS",-5.3,"debit","Fast Food","Addison Avenue Checking",{"$f":"VLOOKUP(TestTable[[#This Row],[Category]],Table11[],2,FALSE)","v":"Food"}]
["2010-06-18","Carl's Jr","POS Transaction CARLS JR. #7611N Q11 MERIDIAN IDUS",-5.82,"debit","Fast Food","Addison Avenue Checking",{"$f":"VLOOKUP(TestTable[[#This Row],[Category]],Table11[],2,FALSE)","v":"Food"}]
["2010-06-18","Jamba Juice","POS Transaction JAMBA JUICE # 252 BOISE IDUS",-7.53,"debit","Food & Dining","Addison Avenue Checking",{"$f":"VLOOKUP(TestTable[[#This Row],[Category]],Table11[],2,FALSE)","v":"Food"}]
["2010-06-17","Electronic Withdrawal","Electronic Withdrawal",-43.61,"debit","Uncategorized","ING Checking",{"$f":"VLOOKUP(TestTable[[#This Row],[Category]],Table11[],2,FALSE)","v":"Misc"}]
["2010-06-17","Deseret Book","DESERET BOOK 81 MERIDIAN ID - D",-20,"debit","Gift","ING Checking",{"$f":"VLOOKUP(TestTable[[#This Row],[Category]],Table11[],2,FALSE)","v":"Misc"}]
["2010-06-17","Purchases Interest Charge","PURCHASES*INTEREST CHARGE*PERIODIC RATE",-2.2999999999999998,"debit","Finance Charge","Citi CC",{"$f":"VLOOKUP(TestTable[[#This Row],[Category]],Table11[],2,FALSE)","v":"Misc"}]
["2010-06-17","Chevron","POS Transaction CHEVRON 00207403 EAGLE IDUS",-44.45,"debit","Gas & Fuel","Addison Avenue Checking",{"$f":"VLOOKUP(TestTable[[#This Row],[Category]],Table11[],2,FALSE)","v":"Auto"}]
["2010-06-17","Haband","POS Transaction GRIDIRON REHAB AND ATHLMERIDIAN IDUS",-40,"debit","Doctor","Addison Avenue Checking",{"$f":"VLOOKUP(TestTable[[#This Row],[Category]],Table11[],2,FALSE)","v":"Medical"}]
["2010-06-16","Kohl's","KOHL'S #1094 3275 N EAGLE RD",-8.89,"debit","Gift","ING Checking",{"$f":"VLOOKUP(TestTable[[#This Row],[Category]],Table11[],2,FALSE)","v":"Misc"}]
["2010-06-16","Electronic Withdrawal","Electronic Withdrawal",-19.95,"debit","Uncategorized","ING Checking",{"$f":"VLOOKUP(TestTable[[#This Row],[Category]],Table11[],2,FALSE)","v":"Misc"}]
["2010-06-16","Electronic Withdrawal","Electronic Withdrawal",-592,"debit","Health Insurance","ING Checking",{"$f":"VLOOKUP(TestTable[[#This Row],[Category]],Table11[],2,FALSE)","v":"Misc"}]
["2010-06-16","ShopKo","0169 SHOPKO 3499 E FAIRVIEW AVE",-6.35,"debit","Shopping","ING Checking",{"$f":"VLOOKUP(TestTable[[#This Row],[Category]],Table11[],2,FALSE)","v":"Misc"}]
["2010-06-16","Albertsons","#00177 ALBERTSO 4700 N. EAGLE R",-35.36,"debit","Miscellaneous","ING Checking",{"$f":"VLOOKUP(TestTable[[#This Row],[Category]],Table11[],2,FALSE)","v":"Misc"}]
["2010-06-16","Albertsons","#00177 ALBERTSO 4700 N. EAGLE R",-2.11,"debit","Gift","ING Checking",{"$f":"VLOOKUP(TestTable[[#This Row],[Category]],Table11[],2,FALSE)","v":"Misc"}]
["2010-06-16","Error","Error",17.79,"credit","Income","ING Checking",{"$f":"VLOOKUP(TestTable[[#This Row],[Category]],Table11[],2,FALSE)","v":"income"}]
["2010-06-16","Deposit","Deposit",162.93,"credit","Check","Addison Avenue Checking",{"$f":"VLOOKUP(TestTable[[#This Row],[Category]],Table11[],2,FALSE)","v":"Income"}]
["2010-06-16","Deposit","Deposit",900,"credit","Mortgage & Rent","Addison Avenue Checking",{"$f":"VLOOKUP(TestTable[[#This Row],[Category]],Table11[],2,FALSE)","v":"Housing"}]
["2010-06-16","Albertsons","#00177 ALBERTSO 4700 N. EAGLE R",-19.07,"debit","Gift","ING Checking",{"$f":"VLOOKUP(TestTable[[#This Row],[Category]],Table11[],2,FALSE)","v":"Misc"}]
["2010-06-16","Albertsons","#00177 ALBERTSO 4700 N. EAGLE R",-30,"debit","Movies & DVDs","ING Checking",{"$f":"VLOOKUP(TestTable[[#This Row],[Category]],Table11[],2,FALSE)","v":"Misc"}]
["2010-06-16","Paid Nsf Fee","Paid POS NSF Fee",-25,"debit","Fees & Charges","Addison Avenue Checking",{"$f":"VLOOKUP(TestTable[[#This Row],[Category]],Table11[],2,FALSE)","v":"Misc"}]
["2010-06-15","Albertsons","#00177 ALBERTSO 4700 N. EAGLE R",-2.16,"debit","Miscellaneous","ING Checking",{"$f":"VLOOKUP(TestTable[[#This Row],[Category]],Table11[],2,FALSE)","v":"Misc"}]
["2010-06-15","Target","TARGET T1230 BO 6280 N EAGLE RO",-17.79,"debit","Miscellaneous","ING Checking",{"$f":"VLOOKUP(TestTable[[#This Row],[Category]],Table11[],2,FALSE)","v":"Misc"}]
["2010-06-15","Electronic Bank A","Electronic Payment to BANK OF A",-38,"debit","Credit Card Payment","ING Checking",{"$f":"VLOOKUP(TestTable[[#This Row],[Category]],Table11[],2,FALSE)","v":"Debt"}]
["2010-06-15","Transfer from Checking","PAYMENT - ELECTRONIC",38,"credit","Credit Card Payment","B of A CC",{"$f":"VLOOKUP(TestTable[[#This Row],[Category]],Table11[],2,FALSE)","v":"Debt"}]
["2010-06-15","Shutterfly","POS Transaction SFI*PHOTOSBYSHUTTERFLY 800-986-1065 CAUS",-109.16,"debit","Hobbies","Addison Avenue Checking",{"$f":"VLOOKUP(TestTable[[#This Row],[Category]],Table11[],2,FALSE)","v":"Misc"}]
["2010-06-15","Swensen Amber M","ACH Debit SWENSEN,AMBER M - ING DIRECT",-290,"debit","Uncategorized","Addison Avenue Checking",{"$f":"VLOOKUP(TestTable[[#This Row],[Category]],Table11[],2,FALSE)","v":"Misc"}]
["2010-06-14","Target","TARGET T1230 BO 6280 N EAGLE RO",-32.520000000000003,"debit","Miscellaneous","ING Checking",{"$f":"VLOOKUP(TestTable[[#This Row],[Category]],Table11[],2,FALSE)","v":"Misc"}]
["2010-06-14","Transfer to 7125","Electronic Withdrawal",-500,"debit","Credit Card Payment","ING Checking",{"$f":"VLOOKUP(TestTable[[#This Row],[Category]],Table11[],2,FALSE)","v":"Debt"}]
["2010-06-14","Internet Deposit Addison","Internet Deposit ADDISON AVENUE",290,"credit","Transfer","ING Checking",{"$f":"VLOOKUP(TestTable[[#This Row],[Category]],Table11[],2,FALSE)","v":"Misc"}]
["2010-06-14","Liberty Mutual","Electronic Withdrawal",-61.58,"debit","Auto Insurance","ING Checking",{"$f":"VLOOKUP(TestTable[[#This Row],[Category]],Table11[],2,FALSE)","v":"Auto"}]
["2010-06-14","Haband","GRIDIRON REHAB AND ATH MERIDIAN     ID",-40,"debit","Doctor","B of A CC",{"$f":"VLOOKUP(TestTable[[#This Row],[Category]],Table11[],2,FALSE)","v":"Medical"}]
["2010-06-14","Transfer to Checking","ACH Debit SWENSEN,AMBER M - ING DIRECT",-900,"debit","Transfer","Addison Avenue Checking",{"$f":"VLOOKUP(TestTable[[#This Row],[Category]],Table11[],2,FALSE)","v":"Misc"}]
["2010-06-13","Transfer from Checking","CLICK-TO-PAY PAYMENT, THANK YOU",500,"credit","Credit Card Payment","Citi CC",{"$f":"VLOOKUP(TestTable[[#This Row],[Category]],Table11[],2,FALSE)","v":"Debt"}]
["2010-06-12","Person Person Karl","Person2Person Payment to Karl o",-1000,"debit","Check","ING Checking",{"$f":"VLOOKUP(TestTable[[#This Row],[Category]],Table11[],2,FALSE)","v":"Income"}]
["2010-06-12","Costco","POS Transaction COSTCO WHSE #0761 2051 S. COLE RD. BOISE IDUS",-21.38,"debit","Miscellaneous","Addison Avenue Checking",{"$f":"VLOOKUP(TestTable[[#This Row],[Category]],Table11[],2,FALSE)","v":"Misc"}]
["2010-06-12","Georges Cycles","POS Transaction GEORGES CYCLES FIT BOISE IDUS",-14.83,"debit","Sporting Goods","Addison Avenue Checking",{"$f":"VLOOKUP(TestTable[[#This Row],[Category]],Table11[],2,FALSE)","v":"Misc"}]
["2010-06-11","Transfer from ING Holding","Internet Deposit",1773,"credit","Transfer","ING Checking",{"$f":"VLOOKUP(TestTable[[#This Row],[Category]],Table11[],2,FALSE)","v":"Misc"}]
["2010-06-11","Internet Deposit Addison","Internet Deposit ADDISON AVENUE",900,"credit","Transfer","ING Checking",{"$f":"VLOOKUP(TestTable[[#This Row],[Category]],Table11[],2,FALSE)","v":"Misc"}]
["2010-06-11","Transfer to Checking","Internet Withdrawal",-1773,"debit","Transfer","ING Holding",{"$f":"VLOOKUP(TestTable[[#This Row],[Category]],Table11[],2,FALSE)","v":"Misc"}]
["2010-06-11","Savings Deposit Direct","Savings Deposit - Direct Deposit",1773.65,"credit","Paycheck","ING Holding",{"$f":"VLOOKUP(TestTable[[#This Row],[Category]],Table11[],2,FALSE)","v":"Income"}]
["2010-06-11","Five Guys Id","FIVE GUYS--ID # 10 542 MERIDIAN     ID",-8.0399999999999991,"debit","Fast Food","B of A CC",{"$f":"VLOOKUP(TestTable[[#This Row],[Category]],Table11[],2,FALSE)","v":"Food"}]
["2010-06-11","Ryan Associates","POS Transaction KELLEY RYAN ASSOCIATE508-473-9660 MAUS",-35.270000000000003,"debit","State Tax","Addison Avenue Checking",{"$f":"VLOOKUP(TestTable[[#This Row],[Category]],Table11[],2,FALSE)","v":"Misc"}]
["2010-06-10","Walgreen","WALGREENS #11452 00001 MERIDIAN     ID",-21.19,"debit","Miscellaneous","B of A CC",{"$f":"VLOOKUP(TestTable[[#This Row],[Category]],Table11[],2,FALSE)","v":"Misc"}]
["2010-06-10","Www Optical Less","WWW. OPTICAL4LESS.COM  TIN SHUI WAI",-111.83,"debit","Eyecare","B of A CC",{"$f":"VLOOKUP(TestTable[[#This Row],[Category]],Table11[],2,FALSE)","v":"Medical"}]
["2010-06-10","Deposit","Deposit",298.60000000000002,"credit","Reimbursement","Addison Avenue Checking",{"$f":"VLOOKUP(TestTable[[#This Row],[Category]],Table11[],2,FALSE)","v":"Misc"}]
["2010-06-10","Albertsons","POS Transaction #00177 ALBERTSONS 4700 N. EAGLE RD. BOISE IDUS",-9.84,"debit","Miscellaneous","Addison Avenue Checking",{"$f":"VLOOKUP(TestTable[[#This Row],[Category]],Table11[],2,FALSE)","v":"Misc"}]
["2010-06-09","Lowe's","LOWE'S #2573 3400 NORTH EAGLE R",-4.08,"debit","Miscellaneous","ING Checking",{"$f":"VLOOKUP(TestTable[[#This Row],[Category]],Table11[],2,FALSE)","v":"Misc"}]
["2010-06-09","Albertsons","#00177 ALBERTSONS 0000 BOISE        ID",-7.09,"debit","Miscellaneous","B of A CC",{"$f":"VLOOKUP(TestTable[[#This Row],[Category]],Table11[],2,FALSE)","v":"Misc"}]
["2010-06-09","Hobby Lobby","HOBBY LOBBY # 433 MERIDIAN ID",-8.7899999999999991,"debit","Hobbies","Citi CC",{"$f":"VLOOKUP(TestTable[[#This Row],[Category]],Table11[],2,FALSE)","v":"Misc"}]
["2010-06-09","Deposit","Deposit",1774.03,"credit","Paycheck","Addison Avenue Checking",{"$f":"VLOOKUP(TestTable[[#This Row],[Category]],Table11[],2,FALSE)","v":"Income"}]
["2010-06-09","Withdrawal","Withdrawal",-800,"debit","Mortgage & Rent","Addison Avenue Checking",{"$f":"VLOOKUP(TestTable[[#This Row],[Category]],Table11[],2,FALSE)","v":"Housing"}]
["2010-06-08","Netflix","NETFLIX                LOS GATOS    CA",-11.65,"debit","Movies & DVDs","B of A CC",{"$f":"VLOOKUP(TestTable[[#This Row],[Category]],Table11[],2,FALSE)","v":"Misc"}]
["2010-06-07","Costco","COSTCO WHSE #07 2051 S. COLE RD",-41.97,"debit","Baby Supplies","ING Checking",{"$f":"VLOOKUP(TestTable[[#This Row],[Category]],Table11[],2,FALSE)","v":"Misc"}]
["2010-06-07","Target","TARGET T1230 BO 6280 N EAGLE RO",-9.89,"debit","Miscellaneous","ING Checking",{"$f":"VLOOKUP(TestTable[[#This Row],[Category]],Table11[],2,FALSE)","v":"Misc"}]
["2010-06-07","Error","Error",14.85,"credit","Shopping","ING Checking",{"$f":"VLOOKUP(TestTable[[#This Row],[Category]],Table11[],2,FALSE)","v":"Misc"}]
["2010-06-06","AT&T Wireless","ATTM 265004344038 08003310500 G",-112.22,"debit","Mobile Phone","ING Checking",{"$f":"VLOOKUP(TestTable[[#This Row],[Category]],Table11[],2,FALSE)","v":"Phone"}]
["2010-06-03","Albertsons","#00177 ALBERTSO 4700 NORTH EAGL",-30,"debit","Gas & Fuel","ING Checking",{"$f":"VLOOKUP(TestTable[[#This Row],[Category]],Table11[],2,FALSE)","v":"Auto"}]
["2010-06-03","Albertsons","#00177 ALBERTSO 4700 N. EAGLE R",-3.17,"debit","Miscellaneous","ING Checking",{"$f":"VLOOKUP(TestTable[[#This Row],[Category]],Table11[],2,FALSE)","v":"Misc"}]
["2010-06-03","iTunes","APL*ITUNES 866-712-7753 CA",-1.06,"debit","Music","Citi CC",{"$f":"VLOOKUP(TestTable[[#This Row],[Category]],Table11[],2,FALSE)","v":"Misc"}]
["2010-06-01","Person Person Laura","Person2Person Payment to Laura",-1075,"debit","Mortgage & Rent","ING Checking",{"$f":"VLOOKUP(TestTable[[#This Row],[Category]],Table11[],2,FALSE)","v":"Housing"}]
["2010-06-01","Toys 'R' Us","TOYS R US 1200 N EAGLE RD",-5.08,"debit","Shopping","ING Checking",{"$f":"VLOOKUP(TestTable[[#This Row],[Category]],Table11[],2,FALSE)","v":"Misc"}]
["2010-06-01","Walgreen","WALGREEN COMPAN 3263 N EAGLE RD",-19.05,"debit","Miscellaneous","ING Checking",{"$f":"VLOOKUP(TestTable[[#This Row],[Category]],Table11[],2,FALSE)","v":"Misc"}]
["2010-06-01","Electronic Bank A","Electronic Payment to BANK OF A",-20,"debit","Credit Card Payment","ING Checking",{"$f":"VLOOKUP(TestTable[[#This Row],[Category]],Table11[],2,FALSE)","v":"Debt"}]
["2010-06-01","Interest Paid For","Interest paid for overdraft Int",-7.0000000000000007E-2,"debit","Bank Fee","ING Checking",{"$f":"VLOOKUP(TestTable[[#This Row],[Category]],Table11[],2,FALSE)","v":"Misc"}]
["2010-06-01","Paper Church Jesus","Paper Payment to CHURCH OF JESU",-177.4,"debit","Charity","ING Checking",{"$f":"VLOOKUP(TestTable[[#This Row],[Category]],Table11[],2,FALSE)","v":"Misc"}]
["2010-06-01","Amazon","AMAZON MKTPLACE PMTS   AMZN.COM/BILLWA",-6.48,"debit","Shopping","B of A CC",{"$f":"VLOOKUP(TestTable[[#This Row],[Category]],Table11[],2,FALSE)","v":"Misc"}]
["2010-06-01","Transfer from Checking","PAYMENT - ELECTRONIC",20,"credit","Credit Card Payment","B of A CC",{"$f":"VLOOKUP(TestTable[[#This Row],[Category]],Table11[],2,FALSE)","v":"Debt"}]
["2010-05-31","Stinker W Ustick","STINKER #59 10677 W USTICK RD",-25.06,"debit","Gas & Fuel","ING Checking",{"$f":"VLOOKUP(TestTable[[#This Row],[Category]],Table11[],2,FALSE)","v":"Auto"}]
["2010-05-31","Interest Paid","Interest Paid",0.1,"credit","Interest Income","ING Checking",{"$f":"VLOOKUP(TestTable[[#This Row],[Category]],Table11[],2,FALSE)","v":"Misc"}]
["2010-05-31","Provo City Utilities","PROVO CITY UTILITIES PROVO UT -",-81.41,"debit","Utilities","ING Checking",{"$f":"VLOOKUP(TestTable[[#This Row],[Category]],Table11[],2,FALSE)","v":"Utilities"}]
["2010-05-31","iTunes","APL*ITUNES 866-712-7753 CA",-1.06,"debit","Shopping","Citi CC",{"$f":"VLOOKUP(TestTable[[#This Row],[Category]],Table11[],2,FALSE)","v":"Misc"}]
["2010-05-31","Wal-Mart","WAL - Debit",-1.44,"debit","Shopping","ING Checking",{"$f":"VLOOKUP(TestTable[[#This Row],[Category]],Table11[],2,FALSE)","v":"Misc"}]
["2010-05-31","Wal-Mart","WAL - Debit",-40,"debit","Cash & ATM","ING Checking",{"$f":"VLOOKUP(TestTable[[#This Row],[Category]],Table11[],2,FALSE)","v":"Misc"}]
["2010-05-29","Target","TARGET T1230 BO 6280 N EAGLE RO",-36.04,"debit","Shopping","ING Checking",{"$f":"VLOOKUP(TestTable[[#This Row],[Category]],Table11[],2,FALSE)","v":"Misc"}]
["2010-05-29","Wal","WAL - Debit",-53.86,"debit","Shopping","ING Checking",{"$f":"VLOOKUP(TestTable[[#This Row],[Category]],Table11[],2,FALSE)","v":"Misc"}]
["2010-05-29","Wal-Mart","WAL-MART  2862         MERIDIAN     ID",-27,"debit","Shopping","B of A CC",{"$f":"VLOOKUP(TestTable[[#This Row],[Category]],Table11[],2,FALSE)","v":"Misc"}]
["2010-05-28","Albertsons","#00177 ALBERTSO 4700 N. EAGLE R",-4.2300000000000004,"debit","Miscellaneous","ING Checking",{"$f":"VLOOKUP(TestTable[[#This Row],[Category]],Table11[],2,FALSE)","v":"Misc"}]
["2010-05-28","Transfer from ING Holding","Internet Deposit",1779,"credit","Transfer","ING Checking",{"$f":"VLOOKUP(TestTable[[#This Row],[Category]],Table11[],2,FALSE)","v":"Misc"}]
["2010-05-28","Person Person Tyler","Person2Person Payment to Tyler",-800,"debit","Mortgage & Rent","ING Checking",{"$f":"VLOOKUP(TestTable[[#This Row],[Category]],Table11[],2,FALSE)","v":"Housing"}]
["2010-05-28","Transfer to Checking","Internet Withdrawal",-1779,"debit","Transfer","ING Holding",{"$f":"VLOOKUP(TestTable[[#This Row],[Category]],Table11[],2,FALSE)","v":"Misc"}]
["2010-05-28","Savings Deposit Direct","Savings Deposit - Direct Deposit",1774.04,"credit","Paycheck","ING Holding",{"$f":"VLOOKUP(TestTable[[#This Row],[Category]],Table11[],2,FALSE)","v":"Income"}]
["2010-05-27","Veracity Network Veracity","Electronic Withdrawal",-47.98,"debit","Internet","ING Checking",{"$f":"VLOOKUP(TestTable[[#This Row],[Category]],Table11[],2,FALSE)","v":"Utilities"}]
["2010-05-27","Chevron","CHEVRON JACKSONS FOOD  BOISE        ID",-21.21,"debit","Gas & Fuel","B of A CC",{"$f":"VLOOKUP(TestTable[[#This Row],[Category]],Table11[],2,FALSE)","v":"Auto"}]
["2010-05-27","Albertsons","#00177 ALBERTSONS 0000 BOISE        ID",-11.95,"debit","Miscellaneous","B of A CC",{"$f":"VLOOKUP(TestTable[[#This Row],[Category]],Table11[],2,FALSE)","v":"Misc"}]
["2010-05-27","REI","REI #47 00047          BOISE        ID",-22.99,"debit","Shopping","B of A CC",{"$f":"VLOOKUP(TestTable[[#This Row],[Category]],Table11[],2,FALSE)","v":"Misc"}]
["2010-05-26","iTunes","APL*ITUNES 866-712-7753 CA",-3.18,"debit","Miscellaneous","Citi CC",{"$f":"VLOOKUP(TestTable[[#This Row],[Category]],Table11[],2,FALSE)","v":"Misc"}]
["2010-05-26","Consumer Reports","CR *CONSUMERREPORTS.OR 8003330663 NY",-5.95,"debit","Miscellaneous","Citi CC",{"$f":"VLOOKUP(TestTable[[#This Row],[Category]],Table11[],2,FALSE)","v":"Misc"}]
["2010-05-26","Walgreen","WALGREENS #11452 00001 MERIDIAN     ID",-42.39,"debit","Miscellaneous","B of A CC",{"$f":"VLOOKUP(TestTable[[#This Row],[Category]],Table11[],2,FALSE)","v":"Misc"}]
["2010-05-26","Costco","COSTCO WHSE #0761 0000 BOISE        ID",-22.79,"debit","Miscellaneous","B of A CC",{"$f":"VLOOKUP(TestTable[[#This Row],[Category]],Table11[],2,FALSE)","v":"Misc"}]
["2010-05-26","Albertsons","#00177 ALBERTSONS 0000 BOISE        ID",-1.69,"debit","Miscellaneous","B of A CC",{"$f":"VLOOKUP(TestTable[[#This Row],[Category]],Table11[],2,FALSE)","v":"Misc"}]
["2010-05-26","Shell","SHELL OIL 57441947306  MERIDIAN     ID",-17.010000000000002,"debit","Gas & Fuel","B of A CC",{"$f":"VLOOKUP(TestTable[[#This Row],[Category]],Table11[],2,FALSE)","v":"Auto"}]
["2010-05-26","Kmart","KMART 3298 KMART #0329 BOISE        ID",-10.85,"debit","Shopping","B of A CC",{"$f":"VLOOKUP(TestTable[[#This Row],[Category]],Table11[],2,FALSE)","v":"Misc"}]
["2010-05-25","Primary Health","PRIMARY HEALTH MEDICAL BOISE        ID",-25,"debit","Doctor","B of A CC",{"$f":"VLOOKUP(TestTable[[#This Row],[Category]],Table11[],2,FALSE)","v":"Medical"}]
["2010-05-25","Albertsons","#00177 ALBERTSONS 0000 BOISE        ID",-59.6,"debit","Pharmacy","B of A CC",{"$f":"VLOOKUP(TestTable[[#This Row],[Category]],Table11[],2,FALSE)","v":"Medical"}]
["2010-05-25","Albertsons","#00177 ALBERTSONS 0000 BOISE        ID",-3.81,"debit","Miscellaneous","B of A CC",{"$f":"VLOOKUP(TestTable[[#This Row],[Category]],Table11[],2,FALSE)","v":"Misc"}]
["2010-05-25","Albertsons","#00177 ALBERTSONS 0000 BOISE        ID",-12.41,"debit","Miscellaneous","B of A CC",{"$f":"VLOOKUP(TestTable[[#This Row],[Category]],Table11[],2,FALSE)","v":"Misc"}]
["2010-05-24","Amazon","AMAZON.COM             AMZN.COM/BILLWA",-19.989999999999998,"debit","Shopping","B of A CC",{"$f":"VLOOKUP(TestTable[[#This Row],[Category]],Table11[],2,FALSE)","v":"Misc"}]
["2010-05-24","Amazon","AMAZON.COM             AMZN.COM/BILLWA",-34.950000000000003,"debit","Shopping","B of A CC",{"$f":"VLOOKUP(TestTable[[#This Row],[Category]],Table11[],2,FALSE)","v":"Misc"}]
["2010-05-24","Albertsons","#00182 ALBERTSONS 0000 EAGLE        ID",-17.54,"debit","Miscellaneous","B of A CC",{"$f":"VLOOKUP(TestTable[[#This Row],[Category]],Table11[],2,FALSE)","v":"Misc"}]
["2010-05-24","Babies 'R' Us","BABIES 'R' US          MERIDIAN     ID",45.76,"credit","Shopping","B of A CC",{"$f":"VLOOKUP(TestTable[[#This Row],[Category]],Table11[],2,FALSE)","v":"Misc"}]
["2010-05-23","Amazon","AMAZON MKTPLACE PMTS   AMZN.COM/BILLWA",-8.3800000000000008,"debit","Shopping","B of A CC",{"$f":"VLOOKUP(TestTable[[#This Row],[Category]],Table11[],2,FALSE)","v":"Misc"}]
["2010-05-23","Scout Com Wa","SCOUT.COM              888-979-0979 WA",-9.9499999999999993,"debit","Miscellaneous","B of A CC",{"$f":"VLOOKUP(TestTable[[#This Row],[Category]],Table11[],2,FALSE)","v":"Misc"}]
["2010-05-22","Costco","COSTCO WHSE #0761 0000 BOISE        ID",-58.27,"debit","Miscellaneous","B of A CC",{"$f":"VLOOKUP(TestTable[[#This Row],[Category]],Table11[],2,FALSE)","v":"Misc"}]
["2010-05-22","George's Cycles & Fitness","GEORGE'S CYCLES & FIT  BOISE        ID",-611.54999999999995,"debit","Shopping","B of A CC",{"$f":"VLOOKUP(TestTable[[#This Row],[Category]],Table11[],2,FALSE)","v":"Misc"}]
["2010-05-21","Primary Health","PRIMARY HEALTH MEDICAL BOISE        ID",-25,"debit","Doctor","B of A CC",{"$f":"VLOOKUP(TestTable[[#This Row],[Category]],Table11[],2,FALSE)","v":"Medical"}]
["2010-05-21","Albertsons","#00177 ALBERTSONS 0000 BOISE        ID",-11.43,"debit","Miscellaneous","B of A CC",{"$f":"VLOOKUP(TestTable[[#This Row],[Category]],Table11[],2,FALSE)","v":"Misc"}]
["2010-05-21","Savers","SAVERS 1033 2270520099 BOISE        ID",-16.91,"debit","Shopping","B of A CC",{"$f":"VLOOKUP(TestTable[[#This Row],[Category]],Table11[],2,FALSE)","v":"Misc"}]
["2010-05-21","Boise Di","BOISE DI 3000034365390 BOISE        ID",-25.97,"debit","Shopping","B of A CC",{"$f":"VLOOKUP(TestTable[[#This Row],[Category]],Table11[],2,FALSE)","v":"Misc"}]
["2010-05-20","Target","TARGET 1230 1230       BOISE        ID",-5.3,"debit","Miscellaneous","B of A CC",{"$f":"VLOOKUP(TestTable[[#This Row],[Category]],Table11[],2,FALSE)","v":"Misc"}]
["2010-05-20","Griddle","THE GRIDDLE EAGLE 6500 EAGLE        ID",-23.09,"debit","Restaurants","B of A CC",{"$f":"VLOOKUP(TestTable[[#This Row],[Category]],Table11[],2,FALSE)","v":"Food"}]
["2010-05-19","Purchases Interest Charge","PURCHASES*INTEREST CHARGE*PERIODIC RATE",-2.4700000000000002,"debit","Finance Charge","Citi CC",{"$f":"VLOOKUP(TestTable[[#This Row],[Category]],Table11[],2,FALSE)","v":"Misc"}]
["2010-05-19","Todd Stewart Salon","TODD STEWART SALON     EAGLE        ID",-25,"debit","Personal Care","B of A CC",{"$f":"VLOOKUP(TestTable[[#This Row],[Category]],Table11[],2,FALSE)","v":"Misc"}]
["2010-05-19","Albertsons","#00177 ALBERTSONS 0000 BOISE        ID",-4.42,"debit","Miscellaneous","B of A CC",{"$f":"VLOOKUP(TestTable[[#This Row],[Category]],Table11[],2,FALSE)","v":"Misc"}]
["2010-05-19","Albertsons","#00177 ALBERTSONS 0000 BOISE        ID",-10.59,"debit","Miscellaneous","B of A CC",{"$f":"VLOOKUP(TestTable[[#This Row],[Category]],Table11[],2,FALSE)","v":"Misc"}]
["2010-05-19","Jamba Juice","JAMBA JUICE # 252 0000 BOISE        ID",-8.3699999999999992,"debit","Food & Dining","B of A CC",{"$f":"VLOOKUP(TestTable[[#This Row],[Category]],Table11[],2,FALSE)","v":"Food"}]
["2010-05-19","Target","TARGET STORE 617 0617  BOISE        ID",-21.72,"debit","Miscellaneous","B of A CC",{"$f":"VLOOKUP(TestTable[[#This Row],[Category]],Table11[],2,FALSE)","v":"Misc"}]
["2010-05-18","Five Guys Id","FIVE GUYS--ID # 10 542 MERIDIAN     ID",-13.86,"debit","Fast Food","B of A CC",{"$f":"VLOOKUP(TestTable[[#This Row],[Category]],Table11[],2,FALSE)","v":"Food"}]
["2010-05-18","Wal-Mart","WAL-MART  2862         MERIDIAN     ID",-68.900000000000006,"debit","Miscellaneous","B of A CC",{"$f":"VLOOKUP(TestTable[[#This Row],[Category]],Table11[],2,FALSE)","v":"Misc"}]
["2010-05-17","Boise Di","BOISE DI 3000034365390 BOISE        ID",-9.5399999999999991,"debit","Miscellaneous","B of A CC",{"$f":"VLOOKUP(TestTable[[#This Row],[Category]],Table11[],2,FALSE)","v":"Misc"}]
["2010-05-17","Transfer to Amber","Electronic Withdrawal from CITI CARD ONLINE PAYMENT",-20,"debit","Credit Card Payment","ING Checking",{"$f":"VLOOKUP(TestTable[[#This Row],[Category]],Table11[],2,FALSE)","v":"Debt"}]
["2010-05-15","Chevron","CHEVRON JACKSONS FOOD  BOISE        ID",-1.9,"debit","Gas & Fuel","B of A CC",{"$f":"VLOOKUP(TestTable[[#This Row],[Category]],Table11[],2,FALSE)","v":"Auto"}]
["2010-05-15","Albertsons","#00177 ALBERTSONS 0000 BOISE        ID",-16.399999999999999,"debit","Miscellaneous","B of A CC",{"$f":"VLOOKUP(TestTable[[#This Row],[Category]],Table11[],2,FALSE)","v":"Misc"}]
["2010-05-15","Chevron","CHEVRON JACKSONS FOOD  BOISE        ID",-3.9,"debit","Gas & Fuel","B of A CC",{"$f":"VLOOKUP(TestTable[[#This Row],[Category]],Table11[],2,FALSE)","v":"Auto"}]
["2010-05-15","Albertsons","#00177 ALBERTSONS 0000 BOISE        ID",-4.43,"debit","Miscellaneous","B of A CC",{"$f":"VLOOKUP(TestTable[[#This Row],[Category]],Table11[],2,FALSE)","v":"Misc"}]
["2010-05-15","Subway","SUBWAY        222976 2 BOISE        ID",-12.72,"debit","Fast Food","B of A CC",{"$f":"VLOOKUP(TestTable[[#This Row],[Category]],Table11[],2,FALSE)","v":"Food"}]
["2010-05-14","Transfer from Checking","CLICK-TO-PAY PAYMENT, THANK YOU",20,"credit","Credit Card Payment","Citi CC",{"$f":"VLOOKUP(TestTable[[#This Row],[Category]],Table11[],2,FALSE)","v":"Debt"}]
["2010-05-13","iTunes","APL*ITUNES 866-712-7753 CA",-1.06,"debit","Miscellaneous","Citi CC",{"$f":"VLOOKUP(TestTable[[#This Row],[Category]],Table11[],2,FALSE)","v":"Misc"}]
["2010-05-13","Shell","SHELL OIL 57441947306  MERIDIAN     ID",-45.97,"debit","Gas & Fuel","B of A CC",{"$f":"VLOOKUP(TestTable[[#This Row],[Category]],Table11[],2,FALSE)","v":"Auto"}]
["2010-05-13","Wal-Mart","WAL-MART  2862         MERIDIAN     ID",-25.78,"debit","Shopping","B of A CC",{"$f":"VLOOKUP(TestTable[[#This Row],[Category]],Table11[],2,FALSE)","v":"Misc"}]
["2010-05-13","Babies 'R' Us","BABIES 'R' US          MERIDIAN     ID",-93.25,"debit","Shopping","B of A CC",{"$f":"VLOOKUP(TestTable[[#This Row],[Category]],Table11[],2,FALSE)","v":"Misc"}]
["2010-05-12","Kid To Kid","KID TO KID BOISE ID",-14.83,"debit","Shopping","Citi CC",{"$f":"VLOOKUP(TestTable[[#This Row],[Category]],Table11[],2,FALSE)","v":"Misc"}]
["2010-05-12","Albertsons","#00177 ALBERTSONS 0000 BOISE        ID",-29.46,"debit","Miscellaneous","B of A CC",{"$f":"VLOOKUP(TestTable[[#This Row],[Category]],Table11[],2,FALSE)","v":"Misc"}]
["2010-05-12","Ross","ROSS STORES 217 217    BOISE        ID",-15.87,"debit","Shopping","B of A CC",{"$f":"VLOOKUP(TestTable[[#This Row],[Category]],Table11[],2,FALSE)","v":"Misc"}]
["2010-05-12","Target","TARGET STORE 617 0617  BOISE        ID",-11.12,"debit","Miscellaneous","B of A CC",{"$f":"VLOOKUP(TestTable[[#This Row],[Category]],Table11[],2,FALSE)","v":"Misc"}]
["2010-05-11","Albertsons","#00177 ALBERTSONS 0000 BOISE        ID",-4,"debit","Miscellaneous","B of A CC",{"$f":"VLOOKUP(TestTable[[#This Row],[Category]],Table11[],2,FALSE)","v":"Misc"}]
["2010-05-10","Transfer to Checking","ACH Debit SWENSEN,AMBER M - ING DIRECT",-880,"debit","Transfer","Addison Avenue Checking",{"$f":"VLOOKUP(TestTable[[#This Row],[Category]],Table11[],2,FALSE)","v":"Misc"}]
["2010-05-10","Albertsons","#00177 ALBERTSONS 0000 BOISE        ID",-14.29,"debit","Miscellaneous","B of A CC",{"$f":"VLOOKUP(TestTable[[#This Row],[Category]],Table11[],2,FALSE)","v":"Misc"}]
["2010-05-10","Target","TARGET 1230 1230       BOISE        ID",6.66,"credit","Miscellaneous","B of A CC",{"$f":"VLOOKUP(TestTable[[#This Row],[Category]],Table11[],2,FALSE)","v":"Misc"}]
["2010-05-10","George's Cycles & Fitness","GEORGE'S CYCLES & FIT  BOISE        ID",-50,"debit","Miscellaneous","B of A CC",{"$f":"VLOOKUP(TestTable[[#This Row],[Category]],Table11[],2,FALSE)","v":"Misc"}]
["2010-05-10","Primary Health","PRIMARY HEALTH MEDICAL BOISE        ID",-25,"debit","Doctor","B of A CC",{"$f":"VLOOKUP(TestTable[[#This Row],[Category]],Table11[],2,FALSE)","v":"Medical"}]
["2010-05-10","Amazon","AMAZON MKTPLACE PMTS   AMZN.COM/BILLWA",-9.3800000000000008,"debit","Shopping","B of A CC",{"$f":"VLOOKUP(TestTable[[#This Row],[Category]],Table11[],2,FALSE)","v":"Misc"}]
["2010-05-10","Amazon","AMAZON.COM             AMZN.COM/BILLWA",-16.489999999999998,"debit","Shopping","B of A CC",{"$f":"VLOOKUP(TestTable[[#This Row],[Category]],Table11[],2,FALSE)","v":"Misc"}]
["2010-05-09","Amazon","AMAZON MKTPLACE PMTS   AMZN.COM/BILLWA",-32.950000000000003,"debit","Shopping","B of A CC",{"$f":"VLOOKUP(TestTable[[#This Row],[Category]],Table11[],2,FALSE)","v":"Misc"}]
["2010-05-09","Amazon","AMAZON MKTPLACE PMTS   AMZN.COM/BILLWA",-40.78,"debit","Shopping","B of A CC",{"$f":"VLOOKUP(TestTable[[#This Row],[Category]],Table11[],2,FALSE)","v":"Misc"}]
["2010-05-08","Brookstone","BROOKSTONE CO 226 0022 BOISE        ID",-69.540000000000006,"debit","Shopping","B of A CC",{"$f":"VLOOKUP(TestTable[[#This Row],[Category]],Table11[],2,FALSE)","v":"Misc"}]
["2010-05-08","Netflix","NETFLIX                LOS GATOS    CA",-3.18,"debit","Movies & DVDs","B of A CC",{"$f":"VLOOKUP(TestTable[[#This Row],[Category]],Table11[],2,FALSE)","v":"Misc"}]
["2010-05-08","Netflix","NETFLIX                LOS GATOS    CA",-14.83,"debit","Movies & DVDs","B of A CC",{"$f":"VLOOKUP(TestTable[[#This Row],[Category]],Table11[],2,FALSE)","v":"Misc"}]
["2010-05-08","Boise Co-op","BOISECOOP              BOISE        ID",-2.0499999999999998,"debit","Groceries","B of A CC",{"$f":"VLOOKUP(TestTable[[#This Row],[Category]],Table11[],2,FALSE)","v":"Food"}]
["2010-05-08","Jamba Juice","JAMBA JUICE # 252 0000 BOISE        ID",-9.9600000000000009,"debit","Food & Dining","B of A CC",{"$f":"VLOOKUP(TestTable[[#This Row],[Category]],Table11[],2,FALSE)","v":"Food"}]
["2010-05-08","Amazon","AMAZON MKTPLACE PMTS   AMZN.COM/BILLWA",-23.86,"debit","Shopping","B of A CC",{"$f":"VLOOKUP(TestTable[[#This Row],[Category]],Table11[],2,FALSE)","v":"Misc"}]
["2010-05-08","TJ Maxx","TJMAXX #0415 000000415 BOISE        ID",-46.78,"debit","Shopping","B of A CC",{"$f":"VLOOKUP(TestTable[[#This Row],[Category]],Table11[],2,FALSE)","v":"Misc"}]
["2010-05-07","Target","TARGET 1230 1230       BOISE        ID",-25.91,"debit","Miscellaneous","B of A CC",{"$f":"VLOOKUP(TestTable[[#This Row],[Category]],Table11[],2,FALSE)","v":"Misc"}]
["2010-05-07","Amazon","AMAZON MKTPLACE PMTS   AMZN.COM/BILLWA",-99.9,"debit","Shopping","B of A CC",{"$f":"VLOOKUP(TestTable[[#This Row],[Category]],Table11[],2,FALSE)","v":"Misc"}]
["2010-05-07","UPS","UPS STORE #4537 300004 BOISE        ID",-14.45,"debit","Miscellaneous","B of A CC",{"$f":"VLOOKUP(TestTable[[#This Row],[Category]],Table11[],2,FALSE)","v":"Misc"}]
["2010-05-07","Target","TARGET 1230 1230       BOISE        ID",-6.66,"debit","Miscellaneous","B of A CC",{"$f":"VLOOKUP(TestTable[[#This Row],[Category]],Table11[],2,FALSE)","v":"Misc"}]
["2010-05-07","Person Person Laura","Person2Person Payment to Laura or Clayne Larsen",-1045,"debit","Mortgage & Rent","ING Checking",{"$f":"VLOOKUP(TestTable[[#This Row],[Category]],Table11[],2,FALSE)","v":"Housing"}]
["2010-05-07","Transfer from Amber Checking","Internet Deposit ADDISON AVENUE FEDERAL CREDIT UNION checking account XXXXXX9908",880,"credit","Mortgage & Rent","ING Checking",{"$f":"VLOOKUP(TestTable[[#This Row],[Category]],Table11[],2,FALSE)","v":"Housing"}]
["2010-05-06","Transfer to Checking","ACH Debit SWENSEN,AMBER M - ING DIRECT",-1050,"debit","Transfer","Addison Avenue Checking",{"$f":"VLOOKUP(TestTable[[#This Row],[Category]],Table11[],2,FALSE)","v":"Misc"}]
["2010-05-06","ShopKo","SHOPKO        401695 5 MERIDIAN     ID",-31.62,"debit","Shopping","B of A CC",{"$f":"VLOOKUP(TestTable[[#This Row],[Category]],Table11[],2,FALSE)","v":"Misc"}]
["2010-05-06","USPS","USPS 150931955500604 4 BOISE        ID",-7.92,"debit","Miscellaneous","B of A CC",{"$f":"VLOOKUP(TestTable[[#This Row],[Category]],Table11[],2,FALSE)","v":"Misc"}]
["2010-05-06","Ross","ROSS STORE 530 530     MERIDIAN     ID",-4.2300000000000004,"debit","Shopping","B of A CC",{"$f":"VLOOKUP(TestTable[[#This Row],[Category]],Table11[],2,FALSE)","v":"Misc"}]
["2010-05-05","Deposit","Deposit",1200,"credit","Income","Addison Avenue Checking",{"$f":"VLOOKUP(TestTable[[#This Row],[Category]],Table11[],2,FALSE)","v":"income"}]
["2010-05-05","Withdrawal","Withdrawal",-320,"debit","Uncategorized","Addison Avenue Checking",{"$f":"VLOOKUP(TestTable[[#This Row],[Category]],Table11[],2,FALSE)","v":"Misc"}]
["2010-05-05","Kidz","KIDZ AGAIN BOISE ID",-6.31,"debit","Shopping","Citi CC",{"$f":"VLOOKUP(TestTable[[#This Row],[Category]],Table11[],2,FALSE)","v":"Misc"}]
["2010-05-05","Chevron","CHEVRON JACKSONS FOOD  BOISE        ID",-35.5,"debit","Gas & Fuel","B of A CC",{"$f":"VLOOKUP(TestTable[[#This Row],[Category]],Table11[],2,FALSE)","v":"Auto"}]
["2010-05-05","Quiznos","QUIZNOS SUB #1522 3000 EAGLE        ID",-12.7,"debit","Fast Food","B of A CC",{"$f":"VLOOKUP(TestTable[[#This Row],[Category]],Table11[],2,FALSE)","v":"Food"}]
["2010-05-05","Transfer from Amber Checking","Internet Deposit ADDISON AVENUE FEDERAL CREDIT UNION checking account XXXXXX9908",1050,"credit","Bonus","ING Checking",{"$f":"VLOOKUP(TestTable[[#This Row],[Category]],Table11[],2,FALSE)","v":"Income"}]
["2010-05-04","Deposit Direct Ing","ACH Deposit DIRECT,ING - ING DIRECT",0.12,"credit","Income","Addison Avenue Checking",{"$f":"VLOOKUP(TestTable[[#This Row],[Category]],Table11[],2,FALSE)","v":"income"}]
["2010-05-04","Deposit Direct Ing","ACH Deposit DIRECT,ING - ING DIRECT",0.12,"credit","Income","Addison Avenue Checking",{"$f":"VLOOKUP(TestTable[[#This Row],[Category]],Table11[],2,FALSE)","v":"income"}]
["2010-05-04","Albertsons","#00177 ALBERTSONS 0000 BOISE        ID",-11.63,"debit","Miscellaneous","B of A CC",{"$f":"VLOOKUP(TestTable[[#This Row],[Category]],Table11[],2,FALSE)","v":"Misc"}]
["2010-05-04","Redbox","Debit Card Purchase - REDBOX DVD RENTAL 866 733 2693 IL",-5.34,"debit","Movies & DVDs","ING Checking",{"$f":"VLOOKUP(TestTable[[#This Row],[Category]],Table11[],2,FALSE)","v":"Misc"}]
["2010-05-03","Questar Gas Company","QUESTAR GAS COMPANY 800-323-5517 UT",-83.51,"debit","Utilities","Citi CC",{"$f":"VLOOKUP(TestTable[[#This Row],[Category]],Table11[],2,FALSE)","v":"Utilities"}]
["2010-05-03","Liberty Mutual","LIBERTYMUTUALINSURAN   800-225-8285 MA",-60.75,"debit","Auto Insurance","B of A CC",{"$f":"VLOOKUP(TestTable[[#This Row],[Category]],Table11[],2,FALSE)","v":"Auto"}]
["2010-05-03","Albertsons","#00177 ALBERTSONS 0000 BOISE        ID",-14.16,"debit","Miscellaneous","B of A CC",{"$f":"VLOOKUP(TestTable[[#This Row],[Category]],Table11[],2,FALSE)","v":"Misc"}]
["2010-05-03","Costco","COSTCO WHSE #0761 0000 BOISE        ID",-39.200000000000003,"debit","Miscellaneous","B of A CC",{"$f":"VLOOKUP(TestTable[[#This Row],[Category]],Table11[],2,FALSE)","v":"Misc"}]
["2010-05-03","Minimum Interest Charge","MINIMUM INTEREST CHARGE",-1.5,"debit","Finance Charge","B of A CC",{"$f":"VLOOKUP(TestTable[[#This Row],[Category]],Table11[],2,FALSE)","v":"Misc"}]
["2010-05-01","AT&T Wireless","ATTM*265004344038MTZ 3 ALPHARETTA   GA",-116.69,"debit","Mobile Phone","B of A CC",{"$f":"VLOOKUP(TestTable[[#This Row],[Category]],Table11[],2,FALSE)","v":"Phone"}]
["2010-05-01","Boise Towne Square","BOISE TOWN SQUARE 3930 BOISE        ID",-71.540000000000006,"debit","Shopping","B of A CC",{"$f":"VLOOKUP(TestTable[[#This Row],[Category]],Table11[],2,FALSE)","v":"Misc"}]
["2010-05-01","Kohl's","KOHL'S 1094 1094       MERIDIAN     ID",-7.41,"debit","Shopping","B of A CC",{"$f":"VLOOKUP(TestTable[[#This Row],[Category]],Table11[],2,FALSE)","v":"Misc"}]
["2010-05-01","Boise Towne Square","BOISE TOWN SQUARE 3930 BOISE        ID",-75.5,"debit","Shopping","B of A CC",{"$f":"VLOOKUP(TestTable[[#This Row],[Category]],Table11[],2,FALSE)","v":"Misc"}]
["2010-05-01","Redbox","REDBOX DVD RENTAL      866-733-2693 IL",-2.14,"debit","Movies & DVDs","B of A CC",{"$f":"VLOOKUP(TestTable[[#This Row],[Category]],Table11[],2,FALSE)","v":"Misc"}]
["2010-05-01","Boise Towne Square","BOISE TOWN SQUARE 3930 BOISE        ID",-55.64,"debit","Shopping","B of A CC",{"$f":"VLOOKUP(TestTable[[#This Row],[Category]],Table11[],2,FALSE)","v":"Misc"}]
["2010-05-01","T G I","T G I FRIDAY'S BOISE 1 BOISE        ID",-18.05,"debit","Restaurants","B of A CC",{"$f":"VLOOKUP(TestTable[[#This Row],[Category]],Table11[],2,FALSE)","v":"Food"}]
["2010-04-30","Periodic Finance Charge","Finance Charge Paid for Overdraft",-0.08,"debit","Finance Charge","ING Checking",{"$f":"VLOOKUP(TestTable[[#This Row],[Category]],Table11[],2,FALSE)","v":"Misc"}]
["2010-04-30","Monthly Interest Paid","Monthly Interest Paid",0.02,"credit","Interest Income","ING Checking",{"$f":"VLOOKUP(TestTable[[#This Row],[Category]],Table11[],2,FALSE)","v":"Misc"}]
["2010-04-30","Chevron","CHEVRON JACKSONS FOOD  MERIDIAN     ID",-43.39,"debit","Gas & Fuel","B of A CC",{"$f":"VLOOKUP(TestTable[[#This Row],[Category]],Table11[],2,FALSE)","v":"Auto"}]
["2010-04-30","Wal-Mart","WAL-MART  2862         MERIDIAN     ID",-32.72,"debit","Shopping","B of A CC",{"$f":"VLOOKUP(TestTable[[#This Row],[Category]],Table11[],2,FALSE)","v":"Misc"}]
["2010-04-30","Wal-Mart","WAL-MART  2862         MERIDIAN     ID",-41.15,"debit","Shopping","B of A CC",{"$f":"VLOOKUP(TestTable[[#This Row],[Category]],Table11[],2,FALSE)","v":"Misc"}]
["2010-04-28","Provo City Utilities","Debit Card Purchase - PROVO CITY UTILITIES PROVO UT",-81.069999999999993,"debit","Utilities","ING Checking",{"$f":"VLOOKUP(TestTable[[#This Row],[Category]],Table11[],2,FALSE)","v":"Utilities"}]
["2010-04-28","Chevron","CHEVRON GOLDN SPIKE TR TREMONTON    UT",-39.69,"debit","Gas & Fuel","B of A CC",{"$f":"VLOOKUP(TestTable[[#This Row],[Category]],Table11[],2,FALSE)","v":"Auto"}]
["2010-04-28","Carl's Jr","CARL'S JR #1101363 QPS PROVO        UT",-20.76,"debit","Fast Food","B of A CC",{"$f":"VLOOKUP(TestTable[[#This Row],[Category]],Table11[],2,FALSE)","v":"Food"}]
["2010-04-27","Smith's Food","SMITHS FOOD #4136 0000 PROVO        UT",-5.33,"debit","Groceries","B of A CC",{"$f":"VLOOKUP(TestTable[[#This Row],[Category]],Table11[],2,FALSE)","v":"Food"}]
["2010-04-27","Domino's Pizza","DOMINOS PIZZA #7501 30 PROVO        UT",-16.850000000000001,"debit","Fast Food","B of A CC",{"$f":"VLOOKUP(TestTable[[#This Row],[Category]],Table11[],2,FALSE)","v":"Food"}]
["2010-04-27","UPS","THE UPS STORE #5266 30 PROUD        UT",-10.76,"debit","Shipping","B of A CC",{"$f":"VLOOKUP(TestTable[[#This Row],[Category]],Table11[],2,FALSE)","v":"Misc"}]
["2010-04-27","Camera","KEWS CAMERA REPAIR KEW PROVO        UT",-95.23,"debit","Hobbies","B of A CC",{"$f":"VLOOKUP(TestTable[[#This Row],[Category]],Table11[],2,FALSE)","v":"Misc"}]
["2010-04-26","Consumer Reports","CR *CONSUMERREPORTS.OR 8003330663 NY",-5.95,"debit","Books","Citi CC",{"$f":"VLOOKUP(TestTable[[#This Row],[Category]],Table11[],2,FALSE)","v":"Misc"}]
["2010-04-26","Kmart","KMART 3765 KMART #0376 PROVO        UT",-31.93,"debit","Shopping","B of A CC",{"$f":"VLOOKUP(TestTable[[#This Row],[Category]],Table11[],2,FALSE)","v":"Misc"}]
["2010-04-26","USPS","USPS CHANGE OF100959 4 MEMPHIS      TN",-1,"debit","Shipping","B of A CC",{"$f":"VLOOKUP(TestTable[[#This Row],[Category]],Table11[],2,FALSE)","v":"Misc"}]
["2010-04-25","Veracity Networks Ut","Debit Card Purchase - VERACITY NETWORKS 801 6915800 UT",-47.98,"debit","Uncategorized","ING Checking",{"$f":"VLOOKUP(TestTable[[#This Row],[Category]],Table11[],2,FALSE)","v":"Misc"}]
["2010-04-24","Costco","COSTCO WHSE #0484 0000 OREM         UT",-22.31,"debit","Miscellaneous","B of A CC",{"$f":"VLOOKUP(TestTable[[#This Row],[Category]],Table11[],2,FALSE)","v":"Misc"}]
["2010-04-24","Chevron","CHEVRON PWI #912 - SAL SALT LAKE CITUT",-41.69,"debit","Gas & Fuel","B of A CC",{"$f":"VLOOKUP(TestTable[[#This Row],[Category]],Table11[],2,FALSE)","v":"Auto"}]
["2010-04-24","Target","TARGET 1814 1814       AMERICAN FORKUT",-26.68,"debit","Miscellaneous","B of A CC",{"$f":"VLOOKUP(TestTable[[#This Row],[Category]],Table11[],2,FALSE)","v":"Misc"}]
["2010-04-24","Melting Pot","THE MELTING POT OF UTA SALT LAKE CITUT",-24.86,"debit","Restaurants","B of A CC",{"$f":"VLOOKUP(TestTable[[#This Row],[Category]],Table11[],2,FALSE)","v":"Food"}]
["2010-04-23","Texaco","TEXACO PWI #968-OREM 0 OREM         UT",-15.2,"debit","Gas & Fuel","B of A CC",{"$f":"VLOOKUP(TestTable[[#This Row],[Category]],Table11[],2,FALSE)","v":"Auto"}]
["2010-04-22","Scout Com Wa","SCOUT.COM              888-979-0979 WA",-9.9499999999999993,"debit","Uncategorized","B of A CC",{"$f":"VLOOKUP(TestTable[[#This Row],[Category]],Table11[],2,FALSE)","v":"Misc"}]
["2010-04-22","Costco","COSTCO WHSE #0484 0000 OREM         UT",-17.73,"debit","Miscellaneous","B of A CC",{"$f":"VLOOKUP(TestTable[[#This Row],[Category]],Table11[],2,FALSE)","v":"Misc"}]
["2010-04-22","Byu Cougar Creations","BYU COUGAR CREATIONS 3 PROVO        UT",-298.60000000000002,"debit","Uncategorized","B of A CC",{"$f":"VLOOKUP(TestTable[[#This Row],[Category]],Table11[],2,FALSE)","v":"Misc"}]
["2010-04-22","Carl's Jr","CARL'S JR #1101146 QPS OREM         UT",-5.49,"debit","Fast Food","B of A CC",{"$f":"VLOOKUP(TestTable[[#This Row],[Category]],Table11[],2,FALSE)","v":"Food"}]
["2010-04-21","Byu Signature Web","Debit Card Purchase - BYU SIGNATURE CRD WEB 08014223867 UT",-10,"debit","Uncategorized","ING Checking",{"$f":"VLOOKUP(TestTable[[#This Row],[Category]],Table11[],2,FALSE)","v":"Misc"}]
["2010-04-20","Fresh Market Provo","FRESH MARKET PROVO 000 PROVO        UT",-9.19,"debit","Groceries","B of A CC",{"$f":"VLOOKUP(TestTable[[#This Row],[Category]],Table11[],2,FALSE)","v":"Food"}]
["2010-04-20","Inspection Station","THE INSPECTION STATION OREM         UT",-555.63,"debit","Parking","B of A CC",{"$f":"VLOOKUP(TestTable[[#This Row],[Category]],Table11[],2,FALSE)","v":"Misc"}]
["2010-04-19","Purchases Interest Charge","PURCHASES*INTEREST CHARGE*PERIODIC RATE",-7.88,"debit","Finance Charge","Citi CC",{"$f":"VLOOKUP(TestTable[[#This Row],[Category]],Table11[],2,FALSE)","v":"Misc"}]
["2010-04-19","Panda Express","PANDA EXPRESS 724 5429 PROVO        UT",-14.33,"debit","Fast Food","B of A CC",{"$f":"VLOOKUP(TestTable[[#This Row],[Category]],Table11[],2,FALSE)","v":"Food"}]
["2010-04-19","Questar Gas","Electronic Withdrawal from Questar Gas Co. QGC",-82.7,"debit","Utilities","ING Checking",{"$f":"VLOOKUP(TestTable[[#This Row],[Category]],Table11[],2,FALSE)","v":"Utilities"}]
["2010-04-19","PayPal","Electronic Withdrawal from PAYPAL INST XFER",-44.95,"debit","Shopping","ING Checking",{"$f":"VLOOKUP(TestTable[[#This Row],[Category]],Table11[],2,FALSE)","v":"Misc"}]
["2010-04-19","Home Depot","Debit Card Purchase - THE HOME DEPOT 1550 S UNIVERSITY AVEN",-6.37,"debit","Home Improvement","ING Checking",{"$f":"VLOOKUP(TestTable[[#This Row],[Category]],Table11[],2,FALSE)","v":"Misc"}]
["2010-04-15","Marketplace Cafe","Debit Card Purchase - MARKETPLACE CAFE PROVO UT",-8.17,"debit","Restaurants","ING Checking",{"$f":"VLOOKUP(TestTable[[#This Row],[Category]],Table11[],2,FALSE)","v":"Food"}]
["2010-04-14","Liberty Mutual","Electronic Withdrawal from LIBERTY MUTUAL PAYMENT",-60.75,"debit","Auto Insurance","ING Checking",{"$f":"VLOOKUP(TestTable[[#This Row],[Category]],Table11[],2,FALSE)","v":"Auto"}]
["2010-04-13","Costa","Debit Card Purchase - COSTA VIDA OF PROVOQPS PROVO UT",-8.26,"debit","Fast Food","ING Checking",{"$f":"VLOOKUP(TestTable[[#This Row],[Category]],Table11[],2,FALSE)","v":"Food"}]
["2010-04-12","GameStop","GAMESTOP #201 00000020 OREM         UT",28.84,"credit","Electronics & Software","B of A CC",{"$f":"VLOOKUP(TestTable[[#This Row],[Category]],Table11[],2,FALSE)","v":"Misc"}]
["2010-04-12","Hogi Yogi","Debit Card Purchase - HOGI YOGI TERIYAKI S PROVO UT",-5.69,"debit","Restaurants","ING Checking",{"$f":"VLOOKUP(TestTable[[#This Row],[Category]],Table11[],2,FALSE)","v":"Food"}]
["2010-04-12","Malt Shoppe","Debit Card Purchase - THE MALT SHOPPE QPS PROVO UT",-3.76,"debit","Restaurants","ING Checking",{"$f":"VLOOKUP(TestTable[[#This Row],[Category]],Table11[],2,FALSE)","v":"Food"}]
["2010-04-08","ATM Fee","ATM Withdrawal - BRIGHAM UNIVERSITY PROVO, UT US",-1,"debit","ATM Fee","ING Checking",{"$f":"VLOOKUP(TestTable[[#This Row],[Category]],Table11[],2,FALSE)","v":"Misc"}]
["2010-04-08","ATM Withdrawal","ATM Withdrawal - BRIGHAM UNIVERSITY PROVO, UT US",-20,"debit","Cash & ATM","ING Checking",{"$f":"VLOOKUP(TestTable[[#This Row],[Category]],Table11[],2,FALSE)","v":"Misc"}]
["2010-04-06","Paper Church Jesus","Paper Payment to CHURCH OF JESUS CHRIST OF LDS",-819,"debit","Charity","ING Checking",{"$f":"VLOOKUP(TestTable[[#This Row],[Category]],Table11[],2,FALSE)","v":"Misc"}]
["2010-04-05","Byu Marketplace","BYU MARKETPLACE 301010 PROVO        UT",-4.62,"debit","Groceries","B of A CC",{"$f":"VLOOKUP(TestTable[[#This Row],[Category]],Table11[],2,FALSE)","v":"Food"}]
["2010-04-05","Byu Marketplace","BYU MARKETPLACE 301010 PROVO        UT",-2.99,"debit","Groceries","B of A CC",{"$f":"VLOOKUP(TestTable[[#This Row],[Category]],Table11[],2,FALSE)","v":"Food"}]
["2010-04-05","GameStop","GAMESTOP #201 00000020 OREM         UT",110.02,"credit","Electronics & Software","B of A CC",{"$f":"VLOOKUP(TestTable[[#This Row],[Category]],Table11[],2,FALSE)","v":"Misc"}]
["2010-04-05","AT&T Wireless","Debit Card Purchase - ATTM xxxxxxxxxxxx3310500 GA",-111.73,"debit","Mobile Phone","ING Checking",{"$f":"VLOOKUP(TestTable[[#This Row],[Category]],Table11[],2,FALSE)","v":"Phone"}]
["2010-04-03","Electronic Thank You","ELECTRONIC PAYMENT-THANK YOU",4000,"credit","Credit Card Payment","Citi CC",{"$f":"VLOOKUP(TestTable[[#This Row],[Category]],Table11[],2,FALSE)","v":"Debt"}]
["2010-04-03","Chevron","CHEVRON PWI #955 - PRO PROVO        UT",-32.32,"debit","Gas & Fuel","B of A CC",{"$f":"VLOOKUP(TestTable[[#This Row],[Category]],Table11[],2,FALSE)","v":"Auto"}]
["2010-04-03","Pmt Bill Payer","PMT FROM BILL PAYER SERVICE",1311.07,"credit","Credit Card Payment","B of A CC",{"$f":"VLOOKUP(TestTable[[#This Row],[Category]],Table11[],2,FALSE)","v":"Debt"}]
["2010-04-02","Internet Deposit Mountain","Internet Deposit MOUNTAIN AMERICA FCU checking account XXXXXXXX1875",1185,"credit","Income","ING Checking",{"$f":"VLOOKUP(TestTable[[#This Row],[Category]],Table11[],2,FALSE)","v":"income"}]
["2010-04-02","Interest Charged Purchases","Interest Charged on Purchases",-9.2799999999999994,"debit","Finance Charge","B of A CC",{"$f":"VLOOKUP(TestTable[[#This Row],[Category]],Table11[],2,FALSE)","v":"Misc"}]
["2010-04-01","Byu Marketplace","BYU MARKETPLACE 301010 PROVO        UT",-2.14,"debit","Groceries","B of A CC",{"$f":"VLOOKUP(TestTable[[#This Row],[Category]],Table11[],2,FALSE)","v":"Food"}]
["2010-03-31","Electronic Thank You","ELECTRONIC PAYMENT-THANK YOU",73,"credit","Credit Card Payment","Citi CC",{"$f":"VLOOKUP(TestTable[[#This Row],[Category]],Table11[],2,FALSE)","v":"Debt"}]
["2010-03-31","Monthly Interest Paid","Monthly Interest Paid",0.02,"credit","Interest Income","ING Checking",{"$f":"VLOOKUP(TestTable[[#This Row],[Category]],Table11[],2,FALSE)","v":"Misc"}]
["2010-03-31","Periodic Finance Charge","Finance Charge Paid for Overdraft",-0.06,"debit","Finance Charge","ING Checking",{"$f":"VLOOKUP(TestTable[[#This Row],[Category]],Table11[],2,FALSE)","v":"Misc"}]
["2010-03-31","Monthly Interest Paid","Monthly Interest Paid",0.02,"credit","Interest Income","ING Savings",{"$f":"VLOOKUP(TestTable[[#This Row],[Category]],Table11[],2,FALSE)","v":"Misc"}]
["2010-03-31","Brigham Young University","BRIGHAM YOUNG UNIV WEB PROVO        UT",-5,"debit","Education","B of A CC",{"$f":"VLOOKUP(TestTable[[#This Row],[Category]],Table11[],2,FALSE)","v":"Misc"}]
["2010-03-31","Hawaiian Bbq","HAWAIIAN BBQ 000000163 PROVO        UT",-10.1,"debit","Restaurants","B of A CC",{"$f":"VLOOKUP(TestTable[[#This Row],[Category]],Table11[],2,FALSE)","v":"Food"}]
["2010-03-31","Pmt Bill Payer","PMT FROM BILL PAYER SERVICE",15,"credit","Credit Card Payment","B of A CC",{"$f":"VLOOKUP(TestTable[[#This Row],[Category]],Table11[],2,FALSE)","v":"Debt"}]
["2010-03-31","Byu Marketplace","BYU MARKETPLACE 301010 PROVO        UT",-1.72,"debit","Groceries","B of A CC",{"$f":"VLOOKUP(TestTable[[#This Row],[Category]],Table11[],2,FALSE)","v":"Food"}]
["2010-03-30","Provo City Utilities","Debit Card Purchase - PROVO CITY UTILITIES PROVO UT",-106.78,"debit","Utilities","ING Checking",{"$f":"VLOOKUP(TestTable[[#This Row],[Category]],Table11[],2,FALSE)","v":"Utilities"}]
["2010-03-30","Byu Marketplace","BYU MARKETPLACE 301010 PROVO        UT",-2.14,"debit","Groceries","B of A CC",{"$f":"VLOOKUP(TestTable[[#This Row],[Category]],Table11[],2,FALSE)","v":"Food"}]
["2010-03-29","Cinemark 10","Debit Card Purchase - CINEMARK 1041 Q34 OREM UT",-11.25,"debit","Movies & DVDs","ING Checking",{"$f":"VLOOKUP(TestTable[[#This Row],[Category]],Table11[],2,FALSE)","v":"Misc"}]
["2010-03-29","Internet Deposit Mountain","Internet Deposit MOUNTAIN AMERICA FCU checking account XXXXXXXX1875",200,"credit","Income","ING Checking",{"$f":"VLOOKUP(TestTable[[#This Row],[Category]],Table11[],2,FALSE)","v":"income"}]
["2010-03-29","Provo City Library","PROVO CITY LIBRARY PRO PROVO        UT",-8.6,"debit","Books & Supplies","B of A CC",{"$f":"VLOOKUP(TestTable[[#This Row],[Category]],Table11[],2,FALSE)","v":"Misc"}]
["2010-03-29","Scout Com Wa","SCOUT.COM              888-979-0979 WA",-9.9499999999999993,"debit","Uncategorized","B of A CC",{"$f":"VLOOKUP(TestTable[[#This Row],[Category]],Table11[],2,FALSE)","v":"Misc"}]
["2010-03-28","Net Works","Debit Card Purchase - BROADWEAVE NETWORKS IN 801 8783200 UT",-47.98,"debit","Business Services","ING Checking",{"$f":"VLOOKUP(TestTable[[#This Row],[Category]],Table11[],2,FALSE)","v":"Misc"}]
["2010-03-27","Maverik Country Store","MAVERIK COUNTRY STORE3 OREM         UT",-2.77,"debit","Groceries","B of A CC",{"$f":"VLOOKUP(TestTable[[#This Row],[Category]],Table11[],2,FALSE)","v":"Food"}]
["2010-03-27","Five Guys Ut","FIVE GUYS--UT # 04 542 OREM         UT",-11.08,"debit","Uncategorized","B of A CC",{"$f":"VLOOKUP(TestTable[[#This Row],[Category]],Table11[],2,FALSE)","v":"Misc"}]
["2010-03-26","Consumer Reports","CR *CONSUMERREPORTS.OR 8003330663 NY",-5.95,"debit","Books","Citi CC",{"$f":"VLOOKUP(TestTable[[#This Row],[Category]],Table11[],2,FALSE)","v":"Misc"}]
["2010-03-26","GameStop","GAMESTOP #201 00000020 OREM         UT",-138.86000000000001,"debit","Electronics & Software","B of A CC",{"$f":"VLOOKUP(TestTable[[#This Row],[Category]],Table11[],2,FALSE)","v":"Misc"}]
["2010-03-26","Byu Wsc Sugar","BYU WSC SUGAR & SPICE  PROVO        UT",-2.04,"debit","Uncategorized","B of A CC",{"$f":"VLOOKUP(TestTable[[#This Row],[Category]],Table11[],2,FALSE)","v":"Misc"}]
["2010-03-26","Byu Wsc L","BYU WSC L&T PRODUCE 30 PROVO        UT",-5.7,"debit","Groceries","B of A CC",{"$f":"VLOOKUP(TestTable[[#This Row],[Category]],Table11[],2,FALSE)","v":"Food"}]
["2010-03-25","Chevron","CHEVRON PWI #950-PROVO PROVO        UT",-8.35,"debit","Gas & Fuel","B of A CC",{"$f":"VLOOKUP(TestTable[[#This Row],[Category]],Table11[],2,FALSE)","v":"Auto"}]
["2010-03-24","Gas N Go","GAS N GO #2 10019016   PROVO        UT",-41.21,"debit","Service & Parts","B of A CC",{"$f":"VLOOKUP(TestTable[[#This Row],[Category]],Table11[],2,FALSE)","v":"Auto"}]
["2010-03-23","Wal-Mart","WAL-MART  2862         MERIDIAN     ID",-18.36,"debit","Shopping","B of A CC",{"$f":"VLOOKUP(TestTable[[#This Row],[Category]],Table11[],2,FALSE)","v":"Misc"}]
["2010-03-21","McDonald's","MCDONALD'S F23720 0000 MERIDIAN     ID",-2.64,"debit","Fast Food","B of A CC",{"$f":"VLOOKUP(TestTable[[#This Row],[Category]],Table11[],2,FALSE)","v":"Food"}]
["2010-03-21","McDonald's","MCDONALD'S F15710 0000 TREMONTON    UT",-7.36,"debit","Fast Food","B of A CC",{"$f":"VLOOKUP(TestTable[[#This Row],[Category]],Table11[],2,FALSE)","v":"Food"}]
["2010-03-21","Chevron","CHEVRON JACKSONS FOOD  MERIDIAN     ID",-37.46,"debit","Gas & Fuel","B of A CC",{"$f":"VLOOKUP(TestTable[[#This Row],[Category]],Table11[],2,FALSE)","v":"Auto"}]
["2010-03-21","Chevron","CHEVRON JACKSONS FOOD  MERIDIAN     ID",-7.7,"debit","Gas & Fuel","B of A CC",{"$f":"VLOOKUP(TestTable[[#This Row],[Category]],Table11[],2,FALSE)","v":"Auto"}]
["2010-03-21","Chevron","Debit Card Purchase - CHEVRON 0301414 TREMONTON UT",-13.09,"debit","Gas & Fuel","ING Checking",{"$f":"VLOOKUP(TestTable[[#This Row],[Category]],Table11[],2,FALSE)","v":"Auto"}]
["2010-03-20","Wal-Mart","WAL-MART  2862         MERIDIAN     ID",-15.27,"debit","Shopping","B of A CC",{"$f":"VLOOKUP(TestTable[[#This Row],[Category]],Table11[],2,FALSE)","v":"Misc"}]
["2010-03-19","Staples","Debit Card Purchase - STAPLES, INC. 13853 WEST CHINDEN BLV 0",-1.06,"debit","Office Supplies","ING Checking",{"$f":"VLOOKUP(TestTable[[#This Row],[Category]],Table11[],2,FALSE)","v":"Misc"}]
["2010-03-18","Steve Crest","STEVE'S CREST 00000000 PROVO        UT",-1.06,"debit","Uncategorized","B of A CC",{"$f":"VLOOKUP(TestTable[[#This Row],[Category]],Table11[],2,FALSE)","v":"Misc"}]
["2010-03-18","Kent's Market","KENT'S MARKET 00000000 TREMONTON    UT",-6.03,"debit","Groceries","B of A CC",{"$f":"VLOOKUP(TestTable[[#This Row],[Category]],Table11[],2,FALSE)","v":"Food"}]
["2010-03-18","Steve Crest","STEVE'S CREST 00000000 PROVO        UT",-37.450000000000003,"debit","Uncategorized","B of A CC",{"$f":"VLOOKUP(TestTable[[#This Row],[Category]],Table11[],2,FALSE)","v":"Misc"}]
["2010-03-18","Purchases Interest Charge","PURCHASES*INTEREST CHARGE*PERIODIC RATE",-12.71,"debit","Finance Charge","Citi CC",{"$f":"VLOOKUP(TestTable[[#This Row],[Category]],Table11[],2,FALSE)","v":"Misc"}]
["2010-03-18","Insta Care","Debit Card Purchase - PROVO INSTACARE PROVO UT",-3,"debit","Doctor","ING Checking",{"$f":"VLOOKUP(TestTable[[#This Row],[Category]],Table11[],2,FALSE)","v":"Medical"}]
["2010-03-17","Netflix","NETFLIX                LOS GATOS    CA",-14.88,"debit","Movies & DVDs","B of A CC",{"$f":"VLOOKUP(TestTable[[#This Row],[Category]],Table11[],2,FALSE)","v":"Misc"}]
["2010-03-17","Costco","COSTCO WHSE #0484 0000 OREM         UT",-13.88,"debit","Shopping","B of A CC",{"$f":"VLOOKUP(TestTable[[#This Row],[Category]],Table11[],2,FALSE)","v":"Misc"}]
["2010-03-17","Questar Gas","Electronic Withdrawal from Questar Gas Co. QGC",-91.59,"debit","Utilities","ING Checking",{"$f":"VLOOKUP(TestTable[[#This Row],[Category]],Table11[],2,FALSE)","v":"Utilities"}]
["2010-03-16","Gas N Go","GAS N GO #2 10019016   PROVO        UT",-10.039999999999999,"debit","Service & Parts","B of A CC",{"$f":"VLOOKUP(TestTable[[#This Row],[Category]],Table11[],2,FALSE)","v":"Auto"}]
["2010-03-15","Ross","ROSS STORES 751 751    OREM         UT",-9.61,"debit","Clothing","B of A CC",{"$f":"VLOOKUP(TestTable[[#This Row],[Category]],Table11[],2,FALSE)","v":"Misc"}]
["2010-03-15","Malt Shoppe","Debit Card Purchase - THE MALT SHOPPE QPS PROVO UT",-3.76,"debit","Restaurants","ING Checking",{"$f":"VLOOKUP(TestTable[[#This Row],[Category]],Table11[],2,FALSE)","v":"Food"}]
["2010-03-14","Rite Aid","RITE AID 6148 RITE AID PROVO        UT",-24.92,"debit","Pharmacy","B of A CC",{"$f":"VLOOKUP(TestTable[[#This Row],[Category]],Table11[],2,FALSE)","v":"Medical"}]
["2010-03-14","Gas N Go","GAS N GO #2 10019016   PROVO        UT",-6.24,"debit","Service & Parts","B of A CC",{"$f":"VLOOKUP(TestTable[[#This Row],[Category]],Table11[],2,FALSE)","v":"Auto"}]
["2010-03-13","ShopKo","SHOPKO        500868 5 PROVO        UT",-6.91,"debit","Shopping","B of A CC",{"$f":"VLOOKUP(TestTable[[#This Row],[Category]],Table11[],2,FALSE)","v":"Misc"}]
["2010-03-13","Batteries","BATTERIES PLUS #35 542 OREM         UT",-10.67,"debit","Electronics & Software","B of A CC",{"$f":"VLOOKUP(TestTable[[#This Row],[Category]],Table11[],2,FALSE)","v":"Misc"}]
["2010-03-13","Smith's Food","SMITHS FOOD #4136 0000 PROVO        UT",-24.93,"debit","Groceries","B of A CC",{"$f":"VLOOKUP(TestTable[[#This Row],[Category]],Table11[],2,FALSE)","v":"Food"}]
["2010-03-12","Costco","Debit Card Purchase - COSTCO WHSE #04 648 EAST 800 SOUTH",-19.22,"debit","Miscellaneous","ING Checking",{"$f":"VLOOKUP(TestTable[[#This Row],[Category]],Table11[],2,FALSE)","v":"Misc"}]
["2010-03-12","Liberty Mutual","Electronic Withdrawal from LIBERTY MUTUAL PAYMENT",-60.75,"debit","Auto Insurance","ING Checking",{"$f":"VLOOKUP(TestTable[[#This Row],[Category]],Table11[],2,FALSE)","v":"Auto"}]
["2010-03-12","Rite Aid","Debit Card Purchase - RITE AID CORP. RIVERSIDE PLAZA",-11.07,"debit","Pharmacy","ING Checking",{"$f":"VLOOKUP(TestTable[[#This Row],[Category]],Table11[],2,FALSE)","v":"Medical"}]
["2010-03-11","7-Eleven","7-ELEVEN 20028 0007200 PROVO        UT",-2.08,"debit","Fast Food","B of A CC",{"$f":"VLOOKUP(TestTable[[#This Row],[Category]],Table11[],2,FALSE)","v":"Food"}]
["2010-03-11","Byu Marketplace","BYU MARKETPLACE 301010 PROVO        UT",-1.72,"debit","Fast Food","B of A CC",{"$f":"VLOOKUP(TestTable[[#This Row],[Category]],Table11[],2,FALSE)","v":"Food"}]
["2010-03-11","Kid To Kid","KID TO KID PROVO UT",-15.99,"debit","Shopping","Citi CC",{"$f":"VLOOKUP(TestTable[[#This Row],[Category]],Table11[],2,FALSE)","v":"Misc"}]
["2010-03-11","Marketplace Cafe","Debit Card Purchase - MARKETPLACE CAFE PROVO UT",-1.07,"debit","Restaurants","ING Checking",{"$f":"VLOOKUP(TestTable[[#This Row],[Category]],Table11[],2,FALSE)","v":"Food"}]
["2010-03-09","Bed Bath & Beyond","BED BATH & BEYOND 292  OREM         UT",-16.02,"debit","Shopping","B of A CC",{"$f":"VLOOKUP(TestTable[[#This Row],[Category]],Table11[],2,FALSE)","v":"Misc"}]
["2010-03-09","eBay","EBAY INC. 08862858380 CA",-8.94,"debit","Shopping","Citi CC",{"$f":"VLOOKUP(TestTable[[#This Row],[Category]],Table11[],2,FALSE)","v":"Misc"}]
["2010-03-09","Amazon","Debit Card Purchase - AMAZON COM AMZN COM BIL WA",-9.98,"debit","Shopping","ING Checking",{"$f":"VLOOKUP(TestTable[[#This Row],[Category]],Table11[],2,FALSE)","v":"Misc"}]
["2010-03-09","Person Person Kelden","Person2Person Payment to Kelden Goulding",-40,"debit","Spa & Massage","ING Checking",{"$f":"VLOOKUP(TestTable[[#This Row],[Category]],Table11[],2,FALSE)","v":"Misc"}]
["2010-03-08","Utah Valley Hospital","UTAH VALLEY HOSPITAL U PROVO        UT",-25.44,"debit","Health & Fitness","B of A CC",{"$f":"VLOOKUP(TestTable[[#This Row],[Category]],Table11[],2,FALSE)","v":"Misc"}]
["2010-03-08","Internet Deposit Mountain","Internet Deposit MOUNTAIN AMERICA FCU checking account XXXXXXXX1875",50,"credit","Income","ING Checking",{"$f":"VLOOKUP(TestTable[[#This Row],[Category]],Table11[],2,FALSE)","v":"income"}]
["2010-03-08","Electronic Deposit Paypal","Electronic Deposit from PAYPAL TRANSFER",163.79,"credit","Transfer","ING Checking",{"$f":"VLOOKUP(TestTable[[#This Row],[Category]],Table11[],2,FALSE)","v":"Misc"}]
["2010-03-07","Marketplace Cafe","Debit Card Purchase - MARKETPLACE CAFE PROVO UT",-2.79,"debit","Restaurants","ING Checking",{"$f":"VLOOKUP(TestTable[[#This Row],[Category]],Table11[],2,FALSE)","v":"Food"}]
["2010-03-07","Marketplace Cafe","Debit Card Purchase - MARKETPLACE CAFE PROVO UT",-5.71,"debit","Restaurants","ING Checking",{"$f":"VLOOKUP(TestTable[[#This Row],[Category]],Table11[],2,FALSE)","v":"Food"}]
["2010-03-07","Transfer from ING Savings","Internet Deposit transferred from OSA XXXX3822",100,"credit","Transfer","ING Checking",{"$f":"VLOOKUP(TestTable[[#This Row],[Category]],Table11[],2,FALSE)","v":"Misc"}]
["2010-03-07","AT&T Wireless","Debit Card Purchase - ATTM xxxxxxxxxxxx3310500 GA",-177.22,"debit","Mobile Phone","ING Checking",{"$f":"VLOOKUP(TestTable[[#This Row],[Category]],Table11[],2,FALSE)","v":"Phone"}]
["2010-03-07","Transfer to Checking","Internet Withdrawal transferred to EO XXXX4669",-100,"debit","Transfer","ING Savings",{"$f":"VLOOKUP(TestTable[[#This Row],[Category]],Table11[],2,FALSE)","v":"Misc"}]
["2010-03-06","Target","Debit Card Purchase - TARGET T1754 OR 175 WEST CENTER STREET",-7.3,"debit","Miscellaneous","ING Checking",{"$f":"VLOOKUP(TestTable[[#This Row],[Category]],Table11[],2,FALSE)","v":"Misc"}]
["2010-03-06","Smiths","Debit Card Purchase - SMITHS 45 SOUTH STATE 0000 ORE",-31.09,"debit","Groceries","ING Checking",{"$f":"VLOOKUP(TestTable[[#This Row],[Category]],Table11[],2,FALSE)","v":"Food"}]
["2010-03-05","Chevron","Debit Card Purchase - CHEVRON 0203586 PROVO UT",-34.22,"debit","Gas & Fuel","ING Checking",{"$f":"VLOOKUP(TestTable[[#This Row],[Category]],Table11[],2,FALSE)","v":"Auto"}]
["2010-03-05","McDonald's","Debit Card Purchase - MCDONALDS F10437 Q17 PROVO UT",-2.9,"debit","Fast Food","ING Checking",{"$f":"VLOOKUP(TestTable[[#This Row],[Category]],Table11[],2,FALSE)","v":"Food"}]
["2010-03-05","Rite Aid","Debit Card Purchase - RITE AID CORP. RIVERSIDE PLAZA",-28.14,"debit","Pharmacy","ING Checking",{"$f":"VLOOKUP(TestTable[[#This Row],[Category]],Table11[],2,FALSE)","v":"Medical"}]
["2010-03-04","Hawaiian Bbq","Debit Card Purchase - HAWAIIAN BBQ PROVO UT",-10.210000000000001,"debit","Restaurants","ING Checking",{"$f":"VLOOKUP(TestTable[[#This Row],[Category]],Table11[],2,FALSE)","v":"Food"}]
["2010-03-04","Gas N Go","Debit Card Purchase - GAS N GO 2 10019QPS PROVO UT",-6.17,"debit","Service & Parts","ING Checking",{"$f":"VLOOKUP(TestTable[[#This Row],[Category]],Table11[],2,FALSE)","v":"Auto"}]
["2010-03-04","Marketplace Cafe","Debit Card Purchase - MARKETPLACE CAFE PROVO UT",-1.92,"debit","Restaurants","ING Checking",{"$f":"VLOOKUP(TestTable[[#This Row],[Category]],Table11[],2,FALSE)","v":"Food"}]
["2010-03-03","Marketplace Cafe","Debit Card Purchase - MARKETPLACE CAFE PROVO UT",-3.86,"debit","Restaurants","ING Checking",{"$f":"VLOOKUP(TestTable[[#This Row],[Category]],Table11[],2,FALSE)","v":"Food"}]
["2010-03-03","Marketplace Cafe","Debit Card Purchase - MARKETPLACE CAFE PROVO UT",-1.07,"debit","Restaurants","ING Checking",{"$f":"VLOOKUP(TestTable[[#This Row],[Category]],Table11[],2,FALSE)","v":"Food"}]
["2010-03-03","Chevron","Debit Card Purchase - CHEVRON/BELL BR CHEVRON/BELL BROTHERS",-3.07,"debit","Gas & Fuel","ING Checking",{"$f":"VLOOKUP(TestTable[[#This Row],[Category]],Table11[],2,FALSE)","v":"Auto"}]
["2010-03-03","Maceys","Debit Card Purchase - MACEYS PROVO 1400 N STATE 00",-1.27,"debit","Groceries","ING Checking",{"$f":"VLOOKUP(TestTable[[#This Row],[Category]],Table11[],2,FALSE)","v":"Food"}]
["2010-03-02","PayPal","Electronic Withdrawal from PAYPAL INST XFER",-19,"debit","Shopping","ING Checking",{"$f":"VLOOKUP(TestTable[[#This Row],[Category]],Table11[],2,FALSE)","v":"Misc"}]
["2010-03-02","Provo City Utilities","Debit Card Purchase - PROVO CITY UTILITIES PROVO UT",-107.87,"debit","Utilities","ING Checking",{"$f":"VLOOKUP(TestTable[[#This Row],[Category]],Table11[],2,FALSE)","v":"Utilities"}]
["2010-03-02","Amazon","Debit Card Purchase - AMAZON MKTPLACE PMTS AMZN COM BIL WA",-6.85,"debit","Shopping","ING Checking",{"$f":"VLOOKUP(TestTable[[#This Row],[Category]],Table11[],2,FALSE)","v":"Misc"}]
["2010-03-02","Bk Amer Vi","Electronic Withdrawal from BK OF AMER VI/MC ONLINE PMT",-15,"debit","Credit Card Payment","ING Checking",{"$f":"VLOOKUP(TestTable[[#This Row],[Category]],Table11[],2,FALSE)","v":"Debt"}]
["2010-03-02","Interest Charged Purchases","Interest Charged on Purchases",-6.4,"debit","Finance Charge","B of A CC",{"$f":"VLOOKUP(TestTable[[#This Row],[Category]],Table11[],2,FALSE)","v":"Misc"}]
["2010-03-01","Amazon","Debit Card Purchase - AMAZON COM AMZN COM BIL WA",-31,"debit","Shopping","ING Checking",{"$f":"VLOOKUP(TestTable[[#This Row],[Category]],Table11[],2,FALSE)","v":"Misc"}]
["2010-03-01","Citi Online","Electronic Withdrawal from CITI CARD ONLINE PAYMENT",-74,"debit","Credit Card Payment","ING Checking",{"$f":"VLOOKUP(TestTable[[#This Row],[Category]],Table11[],2,FALSE)","v":"Debt"}]
["2010-03-01","Net Works","Debit Card Purchase - BROADWEAVE NETWORKS IN 801 8783200 UT",-37.97,"debit","Business Services","ING Checking",{"$f":"VLOOKUP(TestTable[[#This Row],[Category]],Table11[],2,FALSE)","v":"Misc"}]
["2010-02-28","Rite Aid","Debit Card Purchase - RITE AID CORP. RIVERSIDE PLAZA",-13,"debit","Pharmacy","ING Checking",{"$f":"VLOOKUP(TestTable[[#This Row],[Category]],Table11[],2,FALSE)","v":"Medical"}]
["2010-02-28","Monthly Interest Paid","Monthly Interest Paid",0.08,"credit","Interest Income","ING Checking",{"$f":"VLOOKUP(TestTable[[#This Row],[Category]],Table11[],2,FALSE)","v":"Misc"}]
["2010-02-28","Marketplace Cafe","Debit Card Purchase - MARKETPLACE CAFE PROVO UT",-1.07,"debit","Restaurants","ING Checking",{"$f":"VLOOKUP(TestTable[[#This Row],[Category]],Table11[],2,FALSE)","v":"Food"}]
["2010-02-28","Monthly Interest Paid","Monthly Interest Paid",0.49,"credit","Interest Income","ING Savings",{"$f":"VLOOKUP(TestTable[[#This Row],[Category]],Table11[],2,FALSE)","v":"Misc"}]
["2010-02-27","Transfer from Checking","CLICK-TO-PAY PAYMENT, THANK YOU",74,"credit","Credit Card Payment","Citi CC",{"$f":"VLOOKUP(TestTable[[#This Row],[Category]],Table11[],2,FALSE)","v":"Debt"}]
["2010-02-27","Transfer from Checking","BA ELECTRONIC PAYMENT",15,"credit","Credit Card Payment","B of A CC",{"$f":"VLOOKUP(TestTable[[#This Row],[Category]],Table11[],2,FALSE)","v":"Debt"}]
["2010-02-27","Lowe's","Debit Card Purchase - LOWE'S #178 140 W UNIVERSITY PKWY 000",-31.35,"debit","Home Improvement","ING Checking",{"$f":"VLOOKUP(TestTable[[#This Row],[Category]],Table11[],2,FALSE)","v":"Misc"}]
["2010-02-26","Consumer Reports","CR *CONSUMERREPORTS.OR 8003330663 NY",-5.95,"debit","Books","Citi CC",{"$f":"VLOOKUP(TestTable[[#This Row],[Category]],Table11[],2,FALSE)","v":"Misc"}]
["2010-02-25","Marketplace Cafe","Debit Card Purchase - MARKETPLACE CAFE PROVO UT",-1.07,"debit","Restaurants","ING Checking",{"$f":"VLOOKUP(TestTable[[#This Row],[Category]],Table11[],2,FALSE)","v":"Food"}]
["2010-02-25","UPS","Debit Card Purchase - THE UPS STORE 5266 PROUD UT",-16.559999999999999,"debit","Shipping","ING Checking",{"$f":"VLOOKUP(TestTable[[#This Row],[Category]],Table11[],2,FALSE)","v":"Misc"}]
["2010-02-25","Electronic Deposit Paypal","Electronic Deposit from PAYPAL TRANSFER",157.99,"credit","Transfer","ING Checking",{"$f":"VLOOKUP(TestTable[[#This Row],[Category]],Table11[],2,FALSE)","v":"Misc"}]
["2010-02-24","Byu Creamery Fountain","Debit Card Purchase - BYU CREAMERY FOUNTAIN PROVO UT",-6.63,"debit","Uncategorized","ING Checking",{"$f":"VLOOKUP(TestTable[[#This Row],[Category]],Table11[],2,FALSE)","v":"Misc"}]
["2010-02-23","Shutterfly","Debit Card Purchase - SFI PHOTOSBYSHUTTERFLY 800 986 1065 CA",-2.0499999999999998,"debit","Hobbies","ING Checking",{"$f":"VLOOKUP(TestTable[[#This Row],[Category]],Table11[],2,FALSE)","v":"Misc"}]
["2010-02-22","Byu Creamery Fountain","Debit Card Purchase - BYU CREAMERY FOUNTAIN PROVO UT",-4.82,"debit","Uncategorized","ING Checking",{"$f":"VLOOKUP(TestTable[[#This Row],[Category]],Table11[],2,FALSE)","v":"Misc"}]
["2010-02-22","Malt Shoppe","Debit Card Purchase - THE MALT SHOPPE QPS PROVO UT",-11.17,"debit","Restaurants","ING Checking",{"$f":"VLOOKUP(TestTable[[#This Row],[Category]],Table11[],2,FALSE)","v":"Food"}]
["2010-02-21","Marketplace Cafe","Debit Card Purchase - MARKETPLACE CAFE PROVO UT",-1.07,"debit","Restaurants","ING Checking",{"$f":"VLOOKUP(TestTable[[#This Row],[Category]],Table11[],2,FALSE)","v":"Food"}]
["2010-02-20","Costco","Debit Card Purchase - COSTCO WHSE #04 648 EAST 800 SOUTH",-38.46,"debit","Miscellaneous","ING Checking",{"$f":"VLOOKUP(TestTable[[#This Row],[Category]],Table11[],2,FALSE)","v":"Misc"}]
["2010-02-18","Marketplace Cafe","Debit Card Purchase - MARKETPLACE CAFE PROVO UT",-2.99,"debit","Restaurants","ING Checking",{"$f":"VLOOKUP(TestTable[[#This Row],[Category]],Table11[],2,FALSE)","v":"Food"}]
["2010-02-18","Byu Signature Web","Debit Card Purchase - BYU SIGNATURE CRD WEB 08014223867 UT",-10,"debit","Uncategorized","ING Checking",{"$f":"VLOOKUP(TestTable[[#This Row],[Category]],Table11[],2,FALSE)","v":"Misc"}]
["2010-02-18","Questar Gas","Electronic Withdrawal from Questar Gas Co. QGC",-113.28,"debit","Utilities","ING Checking",{"$f":"VLOOKUP(TestTable[[#This Row],[Category]],Table11[],2,FALSE)","v":"Utilities"}]
["2010-02-18","Teamfanshop Com Fl","Debit Card Purchase - TEAMFANSHOP COM 866 687 3305 FL",-1.94,"debit","Uncategorized","ING Checking",{"$f":"VLOOKUP(TestTable[[#This Row],[Category]],Table11[],2,FALSE)","v":"Misc"}]
["2010-02-17","Foreign Fee","FOREIGN TRANSACTION FEE",-20.89,"debit","Service Fee","Citi CC",{"$f":"VLOOKUP(TestTable[[#This Row],[Category]],Table11[],2,FALSE)","v":"Misc"}]
["2010-02-17","Purchases Interest Charge","PURCHASES*INTEREST CHARGE*PERIODIC RATE",-12.35,"debit","Finance Charge","Citi CC",{"$f":"VLOOKUP(TestTable[[#This Row],[Category]],Table11[],2,FALSE)","v":"Misc"}]
["2010-02-16","Chili's","Debit Card Purchase - CHILI S GRI90900009092 OREM UT",-2,"debit","Restaurants","ING Checking",{"$f":"VLOOKUP(TestTable[[#This Row],[Category]],Table11[],2,FALSE)","v":"Food"}]
["2010-02-16","Electronic Deposit Paypal","Electronic Deposit from PAYPAL TRANSFER",458.57,"credit","Transfer","ING Checking",{"$f":"VLOOKUP(TestTable[[#This Row],[Category]],Table11[],2,FALSE)","v":"Misc"}]
["2010-02-14","Harmons Grocery","Debit Card Purchase - HARMONS GROCERY 870 E 800 N",-10.67,"debit","Groceries","ING Checking",{"$f":"VLOOKUP(TestTable[[#This Row],[Category]],Table11[],2,FALSE)","v":"Food"}]
["2010-02-13","Lds Orem Center","Debit Card Purchase - LDS OREM CENTER 232 E UNIVERSITY PKWY",-3,"debit","Uncategorized","ING Checking",{"$f":"VLOOKUP(TestTable[[#This Row],[Category]],Table11[],2,FALSE)","v":"Misc"}]
["2010-02-13","Costco","Debit Card Purchase - COSTCO WHSE #04 648 EAST 800 SOUTH",-10.78,"debit","Miscellaneous","ING Checking",{"$f":"VLOOKUP(TestTable[[#This Row],[Category]],Table11[],2,FALSE)","v":"Misc"}]
["2010-02-12","Land's End","LEI*LANDS END CLOTHING 8003324700 WI",55.65,"credit","Clothing","Citi CC",{"$f":"VLOOKUP(TestTable[[#This Row],[Category]],Table11[],2,FALSE)","v":"Misc"}]
["2010-02-12","Maverik Country Store","Debit Card Purchase - MAVERIK COUNTRY 307 S 700 E",-1.43,"debit","Groceries","ING Checking",{"$f":"VLOOKUP(TestTable[[#This Row],[Category]],Table11[],2,FALSE)","v":"Food"}]
["2010-02-12","Liberty Mutual","Electronic Withdrawal from LIBERTY MUTUAL PAYMENT",-60.75,"debit","Auto Insurance","ING Checking",{"$f":"VLOOKUP(TestTable[[#This Row],[Category]],Table11[],2,FALSE)","v":"Auto"}]
["2010-02-11","Byu Creamery Fountain","Debit Card Purchase - BYU CREAMERY FOUNTAIN PROVO UT",-6.63,"debit","Uncategorized","ING Checking",{"$f":"VLOOKUP(TestTable[[#This Row],[Category]],Table11[],2,FALSE)","v":"Misc"}]
["2010-02-10","eBay","EBAY INC. 08862858380 CA",-6.99,"debit","Shopping","Citi CC",{"$f":"VLOOKUP(TestTable[[#This Row],[Category]],Table11[],2,FALSE)","v":"Misc"}]
["2010-02-10","J Dawgs","Debit Card Purchase - J DAWGS RESTAURANTS LL PROVO UT",-8,"debit","Restaurants","ING Checking",{"$f":"VLOOKUP(TestTable[[#This Row],[Category]],Table11[],2,FALSE)","v":"Food"}]
["2010-02-10","J Dawgs","Debit Card Purchase - J DAWGS RESTAURANTS LL PROVO UT",-2,"debit","Restaurants","ING Checking",{"$f":"VLOOKUP(TestTable[[#This Row],[Category]],Table11[],2,FALSE)","v":"Food"}]
["2010-02-10","ATM Withdrawal","ATM Withdrawal - CT 7-11 PROVO, UT US",-80,"debit","Cash & ATM","ING Checking",{"$f":"VLOOKUP(TestTable[[#This Row],[Category]],Table11[],2,FALSE)","v":"Misc"}]
["2010-02-09","Rick's Muffler","Debit Card Purchase - RICK'S MUFFLER 227 W 990 N",-80.08,"debit","Auto & Transport","ING Checking",{"$f":"VLOOKUP(TestTable[[#This Row],[Category]],Table11[],2,FALSE)","v":"Auto"}]
["2010-02-09","United","Debit Card Purchase - UNITED BURBANK CA",-25,"debit","Air Travel","ING Checking",{"$f":"VLOOKUP(TestTable[[#This Row],[Category]],Table11[],2,FALSE)","v":"Misc"}]
["2010-02-08","Byu Marketplace","BYU MARKETPLACE 301010 PROVO        UT",-2.79,"debit","Groceries","B of A CC",{"$f":"VLOOKUP(TestTable[[#This Row],[Category]],Table11[],2,FALSE)","v":"Food"}]
["2010-02-08","Chevron","Debit Card Purchase - CHEVRON 0072863 OREM UT",-36.729999999999997,"debit","Gas & Fuel","ING Checking",{"$f":"VLOOKUP(TestTable[[#This Row],[Category]],Table11[],2,FALSE)","v":"Auto"}]
["2010-02-08","Paradies San Fra","Debit Card Purchase - PARADIES 9415 SAN FRA SAN FRANCISC CA",-10.23,"debit","Uncategorized","ING Checking",{"$f":"VLOOKUP(TestTable[[#This Row],[Category]],Table11[],2,FALSE)","v":"Misc"}]
["2010-02-08","Burbank Airpt Food","Debit Card Purchase - BURBANK AIRPT FOOD B BURBANK CA",-22.27,"debit","Food & Dining","ING Checking",{"$f":"VLOOKUP(TestTable[[#This Row],[Category]],Table11[],2,FALSE)","v":"Food"}]
["2010-02-07","Quiznos","Debit Card Purchase - QUIZNOS LOW E 30554QPS SALT LAKECIT UT",-4.2,"debit","Fast Food","ING Checking",{"$f":"VLOOKUP(TestTable[[#This Row],[Category]],Table11[],2,FALSE)","v":"Food"}]
["2010-02-07","Delta","Debit Card Purchase - DELTA SALT LAKE CT UT",-25,"debit","Air Travel","ING Checking",{"$f":"VLOOKUP(TestTable[[#This Row],[Category]],Table11[],2,FALSE)","v":"Misc"}]
["2010-02-06","Chevron","Debit Card Purchase - CHEVRON/TOP STO CHEVRON/TOP STOP C-53",-1.53,"debit","Gas & Fuel","ING Checking",{"$f":"VLOOKUP(TestTable[[#This Row],[Category]],Table11[],2,FALSE)","v":"Auto"}]
["2010-02-05","Shakers","Debit Card Purchase - SHAKERS GLENDALE GLENDALE CA",-11.91,"debit","Food & Dining","ING Checking",{"$f":"VLOOKUP(TestTable[[#This Row],[Category]],Table11[],2,FALSE)","v":"Food"}]
["2010-02-05","AT&T Wireless","Debit Card Purchase - ATTM xxxxxxxxxxxx3310500 GA",-121.08,"debit","Mobile Phone","ING Checking",{"$f":"VLOOKUP(TestTable[[#This Row],[Category]],Table11[],2,FALSE)","v":"Phone"}]
["2010-02-04","Netflix","NETFLIX                LOS GATOS    CA",-9.5500000000000007,"debit","Movies & DVDs","B of A CC",{"$f":"VLOOKUP(TestTable[[#This Row],[Category]],Table11[],2,FALSE)","v":"Misc"}]
["2010-02-04","Rite Aid","Debit Card Purchase - RITE AID CORP. RIVERSIDE PLAZA",-20,"debit","Cash & ATM","ING Checking",{"$f":"VLOOKUP(TestTable[[#This Row],[Category]],Table11[],2,FALSE)","v":"Misc"}]
["2010-02-04","Rite Aid","Debit Card Purchase - RITE AID CORP. RIVERSIDE PLAZA",-5.54,"debit","Personal Care","ING Checking",{"$f":"VLOOKUP(TestTable[[#This Row],[Category]],Table11[],2,FALSE)","v":"Misc"}]
["2010-02-04","Transfer from ING Savings","Internet Deposit transferred from OSA XXXX3822",3872.42,"credit","Transfer","ING Checking",{"$f":"VLOOKUP(TestTable[[#This Row],[Category]],Table11[],2,FALSE)","v":"Misc"}]
["2010-02-04","Person Person Laura","Person2Person Payment to Laura or Clayne Larsen",-3205,"debit","Mortgage & Rent","ING Checking",{"$f":"VLOOKUP(TestTable[[#This Row],[Category]],Table11[],2,FALSE)","v":"Housing"}]
["2010-02-04","Transfer to Checking","Internet Withdrawal transferred to EO XXXX4669",-3872.42,"debit","Transfer","ING Savings",{"$f":"VLOOKUP(TestTable[[#This Row],[Category]],Table11[],2,FALSE)","v":"Misc"}]
["2010-02-03","Amazon","Amazon.com AMZN.COM/BILL WA",-10.19,"debit","Shopping","Citi CC",{"$f":"VLOOKUP(TestTable[[#This Row],[Category]],Table11[],2,FALSE)","v":"Misc"}]
["2010-02-03","ATM Withdrawal","ATM Withdrawal - 1900 N CANYON RD PROVO, UT US",-31,"debit","Cash & ATM","ING Checking",{"$f":"VLOOKUP(TestTable[[#This Row],[Category]],Table11[],2,FALSE)","v":"Misc"}]
["2010-02-02","BYU Bookstore","BYU BOOKSTORE 29302066 PROVO        UT",-16,"debit","Books","B of A CC",{"$f":"VLOOKUP(TestTable[[#This Row],[Category]],Table11[],2,FALSE)","v":"Misc"}]
["2010-02-02","Byu Marketplace","BYU MARKETPLACE 301010 PROVO        UT",-2.14,"debit","Groceries","B of A CC",{"$f":"VLOOKUP(TestTable[[#This Row],[Category]],Table11[],2,FALSE)","v":"Food"}]
["2010-02-02","Person Person Tyler","Person2Person Payment to Tyler or Kindra McAllister",-22,"debit","Kids","ING Checking",{"$f":"VLOOKUP(TestTable[[#This Row],[Category]],Table11[],2,FALSE)","v":"Misc"}]
["2010-02-02","Rite Aid","Debit Card Purchase - RITE AID CORP. RIVERSIDE PLAZA",-23.32,"debit","Uncategorized","ING Checking",{"$f":"VLOOKUP(TestTable[[#This Row],[Category]],Table11[],2,FALSE)","v":"Misc"}]
["2010-02-02","Provo City Utilities","Debit Card Purchase - PROVO CITY UTILITIES PROVO UT",-125.59,"debit","Utilities","ING Checking",{"$f":"VLOOKUP(TestTable[[#This Row],[Category]],Table11[],2,FALSE)","v":"Utilities"}]
["2010-02-01","Marketplace Cafe","MARKETPLACE CAFE PROVO UT",-4.46,"debit","Restaurants","Citi CC",{"$f":"VLOOKUP(TestTable[[#This Row],[Category]],Table11[],2,FALSE)","v":"Food"}]
["2010-02-01","JCPenney","Electric Orange Card Adjustment (Credit) JCPENNEY STORE 2770 PROVO UT",15.89,"credit","Kids","ING Checking",{"$f":"VLOOKUP(TestTable[[#This Row],[Category]],Table11[],2,FALSE)","v":"Misc"}]
["2010-02-01","Chevron","Debit Card Purchase - CHEVRON 0072863 OREM UT",-35.92,"debit","Gas & Fuel","ING Checking",{"$f":"VLOOKUP(TestTable[[#This Row],[Category]],Table11[],2,FALSE)","v":"Auto"}]
["2010-02-01","UPS","Debit Card Purchase - THE UPS STORE 5266 PROUD UT",-12.7,"debit","Shipping","ING Checking",{"$f":"VLOOKUP(TestTable[[#This Row],[Category]],Table11[],2,FALSE)","v":"Misc"}]
["2010-02-01","Children's Place","Electric Orange Card Adjustment (Credit) THE CHILDRENS PLACE 0 OREM UT",10.86,"credit","Clothing","ING Checking",{"$f":"VLOOKUP(TestTable[[#This Row],[Category]],Table11[],2,FALSE)","v":"Misc"}]
["2010-02-01","Chevron","Debit Card Purchase - CHEVRON 0212224 MOUNTAIN HOM ID",-28.8,"debit","Gas & Fuel","ING Checking",{"$f":"VLOOKUP(TestTable[[#This Row],[Category]],Table11[],2,FALSE)","v":"Auto"}]
["2010-02-01","Love","Debit Card Purchase - LOVE S 534 HEYBURN ID",-8.18,"debit","Uncategorized","ING Checking",{"$f":"VLOOKUP(TestTable[[#This Row],[Category]],Table11[],2,FALSE)","v":"Misc"}]
["2010-01-31","Air France","AIR FRANCE ROISSY CH DE FRA",-75.7,"debit","Air Travel","Citi CC",{"$f":"VLOOKUP(TestTable[[#This Row],[Category]],Table11[],2,FALSE)","v":"Misc"}]
["2010-01-31","Busgate Z Rich","Busgate 110 Z rich CHE CHE,19.50 SWISS FRANC",-18.45,"debit","Uncategorized","Citi CC",{"$f":"VLOOKUP(TestTable[[#This Row],[Category]],Table11[],2,FALSE)","v":"Misc"}]
["2010-01-31","Renaissance Homes","RENAISSANCE HOTEL ZUER GLATTBRUGG CHE CHE,15.00 SWISS FRANC",-14.19,"debit","Home Improvement","Citi CC",{"$f":"VLOOKUP(TestTable[[#This Row],[Category]],Table11[],2,FALSE)","v":"Misc"}]
["2010-01-31","Periodic Finance Charge","Finance Charge Paid for Overdraft",-0.03,"debit","Finance Charge","ING Checking",{"$f":"VLOOKUP(TestTable[[#This Row],[Category]],Table11[],2,FALSE)","v":"Misc"}]
["2010-01-31","Monthly Interest Paid","Monthly Interest Paid",0.1,"credit","Interest Income","ING Checking",{"$f":"VLOOKUP(TestTable[[#This Row],[Category]],Table11[],2,FALSE)","v":"Misc"}]
["2010-01-31","Fresh Market Bo","Debit Card Purchase - FRESH MARKET BO 535 SOUTH 200 WEST",-13.12,"debit","Groceries","ING Checking",{"$f":"VLOOKUP(TestTable[[#This Row],[Category]],Table11[],2,FALSE)","v":"Food"}]
["2010-01-31","Monthly Interest Paid","Monthly Interest Paid",1.34,"credit","Interest Income","ING Holding",{"$f":"VLOOKUP(TestTable[[#This Row],[Category]],Table11[],2,FALSE)","v":"Misc"}]
["2010-01-31","Monthly Interest Paid","Monthly Interest Paid",3.5,"credit","Interest Income","ING Savings",{"$f":"VLOOKUP(TestTable[[#This Row],[Category]],Table11[],2,FALSE)","v":"Misc"}]
["2010-01-30","Coop Zh Hofwi","Coop-1417 ZH Hofwi Z rich CHE CHE,08.90 SWISS FRANC",-8.44,"debit","Uncategorized","Citi CC",{"$f":"VLOOKUP(TestTable[[#This Row],[Category]],Table11[],2,FALSE)","v":"Misc"}]
["2010-01-30","Merkur Confiserien Ag","MERKUR CONFISERIEN AG ZUERICH CHE CHE,06.25 SWISS FRANC",-5.93,"debit","Uncategorized","Citi CC",{"$f":"VLOOKUP(TestTable[[#This Row],[Category]],Table11[],2,FALSE)","v":"Misc"}]
["2010-01-30","Metzgerei Kauffmann Z","Metzgerei Kauffmann Z Z rich CHE CHE,15.50 SWISS FRANC",-14.71,"debit","Uncategorized","Citi CC",{"$f":"VLOOKUP(TestTable[[#This Row],[Category]],Table11[],2,FALSE)","v":"Misc"}]
["2010-01-30","C A Mode","C & A MODE AG Z rich CHE CHE,19.90 SWISS FRANC",-18.88,"debit","Uncategorized","Citi CC",{"$f":"VLOOKUP(TestTable[[#This Row],[Category]],Table11[],2,FALSE)","v":"Misc"}]
["2010-01-30","JCPenney","JCPENNEY STORE 2770 PROVO UT",22.82,"credit","Clothing","Citi CC",{"$f":"VLOOKUP(TestTable[[#This Row],[Category]],Table11[],2,FALSE)","v":"Misc"}]
["2010-01-30","Coop Zh Bahnh","Coop-1905 ZH Bahnh Z rich CHE CHE,03.25 SWISS FRANC",-3.08,"debit","Uncategorized","Citi CC",{"$f":"VLOOKUP(TestTable[[#This Row],[Category]],Table11[],2,FALSE)","v":"Misc"}]
["2010-01-30","Zuerich Hb Sbb","ZUERICH HB SBB ZUERICH CHE",-45.2,"debit","Uncategorized","Citi CC",{"$f":"VLOOKUP(TestTable[[#This Row],[Category]],Table11[],2,FALSE)","v":"Misc"}]
["2010-01-30","C A Mode","C & A MODE AG Z rich CHE CHE,49.90 SWISS FRANC",-47.34,"debit","Uncategorized","Citi CC",{"$f":"VLOOKUP(TestTable[[#This Row],[Category]],Table11[],2,FALSE)","v":"Misc"}]
["2010-01-30","iTunes","APL*ITUNES 866-712-7753 CA",-19.149999999999999,"debit","Music","Citi CC",{"$f":"VLOOKUP(TestTable[[#This Row],[Category]],Table11[],2,FALSE)","v":"Misc"}]
["2010-01-30","Cachet","Au Cachet Luzern CHE CHE,02.30 SWISS FRANC",-2.15,"debit","Business Services","Citi CC",{"$f":"VLOOKUP(TestTable[[#This Row],[Category]],Table11[],2,FALSE)","v":"Misc"}]
["2010-01-30","JCPenney","JCPENNEY STORE 2770 PROVO UT",-9.6,"debit","Clothing","Citi CC",{"$f":"VLOOKUP(TestTable[[#This Row],[Category]],Table11[],2,FALSE)","v":"Misc"}]
["2010-01-30","TJ Maxx","Debit Card Purchase - TJ TJ MAXX 0000 OREM, U",-13.88,"debit","Clothing","ING Checking",{"$f":"VLOOKUP(TestTable[[#This Row],[Category]],Table11[],2,FALSE)","v":"Misc"}]
["2010-01-30","Childrens P East","Debit Card Purchase - THE CHILDRENS P 575 EAST UNIVERSITY PK",-6.39,"debit","Kids","ING Checking",{"$f":"VLOOKUP(TestTable[[#This Row],[Category]],Table11[],2,FALSE)","v":"Misc"}]
["2010-01-29","Coop Baar Got","Coop-2244 Baar Got Baar CHE CHE,02.60 SWISS FRANC",-2.4700000000000002,"debit","Uncategorized","Citi CC",{"$f":"VLOOKUP(TestTable[[#This Row],[Category]],Table11[],2,FALSE)","v":"Misc"}]
["2010-01-29","McDonald's","McDonald's Restaurant Freienbach CHE CHE,02.00 SWISS FRANC",-1.89,"debit","Fast Food","Citi CC",{"$f":"VLOOKUP(TestTable[[#This Row],[Category]],Table11[],2,FALSE)","v":"Food"}]
["2010-01-29","Transfer to Amber","Electronic Withdrawal from CITI CARD ONLINE PAYMENT",-300,"debit","Credit Card Payment","ING Checking",{"$f":"VLOOKUP(TestTable[[#This Row],[Category]],Table11[],2,FALSE)","v":"Debt"}]
["2010-01-29","Chevron","Debit Card Purchase - CHEVRON/NICK WA CHEVRON/NICK WARLIA",-4.3099999999999996,"debit","Gas & Fuel","ING Checking",{"$f":"VLOOKUP(TestTable[[#This Row],[Category]],Table11[],2,FALSE)","v":"Auto"}]
["2010-01-28","Nestl Suisse Sa","Nestl Suisse SA Vevey CHE CHE,01.90 SWISS FRANC",-1.8,"debit","Travel","Citi CC",{"$f":"VLOOKUP(TestTable[[#This Row],[Category]],Table11[],2,FALSE)","v":"Misc"}]
["2010-01-28","Transfer from Checking","CLICK-TO-PAY PAYMENT, THANK YOU",300,"credit","Credit Card Payment","Citi CC",{"$f":"VLOOKUP(TestTable[[#This Row],[Category]],Table11[],2,FALSE)","v":"Debt"}]
["2010-01-28","Transfer from ING Savings","Internet Deposit transferred from OSA XXXX3822",300,"credit","Transfer","ING Checking",{"$f":"VLOOKUP(TestTable[[#This Row],[Category]],Table11[],2,FALSE)","v":"Misc"}]
["2010-01-28","Transfer to Checking","Internet Withdrawal transferred to EO XXXX4669",-300,"debit","Transfer","ING Savings",{"$f":"VLOOKUP(TestTable[[#This Row],[Category]],Table11[],2,FALSE)","v":"Misc"}]
["2010-01-27","Coop Ge Champ","Coop-1144 GE Champ Gen ve CHE CHE,22.00 SWISS FRANC",-20.98,"debit","Travel","Citi CC",{"$f":"VLOOKUP(TestTable[[#This Row],[Category]],Table11[],2,FALSE)","v":"Misc"}]
["2010-01-27","Coop Blandonnet Vernier","Coop-4261 Blandonnet Vernier CHE CHE,03.60 SWISS FRANC",-3.43,"debit","Travel","Citi CC",{"$f":"VLOOKUP(TestTable[[#This Row],[Category]],Table11[],2,FALSE)","v":"Misc"}]
["2010-01-26","Consumer Reports","CR *CONSUMERREPORTS.OR 8003330663 NY",-5.95,"debit","Books","Citi CC",{"$f":"VLOOKUP(TestTable[[#This Row],[Category]],Table11[],2,FALSE)","v":"Misc"}]
["2010-01-26","Tfl Tom Kilburn","TFL TOM KILBURN PARK GBR GBR,07.20 POUND STERLING",-11.61,"debit","Travel","Citi CC",{"$f":"VLOOKUP(TestTable[[#This Row],[Category]],Table11[],2,FALSE)","v":"Misc"}]
["2010-01-26","Formule Viry Fra","FORMULE 1 1166 VIRY FRA FRA,71.20 EURO",-99.9,"debit","Travel","Citi CC",{"$f":"VLOOKUP(TestTable[[#This Row],[Category]],Table11[],2,FALSE)","v":"Misc"}]
["2010-01-26","Masala Zone Fs","MASALA ZONE (FS) LONDON WC2E GBR GBR,12.00 POUND STERLING",-19.41,"debit","Travel","Citi CC",{"$f":"VLOOKUP(TestTable[[#This Row],[Category]],Table11[],2,FALSE)","v":"Misc"}]
["2010-01-26","Childrens P N","Debit Card Purchase - THE CHILDRENS P 350 N MILWAUKEE, STE #",-5.87,"debit","Kids","ING Checking",{"$f":"VLOOKUP(TestTable[[#This Row],[Category]],Table11[],2,FALSE)","v":"Misc"}]
["2010-01-26","Childrens P N","Debit Card Purchase - THE CHILDRENS P 350 N MILWAUKEE, STE #",-10,"debit","Gift","ING Checking",{"$f":"VLOOKUP(TestTable[[#This Row],[Category]],Table11[],2,FALSE)","v":"Misc"}]
["2010-01-26","JCPenney","Debit Card Purchase - JCPENNEY STORE 300 N MILWAUKEE ST",-15.42,"debit","Gift","ING Checking",{"$f":"VLOOKUP(TestTable[[#This Row],[Category]],Table11[],2,FALSE)","v":"Misc"}]
["2010-01-26","JCPenney","Debit Card Purchase - JCPENNEY STORE 300 N MILWAUKEE ST",-10,"debit","Kids","ING Checking",{"$f":"VLOOKUP(TestTable[[#This Row],[Category]],Table11[],2,FALSE)","v":"Misc"}]
["2010-01-26","Childrens P N","Debit Card Purchase - THE CHILDRENS P 350 N MILWAUKEE, STE #",-47.6,"debit","Kids","ING Checking",{"$f":"VLOOKUP(TestTable[[#This Row],[Category]],Table11[],2,FALSE)","v":"Misc"}]
["2010-01-26","Sephora","Debit Card Purchase - SEPHORA #142 BO 350 NORTH MILWAUKEE ST",-26.5,"debit","Personal Care","ING Checking",{"$f":"VLOOKUP(TestTable[[#This Row],[Category]],Table11[],2,FALSE)","v":"Misc"}]
["2010-01-25","Sunrise Food Stop","SUNRISE FOOD STOP LONDON NW6 GBR GBR,06.16 POUND STERLING",-9.92,"debit","Travel","Citi CC",{"$f":"VLOOKUP(TestTable[[#This Row],[Category]],Table11[],2,FALSE)","v":"Misc"}]
["2010-01-25","Delfont Mackintosh London","DELFONT MACKINTOSH LONDON GBR GBR,05.00 POUND STERLING",-8.06,"debit","Travel","Citi CC",{"$f":"VLOOKUP(TestTable[[#This Row],[Category]],Table11[],2,FALSE)","v":"Misc"}]
["2010-01-25","Tfl Tom Kilburn","TFL TOM KILBURN PARK GBR GBR,07.20 POUND STERLING",-11.58,"debit","Travel","Citi CC",{"$f":"VLOOKUP(TestTable[[#This Row],[Category]],Table11[],2,FALSE)","v":"Misc"}]
["2010-01-25","Westminster Abbey London","WESTMINSTER ABBEY LONDON SW1P GBR GBR,15.00 POUND STERLING",-24.19,"debit","Travel","Citi CC",{"$f":"VLOOKUP(TestTable[[#This Row],[Category]],Table11[],2,FALSE)","v":"Misc"}]
["2010-01-25","Knightsbridge","HARRODS KNIGHTSBRIDGE LONDON GBR",-6.56,"debit","Travel","Citi CC",{"$f":"VLOOKUP(TestTable[[#This Row],[Category]],Table11[],2,FALSE)","v":"Misc"}]
["2010-01-25","Children's Place","Debit Card Purchase - TCP CHILDRENSPLACE COM 877 PLACEUS NJ",-49.34,"debit","Clothing","ING Checking",{"$f":"VLOOKUP(TestTable[[#This Row],[Category]],Table11[],2,FALSE)","v":"Misc"}]
["2010-01-25","Chevron","Debit Card Purchase - CHEVRON 0073034 TWIN FALLS ID",-38.19,"debit","Gas & Fuel","ING Checking",{"$f":"VLOOKUP(TestTable[[#This Row],[Category]],Table11[],2,FALSE)","v":"Auto"}]
["2010-01-25","Transfer to Amber","Electronic Withdrawal from CITI CARD ONLINE PAYMENT",-1300,"debit","Credit Card Payment","ING Checking",{"$f":"VLOOKUP(TestTable[[#This Row],[Category]],Table11[],2,FALSE)","v":"Debt"}]
["2010-01-25","Flying J","Debit Card Purchase - FLYING J C STORE INSID WILLARD BAY UT",-5.69,"debit","Fast Food","ING Checking",{"$f":"VLOOKUP(TestTable[[#This Row],[Category]],Table11[],2,FALSE)","v":"Food"}]
["2010-01-25","Fridal Mountain View","Debit Card Purchase - FRIDAL MOUNTAIN VIEW80 MALTA ID",-7.37,"debit","Fast Food","ING Checking",{"$f":"VLOOKUP(TestTable[[#This Row],[Category]],Table11[],2,FALSE)","v":"Food"}]
["2010-01-24","Boots London Gbr","BOOTS 0873 LONDON GBR GBR,02.59 POUND STERLING",-4.18,"debit","Travel","Citi CC",{"$f":"VLOOKUP(TestTable[[#This Row],[Category]],Table11[],2,FALSE)","v":"Misc"}]
["2010-01-24","Wendy's","Debit Card Purchase - WENDYS 3540 Q25 OREM UT",-2.78,"debit","Fast Food","ING Checking",{"$f":"VLOOKUP(TestTable[[#This Row],[Category]],Table11[],2,FALSE)","v":"Food"}]
["2010-01-23","Sncf Paris Fra","SNCF PARIS 15 FRA FRA,05.90 EURO",-8.32,"debit","Travel","Citi CC",{"$f":"VLOOKUP(TestTable[[#This Row],[Category]],Table11[],2,FALSE)","v":"Misc"}]
["2010-01-23","Tfl Mfm Kings","TFL MFM KINGS CROSS GBR GBR,04.00 POUND STERLING",-6.43,"debit","Travel","Citi CC",{"$f":"VLOOKUP(TestTable[[#This Row],[Category]],Table11[],2,FALSE)","v":"Misc"}]
["2010-01-23","Villa","VILLA TOKYO PARIS 1 FRA FRA,06.50 EURO",-9.17,"debit","Travel","Citi CC",{"$f":"VLOOKUP(TestTable[[#This Row],[Category]],Table11[],2,FALSE)","v":"Misc"}]
["2010-01-23","Musee Orsay Paris","MUSEE ORSAY PARIS7 FRA FRA,09.50 EURO",-13.4,"debit","Travel","Citi CC",{"$f":"VLOOKUP(TestTable[[#This Row],[Category]],Table11[],2,FALSE)","v":"Misc"}]
["2010-01-23","Costco","COSTCO WHSE #0484 0000 OREM         UT",18.149999999999999,"credit","Miscellaneous","B of A CC",{"$f":"VLOOKUP(TestTable[[#This Row],[Category]],Table11[],2,FALSE)","v":"Misc"}]
["2010-01-22","Transfer from Checking","CLICK-TO-PAY PAYMENT, THANK YOU",1300,"credit","Credit Card Payment","Citi CC",{"$f":"VLOOKUP(TestTable[[#This Row],[Category]],Table11[],2,FALSE)","v":"Debt"}]
["2010-01-22","Transfer from ING Savings","Internet Deposit transferred from OSA XXXX3822",300,"credit","Transfer","ING Checking",{"$f":"VLOOKUP(TestTable[[#This Row],[Category]],Table11[],2,FALSE)","v":"Misc"}]
["2010-01-22","Transfer from ING Savings","Internet Deposit transferred from OSA XXXX3822",1000,"credit","Transfer","ING Checking",{"$f":"VLOOKUP(TestTable[[#This Row],[Category]],Table11[],2,FALSE)","v":"Misc"}]
["2010-01-22","Transfer from FREE CHECKING","Internet Deposit MOUNTAIN AMERICA FCU checking account XXXXXXXX1875",160,"credit","Transfer","ING Checking",{"$f":"VLOOKUP(TestTable[[#This Row],[Category]],Table11[],2,FALSE)","v":"Misc"}]
["2010-01-22","Transfer to Checking","Internet Withdrawal transferred to EO XXXX4669",-300,"debit","Transfer","ING Savings",{"$f":"VLOOKUP(TestTable[[#This Row],[Category]],Table11[],2,FALSE)","v":"Misc"}]
["2010-01-22","Transfer to Checking","Internet Withdrawal transferred to EO XXXX4669",-1000,"debit","Transfer","ING Savings",{"$f":"VLOOKUP(TestTable[[#This Row],[Category]],Table11[],2,FALSE)","v":"Misc"}]
["2010-01-21","As Du Fallafel","AS DU FALLAFEL PARIS 04 FRA FRA,50.00 EURO",-70.3,"debit","Travel","Citi CC",{"$f":"VLOOKUP(TestTable[[#This Row],[Category]],Table11[],2,FALSE)","v":"Misc"}]
["2010-01-21","Sncf Roissy C","SNCF ROISSY C D G FRA FRA,18.90 EURO",-26.57,"debit","Travel","Citi CC",{"$f":"VLOOKUP(TestTable[[#This Row],[Category]],Table11[],2,FALSE)","v":"Misc"}]
["2010-01-21","Celio Paris Fra","CELIO PARIS FRA FRA,89.94 EURO",-126.46,"debit","Travel","Citi CC",{"$f":"VLOOKUP(TestTable[[#This Row],[Category]],Table11[],2,FALSE)","v":"Misc"}]
["2010-01-21","Bert Rest Paris","BERT'S REST520 PARIS 08 FRA FRA,08.80 EURO",-12.37,"debit","Travel","Citi CC",{"$f":"VLOOKUP(TestTable[[#This Row],[Category]],Table11[],2,FALSE)","v":"Misc"}]
["2010-01-21","Fresh Market","Debit Card Purchase - FRESH MARKET UN 2255 NORTH UNIVERSITY",-17.579999999999998,"debit","Uncategorized","ING Checking",{"$f":"VLOOKUP(TestTable[[#This Row],[Category]],Table11[],2,FALSE)","v":"Misc"}]
["2010-01-21","Costco","Debit Card Purchase - COSTCO WHSE #04 648 EAST 800 SOUTH",-20.29,"debit","Baby Supplies","ING Checking",{"$f":"VLOOKUP(TestTable[[#This Row],[Category]],Table11[],2,FALSE)","v":"Misc"}]
["2010-01-20","Rite Aid","RITE AID STORE 6148Q05 PROVO UT",-31.58,"debit","Pharmacy","Citi CC",{"$f":"VLOOKUP(TestTable[[#This Row],[Category]],Table11[],2,FALSE)","v":"Medical"}]
["2010-01-20","Laundry Plus","LAUNDRY PLUS PROVO UT",-13.85,"debit","Laundry","Citi CC",{"$f":"VLOOKUP(TestTable[[#This Row],[Category]],Table11[],2,FALSE)","v":"Misc"}]
["2010-01-20","Gas N Go","GAS N GO #2 10019016 PROVO UT",-41.73,"debit","Groceries","Citi CC",{"$f":"VLOOKUP(TestTable[[#This Row],[Category]],Table11[],2,FALSE)","v":"Food"}]
["2010-01-20","Gas N Go","GAS N GO #2 10019QPS PROVO UT",-2.0499999999999998,"debit","Fast Food","Citi CC",{"$f":"VLOOKUP(TestTable[[#This Row],[Category]],Table11[],2,FALSE)","v":"Food"}]
["2010-01-20","Copy Center","BYU TNRB COPY CENTER PROVO UT",-0.75,"debit","Printing","Citi CC",{"$f":"VLOOKUP(TestTable[[#This Row],[Category]],Table11[],2,FALSE)","v":"Misc"}]
["2010-01-20","Burger King","MAIN BURGER KI30552QPS SALT LAKECITY UT",-12.15,"debit","Fast Food","Citi CC",{"$f":"VLOOKUP(TestTable[[#This Row],[Category]],Table11[],2,FALSE)","v":"Food"}]
["2010-01-20","Purchase Finance Charge","PURCHASES*FINANCE CHARGE*PERIODIC RATE",-14.59,"debit","Finance Charge","Citi CC",{"$f":"VLOOKUP(TestTable[[#This Row],[Category]],Table11[],2,FALSE)","v":"Misc"}]
["2010-01-19","Invisible Shield","INVISIBLE SHIELD OREM UT",-10,"debit","Uncategorized","Citi CC",{"$f":"VLOOKUP(TestTable[[#This Row],[Category]],Table11[],2,FALSE)","v":"Misc"}]
["2010-01-19","Five Guys Ut","FIVE GUYS--UT # 04 QAE OREM UT",-4.09,"debit","Uncategorized","Citi CC",{"$f":"VLOOKUP(TestTable[[#This Row],[Category]],Table11[],2,FALSE)","v":"Misc"}]
["2010-01-19","Priceline","PLN*PRICELINE.COM HTL 800-657-9168 CT",-192.12,"debit","Travel","Citi CC",{"$f":"VLOOKUP(TestTable[[#This Row],[Category]],Table11[],2,FALSE)","v":"Misc"}]
["2010-01-19","Costa","COSTA VIDA OF PROVOQPS PROVO UT",-11.83,"debit","Fast Food","Citi CC",{"$f":"VLOOKUP(TestTable[[#This Row],[Category]],Table11[],2,FALSE)","v":"Food"}]
["2010-01-19","Questar Gas","Electronic Withdrawal from Questar Gas Co. QGC",-68.400000000000006,"debit","Utilities","ING Checking",{"$f":"VLOOKUP(TestTable[[#This Row],[Category]],Table11[],2,FALSE)","v":"Utilities"}]
["2010-01-17","Priceline","PLN*PRICELINE.COM HTL 800-657-9168 CT",-170.29,"debit","Travel","Citi CC",{"$f":"VLOOKUP(TestTable[[#This Row],[Category]],Table11[],2,FALSE)","v":"Misc"}]
["2010-01-17","Holiday Oil","Debit Card Purchase - HOLIDAY OIL 49 MIDVALE UT",-10.199999999999999,"debit","Gas & Fuel","ING Checking",{"$f":"VLOOKUP(TestTable[[#This Row],[Category]],Table11[],2,FALSE)","v":"Auto"}]
["2010-01-16","Provo Di North","Debit Card Purchase - PROVO DI 1415 NORTH STATE ST 0000 P",-9,"debit","Uncategorized","ING Checking",{"$f":"VLOOKUP(TestTable[[#This Row],[Category]],Table11[],2,FALSE)","v":"Misc"}]
["2010-01-15","Insta Care","PROVO INSTACARE PROVO UT",-3,"debit","Doctor","Citi CC",{"$f":"VLOOKUP(TestTable[[#This Row],[Category]],Table11[],2,FALSE)","v":"Medical"}]
["2010-01-15","Rite Aid","RITE AID STORE 6148Q05 PROVO UT",-6,"debit","Pharmacy","Citi CC",{"$f":"VLOOKUP(TestTable[[#This Row],[Category]],Table11[],2,FALSE)","v":"Medical"}]
["2010-01-15","Childrens P East","Debit Card Purchase - THE CHILDRENS P 575 EAST UNIVERSITY PK",-19.760000000000002,"debit","Kids","ING Checking",{"$f":"VLOOKUP(TestTable[[#This Row],[Category]],Table11[],2,FALSE)","v":"Misc"}]
["2010-01-15","Carl's Jr","Debit Card Purchase - CARL S JR 1101363 QPS PROVO UT",-11.93,"debit","Fast Food","ING Checking",{"$f":"VLOOKUP(TestTable[[#This Row],[Category]],Table11[],2,FALSE)","v":"Food"}]
["2010-01-14","Byu Wsc L","BYU WSC L&T PRODUCE PROVO UT",-5.7,"debit","Fast Food","Citi CC",{"$f":"VLOOKUP(TestTable[[#This Row],[Category]],Table11[],2,FALSE)","v":"Food"}]
["2010-01-14","Marketplace Cafe","MARKETPLACE CAFE PROVO UT",-0.85,"debit","Restaurants","Citi CC",{"$f":"VLOOKUP(TestTable[[#This Row],[Category]],Table11[],2,FALSE)","v":"Food"}]
["2010-01-14","Marketplace Cafe","MARKETPLACE CAFE PROVO UT",-1.92,"debit","Restaurants","Citi CC",{"$f":"VLOOKUP(TestTable[[#This Row],[Category]],Table11[],2,FALSE)","v":"Food"}]
["2010-01-13","Marketplace Cafe","MARKETPLACE CAFE PROVO UT",-1.82,"debit","Restaurants","Citi CC",{"$f":"VLOOKUP(TestTable[[#This Row],[Category]],Table11[],2,FALSE)","v":"Food"}]
["2010-01-13","Land's End","LEI*LANDS END CLOTHING 8003324700 WI",55.7,"credit","Clothing","Citi CC",{"$f":"VLOOKUP(TestTable[[#This Row],[Category]],Table11[],2,FALSE)","v":"Misc"}]
["2010-01-13","Marketplace Cafe","MARKETPLACE CAFE PROVO UT",-8.17,"debit","Restaurants","Citi CC",{"$f":"VLOOKUP(TestTable[[#This Row],[Category]],Table11[],2,FALSE)","v":"Food"}]
["2010-01-13","Liberty Mutual","Electronic Withdrawal from LIBERTY MUTUAL PAYMENT",-60.75,"debit","Auto Insurance","ING Checking",{"$f":"VLOOKUP(TestTable[[#This Row],[Category]],Table11[],2,FALSE)","v":"Auto"}]
["2010-01-13","Wal-Mart","Debit Card Purchase - WAL-MART #1768 1355 S SANDHILL RD",-37.96,"debit","Shopping","ING Checking",{"$f":"VLOOKUP(TestTable[[#This Row],[Category]],Table11[],2,FALSE)","v":"Misc"}]
["2010-01-12","BYU Bookstore","BYU BOOKSTORE PROVO UT",-7.7,"debit","Books","Citi CC",{"$f":"VLOOKUP(TestTable[[#This Row],[Category]],Table11[],2,FALSE)","v":"Misc"}]
["2010-01-12","Marketplace Cafe","MARKETPLACE CAFE PROVO UT",-1.92,"debit","Restaurants","Citi CC",{"$f":"VLOOKUP(TestTable[[#This Row],[Category]],Table11[],2,FALSE)","v":"Food"}]
["2010-01-12","Transfer to Bank of America","Electronic Withdrawal from BK OF AMER VI/MC ONLINE PMT",-15,"debit","Credit Card Payment","ING Checking",{"$f":"VLOOKUP(TestTable[[#This Row],[Category]],Table11[],2,FALSE)","v":"Debt"}]
["2010-01-12","Transfer to Amber","Electronic Withdrawal from CITI CARD ONLINE PAYMENT",-46,"debit","Credit Card Payment","ING Checking",{"$f":"VLOOKUP(TestTable[[#This Row],[Category]],Table11[],2,FALSE)","v":"Debt"}]
["2010-01-12","Transfer to FREE CHECKING","Internet Withdrawal MOUNTAIN AMERICA FCU checking account XXXXXXXX1875",-180,"debit","Transfer","ING Holding",{"$f":"VLOOKUP(TestTable[[#This Row],[Category]],Table11[],2,FALSE)","v":"Misc"}]
["2010-01-11","Transfer from Checking","CLICK-TO-PAY PAYMENT, THANK YOU",46,"credit","Credit Card Payment","Citi CC",{"$f":"VLOOKUP(TestTable[[#This Row],[Category]],Table11[],2,FALSE)","v":"Debt"}]
["2010-01-11","Marketplace Cafe","MARKETPLACE CAFE PROVO UT",-1.71,"debit","Restaurants","Citi CC",{"$f":"VLOOKUP(TestTable[[#This Row],[Category]],Table11[],2,FALSE)","v":"Food"}]
["2010-01-11","Marketplace Cafe","MARKETPLACE CAFE PROVO UT",-1.07,"debit","Restaurants","Citi CC",{"$f":"VLOOKUP(TestTable[[#This Row],[Category]],Table11[],2,FALSE)","v":"Food"}]
["2010-01-11","Transfer from Checking","BA ELECTRONIC PAYMENT",15,"credit","Credit Card Payment","B of A CC",{"$f":"VLOOKUP(TestTable[[#This Row],[Category]],Table11[],2,FALSE)","v":"Debt"}]
["2010-01-11","Jo-Ann Stores","Debit Card Purchase - JOANN STORES, I 1666 S STATE ST",-18.649999999999999,"debit","Miscellaneous","ING Checking",{"$f":"VLOOKUP(TestTable[[#This Row],[Category]],Table11[],2,FALSE)","v":"Misc"}]
["2010-01-11","Transfer from ING Holding","Internet Deposit transferred from OSA XXXX4516",30,"credit","Transfer","ING Checking",{"$f":"VLOOKUP(TestTable[[#This Row],[Category]],Table11[],2,FALSE)","v":"Misc"}]
["2010-01-11","Transfer from ING Holding","Internet Deposit transferred from OSA XXXX4516",1856,"credit","Transfer","ING Checking",{"$f":"VLOOKUP(TestTable[[#This Row],[Category]],Table11[],2,FALSE)","v":"Misc"}]
["2010-01-11","Person Person Laura","Person2Person Payment to Laura or Clayne Larsen",-1075,"debit","Mortgage & Rent","ING Checking",{"$f":"VLOOKUP(TestTable[[#This Row],[Category]],Table11[],2,FALSE)","v":"Housing"}]
["2010-01-11","Transfer to Checking","Internet Withdrawal transferred to EO XXXX4669",-1856,"debit","Transfer","ING Holding",{"$f":"VLOOKUP(TestTable[[#This Row],[Category]],Table11[],2,FALSE)","v":"Misc"}]
["2010-01-11","Transfer to Checking","Internet Withdrawal transferred to EO XXXX4669",-30,"debit","Transfer","ING Holding",{"$f":"VLOOKUP(TestTable[[#This Row],[Category]],Table11[],2,FALSE)","v":"Misc"}]
["2010-01-11","Transfer to ING Savings","Internet Withdrawal transferred to OSA XXXX3822",-5568,"debit","Transfer","ING Holding",{"$f":"VLOOKUP(TestTable[[#This Row],[Category]],Table11[],2,FALSE)","v":"Misc"}]
["2010-01-11","Transfer from ING Holding","Internet Deposit transferred from OSA XXXX4516",5568,"credit","Transfer","ING Savings",{"$f":"VLOOKUP(TestTable[[#This Row],[Category]],Table11[],2,FALSE)","v":"Misc"}]
["2010-01-09","eBay","EBAY INC. 08862858380 CA",-22.3,"debit","Shopping","Citi CC",{"$f":"VLOOKUP(TestTable[[#This Row],[Category]],Table11[],2,FALSE)","v":"Misc"}]
["2010-01-08","Subway","SUBWAY 00024QPS PROVO UT",-12.12,"debit","Fast Food","Citi CC",{"$f":"VLOOKUP(TestTable[[#This Row],[Category]],Table11[],2,FALSE)","v":"Food"}]
["2010-01-08","iTunes","APL*ITUNES 866-712-7753 CA",-7.47,"debit","Music","Citi CC",{"$f":"VLOOKUP(TestTable[[#This Row],[Category]],Table11[],2,FALSE)","v":"Misc"}]
["2010-01-08","Land's End","LEI*LANDS END CLOTHING 8003324700 WI",-55.65,"debit","Clothing","Citi CC",{"$f":"VLOOKUP(TestTable[[#This Row],[Category]],Table11[],2,FALSE)","v":"Misc"}]
["2010-01-08","BYU Bookstore","BYU BOOKSTORE PROVO UT",196.7,"credit","Books","Citi CC",{"$f":"VLOOKUP(TestTable[[#This Row],[Category]],Table11[],2,FALSE)","v":"Misc"}]
["2010-01-08","Costco","Debit Card Purchase - COSTCO WHSE #04 648 EAST 800 SOUTH",-40.19,"debit","Uncategorized","ING Checking",{"$f":"VLOOKUP(TestTable[[#This Row],[Category]],Table11[],2,FALSE)","v":"Misc"}]
["2010-01-07","Marketplace Cafe","MARKETPLACE CAFE PROVO UT",-2.4700000000000002,"debit","Restaurants","Citi CC",{"$f":"VLOOKUP(TestTable[[#This Row],[Category]],Table11[],2,FALSE)","v":"Food"}]
["2010-01-07","Marketplace Cafe","MARKETPLACE CAFE PROVO UT",-2.14,"debit","Restaurants","Citi CC",{"$f":"VLOOKUP(TestTable[[#This Row],[Category]],Table11[],2,FALSE)","v":"Food"}]
["2010-01-06","Amazon","Amazon.com AMZN.COM/BILL WA",58.99,"credit","Shopping","Citi CC",{"$f":"VLOOKUP(TestTable[[#This Row],[Category]],Table11[],2,FALSE)","v":"Misc"}]
["2010-01-06","Amazon","AMAZON MKTPLACE PMTS AMZN.COM/BILL WA",-22.87,"debit","Shopping","Citi CC",{"$f":"VLOOKUP(TestTable[[#This Row],[Category]],Table11[],2,FALSE)","v":"Misc"}]
["2010-01-06","Tomasso Italian Ice","TOMASSO'S ITALIAN ICE PROVO UT",-5.65,"debit","Restaurants","Citi CC",{"$f":"VLOOKUP(TestTable[[#This Row],[Category]],Table11[],2,FALSE)","v":"Food"}]
["2010-01-06","Marketplace Cafe","MARKETPLACE CAFE PROVO UT",-6.45,"debit","Restaurants","Citi CC",{"$f":"VLOOKUP(TestTable[[#This Row],[Category]],Table11[],2,FALSE)","v":"Food"}]
["2010-01-06","UPS","THE UPS STORE #5266 PROUD UT",-0.03,"debit","Shipping","Citi CC",{"$f":"VLOOKUP(TestTable[[#This Row],[Category]],Table11[],2,FALSE)","v":"Misc"}]
["2010-01-06","UPS","THE UPS STORE #5266 PROUD UT",-21.59,"debit","Shipping","Citi CC",{"$f":"VLOOKUP(TestTable[[#This Row],[Category]],Table11[],2,FALSE)","v":"Misc"}]
["2010-01-05","Eacademyinc De","EACADEMYINC 6135263005 DE",-35,"debit","Uncategorized","Citi CC",{"$f":"VLOOKUP(TestTable[[#This Row],[Category]],Table11[],2,FALSE)","v":"Misc"}]
["2010-01-05","JCPenney","JCPENNEY STORE 2770 PROVO UT",-22.82,"debit","Clothing","Citi CC",{"$f":"VLOOKUP(TestTable[[#This Row],[Category]],Table11[],2,FALSE)","v":"Misc"}]
["2010-01-05","Marketplace Cafe","MARKETPLACE CAFE PROVO UT",-4.62,"debit","Restaurants","Citi CC",{"$f":"VLOOKUP(TestTable[[#This Row],[Category]],Table11[],2,FALSE)","v":"Food"}]
["2010-01-05","Amazon","AMAZON MKTPLACE PMTS AMZN.COM/BILL WA",-56.98,"debit","Shopping","Citi CC",{"$f":"VLOOKUP(TestTable[[#This Row],[Category]],Table11[],2,FALSE)","v":"Misc"}]
["2010-01-05","Target","Debit Card Purchase - TARGET T1754 OR 175 WEST CENTER STREET",-15.31,"debit","Miscellaneous","ING Checking",{"$f":"VLOOKUP(TestTable[[#This Row],[Category]],Table11[],2,FALSE)","v":"Misc"}]
["2010-01-05","AT&T Wireless","Debit Card Purchase - ATTM xxxxxxxxxxxx3310500 GA",-107.96,"debit","Mobile Phone","ING Checking",{"$f":"VLOOKUP(TestTable[[#This Row],[Category]],Table11[],2,FALSE)","v":"Phone"}]
["2010-01-04","BYU Bookstore","BYU BOOKSTORE PROVO UT",-283,"debit","Books","Citi CC",{"$f":"VLOOKUP(TestTable[[#This Row],[Category]],Table11[],2,FALSE)","v":"Misc"}]
["2010-01-04","Netflix","NETFLIX                LOS GATOS    CA",-9.5500000000000007,"debit","Movies & DVDs","B of A CC",{"$f":"VLOOKUP(TestTable[[#This Row],[Category]],Table11[],2,FALSE)","v":"Misc"}]
["2010-01-04","Costco","COSTCO WHSE #0484 0000 OREM         UT",49.4,"credit","Miscellaneous","B of A CC",{"$f":"VLOOKUP(TestTable[[#This Row],[Category]],Table11[],2,FALSE)","v":"Misc"}]
["2010-01-04","Transfer from FREE CHECKING","Internet Deposit MOUNTAIN AMERICA FCU checking account XXXXXXXX1875",7554.44,"credit","Transfer","ING Holding",{"$f":"VLOOKUP(TestTable[[#This Row],[Category]],Table11[],2,FALSE)","v":"Misc"}]
["2010-01-02","Target","TARGET 00017541 OREM UT",-44.36,"debit","Miscellaneous","Citi CC",{"$f":"VLOOKUP(TestTable[[#This Row],[Category]],Table11[],2,FALSE)","v":"Misc"}]
["2010-01-02","Chevron","CHEVRON 0204058 PROVO UT",-32.979999999999997,"debit","Gas & Fuel","Citi CC",{"$f":"VLOOKUP(TestTable[[#This Row],[Category]],Table11[],2,FALSE)","v":"Auto"}]
["2010-01-02","Costco","COSTCO WHSE #0484 0000 OREM         UT",-4.79,"debit","Miscellaneous","B of A CC",{"$f":"VLOOKUP(TestTable[[#This Row],[Category]],Table11[],2,FALSE)","v":"Misc"}]
["2010-01-02","Costco","COSTCO WHSE #0484 0000 OREM         UT",-49.4,"debit","Miscellaneous","B of A CC",{"$f":"VLOOKUP(TestTable[[#This Row],[Category]],Table11[],2,FALSE)","v":"Misc"}]
["2010-01-01","Dri Windows Us","DRI*WINDOWS7US ORDERFIND.COM MN",-29.99,"debit","Uncategorized","Citi CC",{"$f":"VLOOKUP(TestTable[[#This Row],[Category]],Table11[],2,FALSE)","v":"Misc"}]
["2010-01-01","Playon Ny","PAYPAL *PLAYON 4029357733 NY",-39.99,"debit","Uncategorized","Citi CC",{"$f":"VLOOKUP(TestTable[[#This Row],[Category]],Table11[],2,FALSE)","v":"Misc"}]
["2010-01-01","Exxon","EXXONMOBIL 45470226 BOUNTIFUL UT",-10.01,"debit","Gas & Fuel","Citi CC",{"$f":"VLOOKUP(TestTable[[#This Row],[Category]],Table11[],2,FALSE)","v":"Auto"}]
["2009-12-31","Amazon","AMAZON MKTPLACE PMTS AMZN.COM/BILL WA",-122.99,"debit","Shopping","Citi CC",{"$f":"VLOOKUP(TestTable[[#This Row],[Category]],Table11[],2,FALSE)","v":"Misc"}]
["2009-12-31","Amazon","AMAZON MKTPLACE PMTS AMZN.COM/BILL WA",-63.94,"debit","Shopping","Citi CC",{"$f":"VLOOKUP(TestTable[[#This Row],[Category]],Table11[],2,FALSE)","v":"Misc"}]
["2009-12-31","Monthly Interest Paid","Monthly Interest Paid",0.05,"credit","Interest Income","ING Checking",{"$f":"VLOOKUP(TestTable[[#This Row],[Category]],Table11[],2,FALSE)","v":"Misc"}]
["2009-12-31","Monthly Interest Paid","Monthly Interest Paid",7.0000000000000007E-2,"credit","Interest Income","ING Holding",{"$f":"VLOOKUP(TestTable[[#This Row],[Category]],Table11[],2,FALSE)","v":"Misc"}]
["2009-12-30","University Parkway","UNIVERSITY PARKWAY PROVO UT",-2.75,"debit","Uncategorized","Citi CC",{"$f":"VLOOKUP(TestTable[[#This Row],[Category]],Table11[],2,FALSE)","v":"Misc"}]
["2009-12-30","Pizza Factory","PIZZA FACTORY COTTONTR PROVO UT",-134.62,"debit","Restaurants","Citi CC",{"$f":"VLOOKUP(TestTable[[#This Row],[Category]],Table11[],2,FALSE)","v":"Food"}]
["2009-12-30","Provo City Utilities","Debit Card Purchase - PROVO CITY UTILITIES PROVO UT",-98.87,"debit","Utilities","ING Checking",{"$f":"VLOOKUP(TestTable[[#This Row],[Category]],Table11[],2,FALSE)","v":"Utilities"}]
["2009-12-29","Amazon","Amazon.com AMZN.COM/BILL WA",-57,"debit","Shopping","Citi CC",{"$f":"VLOOKUP(TestTable[[#This Row],[Category]],Table11[],2,FALSE)","v":"Misc"}]
["2009-12-29","Cinemark USA","CINEMARK USA Q36 PROVO UT",-17,"debit","Movies & DVDs","Citi CC",{"$f":"VLOOKUP(TestTable[[#This Row],[Category]],Table11[],2,FALSE)","v":"Misc"}]
["2009-12-29","Inspection Station","THE INSPECTION STATION OREM UT",-70.680000000000007,"debit","Parking","Citi CC",{"$f":"VLOOKUP(TestTable[[#This Row],[Category]],Table11[],2,FALSE)","v":"Misc"}]
["2009-12-28","Supersonic Car Wash","SUPERSONIC CAR WASH OREM UT",-15.6,"debit","Service & Parts","Citi CC",{"$f":"VLOOKUP(TestTable[[#This Row],[Category]],Table11[],2,FALSE)","v":"Auto"}]
["2009-12-28","Smith's Food","SMITHS FOOD #4144 OREM UT",-28.25,"debit","Groceries","Citi CC",{"$f":"VLOOKUP(TestTable[[#This Row],[Category]],Table11[],2,FALSE)","v":"Food"}]
["2009-12-26","Flaming Wok Q","FLAMING WOK Q62 OREM UT",-6.44,"debit","Uncategorized","Citi CC",{"$f":"VLOOKUP(TestTable[[#This Row],[Category]],Table11[],2,FALSE)","v":"Misc"}]
["2009-12-26","Chick-Fil-A","CHICK-FIL-A #367 Q05 OREM UT",-1.61,"debit","Fast Food","Citi CC",{"$f":"VLOOKUP(TestTable[[#This Row],[Category]],Table11[],2,FALSE)","v":"Food"}]
["2009-12-26","Arctic Circle","ARCTIC CIRCLE 515 OREM OREM UT",-6.76,"debit","Restaurants","Citi CC",{"$f":"VLOOKUP(TestTable[[#This Row],[Category]],Table11[],2,FALSE)","v":"Food"}]
["2009-12-26","Consumer Reports","CR *CONSUMERREPORTS.OR 8003330663 NY",-5.95,"debit","Books","Citi CC",{"$f":"VLOOKUP(TestTable[[#This Row],[Category]],Table11[],2,FALSE)","v":"Misc"}]
["2009-12-25","iTunes","APL*ITUNES 866-712-7753 CA",-5.32,"debit","Music","Citi CC",{"$f":"VLOOKUP(TestTable[[#This Row],[Category]],Table11[],2,FALSE)","v":"Misc"}]
["2009-12-24","Cinemark USA","CINEMARK USA Q36 PROVO UT",-35,"debit","Movies & DVDs","Citi CC",{"$f":"VLOOKUP(TestTable[[#This Row],[Category]],Table11[],2,FALSE)","v":"Misc"}]
["2009-12-24","Cinemark USA","CINEMARK USA Q36 PROVO UT",-10.5,"debit","Movies & DVDs","Citi CC",{"$f":"VLOOKUP(TestTable[[#This Row],[Category]],Table11[],2,FALSE)","v":"Misc"}]
["2009-12-24","Smith's Food","SMITHS FOOD #4136 PROVO UT",-13.19,"debit","Groceries","Citi CC",{"$f":"VLOOKUP(TestTable[[#This Row],[Category]],Table11[],2,FALSE)","v":"Food"}]
["2009-12-23","Amazon","Amazon.com AMZN.COM/BILL WA",-58.99,"debit","Shopping","Citi CC",{"$f":"VLOOKUP(TestTable[[#This Row],[Category]],Table11[],2,FALSE)","v":"Misc"}]
["2009-12-22","Radioshack Cor Orem","RADIOSHACK COR00140293 OREM UT",43.44,"credit","Credit Card Payment","Citi CC",{"$f":"VLOOKUP(TestTable[[#This Row],[Category]],Table11[],2,FALSE)","v":"Debt"}]
["2009-12-22","Amazon","Amazon.com AMZN.COM/BILL WA",-9.99,"debit","Shopping","Citi CC",{"$f":"VLOOKUP(TestTable[[#This Row],[Category]],Table11[],2,FALSE)","v":"Misc"}]
["2009-12-22","Amazon","Amazon.com AMZN.COM/BILL WA",-17.21,"debit","Shopping","Citi CC",{"$f":"VLOOKUP(TestTable[[#This Row],[Category]],Table11[],2,FALSE)","v":"Misc"}]
["2009-12-22","Target","TARGET 00017541 OREM UT",-16.39,"debit","Miscellaneous","Citi CC",{"$f":"VLOOKUP(TestTable[[#This Row],[Category]],Table11[],2,FALSE)","v":"Misc"}]
["2009-12-22","Good Earth Natural Foods","GOOD EARTH NATURAL FOO OREM UT",-16.02,"debit","Food & Dining","Citi CC",{"$f":"VLOOKUP(TestTable[[#This Row],[Category]],Table11[],2,FALSE)","v":"Food"}]
["2009-12-22","Target","TARGET 00017541 OREM UT",4.26,"credit","Miscellaneous","Citi CC",{"$f":"VLOOKUP(TestTable[[#This Row],[Category]],Table11[],2,FALSE)","v":"Misc"}]
["2009-12-22","JCPenney","JCPENNEY STORE 2770 PROVO UT",-33.04,"debit","Clothing","Citi CC",{"$f":"VLOOKUP(TestTable[[#This Row],[Category]],Table11[],2,FALSE)","v":"Misc"}]
["2009-12-22","Costco","COSTCO WHSE #0484 0000 OREM         UT",-95.72,"debit","Miscellaneous","B of A CC",{"$f":"VLOOKUP(TestTable[[#This Row],[Category]],Table11[],2,FALSE)","v":"Misc"}]
["2009-12-21","UPS","THE UPS STORE #5266 PROUD UT",-27.9,"debit","Shipping","Citi CC",{"$f":"VLOOKUP(TestTable[[#This Row],[Category]],Table11[],2,FALSE)","v":"Misc"}]
["2009-12-21","Wal-Mart","WAL-MART #1768 OREM UT",-11.63,"debit","Shopping","Citi CC",{"$f":"VLOOKUP(TestTable[[#This Row],[Category]],Table11[],2,FALSE)","v":"Misc"}]
["2009-12-21","Amazon","Amazon.com AMZN.COM/BILL WA",-20,"debit","Shopping","Citi CC",{"$f":"VLOOKUP(TestTable[[#This Row],[Category]],Table11[],2,FALSE)","v":"Misc"}]
["2009-12-21","Amazon","Amazon.com AMZN.COM/BILL WA",-14.99,"debit","Shopping","Citi CC",{"$f":"VLOOKUP(TestTable[[#This Row],[Category]],Table11[],2,FALSE)","v":"Misc"}]
["2009-12-21","Wal-Mart","WAL-MART #1768 OREM UT",26.68,"credit","Shopping","Citi CC",{"$f":"VLOOKUP(TestTable[[#This Row],[Category]],Table11[],2,FALSE)","v":"Misc"}]
["2009-12-21","UPS","THE UPS STORE #5266 PROUD UT",-23.13,"debit","Shipping","Citi CC",{"$f":"VLOOKUP(TestTable[[#This Row],[Category]],Table11[],2,FALSE)","v":"Misc"}]
["2009-12-20","Redbox","REDBOX *DVD RENTAL 866-733-2693 IL",-8.5399999999999991,"debit","Movies & DVDs","Citi CC",{"$f":"VLOOKUP(TestTable[[#This Row],[Category]],Table11[],2,FALSE)","v":"Misc"}]
["2009-12-20","Home Depot","THE HOME DEPOT 4416 PROVO UT",-3.39,"debit","Home Improvement","Citi CC",{"$f":"VLOOKUP(TestTable[[#This Row],[Category]],Table11[],2,FALSE)","v":"Misc"}]
["2009-12-19","Harmon's","HARMON'S - OREM OREM UT",-33.130000000000003,"debit","Groceries","Citi CC",{"$f":"VLOOKUP(TestTable[[#This Row],[Category]],Table11[],2,FALSE)","v":"Food"}]
["2009-12-19","Toys \"R\" Us","TOYS R US #5689 OREM UT",-34.369999999999997,"debit","Toys","Citi CC",{"$f":"VLOOKUP(TestTable[[#This Row],[Category]],Table11[],2,FALSE)","v":"Misc"}]
["2009-12-19","Amazon","Amazon.com AMZN.COM/BILL WA",-18,"debit","Shopping","Citi CC",{"$f":"VLOOKUP(TestTable[[#This Row],[Category]],Table11[],2,FALSE)","v":"Misc"}]
["2009-12-19","Tie One On","TIE ONE ON #3 OREM UT",-9.61,"debit","Clothing","Citi CC",{"$f":"VLOOKUP(TestTable[[#This Row],[Category]],Table11[],2,FALSE)","v":"Misc"}]
["2009-12-19","Dick's Sporting","WWW.DICKSSPORTNGGOODS. 877-846-9997 PA",-640.49,"debit","Sporting Goods","Citi CC",{"$f":"VLOOKUP(TestTable[[#This Row],[Category]],Table11[],2,FALSE)","v":"Misc"}]
["2009-12-19","Amazon","Amazon.com AMZN.COM/BILL WA",-68.5,"debit","Shopping","Citi CC",{"$f":"VLOOKUP(TestTable[[#This Row],[Category]],Table11[],2,FALSE)","v":"Misc"}]
["2009-12-19","Texaco","TEXACO 0305131 OREM UT",-39.39,"debit","Gas & Fuel","Citi CC",{"$f":"VLOOKUP(TestTable[[#This Row],[Category]],Table11[],2,FALSE)","v":"Auto"}]
["2009-12-19","Build-A-Bear","BUILDABEAR WRKSHP 0237 OREM UT",-17.100000000000001,"debit","Gift","Citi CC",{"$f":"VLOOKUP(TestTable[[#This Row],[Category]],Table11[],2,FALSE)","v":"Misc"}]
["2009-12-19","Unique Gifts","UNIQUE GIFTS OREM UT",-5.29,"debit","Gift","Citi CC",{"$f":"VLOOKUP(TestTable[[#This Row],[Category]],Table11[],2,FALSE)","v":"Misc"}]
["2009-12-18","Ezkliquidat Ca","PAYPAL *EZKLIQUIDAT 4029357733 CA",-5.24,"debit","Uncategorized","Citi CC",{"$f":"VLOOKUP(TestTable[[#This Row],[Category]],Table11[],2,FALSE)","v":"Misc"}]
["2009-12-18","Shutterfly","SFI*PHOTOSBYSHUTTERFLY 800-986-1065 CA",-18.93,"debit","Hobbies","Citi CC",{"$f":"VLOOKUP(TestTable[[#This Row],[Category]],Table11[],2,FALSE)","v":"Misc"}]
["2009-12-18","Sonic","SONIC DRIVE IN #476Q63 SALT LAKE CIT UT",-4.46,"debit","Fast Food","Citi CC",{"$f":"VLOOKUP(TestTable[[#This Row],[Category]],Table11[],2,FALSE)","v":"Food"}]
["2009-12-18","Wal-Mart","WAL-MART #1768 OREM UT",-82.35,"debit","Shopping","Citi CC",{"$f":"VLOOKUP(TestTable[[#This Row],[Category]],Table11[],2,FALSE)","v":"Misc"}]
["2009-12-09","Savings Deposit Direct","Savings Deposit - Direct Deposit from ELI LILLY AND CO ELI LILLY",82.07,"credit","Paycheck","ING Holding",{"$f":"VLOOKUP(TestTable[[#This Row],[Category]],Table11[],2,FALSE)","v":"Income"}]
["2009-12-07","Electronic Citi Cards","Electronic Payment to CITI CARDS",-20,"debit","Credit Card Payment","ING Checking",{"$f":"VLOOKUP(TestTable[[#This Row],[Category]],Table11[],2,FALSE)","v":"Debt"}]
["2009-12-07","Electronic Bank","Electronic Payment to BANK OF AMERICA",-15,"debit","Credit Card Payment","ING Checking",{"$f":"VLOOKUP(TestTable[[#This Row],[Category]],Table11[],2,FALSE)","v":"Debt"}]
["2009-12-03","Person Person Laura","Person2Person Payment to Laura or Clayne Larsen",-1075,"debit","Mortgage & Rent","ING Checking",{"$f":"VLOOKUP(TestTable[[#This Row],[Category]],Table11[],2,FALSE)","v":"Housing"}]
["2009-12-01","Transfer from FREE CHECKING","Internet Deposit MOUNTAIN AMERICA FCU checking account XXXXXXXX1875",650,"credit","Transfer","ING Checking",{"$f":"VLOOKUP(TestTable[[#This Row],[Category]],Table11[],2,FALSE)","v":"Misc"}]
["2009-11-30","Monthly Interest Paid","Monthly Interest Paid",0.06,"credit","Interest Income","ING Checking",{"$f":"VLOOKUP(TestTable[[#This Row],[Category]],Table11[],2,FALSE)","v":"Misc"}]
["2009-11-30","Monthly Interest Paid","Monthly Interest Paid",0.7,"credit","Interest Income","ING Holding",{"$f":"VLOOKUP(TestTable[[#This Row],[Category]],Table11[],2,FALSE)","v":"Misc"}]
["2009-11-29","Transfer from ING Holding","Internet Deposit transferred from OSA XXXX4516",655,"credit","Transfer","ING Checking",{"$f":"VLOOKUP(TestTable[[#This Row],[Category]],Table11[],2,FALSE)","v":"Misc"}]
["2009-11-29","Transfer from ING Savings","Internet Deposit transferred from OSA XXXX3822",1,"credit","Transfer","ING Checking",{"$f":"VLOOKUP(TestTable[[#This Row],[Category]],Table11[],2,FALSE)","v":"Misc"}]
["2009-11-29","Transfer to Checking","Internet Withdrawal transferred to EO XXXX4669",-655,"debit","Transfer","ING Holding",{"$f":"VLOOKUP(TestTable[[#This Row],[Category]],Table11[],2,FALSE)","v":"Misc"}]
["2009-11-29","Transfer to Checking","Internet Withdrawal transferred to EO XXXX4669",-1,"debit","Transfer","ING Savings",{"$f":"VLOOKUP(TestTable[[#This Row],[Category]],Table11[],2,FALSE)","v":"Misc"}]
["2009-11-15","McDonald's","Debit Card Purchase - MCDONALD S F29589 Q17 OREM UT",-6.56,"debit","Fast Food","ING Checking",{"$f":"VLOOKUP(TestTable[[#This Row],[Category]],Table11[],2,FALSE)","v":"Food"}]
["2009-11-13","Bk Amer Vi","Electronic Withdrawal from BK OF AMER VI/MC ONLINE PMT",-42.46,"debit","Credit Card Payment","ING Checking",{"$f":"VLOOKUP(TestTable[[#This Row],[Category]],Table11[],2,FALSE)","v":"Debt"}]
["2009-11-12","Electronic Us Bank","Electronic Payment to US Bank Credit Card",-40.85,"debit","Credit Card Payment","ING Checking",{"$f":"VLOOKUP(TestTable[[#This Row],[Category]],Table11[],2,FALSE)","v":"Debt"}]
["2009-11-12","Transfer to FREE CHECKING","Internet Withdrawal MOUNTAIN AMERICA FCU checking account XXXXXXXX1875",-750,"debit","Transfer","ING Checking",{"$f":"VLOOKUP(TestTable[[#This Row],[Category]],Table11[],2,FALSE)","v":"Misc"}]
["2009-11-10","Transfer from ING Holding","Internet Deposit transferred from OSA XXXX4516",135,"credit","Transfer","ING Checking",{"$f":"VLOOKUP(TestTable[[#This Row],[Category]],Table11[],2,FALSE)","v":"Misc"}]
["2009-11-10","Transfer to Checking","Internet Withdrawal transferred to EO XXXX4669",-135,"debit","Transfer","ING Holding",{"$f":"VLOOKUP(TestTable[[#This Row],[Category]],Table11[],2,FALSE)","v":"Misc"}]
["2009-11-06","PayPal","Electronic Withdrawal from PAYPAL INST XFER",-48.49,"debit","Shopping","ING Checking",{"$f":"VLOOKUP(TestTable[[#This Row],[Category]],Table11[],2,FALSE)","v":"Misc"}]
["2009-11-03","Adjustment For Amber","Credit Adjustment for payment to Amber Swensen",750,"credit","Income","ING Checking",{"$f":"VLOOKUP(TestTable[[#This Row],[Category]],Table11[],2,FALSE)","v":"income"}]
["2009-11-02","Transfer to FREE CHECKING","Internet Withdrawal MOUNTAIN AMERICA FCU checking account XXXXXXXX1875",-75,"debit","Transfer","ING Holding",{"$f":"VLOOKUP(TestTable[[#This Row],[Category]],Table11[],2,FALSE)","v":"Misc"}]
["2009-10-31","Monthly Interest Paid","Monthly Interest Paid",0.04,"credit","Interest Income","ING Checking",{"$f":"VLOOKUP(TestTable[[#This Row],[Category]],Table11[],2,FALSE)","v":"Misc"}]
["2009-10-31","Monthly Interest Paid","Monthly Interest Paid",3.24,"credit","Interest Income","ING Holding",{"$f":"VLOOKUP(TestTable[[#This Row],[Category]],Table11[],2,FALSE)","v":"Misc"}]
["2009-10-29","Citi Online","Electronic Withdrawal from CITI CARD ONLINE PAYMENT",-1058.3499999999999,"debit","Credit Card Payment","ING Checking",{"$f":"VLOOKUP(TestTable[[#This Row],[Category]],Table11[],2,FALSE)","v":"Debt"}]
["2009-10-28","Internet Withdrawal Mountain","Internet Withdrawal MOUNTAIN AMERICA FCU checking account XXXXXXXX1875",-1300,"debit","Transfer","ING Holding",{"$f":"VLOOKUP(TestTable[[#This Row],[Category]],Table11[],2,FALSE)","v":"Misc"}]
["2009-10-27","Transfer from ING Holding","Internet Deposit transferred from OSA XXXX4516",1058,"credit","Transfer","ING Checking",{"$f":"VLOOKUP(TestTable[[#This Row],[Category]],Table11[],2,FALSE)","v":"Misc"}]
["2009-10-27","Transfer to Checking","Internet Withdrawal transferred to EO XXXX4669",-1058,"debit","Transfer","ING Holding",{"$f":"VLOOKUP(TestTable[[#This Row],[Category]],Table11[],2,FALSE)","v":"Misc"}]
["2009-10-18","Wall Street Journal","Debit Card Purchase - D J WALL STREET JOURNA 800 568 7625 MA",-179,"debit","Printing","ING Checking",{"$f":"VLOOKUP(TestTable[[#This Row],[Category]],Table11[],2,FALSE)","v":"Misc"}]
["2009-10-07","Citi Online","Electronic Withdrawal from CITI CARD ONLINE PAYMENT",-282.22000000000003,"debit","Credit Card Payment","ING Checking",{"$f":"VLOOKUP(TestTable[[#This Row],[Category]],Table11[],2,FALSE)","v":"Debt"}]
["2009-10-06","Transfer from ING Holding","Internet Deposit transferred from OSA XXXX4516",282,"credit","Transfer","ING Checking",{"$f":"VLOOKUP(TestTable[[#This Row],[Category]],Table11[],2,FALSE)","v":"Misc"}]
["2009-10-06","Transfer from ING Holding","Internet Deposit transferred from OSA XXXX4516",180,"credit","Transfer","ING Checking",{"$f":"VLOOKUP(TestTable[[#This Row],[Category]],Table11[],2,FALSE)","v":"Misc"}]
["2009-10-06","Transfer to Checking","Internet Withdrawal transferred to EO XXXX4669",-282,"debit","Transfer","ING Holding",{"$f":"VLOOKUP(TestTable[[#This Row],[Category]],Table11[],2,FALSE)","v":"Misc"}]
["2009-10-06","Transfer to Checking","Internet Withdrawal transferred to EO XXXX4669",-180,"debit","Transfer","ING Holding",{"$f":"VLOOKUP(TestTable[[#This Row],[Category]],Table11[],2,FALSE)","v":"Misc"}]
["2009-09-30","Monthly Interest Paid","Monthly Interest Paid",0.04,"credit","Interest Income","ING Checking",{"$f":"VLOOKUP(TestTable[[#This Row],[Category]],Table11[],2,FALSE)","v":"Misc"}]
["2009-09-30","Periodic Finance Charge","Finance Charge Paid for Overdraft",-7.0000000000000007E-2,"debit","Finance Charge","ING Checking",{"$f":"VLOOKUP(TestTable[[#This Row],[Category]],Table11[],2,FALSE)","v":"Misc"}]
["2009-09-30","Internet Withdrawal Mountain","Internet Withdrawal MOUNTAIN AMERICA FCU checking account XXXXXXXX1875",-625,"debit","Transfer","ING Holding",{"$f":"VLOOKUP(TestTable[[#This Row],[Category]],Table11[],2,FALSE)","v":"Misc"}]
["2009-09-30","Savings Deposit Direct","Savings Deposit - Direct Deposit from ELI LILLY AND CO TER TRAVEL",177.51,"credit","Paycheck","ING Holding",{"$f":"VLOOKUP(TestTable[[#This Row],[Category]],Table11[],2,FALSE)","v":"Income"}]
["2009-09-30","Monthly Interest Paid","Monthly Interest Paid",4.55,"credit","Interest Income","ING Holding",{"$f":"VLOOKUP(TestTable[[#This Row],[Category]],Table11[],2,FALSE)","v":"Misc"}]
["2009-09-29","Internet Deposit Transferred","Internet Deposit transferred from OSA XXXX4516",1075,"credit","Income","ING Checking",{"$f":"VLOOKUP(TestTable[[#This Row],[Category]],Table11[],2,FALSE)","v":"income"}]
["2009-09-29","Person Person Laura","Person2Person Payment to Laura or Clayne Larsen",-1075,"debit","Mortgage & Rent","ING Checking",{"$f":"VLOOKUP(TestTable[[#This Row],[Category]],Table11[],2,FALSE)","v":"Housing"}]
["2009-09-17","Citi Online","Electronic Withdrawal from CITI CARD ONLINE PAYMENT",-3716.77,"debit","Credit Card Payment","ING Checking",{"$f":"VLOOKUP(TestTable[[#This Row],[Category]],Table11[],2,FALSE)","v":"Debt"}]
["2009-09-17","Paper Church Jesus","Paper Payment to CHURCH OF JESUS CHRIST OF LDS",-148,"debit","Charity","ING Checking",{"$f":"VLOOKUP(TestTable[[#This Row],[Category]],Table11[],2,FALSE)","v":"Misc"}]
["2009-09-16","Citi Online","Electronic Withdrawal from CITI CARD ONLINE PAYMENT",-1000,"debit","Credit Card Payment","ING Checking",{"$f":"VLOOKUP(TestTable[[#This Row],[Category]],Table11[],2,FALSE)","v":"Debt"}]
["2009-09-16","Internet Deposit Transferred","Internet Deposit transferred from OSA XXXX4516",148,"credit","Income","ING Checking",{"$f":"VLOOKUP(TestTable[[#This Row],[Category]],Table11[],2,FALSE)","v":"income"}]
["2009-09-16","Internet Deposit Transferred","Internet Deposit transferred from OSA XXXX4516",3716,"credit","Income","ING Checking",{"$f":"VLOOKUP(TestTable[[#This Row],[Category]],Table11[],2,FALSE)","v":"income"}]
["2009-09-16","PayPal","Electronic Withdrawal from PAYPAL INST XFER",-5,"debit","Shopping","ING Checking",{"$f":"VLOOKUP(TestTable[[#This Row],[Category]],Table11[],2,FALSE)","v":"Misc"}]
["2009-09-15","Internet Deposit Transferred","Internet Deposit transferred from OSA XXXX4516",1050,"credit","Income","ING Checking",{"$f":"VLOOKUP(TestTable[[#This Row],[Category]],Table11[],2,FALSE)","v":"income"}]
["2009-09-08","Internet Deposit Mountain","Internet Deposit MOUNTAIN AMERICA FCU checking account XXXXXXXX1875",60,"credit","Income","ING Checking",{"$f":"VLOOKUP(TestTable[[#This Row],[Category]],Table11[],2,FALSE)","v":"income"}]
["2009-09-08","Liberty Mutual","Electronic Withdrawal from LIBERTY MUTUAL PAYMENT",-68.03,"debit","Auto Insurance","ING Checking",{"$f":"VLOOKUP(TestTable[[#This Row],[Category]],Table11[],2,FALSE)","v":"Auto"}]
["2009-09-04","Electric Orange Adjustment","Electric Orange Card Adjustment (Credit) EBAYS HALF COM 08005459857 CA",18.059999999999999,"credit","Income","ING Checking",{"$f":"VLOOKUP(TestTable[[#This Row],[Category]],Table11[],2,FALSE)","v":"income"}]
["2009-09-04","Electric Orange Adjustment","Electric Orange Card Adjustment (Credit) EBAYS HALF COM 08005459857 CA",26.94,"credit","Income","ING Checking",{"$f":"VLOOKUP(TestTable[[#This Row],[Category]],Table11[],2,FALSE)","v":"income"}]
["2009-09-01","Internet Deposit Rbs","Internet Deposit RBS CITIZENS, NATIONAL ASSOCIATION checking account XXXXXX1929",22.26,"credit","Income","ING Checking",{"$f":"VLOOKUP(TestTable[[#This Row],[Category]],Table11[],2,FALSE)","v":"income"}]
["2009-08-31","Periodic Finance Charge","Finance Charge Paid for Overdraft",-0.11,"debit","Finance Charge","ING Checking",{"$f":"VLOOKUP(TestTable[[#This Row],[Category]],Table11[],2,FALSE)","v":"Misc"}]
["2009-08-31","Consumer Reports","Debit Card Purchase - CR CONSUMERREPORTS OR 800 333 0663 NY",-5.95,"debit","Books","ING Checking",{"$f":"VLOOKUP(TestTable[[#This Row],[Category]],Table11[],2,FALSE)","v":"Misc"}]
["2009-08-31","Monthly Interest Paid","Monthly Interest Paid",0.18,"credit","Interest Income","ING Checking",{"$f":"VLOOKUP(TestTable[[#This Row],[Category]],Table11[],2,FALSE)","v":"Misc"}]
["2009-08-27","Byu Creamery Ninth","Debit Card Purchase - BYU CREAMERY ON NINTH PROVO UT",-10.59,"debit","Uncategorized","ING Checking",{"$f":"VLOOKUP(TestTable[[#This Row],[Category]],Table11[],2,FALSE)","v":"Misc"}]
["2009-08-26","Brigham Young University","Debit Card Purchase - BRIGHAM YOUNG UNIV WEB 01111111111 UT",-60,"debit","Education","ING Checking",{"$f":"VLOOKUP(TestTable[[#This Row],[Category]],Table11[],2,FALSE)","v":"Misc"}]
["2009-08-26","Electronic Citi Cards","Electronic Payment to CITI CARDS",-400,"debit","Credit Card Payment","ING Checking",{"$f":"VLOOKUP(TestTable[[#This Row],[Category]],Table11[],2,FALSE)","v":"Debt"}]
["2009-08-25","Costco","Debit Card Purchase - COSTCO WHSE #0484 648 EAST 800 SOUTH",-81.17,"debit","Miscellaneous","ING Checking",{"$f":"VLOOKUP(TestTable[[#This Row],[Category]],Table11[],2,FALSE)","v":"Misc"}]
["2009-08-25","Costco","Debit Card Purchase - COSTCO WHSE #0484 648 EAST 800 SOUTH",-17.09,"debit","Miscellaneous","ING Checking",{"$f":"VLOOKUP(TestTable[[#This Row],[Category]],Table11[],2,FALSE)","v":"Misc"}]
["2009-08-25","Paper Church Jesus","Paper Payment to Church of Jesus Christ of LDS",-140,"debit","Charity","ING Checking",{"$f":"VLOOKUP(TestTable[[#This Row],[Category]],Table11[],2,FALSE)","v":"Misc"}]
["2009-08-24","Big Lots","Debit Card Purchase - BIG LOTS #04116 1290 N STATE ST",-34.26,"debit","Shopping","ING Checking",{"$f":"VLOOKUP(TestTable[[#This Row],[Category]],Table11[],2,FALSE)","v":"Misc"}]
["2009-08-24","Person Person Laura","Person2Person Payment to Laura or Clayne Larsen",-555,"debit","Mortgage & Rent","ING Checking",{"$f":"VLOOKUP(TestTable[[#This Row],[Category]],Table11[],2,FALSE)","v":"Housing"}]
["2009-08-24","Subway","Debit Card Purchase - BYU WSC SUBWAY PROVO UT",-7.54,"debit","Fast Food","ING Checking",{"$f":"VLOOKUP(TestTable[[#This Row],[Category]],Table11[],2,FALSE)","v":"Food"}]
["2009-08-24","Byu Signature Web","Debit Card Purchase - BYU SIGNATURE CRD WEB 08014223867 UT",-20,"debit","Uncategorized","ING Checking",{"$f":"VLOOKUP(TestTable[[#This Row],[Category]],Table11[],2,FALSE)","v":"Misc"}]
["2009-08-24","Maceys","Debit Card Purchase - MACEYS PROVO 1400 N STATE 00",-8.5,"debit","Groceries","ING Checking",{"$f":"VLOOKUP(TestTable[[#This Row],[Category]],Table11[],2,FALSE)","v":"Food"}]
["2009-08-24","Maceys","Debit Card Purchase - MACEYS PROVO 1400 N STATE 00",-51.92,"debit","Groceries","ING Checking",{"$f":"VLOOKUP(TestTable[[#This Row],[Category]],Table11[],2,FALSE)","v":"Food"}]
["2009-08-20","Lowe's","Debit Card Purchase - LOWE'S #178 140 W UNIVERSITY PKWY 000",-7.67,"debit","Home Improvement","ING Checking",{"$f":"VLOOKUP(TestTable[[#This Row],[Category]],Table11[],2,FALSE)","v":"Misc"}]
["2009-08-20","Wal-Mart","Debit Card Purchase - WAL-MART #1768 1355 S SANDHILL RD",-54.58,"debit","Shopping","ING Checking",{"$f":"VLOOKUP(TestTable[[#This Row],[Category]],Table11[],2,FALSE)","v":"Misc"}]
["2009-08-20","Sports Authority","Debit Card Purchase - SPORTS AUTHORI 643 E UNIVERSITY PKWY",-12,"debit","Sporting Goods","ING Checking",{"$f":"VLOOKUP(TestTable[[#This Row],[Category]],Table11[],2,FALSE)","v":"Misc"}]
["2009-08-20","Wal-Mart","Debit Card Purchase - WAL-MART #1768 1355 S SANDHILL RD",-13.66,"debit","Shopping","ING Checking",{"$f":"VLOOKUP(TestTable[[#This Row],[Category]],Table11[],2,FALSE)","v":"Misc"}]
["2009-08-20","Internet Deposit Transferred","Internet Deposit transferred from OSA XXXX4516",1444,"credit","Income","ING Checking",{"$f":"VLOOKUP(TestTable[[#This Row],[Category]],Table11[],2,FALSE)","v":"income"}]
["2009-08-19","Genzyme Corp","Debit Card Purchase - GENZYME CORPORATION 508 3896605 MA",-387.1,"debit","Doctor","ING Checking",{"$f":"VLOOKUP(TestTable[[#This Row],[Category]],Table11[],2,FALSE)","v":"Medical"}]
["2009-08-18","Maverik","Debit Card Purchase - MAVERIK CTRY STRE 339 OREM UT",-35.03,"debit","Gas & Fuel","ING Checking",{"$f":"VLOOKUP(TestTable[[#This Row],[Category]],Table11[],2,FALSE)","v":"Auto"}]
["2009-08-17","Burger King","Debit Card Purchase - BURGER KING 10646 Q07 OREM UT",-2.69,"debit","Fast Food","ING Checking",{"$f":"VLOOKUP(TestTable[[#This Row],[Category]],Table11[],2,FALSE)","v":"Food"}]
["2009-08-14","Target","Debit Card Purchase - TARGET T1754 OREM STAT 175 WEST CENTER S",-11.23,"debit","Miscellaneous","ING Checking",{"$f":"VLOOKUP(TestTable[[#This Row],[Category]],Table11[],2,FALSE)","v":"Misc"}]
["2009-08-13","Mount Auburn Hospital","Debit Card Purchase - MOUNT AUBURN HOSPITAL CAMBRIDGE MA",-252.48,"debit","Doctor","ING Checking",{"$f":"VLOOKUP(TestTable[[#This Row],[Category]],Table11[],2,FALSE)","v":"Medical"}]
["2009-08-13","Target","Debit Card Purchase - TARGET T1754 OREM STAT 175 WEST CENTER S",-1.03,"debit","Miscellaneous","ING Checking",{"$f":"VLOOKUP(TestTable[[#This Row],[Category]],Table11[],2,FALSE)","v":"Misc"}]
["2009-08-12","E Cnty Rd","Debit Card Purchase - 506 4004 E CNTY RD 700 N 0000 ROLLIN",-80.62,"debit","Uncategorized","ING Checking",{"$f":"VLOOKUP(TestTable[[#This Row],[Category]],Table11[],2,FALSE)","v":"Misc"}]
["2009-07-31","Internet Withdrawal Transferred","Internet Withdrawal transferred to EO XXXX4669",-750,"debit","Transfer","ING Savings",{"$f":"VLOOKUP(TestTable[[#This Row],[Category]],Table11[],2,FALSE)","v":"Misc"}]
["2009-07-31","Monthly Interest Paid","Monthly Interest Paid",1.47,"credit","Interest Income","ING Savings",{"$f":"VLOOKUP(TestTable[[#This Row],[Category]],Table11[],2,FALSE)","v":"Misc"}]
["2009-07-31","Internet Deposit Transferred","Internet Deposit transferred from OSA XXXX4516",750,"credit","Income","ING Savings",{"$f":"VLOOKUP(TestTable[[#This Row],[Category]],Table11[],2,FALSE)","v":"income"}]

{"sheet":"Lookup Lists","index":2,"n_rows":81,"n_cols":13,"rows_kept":81,"cut":false,"hidden":true,"merged":[]}
["Budget Category Lookup",null,"Mint Categories","Fixed Categories"]
["Shopping",null,"Rental Car & Taxi","Misc",null,null,4,3,null,{"$f":"INDEX(G3:G14,G2)","v":"April"},{"$f":"INDEX(H3:H14,H2)","v":2011},{"$f":"TEXT(CONCATENATE(J2,\"/\",K2),\"#####\")","v":"40634"}]
["Uncategorized",null,"Uncategorized","Misc",null,null,"January",2009,null,{"$f":"INDEX(G3:G14,G2+IF(G2=12,(-11),1))","v":"May"},{"$f":"INDEX(H3:H14,IF(G2=12,(H2+1),H2))","v":2011},{"$f":"TEXT(CONCATENATE(J3,\"/\",K3),\"#####\")","v":"40664"},{"$f":"TEXT(L3,\"mm/dd/yyyy\")-1","v":"2011-04-30"}]
["Bank Fee",null,"Air Travel","Misc",null,null,"February",2010]
["Clothing",null,"Gas & Fuel","Auto",null,null,"March",2011]
["Fast Food",null,"Miscellaneous","Misc",null,null,"April",2012]
["Gas & Fuel",null,"Pharmacy","Medical",null,null,"May",2013]
["Miscellaneous",null,"Credit Card Payment","Debt",null,null,"June"]
["Groceries",null,"Fast Food","Food",null,null,"July"]
["Rental Car & Taxi",null,"Shopping","Misc",null,null,"August"]
["Pharmacy",null,"Music","Misc",null,null,"September"]
["Credit Card Payment",null,"Income","income",null,null,"October"]
["Income",null,"Restaurants","Food",null,null,"November"]
["Taxes",null,"Mortgage & Rent","Housing",null,null,"December"]
["Movies & DVDs",null,"Interest Income","Misc"]
["Public Transportation",null,"Finance Charge","Misc"]
["Restaurants",null,"Transfer","Misc"]
["ATM Fee",null,"Books","Misc"]
["Cash & ATM",null,"Gift","Misc"]
["Finance Charge",null,"Bank Fee","Misc"]
["Business Services",null,"Home Phone","Phone"]
["Service & Parts",null,"Movies & DVDs","Misc"]
["Electronics & Software",null,"Clothing","Misc"]
["Air Travel",null,"Gym","Misc"]
["Music",null,"Cash & ATM","Misc"]
["Transfer",null,"Hotel","Misc"]
["Mortgage & Rent",null,"Furnishings","Misc"]
["Interest Income",null,"Personal Care","Misc"]
["Books",null,"Sporting Goods","Misc"]
["Gift",null,"Shipping","Misc"]
["Home Phone",null,"Fees & Charges","Misc"]
["Gym",null,"Check","Income"]
["Hotel",null,"Business Services","Misc"]
["Furnishings",null,"Electronics & Software","Misc"]
["Personal Care",null,"Arts","Misc"]
["Sporting Goods",null,"Transfer for Cash Spending","Misc"]
["Shipping",null,"Late Fee","Misc"]
["Fees & Charges",null,"Travel","Misc"]
["Check",null,"ATM Fee","Misc"]
["Arts",null,"Hair","Misc"]
["Transfer for Cash Spending",null,"Auto Payment","Auto"]
["Late Fee",null,"Groceries","Food"]
["Travel",null,"Mobile Phone","Phone"]
["Hair",null,"Amusement","Misc"]
["Auto Payment",null,"Home Improvement","Misc"]
["Mobile Phone",null,"Food & Dining","Food"]
["Amusement",null,"Coffee Shops","Food"]
["Home Improvement",null,"Public Transportation","Misc"]
["Food & Dining",null,"Entertainment","Misc"]
["Coffee Shops",null,"Laundry","Misc"]
["Entertainment",null,"Paycheck","Income"]
["Laundry",null,"Kids Activities","Misc"]
["Paycheck",null,"Hobbies","Misc"]
["Kids Activities",null,"Alcohol & Bars","Misc"]
["Hobbies",null,"Internet","Utilities"]
["Internet",null,"Toys","Misc"]
["Toys",null,"Kids","Misc"]
["Kids",null,"Utilities","Utilities"]
["Utilities",null,"Auto Insurance","Auto"]
["Auto Insurance",null,"Charity","Misc"]
["Charity",null,"Health & Fitness","Misc"]
["Health & Fitness",null,"Education","Misc"]
["Education",null,"Service Fee","Misc"]
["Service Fee",null,"Service & Parts","Auto"]
["Eyecare",null,"Eyecare","Medical"]
["Doctor",null,"Doctor","Medical"]
["Baby Supplies",null,"Baby Supplies","Misc"]
["Parking",null,"Parking","Misc"]
["Auto & Transport",null,"Auto & Transport","Auto"]
["Money Transfer",null,"Reimbursement","Misc"]
["Reimbursement",null,"Sports","Misc"]
["Sports",null,"Lawn & Garden","Misc"]
["Lawn & Garden",null,"Bills & Utilities","Utilities"]
["Newspapers & Magazines",null,"Health Insurance","Misc"]
["Health Insurance",null,"State Tax","Misc"]
["State Tax",null,"Bonus","Income"]
["Bonus",null,"Books & Supplies","Misc"]
["Books & Supplies",null,"Office Supplies","Misc"]
["Office Supplies",null,"Spa & Massage","Misc"]
["Spa & Massage",null,"Printing","Misc"]
["Printing",null,"Taxes","Misc"]

{"sheet":"Summary","index":3,"n_rows":19,"n_cols":17,"rows_kept":19,"cut":false,"hidden":false,"merged":[]}
[]
[null,"Housing",-1075,null,null,null,"Uncategorized",-604.58000000000004,null,"Fast Food",-80.13,null,"Gas & Fuel",-117.21,null,"Pharmacy",139.01]
[null,"Misc",-780.37,null,null,null,"Miscellaneous",-273.97000000000003,null,"Groceries",-35.4,null,"Service & Parts",-10.550000190734863]
[null,"Food",-133.06,null,null,null,"Shopping",-134.15,null,"Restaurants",-17.53]
[null,"Auto",-127.76,null,null,null,"Taxes",-114.84999847412109]
[null,"Debt",73,null,null,null,"Bank Fee",-113.16000366210937]
[null,"income",94.4,null,null,null,"Rental Car & Taxi",-97.26]
[null,"Medical",139.01,null,null,null,"Finance Charge",-65.87]
[null,null,null,null,null,null,"Cash & ATM",-40]
[null,null,null,null,null,null,"Public Transportation",-20]
[null,null,null,null,null,null,"Clothing",-18.110000610351563]
[null,null,null,null,null,null,"Electronics & Software",-9.9899997711181641]
[null,null,null,null,null,null,"Movies & DVDs",-7.4600000381469727]
[null,null,null,null,null,null,"Music",-6.369999885559082]
[null,null,null,null,null,null,"Air Travel",-2.5]
[null,null,null,null,null,null,"ATM Fee",-2]
[null,null,null,null,null,null,"Business Services",-0.10000000149011612]
[null,null,null,null,null,null,"Interest Income",0]
[null,null,null,null,null,null,"Transfer",730]