{"text_format":"1","workbook":"xlsx","n_sheets":3,"sheets":["Grades","Temp","LOCKED"],"not_rendered":{"charts":0,"images":0,"macros":1,"external_links":0,"defined_names":0,"comments":0,"pivot_tables":0},"unopened":[],"bounds":{"document_bytes":16777216,"sheet_cells":100000,"rows_first":2000,"rows_last":500,"rows_between":2000,"halvings":0,"cell_chars":16384,"cell_head_chars":4096},"cells_cut":0,"cells_raw":0,"read":"whole","date_system":"1900"}

{"sheet":"Grades","index":0,"n_rows":235,"n_cols":27,"rows_kept":235,"cut":false,"hidden":false,"merged":[[20,20,20,22],[21,20,21,22],[22,20,22,22],[23,20,26,22],[23,23,26,23],[14,20,14,22],[15,20,15,22],[16,20,17,22],[16,23,17,23],[18,20,18,22],[19,20,19,22],[4,20,4,21],[8,21,8,23],[9,21,9,23],[10,21,10,23],[12,20,12,23],[13,20,13,22]]}
["LastName","FirstName","Lesson 1","Lesson 2 ","Lesson 3 ","Lesson 4 ","Lesson 5 ","Lesson 6 ","Lesson 7 ","Comp Rev","Extra Credit 1","Extra Credit 2","Practice Final 1","Practice Final 2&3","Homework","Final Exam","HW","Final","Class"]
["Adkins","Charles",19,13,19,18,14,17,18,25,5,0,10,20,{"$f":"SUM(C2:N2)","v":178},28,{"$f":"IF(O2>=$V$6,\"PASS\",\"FAIL\")","v":"PASS"},{"$f":"IF(P2>=$V$7,\"PASS\",\"FAIL\")","v":"PASS"},{"$f":"IF(SUMPRODUCT((Q2=\"PASS\")*(R2=\"PASS\"))=1,\"PASS\",\"FAIL\")","v":"PASS"}]
["Aitken","Skyler",19,12,15,17,13,16,0,24,0,0,10,20,{"$f":"SUM(C3:N3)","v":146},29,{"$f":"IF(O3>=$V$6,\"PASS\",\"FAIL\")","v":"PASS"},{"$f":"IF(P3>=$V$7,\"PASS\",\"FAIL\")","v":"PASS"},{"$f":"IF(SUMPRODUCT((Q3=\"PASS\")*(R3=\"PASS\"))=1,\"PASS\",\"FAIL\")","v":"PASS"}]
["Allen","Jordan",0,0,0,0,0,0,0,0,0,0,0,0,0,0,"FAIL","FAIL","FAIL"]
["Allen","Nathan",19,9,17,16,12,18,15,29,0,0,10,20,165,28,"PASS","PASS","PASS",null,"Requirements"]
["Allred","Austen",20,14,19,18,14,19,17,33,0,0,10,20,184,29,"PASS","PASS","PASS",null,"HW",140]
["Barker"," Ryan",20,11,14,19,12,17,17,31,0,0,10,20,171,26,"PASS","PASS","PASS",null,"Final",23]
["Barrett"," Thomas",0,15,20,20,12,20,18,40,5,5,10,20,185,29,"PASS","PASS","PASS"]
["bellingham"," dalyn",19,13,17,18,14,13,17,26,0,0,10,20,167,26,"PASS","PASS","PASS",null,"Red","Failed HW and Final"]
["Bench"," Johnny",14,9,17,13,11,15,15,19,5,5,10,20,153,24,"PASS","PASS","PASS",null,"Blue","Passed HW Failed Final"]
["Bennett"," Brandyn",0,0,0,0,0,0,0,0,0,0,0,0,0,0,"FAIL","FAIL","FAIL",null,"Green","Passed Final Failed HW"]
["Bennett"," Trent",19,13,14,18,11,19,16,29,0,0,10,20,169,27,"PASS","PASS","PASS"]
["Bentley"," Sean",20,14,17,18,12,18,13,26,0,0,10,20,168,29,"PASS","PASS","PASS",null,"Stats"]
["Bitnoff"," Kevin",18,13,13,18,11,19,18,31,5,5,10,20,181,29,"PASS","PASS","PASS",null,"Total Enrolled",null,null,{"$f":"COUNT(P:P)","v":234}]
["Bitseedy"," DeVone",19,14,19,19,13,16,19,40,5,5,10,20,199,26,"PASS","PASS","PASS",null,"Total Passed",null,null,{"$f":"COUNTIF(S:S,\"PASS\")","v":205}]
["Blackham"," Jonathan",20,14,19,18,13,20,17,33,0,0,10,20,184,29,"PASS","PASS","PASS",null,"Total Failed",null,null,{"$f":"COUNTIF(S:S,\"FAIL\")","v":29},null,{"$f":"P1","v":"Final Exam"},{"$f":"O1","v":"Homework"}]
["Bludorn"," Sarah",16,11,18,17,9,19,16,26,0,0,10,20,162,29,"PASS","PASS","PASS",null,"Pass %",null,null,{"$f":"X15/X14","v":0.87606837606837606},null,{"$f":"CONCATENATE(\"<\",V7)","v":"<23"},{"$f":"CONCATENATE(\">\",V6)","v":">140"}]
["Bobadilla"," Alvaro",20,14,20,16,12,18,19,34,5,5,10,20,193,30,"PASS","PASS","PASS",null,null,null,null,null,null,{"$f":"Z16","v":"Final Exam"},{"$f":"AA16","v":"Homework"}]
["Braden"," Dan",19,14,19,17,0,18,19,30,5,0,10,20,171,30,"PASS","PASS","PASS",null,"Never Signed up for Myitlab",null,null,null,null,{"$f":"CONCATENATE(\">\",V7)","v":">23"},{"$f":"CONCATENATE(\"<\",V6)","v":"<140"}]
["Brandenburg"," Matt",19,9,18,16,8,18,14,25,0,0,10,20,157,30,"PASS","PASS","PASS",null,"Didn't Take Final",null,null,{"$f":"COUNTIF(P:P,0)","v":23},null,{"$f":"Z18","v":"Final Exam"},{"$f":"AA18","v":"Homework"}]
["Braunberger"," Alex",18,13,14,19,8,16,16,23,5,5,10,20,167,25,"PASS","PASS","PASS",null,"Passed HW Failed Final",null,null,{"$f":"DCOUNT(C:P,1,Z16:AA17)","v":5},null,{"$f":"CONCATENATE(\">\",\"0\")","v":">0"},{"$f":"CONCATENATE(\">\",V6)","v":">140"}]
["Briscoe"," Jessica",18,12,17,19,14,19,16,32,0,0,10,20,177,30,"PASS","PASS","PASS",null,"Passed Final Failed HW",null,null,{"$f":"DCOUNT(C:P,1,Z18:AA19)","v":1}]
["Broderick"," Lynn",20,15,19,18,15,18,19,36,5,5,10,20,200,29,"PASS","PASS","PASS",null,"Passed HW Took Final",null,null,{"$f":"DCOUNT(C:P,1,Z20:AA21)","v":208}]
["Brough"," Nicole",19,14,17,17,14,19,16,28,5,0,10,20,179,30,"PASS","PASS","PASS",null,"Pass % of Students Who Passed Homework and Took Final",null,null,{"$f":"X15/X23","v":0.98557692307692313}]
["Brown"," Kylan",19,12,17,20,15,19,17,29,0,0,10,20,178,27,"PASS","PASS","PASS"]
["Bryan"," Tyson",18,12,15,17,13,18,10,24,0,0,10,20,157,27,"PASS","PASS","PASS"]
["Burton"," Shelby",20,14,18,20,13,20,17,31,5,5,10,20,193,30,"PASS","PASS","PASS"]
["Burwasser"," Joe",0,0,0,0,0,0,0,0,0,0,0,0,0,0,"FAIL","FAIL","FAIL"]
["Butterfield"," John",17,14,15,18,13,17,14,39,5,0,10,20,182,28,"PASS","PASS","PASS"]
["Cabamongan"," Stefanie",18,13,10,19,12,19,15,31,0,0,10,20,167,29,"PASS","PASS","PASS"]
["Calvert"," Justin",19,13,16,18,11,19,17,29,5,0,10,20,177,28,"PASS","PASS","PASS"]
["Campbell"," Clark",20,8,18,17,12,20,15,30,0,0,10,20,170,30,"PASS","PASS","PASS"]
["Cardinal"," James",18,0,0,0,0,0,0,0,0,0,0,0,18,0,"FAIL","FAIL","FAIL"]
["Carpenter"," Brady",17,8,15,0,12,17,17,26,0,5,10,20,147,29,"PASS","PASS","PASS"]
["Charles"," Fanfan",15,14,14,14,8,16,12,20,5,5,10,20,153,26,"PASS","PASS","PASS"]
["Chavez"," Doug",15,11,17,11,10,17,10,24,0,0,10,20,145,27,"PASS","PASS","PASS"]
["Christensen"," Jared",20,12,17,17,12,19,16,33,5,5,10,20,186,29,"PASS","PASS","PASS"]
["Christensen"," Llyr",18,11,16,16,12,18,16,30,0,0,10,20,167,25,"PASS","PASS","PASS"]
["Christensen"," Roland",18,7,16,13,14,18,16,27,0,0,10,20,159,29,"PASS","PASS","PASS"]
["Christopherson"," Alexander",20,14,20,20,15,18,12,32,0,0,10,20,181,29,"PASS","PASS","PASS"]
["Church"," Seth",18,13,17,17,13,18,18,34,0,0,10,0,158,25,"PASS","PASS","PASS"]
["Claiborne"," Austin",15,14,18,15,14,19,15,29,5,5,10,20,179,28,"PASS","PASS","PASS"]
["Cobb"," John Mitchell",20,15,19,20,14,19,19,33,0,0,10,20,189,26,"PASS","PASS","PASS"]
["Cobb"," Richard",19,10,13,19,15,16,17,34,0,0,10,20,173,30,"PASS","PASS","PASS"]
["Cole"," Lauren",20,11,17,19,12,17,16,29,0,0,10,20,171,30,"PASS","PASS","PASS"]
["Connolly"," Richie",16,10,15,16,11,17,15,31,0,5,10,20,166,30,"PASS","PASS","PASS"]
["Cook"," Chelsie",19,14,19,19,13,19,18,31,5,5,10,20,192,28,"PASS","PASS","PASS"]
["Corbridge"," Zak",18,12,16,16,12,18,15,25,0,0,10,20,162,27,"PASS","PASS","PASS"]
["Corry"," Jake",17,14,19,20,12,20,19,40,0,0,10,20,191,28,"PASS","PASS","PASS"]
["Croskrey"," Jeff",20,14,16,16,13,17,16,24,0,0,10,20,166,30,"PASS","PASS","PASS"]
["Cummings"," Daniel",19,14,16,18,0,17,0,0,5,0,10,0,99,0,"FAIL","FAIL","FAIL"]
["Dalton"," Chase",14,11,10,16,12,18,17,31,5,5,10,20,169,30,"PASS","PASS","PASS"]
["Dang"," Bao",19,14,18,20,15,18,18,34,5,5,10,20,196,29,"PASS","PASS","PASS"]
["DeCrescenzo"," Richard",20,13,20,20,14,19,19,35,0,0,10,20,190,29,"PASS","PASS","PASS"]
["Didericksen"," Scott",19,11,16,16,12,18,15,28,0,5,10,20,170,29,"PASS","PASS","PASS"]
["Dodge"," Connor",16,12,18,18,14,18,18,27,0,0,10,20,171,30,"PASS","PASS","PASS"]
["Dowdle"," Kyle",20,12,19,18,14,20,14,33,0,0,10,20,180,29,"PASS","PASS","PASS"]
["Draper"," Rachel",20,14,16,19,15,20,17,33,5,5,10,20,194,29,"PASS","PASS","PASS"]
["Duford"," Bryan",20,14,19,20,14,18,18,32,0,0,10,20,185,30,"PASS","PASS","PASS"]
["Eaton"," Cameron",19,13,18,16,12,19,15,0,0,0,10,20,142,25,"PASS","PASS","PASS"]
["Ehlert"," Benjamin",19,13,16,18,13,20,16,0,0,0,10,20,145,29,"PASS","PASS","PASS"]
["Eichelberger"," Jesse",19,13,17,20,15,19,18,33,0,0,10,20,184,30,"PASS","PASS","PASS"]
["EICHELBERGER"," THOMAS",20,14,20,19,14,20,18,30,5,5,10,20,195,30,"PASS","PASS","PASS"]
["Empey"," Reid",19,13,18,19,15,18,14,35,0,0,10,20,181,30,"PASS","PASS","PASS"]
["Ence"," Alex",18,12,17,18,12,17,14,26,0,0,10,20,164,26,"PASS","PASS","PASS"]
["Ericson"," Paul",20,14,20,19,15,20,20,36,0,0,10,20,194,27,"PASS","PASS","PASS"]
["Evans"," Jimmy",18,14,14,17,13,17,18,26,0,0,10,20,{"$f":"SUM(C67:N67)","v":167},29,{"$f":"IF(O67>=$V$6,\"PASS\",\"FAIL\")","v":"PASS"},{"$f":"IF(P67>=$V$7,\"PASS\",\"FAIL\")","v":"PASS"},{"$f":"IF(SUMPRODUCT((Q67=\"PASS\")*(R67=\"PASS\"))=1,\"PASS\",\"FAIL\")","v":"PASS"}]
["Fielding"," Brynlee",19,14,17,16,11,19,18,34,0,0,10,20,178,29,"PASS","PASS","PASS"]
["Folsom"," Amy",19,15,17,18,13,20,19,32,0,0,10,20,183,24,"PASS","PASS","PASS"]
["fuhriman"," troy",20,11,17,18,12,0,15,29,0,0,10,20,152,29,"PASS","PASS","PASS"]
["Galan"," Andres",19,15,14,19,13,18,14,31,5,5,10,20,183,29,"PASS","PASS","PASS"]
["Gallagher"," Cherie",19,14,10,17,13,20,14,27,0,0,10,20,164,29,"PASS","PASS","PASS"]
["Ganbat"," Tungalag",18,15,19,18,13,18,15,0,5,5,10,0,136,0,"FAIL","FAIL","FAIL"]
["Garcia"," Troy",20,13,19,19,12,0,16,29,0,0,0,20,148,28,"PASS","PASS","PASS"]
["Gardner"," Nathaniel",20,12,14,19,13,17,17,26,5,0,10,20,173,29,"PASS","PASS","PASS"]
["Gilster"," Daniel",20,10,18,17,12,18,14,28,0,0,10,20,167,27,"PASS","PASS","PASS"]
["Gomez"," Julia",20,12,16,16,14,19,14,28,5,5,0,20,169,30,"PASS","PASS","PASS"]
["gormley"," patrick",19,10,15,17,13,19,18,32,0,0,10,20,173,29,"PASS","PASS","PASS"]
["Graves"," Angela",15,9,17,15,14,18,16,33,0,0,10,20,167,30,"PASS","PASS","PASS"]
["Gregson"," Landon",20,14,20,17,15,19,19,34,0,0,10,20,188,28,"PASS","PASS","PASS"]
["Guynn"," William",19,13,17,17,11,20,18,32,0,0,10,20,177,25,"PASS","PASS","PASS"]
["Hansen"," Travisse",20,13,19,19,13,17,16,21,0,0,10,20,168,28,"PASS","PASS","PASS"]
["Harmon"," Kyler",19,14,18,19,14,20,17,33,0,0,10,20,184,30,"PASS","PASS","PASS"]
["Haskell"," Eric",19,12,20,17,13,15,16,28,0,0,10,20,170,29,"PASS","PASS","PASS"]
["Haymond"," Andrew",17,13,14,18,10,19,15,22,5,5,10,20,168,30,"PASS","PASS","PASS"]
["Haymore"," Sarah",18,12,17,17,12,20,15,28,0,0,10,20,169,29,"PASS","PASS","PASS"]
["Hayne"," Dallin",19,13,17,17,10,19,16,31,0,0,10,20,172,29,"PASS","PASS","PASS"]
["Hepfinger"," Lisa",17,12,18,19,11,19,16,24,5,5,10,20,176,26,"PASS","PASS","PASS"]
["Hermansen"," Andrew",20,13,18,17,13,19,18,32,0,0,10,20,180,25,"PASS","PASS","PASS"]
["Heyland"," Taylor",18,10,18,18,14,16,15,29,0,0,10,20,168,29,"PASS","PASS","PASS"]
["Hiatt"," Taylor",19,13,17,16,12,18,18,28,5,5,10,20,181,25,"PASS","PASS","PASS"]
["Hill"," Jackson",19,12,17,18,14,20,20,39,5,5,0,20,189,0,"PASS","FAIL","FAIL"]
["Hillam"," Kelsea",16,13,19,19,12,20,17,22,5,5,10,20,178,24,"PASS","PASS","PASS"]
["Hilton"," Laura",19,12,18,19,10,18,17,33,0,0,10,20,176,29,"PASS","PASS","PASS"]
["Hilton"," Michael",20,15,19,19,15,19,20,39,0,0,0,0,166,0,"PASS","FAIL","FAIL"]
["hintze"," matt",0,0,0,0,0,0,0,0,0,0,0,0,0,0,"FAIL","FAIL","FAIL"]
["Hirschi"," Alaina",19,12,17,18,13,17,15,0,5,0,10,20,146,30,"PASS","PASS","PASS"]
["Ho"," Duc",18,14,16,19,15,20,18,31,5,5,10,20,191,30,"PASS","PASS","PASS"]
["Hollingshead"," Andrew",0,0,0,0,0,0,0,0,0,0,0,0,0,0,"FAIL","FAIL","FAIL"]
["Holmes"," Courtney",19,14,18,15,10,16,18,28,5,5,10,20,178,25,"PASS","PASS","PASS"]
["Holt"," Brian",20,15,18,20,15,20,17,31,0,0,10,20,186,24,"PASS","PASS","PASS"]
["Homer"," Jessalyn",18,13,17,16,13,19,17,23,0,0,10,20,166,30,"PASS","PASS","PASS"]
["Houldridge"," Rachel",19,10,17,15,12,18,15,30,5,5,10,20,176,28,"PASS","PASS","PASS"]
["Howard"," Seth",20,12,16,15,12,18,14,27,0,0,10,20,164,30,"PASS","PASS","PASS"]
["Jardine"," Kyle",20,13,17,19,12,19,14,29,0,0,10,20,173,30,"PASS","PASS","PASS"]
["Jeffords"," Remington",18,12,19,15,11,16,15,33,0,0,10,20,169,30,"PASS","PASS","PASS"]
["Jensen"," Holly",20,12,19,18,11,19,15,32,0,0,10,20,176,30,"PASS","PASS","PASS"]
["Jensen"," Steven",19,13,20,19,11,19,17,31,0,0,10,0,159,29,"PASS","PASS","PASS"]
["Jimenez"," Ian",19,11,17,17,12,19,13,32,0,0,10,0,150,28,"PASS","PASS","PASS"]
["Johansen"," Deborah",20,15,18,19,14,17,18,30,0,0,10,20,181,28,"PASS","PASS","PASS"]
["Johnson"," Brooke",19,14,15,17,13,18,12,29,5,5,10,20,177,29,"PASS","PASS","PASS"]
["Johnson"," Jonathan",18,13,17,18,11,20,14,27,0,0,10,20,168,28,"PASS","PASS","PASS"]
["Johnson"," Taylor",17,13,13,14,9,17,14,21,5,5,10,20,158,28,"PASS","PASS","PASS"]
["Jonathan"," Bradshaw",17,14,17,16,13,19,16,32,5,0,10,20,179,30,"PASS","PASS","PASS"]
["Judd"," Blaine",20,14,19,18,13,17,19,34,5,5,10,20,194,29,"PASS","PASS","PASS"]
["Juncker"," Joshua",20,15,19,19,14,20,18,38,5,0,10,20,198,29,"PASS","PASS","PASS"]
["Karlsven"," Matt",20,15,18,19,13,20,19,32,5,0,10,20,191,30,"PASS","PASS","PASS"]
["King"," Kortney",19,11,17,18,13,19,14,27,0,0,10,20,168,27,"PASS","PASS","PASS"]
["Kinghorn"," Robert",20,13,15,16,15,19,18,31,0,0,10,20,177,30,"PASS","PASS","PASS"]
["Kite"," Taylor",17,12,17,15,14,17,19,28,5,5,10,0,159,26,"PASS","PASS","PASS"]
["Klemetson"," Broderick",19,12,14,20,13,18,15,31,0,0,10,20,172,29,"PASS","PASS","PASS"]
["Knab"," Tiffany",20,14,16,20,14,18,17,27,5,5,10,20,186,29,"PASS","PASS","PASS"]
["Koons"," Aaron",20,14,18,19,14,19,19,36,5,0,10,0,174,28,"PASS","PASS","PASS"]
["Krebs"," Walker",18,0,0,0,0,0,0,0,0,0,0,0,18,0,"FAIL","FAIL","FAIL"]
["Kubal"," Jessica",19,14,18,16,12,20,16,33,5,5,10,20,188,28,"PASS","PASS","PASS"]
["Kuettel"," Joseph",18,14,18,19,14,20,18,32,5,5,10,20,193,30,"PASS","PASS","PASS"]
["Labrum"," McKenzie",19,14,18,19,14,20,17,31,0,0,10,20,182,25,"PASS","PASS","PASS"]
["Larsen"," Gregory",19,14,17,19,15,19,16,31,0,5,10,20,185,30,"PASS","PASS","PASS"]
["Larsen"," Zackery",18,14,18,18,12,20,16,23,5,0,10,20,174,29,"PASS","PASS","PASS"]
["Laughlin"," Taylor",0,0,0,0,0,0,0,0,0,0,0,0,0,0,"FAIL","FAIL","FAIL"]
["Le"," Phong",20,13,15,16,9,19,20,38,5,5,10,20,{"$f":"SUM(C131:N131)","v":190},28,{"$f":"IF(O131>=$V$6,\"PASS\",\"FAIL\")","v":"PASS"},{"$f":"IF(P131>=$V$7,\"PASS\",\"FAIL\")","v":"PASS"},{"$f":"IF(SUMPRODUCT((Q131=\"PASS\")*(R131=\"PASS\"))=1,\"PASS\",\"FAIL\")","v":"PASS"}]
["Li"," Liyi",20,14,20,19,14,19,13,39,5,5,10,20,198,29,"PASS","PASS","PASS"]
["Lopez (Villegas)"," (Jesus) Alejandro",20,14,18,20,15,19,20,37,5,5,10,20,203,28,"PASS","PASS","PASS"]
["Loveless"," David",19,12,14,15,10,18,15,29,5,0,10,20,167,28,"PASS","PASS","PASS"]
["Lucero"," Santiago",19,14,18,20,12,19,15,27,0,0,10,20,174,28,"PASS","PASS","PASS"]
["Mansius"," Neal",20,14,18,19,14,20,16,0,0,0,10,20,151,30,"PASS","PASS","PASS"]
["Marquardt"," Josh",15,8,17,17,13,16,8,24,0,0,10,20,148,28,"PASS","PASS","PASS"]
["marsh"," stephen",19,13,18,18,14,16,17,26,0,0,0,0,141,27,"PASS","PASS","PASS"]
["McCarty"," Andrew Allan",20,13,17,20,14,18,0,24,0,0,10,20,156,27,"PASS","PASS","PASS"]
["McCord"," Ryan",20,11,18,17,13,19,18,30,0,0,10,20,176,28,"PASS","PASS","PASS"]
["mchargue"," jacob",19,13,17,18,11,19,17,34,0,0,10,20,178,27,"PASS","PASS","PASS"]
["Metcalf"," Kelsey",0,0,0,0,0,0,0,0,0,0,0,0,0,0,"FAIL","FAIL","FAIL"]
["Meyer"," Tyson",19,14,18,15,11,18,14,30,5,0,10,20,174,28,"PASS","PASS","PASS"]
["Milne"," Jace",19,12,18,18,13,20,14,28,5,5,10,20,182,30,"PASS","PASS","PASS"]
["Miner"," Steven",20,14,18,16,12,19,14,26,0,0,10,20,169,30,"PASS","PASS","PASS"]
["Morris"," Daniel",14,12,19,16,10,19,15,30,0,0,10,20,165,29,"PASS","PASS","PASS"]
["MORRISS"," ANNA",15,9,18,16,12,20,14,28,5,5,10,0,152,0,"PASS","FAIL","FAIL"]
["Mortensen"," Zach",20,13,16,18,14,19,17,0,5,5,10,20,157,25,"PASS","PASS","PASS"]
["Murphy"," James",20,14,16,17,13,0,0,0,0,0,0,0,80,0,"FAIL","FAIL","FAIL"]
["Nam"," Yunhee",17,12,13,15,6,9,11,0,0,0,0,0,83,3,"FAIL","FAIL","FAIL"]
["Nelson"," Jeffery",20,14,19,20,14,20,17,33,0,0,10,0,167,29,"PASS","PASS","PASS"]
["Nickerson"," David",19,14,0,0,0,0,0,0,0,0,0,0,33,0,"FAIL","FAIL","FAIL"]
["Nilsen"," Britton",19,14,17,16,14,19,17,26,0,0,0,20,162,27,"PASS","PASS","PASS"]
["Nilsson"," Kenneth",20,14,20,17,15,19,16,12,5,5,10,20,173,29,"PASS","PASS","PASS"]
["Oakey"," Gabriel",18,9,12,18,13,18,10,22,0,0,10,0,130,1,"FAIL","FAIL","FAIL"]
["Osuna"," Gil",15,10,10,17,11,18,13,32,0,0,10,20,156,30,"PASS","PASS","PASS"]
["Palkki"," Joshua",0,0,0,0,0,0,0,0,0,0,0,0,0,0,"FAIL","FAIL","FAIL"]
["Pan"," Yuxin",20,14,20,20,12,20,18,39,5,5,10,20,203,29,"PASS","PASS","PASS"]
["Pande"," Eric",20,13,17,18,0,0,0,0,5,5,0,0,78,0,"FAIL","FAIL","FAIL"]
["Paxman"," Alicia",19,12,17,19,14,18,17,32,5,5,10,20,188,30,"PASS","PASS","PASS"]
["perkes"," tim",20,15,20,18,15,20,19,36,0,0,10,20,193,30,"PASS","PASS","PASS"]
["Petersen"," Jennie",20,13,18,18,10,18,15,29,0,0,10,20,171,29,"PASS","PASS","PASS"]
["Pettersson"," Ryan",19,10,16,17,12,17,14,27,0,0,10,20,162,29,"PASS","PASS","PASS"]
["Pfeiffer"," Erik",19,14,18,17,13,16,16,28,5,0,10,20,176,26,"PASS","PASS","PASS"]
["Posey"," Amy",16,10,15,15,11,19,16,27,5,5,10,20,169,27,"PASS","PASS","PASS"]
["Powers"," Cody",19,14,19,19,11,20,16,27,0,0,10,20,175,28,"PASS","PASS","PASS"]
["Preston"," John",20,15,18,20,13,19,17,35,0,0,10,20,187,29,"PASS","PASS","PASS"]
["Prete"," Jordan",18,0,16,0,14,0,0,0,0,0,0,0,48,0,"FAIL","FAIL","FAIL"]
["Price"," Jordan",18,11,17,18,14,20,16,0,5,0,10,10,139,28,"FAIL","PASS","FAIL"]
["Prior"," Caleb",20,13,16,19,15,19,14,15,0,0,10,20,161,30,"PASS","PASS","PASS"]
["Pugmire"," Samuel",19,15,20,20,15,19,20,39,0,0,10,20,197,12,"PASS","FAIL","FAIL"]
["qin"," shaoyi",19,14,16,19,13,18,15,28,5,5,10,20,182,30,"PASS","PASS","PASS"]
["Rabe"," Joshua",20,12,17,18,11,15,13,26,5,5,10,20,172,28,"PASS","PASS","PASS"]
["Rich"," Gregory",20,13,18,19,15,20,18,35,0,0,10,20,188,29,"PASS","PASS","PASS"]
["Richardson"," Adam",20,14,17,19,15,19,18,33,5,5,10,20,195,29,"PASS","PASS","PASS"]
["Richardson"," Stephen",19,12,16,19,14,18,15,34,0,0,10,20,177,30,"PASS","PASS","PASS"]
["Rimal"," Sarat Jr.",18,10,17,18,11,19,17,29,5,5,10,20,179,27,"PASS","PASS","PASS"]
["Robinson"," Ada Lee",0,0,0,0,0,0,0,0,0,0,0,0,0,0,"FAIL","FAIL","FAIL"]
["Robinson"," Alyssa",18,10,18,17,13,18,15,23,0,0,10,20,162,25,"PASS","PASS","PASS"]
["Rodee"," Audra",20,15,20,18,14,20,18,36,0,0,10,20,191,30,"PASS","PASS","PASS"]
["Romrell"," Taylor",20,14,18,18,12,17,16,32,0,5,10,20,182,25,"PASS","PASS","PASS"]
["Roney"," Mari",19,14,18,18,13,18,12,30,0,0,10,20,172,20,"PASS","FAIL","FAIL"]
["Rowberry"," Tiffany",18,12,16,18,12,18,17,30,0,0,10,20,171,28,"PASS","PASS","PASS"]
["Ruff"," Eric TJ",19,14,19,17,13,18,18,30,0,0,10,20,178,28,"PASS","PASS","PASS"]
["Sander"," Emily",19,14,20,19,15,18,19,30,0,0,10,20,184,29,"PASS","PASS","PASS"]
["Sawyer"," Lane",20,14,17,20,14,19,19,35,0,0,10,20,188,24,"PASS","PASS","PASS"]
["Shaner"," Sarah",18,13,18,17,12,20,16,29,0,5,10,20,178,29,"PASS","PASS","PASS"]
["Sheffield"," Jordan",20,13,19,17,11,19,16,32,5,0,10,20,182,30,"PASS","PASS","PASS"]
["Shields"," Emily",20,13,17,16,11,17,12,21,0,5,10,20,162,28,"PASS","PASS","PASS"]
["Siepert"," Ryan",19,10,20,18,14,20,20,39,0,0,10,20,190,28,"PASS","PASS","PASS"]
["Simmons"," Madeline",18,13,14,17,12,17,14,27,0,0,10,20,162,28,"PASS","PASS","PASS"]
["Smith"," matthew",19,14,19,18,15,19,15,31,5,0,10,20,185,30,"PASS","PASS","PASS"]
["Smith"," Rachel",15,13,17,18,11,20,17,31,0,0,10,20,172,29,"PASS","PASS","PASS"]
["SOELBERG"," ASHLYN",20,14,17,18,15,20,14,28,0,0,10,20,176,30,"PASS","PASS","PASS"]
["Solomon"," Christian",19,13,19,16,12,19,16,27,0,0,10,20,{"$f":"SUM(C195:N195)","v":171},28,{"$f":"IF(O195>=$V$6,\"PASS\",\"FAIL\")","v":"PASS"},{"$f":"IF(P195>=$V$7,\"PASS\",\"FAIL\")","v":"PASS"},{"$f":"IF(SUMPRODUCT((Q195=\"PASS\")*(R195=\"PASS\"))=1,\"PASS\",\"FAIL\")","v":"PASS"}]
["Souza"," Raphael",17,12,15,19,12,19,16,28,0,0,10,20,168,29,"PASS","PASS","PASS"]
["Stapleton"," Kevin",20,15,19,17,13,20,20,29,0,5,10,20,188,30,"PASS","PASS","PASS"]
["Stapley"," Emily",19,14,16,19,13,16,14,26,0,0,10,20,167,29,"PASS","PASS","PASS"]
["Stark"," Rebecca",20,14,16,18,12,18,16,29,5,5,10,20,183,28,"PASS","PASS","PASS"]
["Stevenson"," Ben",19,13,16,20,14,18,20,27,5,0,10,20,182,30,"PASS","PASS","PASS"]
["Stewart"," Christian",19,13,17,19,14,18,14,33,0,0,10,20,177,30,"PASS","PASS","PASS"]
["Subiantoro"," Kinantia",19,14,20,20,15,20,20,37,5,0,10,20,200,30,"PASS","PASS","PASS"]
["Swanson"," Lewis",20,13,17,19,14,19,17,27,0,0,10,10,166,28,"PASS","PASS","PASS"]
["Sweeney"," James",19,13,17,16,11,16,18,32,0,0,10,20,172,29,"PASS","PASS","PASS"]
["Sweeney"," Sean T",19,14,18,18,15,19,15,30,5,0,10,20,183,30,"PASS","PASS","PASS"]
["Tai"," Jintoku",20,15,19,19,15,19,16,30,0,0,10,20,183,28,"PASS","PASS","PASS"]
["Tanner"," Matson",18,14,18,18,13,20,17,26,0,0,10,0,154,29,"PASS","PASS","PASS"]
["Tanner"," Todd",17,12,18,17,13,19,17,39,0,0,10,20,182,26,"PASS","PASS","PASS"]
["Thompson"," Payton",19,12,14,18,11,19,19,29,5,0,10,20,176,27,"PASS","PASS","PASS"]
["Thurgood"," Dewey",20,13,16,17,12,19,16,34,0,0,10,20,177,30,"PASS","PASS","PASS"]
["Tolman"," Kevan",17,11,12,17,11,12,9,24,0,0,10,0,123,0,"FAIL","FAIL","FAIL"]
["Trottier"," Alexi",19,13,18,19,11,19,17,28,0,0,10,20,174,28,"PASS","PASS","PASS"]
["Tuft"," Kyle",20,13,18,20,15,19,19,38,0,0,10,20,192,30,"PASS","PASS","PASS"]
["Turner"," Jordan",19,10,17,19,14,20,17,26,0,0,10,20,172,28,"PASS","PASS","PASS"]
["Vail"," Michael",20,13,19,20,15,20,20,37,5,0,10,20,199,29,"PASS","PASS","PASS"]
["VanDerwerken"," Ariel",20,14,20,18,15,20,16,31,0,0,10,20,184,26,"PASS","PASS","PASS"]
["Walker"," Terry",20,11,18,16,13,16,18,30,0,0,10,20,172,26,"PASS","PASS","PASS"]
["Wandelt"," Lindsey",19,14,17,20,11,16,17,26,5,5,10,20,180,28,"PASS","PASS","PASS"]
["warner"," matilyn",18,14,17,17,15,17,17,27,0,0,10,20,172,29,"PASS","PASS","PASS"]
["Waters"," Brock",17,13,19,17,13,19,14,21,0,0,10,20,163,25,"PASS","PASS","PASS"]
["Weaver"," Celina",20,14,17,16,14,17,17,27,0,0,10,20,172,29,"PASS","PASS","PASS"]
["Weight"," Hayley",18,14,18,18,12,18,18,32,5,0,10,20,183,30,"PASS","PASS","PASS"]
["Weirich"," Brian",19,11,18,19,14,19,18,32,0,0,10,20,180,30,"PASS","PASS","PASS"]
["Wells"," Cody",19,14,19,19,13,19,17,27,0,0,10,20,177,29,"PASS","PASS","PASS"]
["Wennerholm"," Ashley",19,14,16,20,14,19,18,33,0,0,10,20,183,30,"PASS","PASS","PASS"]
["Wilkinson"," Ashley",20,13,17,14,13,19,17,31,0,0,10,20,174,30,"PASS","PASS","PASS"]
["Willard"," Delaney",14,11,14,15,11,13,13,27,5,5,10,20,158,24,"PASS","PASS","PASS"]
["Wise"," Andrea",19,15,17,19,12,19,15,27,5,5,10,20,183,25,"PASS","PASS","PASS"]
["Wiser"," Zachary",16,14,18,18,10,19,14,24,0,0,10,20,163,28,"PASS","PASS","PASS"]
["Wood"," Michael",19,13,14,18,14,19,18,0,0,0,0,0,115,0,"FAIL","FAIL","FAIL"]
["Woolsey"," Michael",19,13,18,18,13,19,17,33,5,5,10,20,190,29,"PASS","PASS","PASS"]
["Wyman"," Scott",0,0,0,0,0,0,0,0,0,0,0,0,0,0,"FAIL","FAIL","FAIL"]
["Yentes"," Garrett",18,7,18,16,15,19,18,32,0,0,10,20,173,26,"PASS","PASS","PASS"]
["Zhang"," Meng",20,14,18,19,15,20,17,28,5,5,10,20,191,28,"PASS","PASS","PASS"]
["Yost","Paul",16,11,17,16,13,19,17,28,5,5,10,20,177,30,"PASS","PASS","FAIL"]

{"sheet":"Temp","index":1,"n_rows":0,"n_cols":0,"rows_kept":0,"cut":false,"hidden":false,"merged":[]}

{"sheet":"LOCKED","index":2,"n_rows":21,"n_cols":4,"rows_kept":21,"cut":false,"hidden":false,"merged":[]}
[]
[]
["Lesson 1 Quiz",20,null,"y"]
["Lesson 2 Quiz",15,null,"y"]
["Lesson 3 Quiz",20,null,"y"]
["Lesson 4 Quiz",20,null,"y"]
["Lesson 5 Quiz",15,null,"y"]
["Lesson 6 Quiz",20,null,"y"]
["Lesson 7 Quiz",20,null,"y"]
["Comprehensive Review",40,null,"y"]
["Enrichment Lecture A  Bonus Points",5,null,"y"]
["Enrichment Lecture B Bonus Points",5,null,"y"]
["Practice Exam 1",10,null,"y"]
["Practice Exam 2",10,null,"y"]
["Practice Exam 3",10,null,"y"]
["Final Exam",30,"c","x"]
["Final Exam R",15,null,"x"]
["combine1",5,null,"y"]
["combine1",5,null,"y"]
["combine2",5,null,"y"]
["combine4",5,null,"y"]