{"text_format":"1","workbook":"xlsx","n_sheets":2,"sheets":["Dashboard","List"],"not_rendered":{"charts":0,"images":0,"macros":1,"external_links":0,"defined_names":59,"comments":0,"pivot_tables":0},"unopened":[],"bounds":{"document_bytes":16777216,"sheet_cells":100000,"rows_first":2000,"rows_last":500,"rows_between":2000,"halvings":0,"cell_chars":16384,"cell_head_chars":4096},"cells_cut":0,"cells_raw":0,"read":"whole","date_system":"1900"}

{"sheet":"Dashboard","index":0,"n_rows":35,"n_cols":21,"rows_kept":35,"cut":false,"hidden":false,"merged":[]}
[]
[null,null,null,null,null,null,"Return",null,null,null,null,"Risk"]
[null,"S&P 500 Index ",null,null,null,null,"1-Yr Return","3-Yr Return","5-Yr Return","10-Yr Return",null,"3 Yr Beta","3 Yr Standard Deviation","5 Yr Beta","5 Yr Standard Deviation","10 Yr Beta","10 Yr Standard Deviation"]
[null,null,"S&P 500 Index",null,null,null,0.22570000000000001,2.1899999999999999E-2,2.8700000000000003E-2,0,null,1,21.84,1,17.829999999999998,1,"N/A"]
[]
[null,"Total Investment Holding:",null,100000]
[]
[null,"Portfolio Information",null,null,null,null,"Return",null,null,null,null,"Risk",null,null,null,null,null,null,"Cost"]
[null,"Ticker","Fund Name","Category","Investment","Allocation %","Load Adj 1-Yr Return","Load Adj 3-Yr Return","Load Adj 5-Yr Return","Load Adj 10-Yr Return",null,"3 Yr Beta","3 Yr Standard Deviation","5 Yr Beta","5 Yr Standard Deviation","10 Yr Beta","10 Yr Standard Deviation",null,"3 Yr Exp Proj / $10,000","5 Yr Exp Proj / $10,000","10 Yr Exp Proj / $10,000"]
[null,"AGTHX",{"$f":"VLOOKUP(B10,List!B:BG,2,FALSE)","v":"American Funds Growth Fund of Amer A"},{"$f":"VLOOKUP(B10,List!B:BG,3,FALSE)","v":"Large Growth"},{"$f":"$D$6*F10","v":0},0,{"$f":"VLOOKUP(B10,List!B:BG,23,FALSE)","v":6.9599999999999995E-2},{"$f":"VLOOKUP(B10,List!B:BG,24,FALSE)","v":-3.0000000000000001E-3},{"$f":"VLOOKUP(B10,List!B:BG,25,FALSE)","v":1.49E-2},{"$f":"VLOOKUP(B10,List!B:BG,26,FALSE)","v":4.2799999999999998E-2},null,{"$f":"VLOOKUP(B10,List!B:BG,39,FALSE)","v":0.96},{"$f":"VLOOKUP(B10,List!B:BG,42,FALSE)","v":21.58},{"$f":"VLOOKUP(B10,List!B:BG,46,FALSE)","v":0.96},{"$f":"VLOOKUP(B10,List!B:BG,49,FALSE)","v":17.600000000000001},{"$f":"VLOOKUP(B10,List!B:BG,53,FALSE)","v":1.01},{"$f":"VLOOKUP(B10,List!B:BG,56,FALSE)","v":16.77},null,{"$f":"VLOOKUP(B10,List!B:BG,15,FALSE)","v":783},{"$f":"VLOOKUP(B10,List!B:BG,16,FALSE)","v":937},{"$f":"VLOOKUP(B10,List!B:BG,17,FALSE)","v":1384}]
[null,"AMAGX",{"$f":"VLOOKUP(B11,List!B:BG,2,FALSE)","v":"Amana Trust Growth"},{"$f":"VLOOKUP(B11,List!B:BG,3,FALSE)","v":"Large Growth"},10000,0.1,{"$f":"VLOOKUP(B11,List!B:BG,23,FALSE)","v":0.20699999999999999},{"$f":"VLOOKUP(B11,List!B:BG,24,FALSE)","v":6.1699999999999998E-2},{"$f":"VLOOKUP(B11,List!B:BG,25,FALSE)","v":6.7799999999999999E-2},{"$f":"VLOOKUP(B11,List!B:BG,26,FALSE)","v":7.5499999999999998E-2},null,{"$f":"VLOOKUP(B11,List!B:BG,39,FALSE)","v":0.77},{"$f":"VLOOKUP(B11,List!B:BG,42,FALSE)","v":17.96},{"$f":"VLOOKUP(B11,List!B:BG,46,FALSE)","v":0.79},{"$f":"VLOOKUP(B11,List!B:BG,49,FALSE)","v":15.16},{"$f":"VLOOKUP(B11,List!B:BG,53,FALSE)","v":0.91},{"$f":"VLOOKUP(B11,List!B:BG,56,FALSE)","v":15.95},null,{"$f":"VLOOKUP(B11,List!B:BG,15,FALSE)","v":384},{"$f":"VLOOKUP(B11,List!B:BG,16,FALSE)","v":665},{"$f":"VLOOKUP(B11,List!B:BG,17,FALSE)","v":1466}]
[null,"BERIX",{"$f":"VLOOKUP(B12,List!B:BG,2,FALSE)","v":"Berwyn Income"},{"$f":"VLOOKUP(B12,List!B:BG,3,FALSE)","v":"Conservative Allocation"},10000,0.1,{"$f":"VLOOKUP(B12,List!B:BG,23,FALSE)","v":0.1084},{"$f":"VLOOKUP(B12,List!B:BG,24,FALSE)","v":0.10100000000000001},{"$f":"VLOOKUP(B12,List!B:BG,25,FALSE)","v":8.3500000000000005E-2},{"$f":"VLOOKUP(B12,List!B:BG,26,FALSE)","v":8.9300000000000004E-2},null,{"$f":"VLOOKUP(B12,List!B:BG,39,FALSE)","v":0.56999999999999995},{"$f":"VLOOKUP(B12,List!B:BG,42,FALSE)","v":9.0399999999999991},{"$f":"VLOOKUP(B12,List!B:BG,46,FALSE)","v":0.56000000000000005},{"$f":"VLOOKUP(B12,List!B:BG,49,FALSE)","v":7.26},{"$f":"VLOOKUP(B12,List!B:BG,53,FALSE)","v":0.5},{"$f":"VLOOKUP(B12,List!B:BG,56,FALSE)","v":6.22},null,{"$f":"VLOOKUP(B12,List!B:BG,15,FALSE)","v":230},{"$f":"VLOOKUP(B12,List!B:BG,16,FALSE)","v":401},{"$f":"VLOOKUP(B12,List!B:BG,17,FALSE)","v":894}]
[null,"CGMRX",{"$f":"VLOOKUP(B13,List!B:BG,2,FALSE)","v":"CGM Realty"},{"$f":"VLOOKUP(B13,List!B:BG,3,FALSE)","v":"Real Estate"},10000,0.1,{"$f":"VLOOKUP(B13,List!B:BG,23,FALSE)","v":0.37830000000000003},{"$f":"VLOOKUP(B13,List!B:BG,24,FALSE)","v":8.0999999999999996E-3},{"$f":"VLOOKUP(B13,List!B:BG,25,FALSE)","v":9.5000000000000001E-2},{"$f":"VLOOKUP(B13,List!B:BG,26,FALSE)","v":0.2029},null,{"$f":"VLOOKUP(B13,List!B:BG,39,FALSE)","v":1.55},{"$f":"VLOOKUP(B13,List!B:BG,42,FALSE)","v":40.24},{"$f":"VLOOKUP(B13,List!B:BG,46,FALSE)","v":1.53},{"$f":"VLOOKUP(B13,List!B:BG,49,FALSE)","v":33.03},{"$f":"VLOOKUP(B13,List!B:BG,53,FALSE)","v":1.18},{"$f":"VLOOKUP(B13,List!B:BG,56,FALSE)","v":27.44},null,{"$f":"VLOOKUP(B13,List!B:BG,15,FALSE)","v":296},{"$f":"VLOOKUP(B13,List!B:BG,16,FALSE)","v":515},{"$f":"VLOOKUP(B13,List!B:BG,17,FALSE)","v":1143}]
[null,"CRMMX",{"$f":"VLOOKUP(B14,List!B:BG,2,FALSE)","v":"CRM Mid Cap Value Inv"},{"$f":"VLOOKUP(B14,List!B:BG,3,FALSE)","v":"Mid-Cap Blend"},10000,0.1,{"$f":"VLOOKUP(B14,List!B:BG,23,FALSE)","v":0.26860000000000001},{"$f":"VLOOKUP(B14,List!B:BG,24,FALSE)","v":4.2799999999999998E-2},{"$f":"VLOOKUP(B14,List!B:BG,25,FALSE)","v":5.1999999999999998E-2},{"$f":"VLOOKUP(B14,List!B:BG,26,FALSE)","v":9.6699999999999994E-2},null,{"$f":"VLOOKUP(B14,List!B:BG,39,FALSE)","v":0.98},{"$f":"VLOOKUP(B14,List!B:BG,42,FALSE)","v":22.01},{"$f":"VLOOKUP(B14,List!B:BG,46,FALSE)","v":0.97},{"$f":"VLOOKUP(B14,List!B:BG,49,FALSE)","v":17.98},{"$f":"VLOOKUP(B14,List!B:BG,53,FALSE)","v":0.91},{"$f":"VLOOKUP(B14,List!B:BG,56,FALSE)","v":16.170000000000002},null,{"$f":"VLOOKUP(B14,List!B:BG,15,FALSE)","v":331},{"$f":"VLOOKUP(B14,List!B:BG,16,FALSE)","v":574},{"$f":"VLOOKUP(B14,List!B:BG,17,FALSE)","v":1271}]
[null,"CVGRX",{"$f":"VLOOKUP(B15,List!B:BG,2,FALSE)","v":"Calamos Growth A"},{"$f":"VLOOKUP(B15,List!B:BG,3,FALSE)","v":"Large Growth"},0,0,{"$f":"VLOOKUP(B15,List!B:BG,23,FALSE)","v":0.24099999999999999},{"$f":"VLOOKUP(B15,List!B:BG,24,FALSE)","v":1.7500000000000002E-2},{"$f":"VLOOKUP(B15,List!B:BG,25,FALSE)","v":1.83E-2},{"$f":"VLOOKUP(B15,List!B:BG,26,FALSE)","v":5.5399999999999998E-2},null,{"$f":"VLOOKUP(B15,List!B:BG,39,FALSE)","v":1.1299999999999999},{"$f":"VLOOKUP(B15,List!B:BG,42,FALSE)","v":26.56},{"$f":"VLOOKUP(B15,List!B:BG,46,FALSE)","v":1.1599999999999999},{"$f":"VLOOKUP(B15,List!B:BG,49,FALSE)","v":22.57},{"$f":"VLOOKUP(B15,List!B:BG,53,FALSE)","v":1.03},{"$f":"VLOOKUP(B15,List!B:BG,56,FALSE)","v":19.27},null,{"$f":"VLOOKUP(B15,List!B:BG,15,FALSE)","v":862},{"$f":"VLOOKUP(B15,List!B:BG,16,FALSE)","v":1145},{"$f":"VLOOKUP(B15,List!B:BG,17,FALSE)","v":1947}]
[null,"DHSCX",{"$f":"VLOOKUP(B16,List!B:BG,2,FALSE)","v":"Diamond Hill Small Cap A"},{"$f":"VLOOKUP(B16,List!B:BG,3,FALSE)","v":"Small Value"},0,0,{"$f":"VLOOKUP(B16,List!B:BG,23,FALSE)","v":0.18329999999999999},{"$f":"VLOOKUP(B16,List!B:BG,24,FALSE)","v":5.3100000000000001E-2},{"$f":"VLOOKUP(B16,List!B:BG,25,FALSE)","v":2.5499999999999998E-2},{"$f":"VLOOKUP(B16,List!B:BG,26,FALSE)","v":0.1012},null,{"$f":"VLOOKUP(B16,List!B:BG,39,FALSE)","v":1.02},{"$f":"VLOOKUP(B16,List!B:BG,42,FALSE)","v":23.74},{"$f":"VLOOKUP(B16,List!B:BG,46,FALSE)","v":1},{"$f":"VLOOKUP(B16,List!B:BG,49,FALSE)","v":19.52},{"$f":"VLOOKUP(B16,List!B:BG,53,FALSE)","v":1.02},{"$f":"VLOOKUP(B16,List!B:BG,56,FALSE)","v":19.100000000000001},null,{"$f":"VLOOKUP(B16,List!B:BG,15,FALSE)","v":906},{"$f":"VLOOKUP(B16,List!B:BG,16,FALSE)","v":1202},{"$f":"VLOOKUP(B16,List!B:BG,17,FALSE)","v":2043}]
[null,"EANAX",{"$f":"VLOOKUP(B17,List!B:BG,2,FALSE)","v":"Eaton Vance National Municipal Income A"},{"$f":"VLOOKUP(B17,List!B:BG,3,FALSE)","v":"Muni National Long"},0,0,{"$f":"VLOOKUP(B17,List!B:BG,23,FALSE)","v":-9.5299999999999996E-2},{"$f":"VLOOKUP(B17,List!B:BG,24,FALSE)","v":-1.18E-2},{"$f":"VLOOKUP(B17,List!B:BG,25,FALSE)","v":-1.3599999999999999E-2},{"$f":"VLOOKUP(B17,List!B:BG,26,FALSE)","v":3.1E-2},null,{"$f":"VLOOKUP(B17,List!B:BG,39,FALSE)","v":2.4},{"$f":"VLOOKUP(B17,List!B:BG,42,FALSE)","v":16.34},{"$f":"VLOOKUP(B17,List!B:BG,46,FALSE)","v":2.23},{"$f":"VLOOKUP(B17,List!B:BG,49,FALSE)","v":13.94},{"$f":"VLOOKUP(B17,List!B:BG,53,FALSE)","v":1.76},{"$f":"VLOOKUP(B17,List!B:BG,56,FALSE)","v":10.5},null,{"$f":"VLOOKUP(B17,List!B:BG,15,FALSE)","v":718},{"$f":"VLOOKUP(B17,List!B:BG,16,FALSE)","v":898},{"$f":"VLOOKUP(B17,List!B:BG,17,FALSE)","v":1418}]
[null,"ETGIX",{"$f":"VLOOKUP(B18,List!B:BG,2,FALSE)","v":"Eaton Vance Greater India A"},{"$f":"VLOOKUP(B18,List!B:BG,3,FALSE)","v":"Pacific/Asia ex-Japan Stk"},-3.3711459549815949E-11,-3.3711459549815948E-16,{"$f":"VLOOKUP(B18,List!B:BG,23,FALSE)","v":3.1899999999999998E-2},{"$f":"VLOOKUP(B18,List!B:BG,24,FALSE)","v":-2.9999999999999997E-4},{"$f":"VLOOKUP(B18,List!B:BG,25,FALSE)","v":3.95E-2},{"$f":"VLOOKUP(B18,List!B:BG,26,FALSE)","v":0.1744},null,{"$f":"VLOOKUP(B18,List!B:BG,39,FALSE)","v":1.27},{"$f":"VLOOKUP(B18,List!B:BG,42,FALSE)","v":41.36},{"$f":"VLOOKUP(B18,List!B:BG,46,FALSE)","v":1.33},{"$f":"VLOOKUP(B18,List!B:BG,49,FALSE)","v":36.229999999999997},{"$f":"VLOOKUP(B18,List!B:BG,53,FALSE)","v":1.22},{"$f":"VLOOKUP(B18,List!B:BG,56,FALSE)","v":30.89},null,{"$f":"VLOOKUP(B18,List!B:BG,15,FALSE)","v":1233},{"$f":"VLOOKUP(B18,List!B:BG,16,FALSE)","v":1712},{"$f":"VLOOKUP(B18,List!B:BG,17,FALSE)","v":3029}]
[null,"ETHYX",{"$f":"VLOOKUP(B19,List!B:BG,2,FALSE)","v":"Eaton Vance High-Yield Municipal Inc A"},{"$f":"VLOOKUP(B19,List!B:BG,3,FALSE)","v":"High Yield Muni"},0,0,{"$f":"VLOOKUP(B19,List!B:BG,23,FALSE)","v":-6.08E-2},{"$f":"VLOOKUP(B19,List!B:BG,24,FALSE)","v":-2.23E-2},{"$f":"VLOOKUP(B19,List!B:BG,25,FALSE)","v":-2.06E-2},{"$f":"VLOOKUP(B19,List!B:BG,26,FALSE)","v":2.58E-2},null,{"$f":"VLOOKUP(B19,List!B:BG,39,FALSE)","v":2.11},{"$f":"VLOOKUP(B19,List!B:BG,42,FALSE)","v":17.190000000000001},{"$f":"VLOOKUP(B19,List!B:BG,46,FALSE)","v":1.89},{"$f":"VLOOKUP(B19,List!B:BG,49,FALSE)","v":14.05},{"$f":"VLOOKUP(B19,List!B:BG,53,FALSE)","v":1.39},{"$f":"VLOOKUP(B19,List!B:BG,56,FALSE)","v":10.29},null,{"$f":"VLOOKUP(B19,List!B:BG,15,FALSE)","v":811},{"$f":"VLOOKUP(B19,List!B:BG,16,FALSE)","v":1058},{"$f":"VLOOKUP(B19,List!B:BG,17,FALSE)","v":1762}]
[null,"EUEYX",{"$f":"VLOOKUP(B20,List!B:BG,2,FALSE)","v":"Alpine Cyclical Advantage Property Y"},{"$f":"VLOOKUP(B20,List!B:BG,3,FALSE)","v":"Real Estate"},0,0,{"$f":"VLOOKUP(B20,List!B:BG,23,FALSE)","v":0.16739999999999999},{"$f":"VLOOKUP(B20,List!B:BG,24,FALSE)","v":-6.9199999999999998E-2},{"$f":"VLOOKUP(B20,List!B:BG,25,FALSE)","v":-9.7799999999999998E-2},{"$f":"VLOOKUP(B20,List!B:BG,26,FALSE)","v":6.9099999999999995E-2},null,{"$f":"VLOOKUP(B20,List!B:BG,39,FALSE)","v":1.76},{"$f":"VLOOKUP(B20,List!B:BG,42,FALSE)","v":44.3},{"$f":"VLOOKUP(B20,List!B:BG,46,FALSE)","v":1.7},{"$f":"VLOOKUP(B20,List!B:BG,49,FALSE)","v":35.75},{"$f":"VLOOKUP(B20,List!B:BG,53,FALSE)","v":1.38},{"$f":"VLOOKUP(B20,List!B:BG,56,FALSE)","v":29.87},null,{"$f":"VLOOKUP(B20,List!B:BG,15,FALSE)","v":418},{"$f":"VLOOKUP(B20,List!B:BG,16,FALSE)","v":723},{"$f":"VLOOKUP(B20,List!B:BG,17,FALSE)","v":1590}]
{"$rows_left_out":16}
{"sheet":"List","index":1,"n_rows":47,"n_cols":59,"rows_kept":47,"cut":false,"hidden":false,"merged":[]}
[]
[null,"Fund Overview",null,null,null,"Investment Information",null,null,null,"Fees and Expenses",null,null,null,null,null,null,null,null,"Fund Operations",null,null,null,"Performance Overview",null,null,null,null,null,null,null,null,null,null,null,null,null,null,"Fund Risk"]
[null,"Fund Ticker","Fund Name","Fund Category","Fund Family","Min Initial Investment:","Min Initial Investment, IRA:","Min Subsequent Investment:","Min Subsequent Investment, IRA:","Annual Report Expense Ratio (net):","Prospectus Net Expense Ratio:","Prospectus Gross Expense Ratio:","Max 12b1 Fee:","Max Front End Sales Load:","Max Deferred Sales Load:","3 Yr Exp Proj / $10,000","5 Yr Exp Proj / $10,000","10 Yr Exp Proj / $10,000","Last Dividend","Last Cap Gain","Annual Holdings Turnover","Avg Annual Holdings Turnover for Category","Morningstar Return Rating","Load Adj 1-Yr Return","Load Adj 3-Yr Return","Load Adj 5-Yr Return","Load Adj 10-Yr Return","YTD Trailing Return","1-Month Trailing Return","3-Month Trailing Return","1-Year Trailing Return","3-Year Trailing Return","5-Year Trailing Return","YTD Total Return Rank","1-Year Total Return Rank","3-Year Total Return Rank","5-Year Total Return Rank","Morningstar Risk Rating","3 Yr Alpha","3 Yr Beta","3 Yr Mean Annual Return","3 Yr R-squared","3 Yr Standard Deviation","3 Yr Sharpe Ratio","3 Yr Treynor Ratio","5 Yr Alpha","5 Yr Beta","5 Yr Mean Annual Return","5 Yr R-squared","5 Yr Standard Deviation","5 Yr Sharpe Ratio","5 Yr Treynor Ratio","10 Yr Alpha","10 Yr Beta","10 Yr Mean Annual Return","10 Yr R-squared","10 Yr Standard Deviation","10 Yr Sharpe Ratio","10 Yr Treynor Ratio"]
[1,"FEXPX","Fidelity Export & Multinational","Large Growth","Fidelity Investments",2500,500,"N/A","N/A",8.3999999999999995E-3,8.6E-3,8.6E-3,"N/A","N/A","N/A",274,477,1061,0.08,0,1.97,0.89100000000000001,null,null,null,null,null,0,0,0,0,0,0,null,null,null,null,3,-1.0900000000000001,1.03,0.3,92.7,23.46,0.13,0.39,-0.28999999999999998,1.05,0.36,89.89,19.86,0.11,0.15,2.74,1.06,0.56000000000000005,90.18,18.100000000000001,0.25,2.85]
[2,"MPGFX","Mairs & Power Growth Inv","Large Blend","Mairs & Power",2500,1000,100,100,7.1000000000000004E-3,7.1000000000000004E-3,7.1000000000000004E-3,"N/A","N/A","N/A",228,396,885,0.2,0,1.8100000000000002E-2,0.69420000000000004,5,0.21279999999999999,4.4699999999999997E-2,3.73E-2,6.83E-2,4.4999999999999998E-2,3.0600000000000002E-2,0.11380000000000001,0.21280000000000002,4.4699999999999997E-2,3.73E-2,78,45,10,20,3,2.41,0.98,0.57999999999999996,90.79,22.52,0.28999999999999998,4.09,0.96,0.95,0.44,89.01,18.05,0.18,1.64,4.12,0.86,0.65,84.37,15.04,0.37,5.43]
[3,"SLASX","Selected American Shares S","Large Blend","Selected Funds",1000,1000,25,25,9.2999999999999992E-3,9.4000000000000004E-3,9.4000000000000004E-3,2.5000000000000001E-3,"N/A","N/A",300,520,1155,0.28000000000000003,0.01,0.09,0.69420000000000004,3,0.17849999999999999,1.1999999999999999E-3,2.07E-2,3.49E-2,3.7200000000000004E-2,2.4100000000000003E-2,0.1086,0.17850000000000002,1.1999999999999999E-3,2.07E-2,90,84,78,61,4,-1.92,1.08,0.25,97.15,24.04,0.1,-0.32,-0.66,1.06,0.33,96.48,19.3,0.09,-0.08,0.92,0.98,0.4,93.56,16.3,0.16,1.34]
[4,"AGTHX","American Funds Growth Fund of Amer A","Large Growth","American Funds",250,250,50,50,6.8999999999999999E-3,6.8999999999999999E-3,6.8999999999999999E-3,2.3E-3,5.7500000000000002E-2,"N/A",783,937,1384,0.21,2.06,0.33,0.89100000000000001,3,6.9599999999999995E-2,-3.0000000000000001E-3,1.49E-2,4.2799999999999998E-2,5.2900000000000003E-2,1.6000000000000001E-3,5.2900000000000003E-2,0.1348,1.6899999999999998E-2,2.7000000000000003E-2,55,77,73,57,3,-0.56000000000000005,0.96,0.34,95.49,21.58,0.17,1.31,0.12,0.96,0.35,94.41,17.600000000000001,0.12,0.65,1.66,1.01,0.52,92.24,16.77,0.24,2.74]
[5,"AMAGX","Amana Trust Growth","Large Growth","Amana",250,100,25,25,1.2E-2,1.21E-2,1.21E-2,2.5000000000000001E-3,"N/A","N/A",384,665,1466,0.46,7.0000000000000007E-2,0.05,0.89100000000000001,5,0.20699999999999999,6.1699999999999998E-2,6.7799999999999999E-2,7.5499999999999998E-2,3.8800000000000001E-2,2.4300000000000002E-2,8.6999999999999994E-2,0.20699999999999999,6.1699999999999998E-2,6.7799999999999999E-2,86,68,14,6,2,4,0.77,0.64,87.13,17.96,0.4,7.45,3.78,0.79,0.64,86.02,15.16,0.37,5.88,4.84,0.91,0.72,84.78,15.95,0.4,5.9]
[6,"FCNTX","Fidelity Contrafund","Large Growth","Fidelity Investments",2500,500,"N/A","N/A",9.1000000000000004E-3,9.1999999999999998E-3,9.1999999999999998E-3,"N/A","N/A","N/A",293,509,1131,0,0,0.46,0.89100000000000001,4,0.24790000000000001,3.3099999999999997E-2,5.2999999999999999E-2,6.9699999999999998E-2,4.7300000000000009E-2,4.1200000000000001E-2,8.8699999999999987E-2,0.24790000000000001,3.3100000000000004E-2,5.2999999999999999E-2,65,36,47,17,1,1.1599999999999999,0.85,0.43,92.89,19.39,0.24,3.33,2.4,0.87,0.55000000000000004,89.19,16.510000000000002,0.27,3.6,4.22,0.77,0.64,80.52,13.8,0.4,6.24]
[7,"AAGAX","American Beacon Lg Cap Value AMR","Large Value","American Beacon",0,0,"N/A",0,3.3999999999999998E-3,3.5000000000000001E-3,3.5000000000000001E-3,0,"N/A","N/A",113,197,443,0.33,0.71,0.28000000000000003,0.60260000000000002,4,0.2059,8.3999999999999995E-3,2.4199999999999999E-2,5.9200000000000003E-2,5.5999999999999994E-2,2.7799999999999998E-2,0.13570000000000002,0.2059,8.3999999999999995E-3,2.4199999999999999E-2,54,44,47,35,4,-1.22,1.08,0.31,98.66,23.89,0.14000000000000001,0.35,-0.32,1.07,0.36,97.92,19.309999999999999,0.11,0.25,3.28,1.01,0.6,93.9,16.8,0.3,3.71]
[8,"IDQYX","Columbia Diversified Equity Income R4","Large Value","Columbia",2000,1000,100,100,9.7000000000000003E-3,9.1999999999999998E-3,9.1999999999999998E-3,0,"N/A","N/A",294,510,1136,0.04,0,0.34,0.60260000000000002,4,0.17030000000000001,1.5599999999999999E-2,2.2800000000000001E-2,7.0000000000000007E-2,5.91E-2,1.49E-2,5.91E-2,0.17030000000000001,1.5600000000000001E-2,2.2799999999999997E-2,50,14,44,35,4,-0.65,1.0900000000000001,0.37,98.29,24.14,0.17,1.04,-0.16,1.0900000000000001,0.35,97.34,19.73,0.11,0.19,3.7,1.07,0.7,91.9,17.87,0.35,4.54]
[9,"UMBIX","Columbia Value & Restructuring Z","Large Value","Columbia",2500,1000,0,0,8.8999999999999999E-3,9.1000000000000004E-3,9.1000000000000004E-3,0,"N/A","N/A",290,504,1120,0.09,0,0.06,0.60260000000000002,4,0.25259999999999999,1.8E-3,2.9000000000000001E-2,5.9499999999999997E-2,2.9700000000000004E-2,2.46E-2,0.1245,0.25260000000000005,1.8E-3,2.8999999999999998E-2,98,7,59,27,5,-1,1.3,0.4,89.39,30.1,0.14000000000000001,-0.22,0.84,1.28,0.49,87.66,24.36,0.16,0.57999999999999996,3.79,1.22,0.67,87.05,21.02,0.28000000000000003,3.1]
[10,"CRMMX","CRM Mid Cap Value Inv","Mid-Cap Blend","CRM",2500,2000,100,100,1.03E-2,1.04E-2,1.04E-2,"N/A","N/A","N/A",331,574,1271,7.0000000000000007E-2,3.03,1.26,0.9032,4,0.26860000000000001,4.2799999999999998E-2,5.1999999999999998E-2,9.6699999999999994E-2,6.4100000000000004E-2,3.5499999999999997E-2,0.15490000000000001,0.26860000000000001,4.2800000000000005E-2,5.2000000000000005E-2,43,65,65,34,2,2.16,0.98,0.55000000000000004,94.8,22.01,0.28000000000000003,3.9,2.34,0.97,0.56000000000000005,93.32,17.98,0.26,3.13,6.86,0.91,0.88,82.29,16.170000000000002,0.52,8.24]
[11,"TAVFX","Third Avenue Value Instl","World Stock","Third Avenue",100000,100000,1000,200,1.15E-2,1.15E-2,1.1900000000000001E-2,"N/A","N/A","N/A",374,651,1441,1.1399999999999999,0,0.02,0.83760000000000001,3,0.16270000000000001,1.9099999999999999E-2,1.1299999999999999E-2,7.1599999999999997E-2,3.9800000000000002E-2,3.3799999999999997E-2,3.9800000000000002E-2,0.16270000000000001,1.9099999999999999E-2,1.1299999999999999E-2,56,31,35,72,4,5.5,1,0.49,84.68,28.47,0.19,1.48,0.14000000000000001,0.97,0.31,82.92,22.88,7.0000000000000007E-2,-0.98,2.13,0.92,0.72,80.38,18.760000000000002,0.35,5.47]
[12,"WWNPX","Kinetics Paradigm No Load","World Stock","Kinetics",2500,2500,100,100,1.6400000000000001E-2,1.6400000000000001E-2,1.7399999999999999E-2,"N/A","N/A","N/A",539,935,2044,0.17,0.08,7.0000000000000007E-2,0.83760000000000001,4,0.26319999999999999,-2.7099999999999999E-2,2.8500000000000001E-2,9.6100000000000005E-2,4.5899999999999996E-2,3.9700000000000006E-2,9.3200000000000005E-2,0.26319999999999999,-2.7099999999999999E-2,2.8500000000000001E-2,34,15,79,55,4,0.33,0.99,0.09,86.71,27.95,0.02,-3.19,0.82,1,0.46,83.59,23.45,0.15,0.7,4.9800000000000004,0.86,0.91,74.97,18.489999999999998,0.47,8.58]
[13,"CVGRX","Calamos Growth A","Large Growth","Calamos",2500,500,50,50,1.2699999999999999E-2,1.2800000000000001E-2,1.2800000000000001E-2,2.5000000000000001E-3,4.7500000000000001E-2,"N/A",862,1145,1947,7.0000000000000007E-2,7.56,0.52700000000000002,0.89100000000000001,4,0.24099999999999999,1.7500000000000002E-2,1.83E-2,5.5399999999999998E-2,5.0800000000000005E-2,3.56E-2,0.1162,0.3029,3.4200000000000001E-2,2.8300000000000002E-2,54,9,45,59,5,1.83,1.1299999999999999,0.57999999999999996,87.26,26.56,0.24,2.61,0.57999999999999996,1.1599999999999999,0.45,84.02,22.57,0.14000000000000001,0.57999999999999996,3.83,1.03,0.65,74.12,19.27,0.28999999999999998,3.76]
[14,"FISGX","Nuveen Mid Cap Growth Opp I","Mid-Cap Growth","Nuveen",100000,"N/A","N/A","N/A",9.7999999999999997E-3,1.04E-2,1.04E-2,0,"N/A","N/A",331,574,1271,0,4.67,1.1399999999999999,1.0615000000000001,4,0.36680000000000001,6.7100000000000007E-2,5.2600000000000001E-2,7.9399999999999998E-2,6.08E-2,5.0499999999999996E-2,0.10710000000000001,0.36680000000000001,6.7100000000000007E-2,5.2600000000000001E-2,37,17,39,42,3,4.8,1.04,0.8,86.13,24.61,0.37,5.99,2.7,1.06,0.61,83.78,20.59,0.25,2.94,5.42,1.04,0.78,81.94,18.43,0.39,5.56]
[15,"MMELX","MassMutual Select Mid Cap Gr Eq II L","Mid-Cap Growth","MassMutual",0,"N/A",0,"N/A",1.0999999999999999E-2,1.0999999999999999E-2,1.2E-2,"N/A","N/A","N/A",371,650,1446,"N/A",0.27,0.52,1.0615000000000001,4,0.27939999999999998,9.7600000000000006E-2,6.6299999999999998E-2,9.2100000000000001E-2,8.4600000000000009E-2,1.6500000000000001E-2,8.4600000000000009E-2,0.27940000000000004,9.7600000000000006E-2,6.6299999999999998E-2,35,36,22,21,3,7.44,1.1000000000000001,1.05,90.72,25.17,0.48,8.5299999999999994,4.2300000000000004,1.1000000000000001,0.72,88.7,20.75,0.32,4.16,5.86,1.1000000000000001,0.89,87.6,18.82,0.45,6.41]
[16,"FDVLX","Fidelity Value","Mid-Cap Value","Fidelity Investments",2500,500,"N/A","N/A",6.3E-3,6.4000000000000003E-3,6.4000000000000003E-3,"N/A","N/A","N/A",205,357,798,0.01,7.09,1.48,0.80830000000000002,3,0.28029999999999999,3.1699999999999999E-2,2.3699999999999999E-2,7.8100000000000003E-2,6.3200000000000006E-2,3.1099999999999999E-2,0.1474,0.28029999999999999,3.1699999999999999E-2,2.3700000000000002E-2,30,38,80,85,4,2,1.4,0.68,93.03,31.69,0.24,1.94,0.32,1.36,0.47,91.85,25.26,0.14000000000000001,0.15,5.5,1.19,0.81,86.1,20.67,0.37,4.7300000000000004]
[17,"FSHOX","Fidelity Select Construction & Housing","Miscellaneous Sector","Fidelity Investments",2500,2500,"N/A","N/A",1.01E-2,1.01E-2,1.01E-2,"N/A","N/A","N/A",322,558,1236,0.04,0,0.82,1.2517,3,0.26240000000000002,5.9900000000000002E-2,5.4999999999999997E-3,9.0899999999999995E-2,6.7599999999999993E-2,2.63E-2,0.2016,0.26239999999999997,5.9900000000000002E-2,5.5000000000000005E-3,10,64,75,100,4,5.21,1.29,0.92,76.650000000000006,32.33,0.32,4.28,-0.88,1.25,0.34,68.569999999999993,26.88,7.0000000000000007E-2,-1.29,7.34,1.1599999999999999,0.96,62.51,23.54,0.4,5.98]
{"$rows_left_out":27}