{"text_format":"1","workbook":"xlsx","n_sheets":4,"sheets":["Data","Result","Email Result","Airport Code"],"not_rendered":{"charts":0,"images":0,"macros":1,"external_links":0,"defined_names":1,"comments":0,"pivot_tables":0},"unopened":[],"bounds":{"document_bytes":16777216,"sheet_cells":100000,"rows_first":2000,"rows_last":500,"rows_between":2000,"halvings":0,"cell_chars":16384,"cell_head_chars":4096},"cells_cut":0,"cells_raw":0,"read":"whole","date_system":"1900"}

{"sheet":"Data","index":0,"n_rows":8,"n_cols":3,"rows_kept":8,"cut":false,"hidden":false,"merged":[]}
[null,"Airport Code","Airport"]
["From:","SLC",{"$f":"IFERROR(VLOOKUP(B2,'Airport Code'!A:C,3,),\"\")","v":"Salt Lake City, UT (SLC)"}]
["To:","atl",{"$f":"IFERROR(VLOOKUP(B3,'Airport Code'!A:C,3,),\"\")","v":"Atlanta, GA (ATL)"}]
["Depart Date (mmddyyyy):",12112011]
["Return Date (mmddyyyy):",12202011]
[]
["Running Time (hh:mm:ss):","00:00:20"]
["Target Price:",700]

{"sheet":"Result","index":1,"n_rows":7,"n_cols":8,"rows_kept":7,"cut":false,"hidden":false,"merged":[]}
["Link","Airline","Price","Depart Date","Return Date","Depart Time Amount","Return Time Around"]
["http://www.kayak.com/book/flight?code=-1944574535.GECDj61Yc.0.F.US,ITA.62180.79e2de8b49bb4154076093ae32a6723e&amp;sub=E068c3ea3c96&amp;resultid=79e2de8b49bb4154076093ae32a6723e&amp;sr=1&amp;pg=0&amp;cp=0-423-1370","US Airways ",622,"US SLC 1:30p ATL 9:49p","US ATL 11:35a SLC 4:17p","6h 19m","6h 42m","US Airways 622US SLC 1:30p ATL 9:49pUS ATL 11:35a SLC 4:17p"]
["http://www.kayak.com/book/flight?code=1663273266.GECDj61Yc.0.F.US,ITA.62180.eca372767548353da3ef6d284de7667c&amp;sub=E068c3ea3c96&amp;resultid=eca372767548353da3ef6d284de7667c&amp;sr=1&amp;pg=0&amp;cp=0-423-1370","US Airways ",622,"US SLC 1:30p ATL 9:49p","US ATL 7:45a SLC 12:43p","6h 19m","6h 58m","US Airways 622US SLC 1:30p ATL 9:49pUS ATL 7:45a SLC 12:43p"]
["http://www.kayak.com/book/flight?code=-1184058785.GECDj61Yc.0.F.US,ITA.62180.c543bcf2e66f89830882ac2191ab3bfa&amp;sub=E068c3ea3c96&amp;resultid=c543bcf2e66f89830882ac2191ab3bfa&amp;sr=1&amp;pg=0&amp;cp=0-423-1370","US Airways ",622,"US SLC 1:30p ATL 9:49p","US ATL 5:40p SLC 10:48p","6h 19m","7h 08m","US Airways 622US SLC 1:30p ATL 9:49pUS ATL 5:40p SLC 10:48p"]
["http://www.kayak.com/book/flight?code=530403367.GECDj61Yc.0.F.US,ITA.62180.d86d9acb221d9ac71bbd3f0812aebbec&amp;sub=E068c3ea3c96&amp;resultid=d86d9acb221d9ac71bbd3f0812aebbec&amp;sr=1&amp;pg=0&amp;cp=0-423-1370","US Airways ",622,"US SLC 7:05a ATL 4:47p","US ATL 11:35a SLC 4:17p","7h 42m","6h 42m","US Airways 622US SLC 7:05a ATL 4:47pUS ATL 11:35a SLC 4:17p"]
["http://www.kayak.com/book/flight?code=-1800686580.GECDj61Yc.0.F.US,ITA.62180.d0b38510092cb40ca26e0f51e4a9f4f5&amp;sub=E068c3ea3c96&amp;resultid=d0b38510092cb40ca26e0f51e4a9f4f5&amp;sr=1&amp;pg=0&amp;cp=0-423-1370","US Airways ",622,"US SLC 7:05a ATL 4:47p","US ATL 7:45a SLC 12:43p","7h 42m","6h 58m","US Airways 622US SLC 7:05a ATL 4:47pUS ATL 7:45a SLC 12:43p"]
["http://www.kayak.com/book/flight?code=1213086514.GECDj61Yc.0.F.US,ITA.62180.a6be4e011763eacf73195af1dd10942e&amp;sub=E068c3ea3c96&amp;resultid=a6be4e011763eacf73195af1dd10942e&amp;sr=1&amp;pg=0&amp;cp=0-423-1370","US Airways ",622,"US SLC 7:05a ATL 4:47p","US ATL 5:40p SLC 10:48p","7h 42m","7h 08m","US Airways 622US SLC 7:05a ATL 4:47pUS ATL 5:40p SLC 10:48p"]

{"sheet":"Email Result","index":2,"n_rows":7,"n_cols":7,"rows_kept":7,"cut":false,"hidden":false,"merged":[]}
["Link","Airline","Price","Depart Date","Return Date","Depart Time Amount","Return Time Around"]
["http://www.kayak.com/book/flight?code=-1944574535.GECDj61Yc.0.F.US,ITA.62180.79e2de8b49bb4154076093ae32a6723e&amp;sub=E068c3ea3c96&amp;resultid=79e2de8b49bb4154076093ae32a6723e&amp;sr=1&amp;pg=0&amp;cp=0-423-1370","US Airways ",622,"US SLC 1:30p ATL 9:49p","US ATL 11:35a SLC 4:17p","6h 19m","6h 42m"]
["http://www.kayak.com/book/flight?code=1663273266.GECDj61Yc.0.F.US,ITA.62180.eca372767548353da3ef6d284de7667c&amp;sub=E068c3ea3c96&amp;resultid=eca372767548353da3ef6d284de7667c&amp;sr=1&amp;pg=0&amp;cp=0-423-1370","US Airways ",622,"US SLC 1:30p ATL 9:49p","US ATL 7:45a SLC 12:43p","6h 19m","6h 58m"]
["http://www.kayak.com/book/flight?code=-1184058785.GECDj61Yc.0.F.US,ITA.62180.c543bcf2e66f89830882ac2191ab3bfa&amp;sub=E068c3ea3c96&amp;resultid=c543bcf2e66f89830882ac2191ab3bfa&amp;sr=1&amp;pg=0&amp;cp=0-423-1370","US Airways ",622,"US SLC 1:30p ATL 9:49p","US ATL 5:40p SLC 10:48p","6h 19m","7h 08m"]
["http://www.kayak.com/book/flight?code=530403367.GECDj61Yc.0.F.US,ITA.62180.d86d9acb221d9ac71bbd3f0812aebbec&amp;sub=E068c3ea3c96&amp;resultid=d86d9acb221d9ac71bbd3f0812aebbec&amp;sr=1&amp;pg=0&amp;cp=0-423-1370","US Airways ",622,"US SLC 7:05a ATL 4:47p","US ATL 11:35a SLC 4:17p","7h 42m","6h 42m"]
["http://www.kayak.com/book/flight?code=-1800686580.GECDj61Yc.0.F.US,ITA.62180.d0b38510092cb40ca26e0f51e4a9f4f5&amp;sub=E068c3ea3c96&amp;resultid=d0b38510092cb40ca26e0f51e4a9f4f5&amp;sr=1&amp;pg=0&amp;cp=0-423-1370","US Airways ",622,"US SLC 7:05a ATL 4:47p","US ATL 7:45a SLC 12:43p","7h 42m","6h 58m"]
["http://www.kayak.com/book/flight?code=1213086514.GECDj61Yc.0.F.US,ITA.62180.a6be4e011763eacf73195af1dd10942e&amp;sub=E068c3ea3c96&amp;resultid=a6be4e011763eacf73195af1dd10942e&amp;sr=1&amp;pg=0&amp;cp=0-423-1370","US Airways ",622,"US SLC 7:05a ATL 4:47p","US ATL 5:40p SLC 10:48p","7h 42m","7h 08m"]

{"sheet":"Airport Code","index":3,"n_rows":1465,"n_cols":3,"rows_kept":1465,"cut":false,"hidden":false,"merged":[]}
["Column1","City","Full"]
["ABR","Aberdeen","Aberdeen, SD (ABR)"]
["ABI","Abilene","Abilene, TX (ABI)"]
["ADK","Adak Island","Adak Island, AK (ADK)"]
["KKI","Akiachak","Akiachak, AK (KKI)"]
["AKI","Akiak","Akiak, AK (AKI)"]
["CAK","Akron/Canton","Akron/Canton, OH (CAK)"]
["KQA","Akuton","Akuton, AK (KQA)"]
["AUK","Alakanuk","Alakanuk, AK (AUK)"]
["ALM","Alamogordo","Alamogordo, NM (ALM)"]
["ALS","Alamosa","Alamosa, CO (ALS)"]
["ALB","Albany","Albany, NY (ALB)"]
["CVO","Albany","Albany, OR - Bus service (CVO)"]
["QWY","Albany","Albany, OR - Bus service (QWY)"]
["ABQ","Albuquerque","Albuquerque, NM (ABQ)"]
["WKK","Aleknagik","Aleknagik, AK (WKK)"]
["AEX","Alexandria","Alexandria, LA (AEX)"]
["AET","Allakaket","Allakaket, AK (AET)"]
["ABE","Allentown","Allentown, PA (ABE)"]
["AIA","Alliance","Alliance, NE (AIA)"]
["APN","Alpena","Alpena, MI (APN)"]
["AOO","Altoona","Altoona, PA (AOO)"]
["AMA","Amarillo","Amarillo, TX (AMA)"]
["ABL","Ambler","Ambler, AK (ABL)"]
["AKP","Anaktueuk","Anaktueuk, AK (AKP)"]
["ANC","Anchorage","Anchorage, AK (ANC)"]
["AGN","Angoon","Angoon, AK (AGN)"]
["ANI","Aniak","Aniak, AK (ANI)"]
["ANV","Anvik","Anvik, AK (ANV)"]
["ATW","Appleton","Appleton, WI (ATW)"]
["ACV","Arcata","Arcata, CA (ACV)"]
["ARC","Arctic Village","Arctic Village, AK (ARC)"]
["AVL","Asheville","Asheville, NC (AVL)"]
["HTS","Ashland","Ashland, KY/Huntington, WV (HTS)"]
["ASE","Aspen","Aspen, CO (ASE)"]
["AHN","Athens","Athens, GA (AHN)"]
["AKB","Atka","Atka, AK (AKB)"]
["ATL","Atlanta","Atlanta, GA (ATL)"]
["AIY","Atlantic City","Atlantic City, NJ (AIY)"]
["ATK","Atqasuk","Atqasuk, AK (ATK)"]
["AGS","Augusta","Augusta, GA (AGS)"]
["AUG","Augusta","Augusta, ME (AUG)"]
["AUS","Austin","Austin, TX (AUS)"]
["BFL","Bakersfield","Bakersfield, CA (BFL)"]
["BWI","Baltimore","Baltimore, MD (BWI)"]
["BGR","Bangor","Bangor, ME (BGR)"]
["BHB","Bar Harbour","Bar Harbour, ME (BHB)"]
["BRW","Barrow","Barrow, AK (BRW)"]
["BTI","Barter Island","Barter Island, AK (BTI)"]
["BTR","Baton Rouge","Baton Rouge, LA (BTR)"]
["MBS","Bay City","Bay City, MI (MBS)"]
["BPT","Beaumont/Port Arthur","Beaumont/Port Arthur, TX (BPT)"]
["ZBV","Beaver Creek","Beaver Creek, CO - Van service (ZBV)"]
["WBQ","Beaver","Beaver, AK (WBQ)"]
["BKW","Beckley","Beckley, WV (BKW)"]
["BED","Bedford","Bedford, MA (BED)"]
["BLV","Belleville","Belleville, IL (BLV)"]
["BLI","Bellingham","Bellingham, WA (BLI)"]
["BJI","Bemidji","Bemidji, MN (BJI)"]
["BEH","Benton Harbor","Benton Harbor, MI (BEH)"]
["BET","Bethel","Bethel, AK (BET)"]
["ABE","Bethlehem","Bethlehem, PA (ABE)"]
["BTT","Bettles","Bettles, AK (BTT)"]
["BIL","Billings","Billings, MT (BIL)"]
["GPT","Biloxi/Gulfport","Biloxi/Gulfport, MS (GPT)"]
["BGM","Binghamton","Binghamton, NY (BGM)"]
["KBC","Birch Creek","Birch Creek, AK (KBC)"]
["BHM","Birmingham","Birmingham, AL (BHM)"]
["BIS","Bismarck","Bismarck, ND (BIS)"]
["BID","Block Island","Block Island, RI (BID)"]
["BMI","Bloomington","Bloomington, IL (BMI)"]
["BLF","Bluefield","Bluefield, WV (BLF)"]
["BOI","Boise","Boise, ID (BOI)"]
["BOS","Boston","Boston, MA (BOS)"]
["XHH","Boulder","Boulder, CO - Bus service (XHH)"]
["WHH","Boulder","Boulder, CO - Hiltons Har H (WHH)"]
["WBU","Boulder","Boulder, CO - Municipal Airport (WBU)"]
["BYA","Boundary","Boundary, AK (BYA)"]
["BWG","Bowling Green","Bowling Green, KY (BWG)"]
["BZN","Bozeman","Bozeman, MT (BZN)"]
["BFD","Bradford","Bradford, PA (BFD)"]
["BRD","Brainerd","Brainerd, MN (BRD)"]
["BWD","Brawnwood","Brawnwood, TX (BWD)"]
["QKB","Breckonridge","Breckonridge, CO - Van service (QKB)"]
["TRI","Bristol","Bristol, VA (TRI)"]
["BKX","Brookings","Brookings, SD (BKX)"]
["RBH","Brooks Lodge","Brooks Lodge, AK (RBH)"]
["BRO","Brownsville","Brownsville, TX (BRO)"]
["BQK","Brunswick","Brunswick, GA (BQK)"]
["BKC","Buckland","Buckland, AK (BKC)"]
["BUF","Buffalo","Buffalo, NY (BUF)"]
["IFP","Bullhead City/Laughlin","Bullhead City/Laughlin, AZ (IFP)"]
["BUR","Burbank","Burbank, CA (BUR)"]
["BRL","Burlington","Burlington, IA (BRL)"]
["BTV","Burlington","Burlington, VT (BTV)"]
["BTM","Butte","Butte, MT (BTM)"]
["CAK","Canton/Akron","Canton/Akron, OH (CAK)"]
["CGI","Cape Girardeau","Cape Girardeau, MO (CGI)"]
["LUR","Cape Lisburne","Cape Lisburne, AK (LUR)"]
["EHM","Cape Newenham","Cape Newenham, AK (EHM)"]
["MDH","Carbondale","Carbondale, IL (MDH)"]
["CLD","Carlsbad","Carlsbad, CA (CLD)"]
["CNM","Carlsbad","Carlsbad, NM (CNM)"]
["MRY","Carmel","Carmel, CA (MRY)"]
["CPR","Casper","Casper, WY (CPR)"]
["CDC","Cedar City","Cedar City, UT (CDC)"]
["CID","Cedar Rapids","Cedar Rapids, IA (CID)"]
["CEM","Central","Central, AK (CEM)"]
["CDR","Chadron","Chadron, NE (CDR)"]
["CIK","Chalkyitsik","Chalkyitsik, AK (CIK)"]
["CMI","Champaign/Urbana","Champaign/Urbana, IL (CMI)"]
["CHS","Charleston","Charleston, SC (CHS)"]
["CRW","Charleston","Charleston, WV (CRW)"]
["CLT","Charlotte","Charlotte, NC (CLT)"]
["CHO","Charlottesville","Charlottesville, VA (CHO)"]
["CHA","Chattanooga","Chattanooga, TN (CHA)"]
["CYF","Chefornak","Chefornak, AK (CYF)"]
["VAK","Chevak","Chevak, AK (VAK)"]
["CYS","Cheyenne","Cheyenne, WY (CYS)"]
["CGX","Chicago","Chicago, IL - Meigs (CGX)"]
["CHI","Chicago","Chicago, IL - All airports (CHI)"]
["MDW","Chicago","Chicago, IL - Midway (MDW)"]
["ORD","Chicago","Chicago, IL - O'Hare (ORD)"]
["CKX","Chicken","Chicken, AK (CKX)"]
["CIC","Chico","Chico, CA (CIC)"]
["KCG","Chignik","Chignik, AK - Fisheries (KCG)"]
["KCQ","Chignik","Chignik, AK - (KCQ)"]
["KCL","Chignik","Chignik, AK - Lagoon (KCL)"]
["CZN","Chisana","Chisana, AK (CZN)"]
["HIB","Chisholm/Hibbing","Chisholm/Hibbing, MN (HIB)"]
["CHU","Chuathbaluk","Chuathbaluk, AK (CHU)"]
["CVG","Cincinnati","Cincinnati, OH (CVG)"]
["CHP","Circle Hot Springs","Circle Hot Springs, AK (CHP)"]
["IRC","Circle","Circle, AK (IRC)"]
["CLP","Clarks Point","Clarks Point, AK (CLP)"]
["CKB","Clarksburg","Clarksburg, WV (CKB)"]
["PIE","Clearwater/St Petersburg","Clearwater/St Petersburg, FL (PIE)"]
["CLE","Cleveland","Cleveland, OH (CLE)"]
["CVN","Clovis","Clovis, NM (CVN)"]
["COD","Cody/Yellowstone","Cody/Yellowstone, WY (COD)"]
["CFA","Coffee Point","Coffee Point, AK (CFA)"]
["KCC","Coffman Cove","Coffman Cove, AK (KCC)"]
["CDB","Cold Bay","Cold Bay, AK (CDB)"]
["CLL","College Station","College Station, TX (CLL)"]
["COS","Colorado Springs","Colorado Springs, CO (COS)"]
["COU","Columbia","Columbia, MO (COU)"]
["CAE","Columbia","Columbia, SC (CAE)"]
["CSG","Columbus","Columbus, GA (CSG)"]
["GTR","Columbus","Columbus, MS (GTR)"]
["CMH","Columbus","Columbus, OH (CMH)"]
["CCR","Concord","Concord, CA (CCR)"]
["CNK","Concordia","Concordia, KS (CNK)"]
["QCE","Copper Mountain","Copper Mountain, CO - Van service (QCE)"]
["CDV","Cordova","Cordova, AK (CDV)"]
["CRP","Corpus Christi","Corpus Christi, TX (CRP)"]
["CEZ","Cortez","Cortez, CO (CEZ)"]
["CGA","Craig","Craig, AK (CGA)"]
["CEC","Crescent City","Crescent City, CA (CEC)"]
["CKO","Crooked Creek","Crooked Creek, AK (CKO)"]
["CUW","Cube Cove","Cube Cove, AK (CUW)"]
["CBE","Cumberland","Cumberland, MD (CBE)"]
["DFW","Dallas/Fort Worth","Dallas/Fort Worth, TX (DFW)"]
["DAY","Dayton","Dayton, OH (DAY)"]
["DAB","Daytona Beach","Daytona Beach, FL (DAB)"]
["DEC","Decatur","Decatur, IL (DEC)"]
["DRG","Deering","Deering, AK (DRG)"]
["DJN","Delta Junction","Delta Junction, AK (DJN)"]
["DEN","Denver","Denver, CO - International (DEN)"]
["QWM","Denver","Denver, CO - Longmont Bus service (QWM)"]
["DSM","Des Moines","Des Moines, IA (DSM)"]
["DTT","Detroit","Detroit, MI - All airports (DTT)"]
["DTW","Detroit","Detroit, MI - Metro/Wayne County (DTW)"]
["DVL","Devil's Lake","Devil's Lake, ND (DVL)"]
["DIK","Dickinson","Dickinson, ND (DIK)"]
["DLG","Dillingham","Dillingham, AK (DLG)"]
["DDC","Dodge City","Dodge City, KS (DDC)"]
["DHN","Dothan","Dothan, AL (DHN)"]
["DUJ","Dubois","Dubois, PA (DUJ)"]
["DBQ","Dubuque","Dubuque, IA (DBQ)"]
["DLH","Duluth","Duluth, MN (DLH)"]
["DRO","Durango","Durango, CO (DRO)"]
["RDU","Durham","Durham, NC (RDU)"]
["RDU","Durham/Raleigh","Durham/Raleigh, NC (RDU)"]
["DUT","Dutch Harbor","Dutch Harbor, AK (DUT)"]
["ABE","Easton","Easton, PA (ABE)"]
["EAU","Eau Claire","Eau Claire, WI (EAU)"]
["EDA","Edna Bay","Edna Bay, AK (EDA)"]
["EEK","Eek","Eek, AK (EEK)"]
["KKU","Ekuk","Ekuk, AK (KKU)"]
["KEK","Ekwok","Ekwok, AK (KEK)"]
["IPL","El Centro","El Centro, CA (IPL)"]
["ELD","El Dorado","El Dorado, AR (ELD)"]
["ELP","El Paso","El Paso, TX (ELP)"]
["ELV","Elfin Cove","Elfin Cove, AK (ELV)"]
["ELI","Elim","Elim, AK (ELI)"]
["EKO","Elko","Elko, NV (EKO)"]
["ELM","Elmira","Elmira, NY (ELM)"]
["LYU","Ely","Ely, MN (LYU)"]
["EMK","Emmonak","Emmonak, AK (EMK)"]
["BGM","Endicott","Endicott, NY (BGM)"]
["WDG","Enid","Enid, OK (WDG)"]
["ERI","Erie","Erie, PA (ERI)"]
["ESC","Escanaba","Escanaba, MI (ESC)"]
["EUG","Eugene","Eugene, OR (EUG)"]
["ACV","Eureka/Arcata","Eureka/Arcata, CA (ACV)"]
["EUE","Eureka","Eureka, NV (EUE)"]
["EVV","Evansville","Evansville, IN (EVV)"]
["FAI","Fairbanks","Fairbanks, AK (FAI)"]
["FAR","Fargo","Fargo, ND (FAR)"]
["FYV","Fayetteville","Fayetteville, AR - Municipal/Drake (FYV)"]
["XNA","Fayetteville","Fayetteville, AR - Northwest Arkansas Regional (XNA)"]
["FAY","Fayetteville","Fayetteville, NC (FAY)"]
["FLG","Flagstaff","Flagstaff, AZ (FLG)"]
["FNT","Flint","Flint, MI (FNT)"]
["FLO","Florence","Florence, SC (FLO)"]
["MSL","Florence/Muscle Shoals/Sheffield","Florence/Muscle Shoals/Sheffield, AL (MSL)"]
["FNL","Fort Collins/Loveland","Fort Collins/Loveland, CO - Municipal Airport (FNL)"]
["QWF","Fort Collins/Loveland","Fort Collins/Loveland, CO - Bus service (QWF)"]
["FOD","Fort Dodge","Fort Dodge, IA (FOD)"]
["FLL","Fort Lauderdale","Fort Lauderdale, FL (FLL)"]
["TBN","Fort Leonard Wood","Fort Leonard Wood, MO (TBN)"]
["RSW","Fort Myers","Fort Myers, FL (RSW)"]
["FSM","Fort Smith","Fort Smith, AR (FSM)"]
["VPS","Fort Walton Beach","Fort Walton Beach, FL (VPS)"]
["FWA","Fort Wayne","Fort Wayne, IN (FWA)"]
["DFW","Fort Worth/Dallas","Fort Worth/Dallas, TX (DFW)"]
["FKL","Franklin","Franklin, PA (FKL)"]
["FAT","Fresno","Fresno, CA (FAT)"]
["GNV","Gainesville","Gainesville, FL (GNV)"]
["GUP","Gallup","Gallup, NM (GUP)"]
["GCK","Garden City","Garden City, KS (GCK)"]
["GYY","Gary","Gary, IN (GYY)"]
["GCC","Gillette","Gillette, WY (GCC)"]
["GGG","Gladewater/Kilgore","Gladewater/Kilgore, TX (GGG)"]
["GGW","Glasgow","Glasgow, MT (GGW)"]
["GDV","Glendive","Glendive, MT (GDV)"]
["GLV","Golovin","Golovin, AK (GLV)"]
["GNU","Goodnews Bay","Goodnews Bay, AK (GNU)"]
["JGC","Grand Canyon","Grand Canyon, AZ - Heliport (JGC)"]
["GCN","Grand Canyon","Grand Canyon, AZ - National Park (GCN)"]
["GFK","Grand Forks","Grand Forks, ND (GFK)"]
["GRI","Grand Island","Grand Island, NE (GRI)"]
["GJT","Grand Junction","Grand Junction, CO (GJT)"]
["GRR","Grand Rapids","Grand Rapids, MI (GRR)"]
["GPZ","Grand Rapids","Grand Rapids, MN (GPZ)"]
["KGX","Grayling","Grayling, AK (KGX)"]
["GTF","Great Falls","Great Falls, MT (GTF)"]
["GRB","Green Bay","Green Bay, WI (GRB)"]
["GSO","Greensboro","Greensboro, NC (GSO)"]
["GLH","Greenville","Greenville, MS (GLH)"]
["PGV","Greenville","Greenville, NC (PGV)"]
["GSP","Greenville/Spartanburg","Greenville/Spartanburg, SC (GSP)"]
["GON","Groton/New London","Groton/New London, CT (GON)"]
["GPT","Gulfport","Gulfport, MS (GPT)"]
["GUC","Gunnison","Gunnison, CO (GUC)"]
["GST","Gustavus","Gustavus, AK (GST)"]
["HGR","Hagerstown","Hagerstown, MD (HGR)"]
["SUN","Hailey","Hailey, ID (SUN)"]
["HNS","Haines","Haines, AK (HNS)"]
["PHF","Hampton","Hampton, VA (PHF)"]
["HNM","Hana","Hana, HI - Island of Maui (HNM)"]
["PAK","Hanapepe","Hanapepe, HI (PAK)"]
["CMX","Hancock","Hancock, MI (CMX)"]
["LEB","Hanover","Hanover, NH (LEB)"]
["HRL","Harlingen","Harlingen, TX (HRL)"]
["MDT","Harrisburg","Harrisburg, PA (MDT)"]
["HRO","Harrison","Harrison, AR (HRO)"]
["BDL","Hartford","Hartford, CT (BDL)"]
["HAE","Havasupai","Havasupai, AZ (HAE)"]
["HVR","Havre","Havre, MT (HVR)"]
["HDN","Hayden","Hayden, CO (HDN)"]
["HYS","Hays","Hays, KS (HYS)"]
["HKB","Healy Lake","Healy Lake, AK (HKB)"]
["HLN","Helena","Helena, MT (HLN)"]
["AVL","Hendersonville","Hendersonville, NC (AVL)"]
["HIB","Hibbing/Chisholm","Hibbing/Chisholm, MN (HIB)"]
["HKY","Hickory","Hickory, NC (HKY)"]
["GSO","High Point","High Point, NC (GSO)"]
["ITO","Hilo","Hilo, HI - Island of Hawaii (ITO)"]
["HHH","Hilton Head","Hilton Head, SC (HHH)"]
["HBB","Hobbs","Hobbs, NM (HBB)"]
["HYL","Hollis","Hollis, AK (HYL)"]
["HCR","Holy Cross","Holy Cross, AK (HCR)"]
["HOM","Homer","Homer, AK (HOM)"]
["HNL","Honolulu","Honolulu, HI - Island of Oahu (HNL)"]
["MKK","Hoolehua","Hoolehua, HI - Island of Molokai (MKK)"]
["HNH","Hoonah","Hoonah, AK (HNH)"]
["HPB","Hooper Bay","Hooper Bay, AK (HPB)"]
["HOT","Hot Springs","Hot Springs, AR (HOT)"]
["HOU","Houston","Houston, TX - All airports (HOU)"]
["HOU","Houston","Houston, TX - Hobby (HOU)"]
["IAH","Houston","Houston, TX - Intercontinental (IAH)"]
["HUS","Hughes","Hughes, AK (HUS)"]
["HTS","Huntington","Huntington, WV/Ashland, KY (HTS)"]
["HSV","Huntsville","Huntsville, AL (HSV)"]
["HON","Huron","Huron, SD (HON)"]
["HSL","Huslia","Huslia, AK (HSL)"]
["HYA","Hyannis","Hyannis, MA (HYA)"]
["HYG","Hydaburg","Hydaburg, AK (HYG)"]
["IDA","Idaho Falls","Idaho Falls, ID (IDA)"]
["IGG","Igiugig","Igiugig, AK (IGG)"]
["ILI","Iliamna","Iliamna, AK (ILI)"]
["IPL","Imperial","Imperial, CA (IPL)"]
["IND","Indianapolis","Indianapolis, IN (IND)"]
["INL","International Falls","International Falls, MN (INL)"]
["IYK","Inyokern","Inyokern, CA (IYK)"]
["IMT","Iron Mountain","Iron Mountain, MI (IMT)"]
["IWD","Ironwood","Ironwood, MI (IWD)"]
["ISP","Islip","Islip, NY (ISP)"]
["ITH","Ithaca","Ithaca, NY (ITH)"]
["JAC","Jackson Hole","Jackson Hole, WY (JAC)"]
["JAN","Jackson","Jackson, MS (JAN)"]
["MKL","Jackson","Jackson, TN (MKL)"]
["JAX","Jacksonville","Jacksonville, FL (JAX)"]
["OAJ","Jacksonville","Jacksonville, NC (OAJ)"]
["JMS","Jamestown","Jamestown, ND (JMS)"]
["JHW","Jamestown","Jamestown, NY (JHW)"]
["JVL","Janesville","Janesville, WI (JVL)"]
["BGM","Johnson City","Johnson City, NY (BGM)"]
["TRI","Johnson City","Johnson City, TN (TRI)"]
["JST","Johnstown","Johnstown, PA (JST)"]
["JBR","Jonesboro","Jonesboro, AR (JBR)"]
["JLN","Joplin","Joplin, MO (JLN)"]
["JNU","Juneau","Juneau, AK (JNU)"]
["OGG","Kahului","Kahului, HI - Island of Maui, (OGG)"]
["KAE","Kake","Kake, AK (KAE)"]
["KNK","Kakhonak","Kakhonak, AK (KNK)"]
["AZO","Kalamazoo","Kalamazoo, MI (AZO)"]
["LUP","Kalaupapa","Kalaupapa, HI - Island of Molokai, (LUP)"]
["KLG","Kalskag","Kalskag, AK (KLG)"]
["KAL","Kaltag","Kaltag, AK (KAL)"]
["MUE","Kamuela","Kamuela, HI - Island of Hawaii, (MUE)"]
["MCI","Kansas City","Kansas City, MO (MCI)"]
["JHM","Kapalua","Kapalua, HI - Island of Maui, (JHM)"]
["KXA","Kasaan","Kasaan, AK (KXA)"]
["KUK","Kasigluk","Kasigluk, AK (KUK)"]
["LIH","Kauai Island/Lihue","Kauai Island/Lihue, HI (LIH)"]
["EAR","Kearney","Kearney, NE (EAR)"]
["EEN","Keene","Keene, NH (EEN)"]
["ENA","Kenai","Kenai, AK (ENA)"]
["KTN","Ketchikan","Ketchikan, AK (KTN)"]
["EYW","Key West","Key West, FL (EYW)"]
["QKS","Keystone","Keystone, CO - Van service (QKS)"]
["IAN","Kiana","Kiana, AK (IAN)"]
["GGG","Kilgore/Gladewater","Kilgore/Gladewater, TX (GGG)"]
["ILE","Killeen","Killeen, TX (ILE)"]
["KVC","King Cove","King Cove, AK (KVC)"]
["AKN","King Salmon","King Salmon, AK (AKN)"]
["IGM","Kingman","Kingman, AZ (IGM)"]
["TRI","Kingsport","Kingsport, TN (TRI)"]
["KPN","Kipnuk","Kipnuk, AK (KPN)"]
["IRK","Kirksville","Kirksville, MO (IRK)"]
["KVL","Kivalina","Kivalina, AK (KVL)"]
["LMT","Klamath Falls","Klamath Falls, OR (LMT)"]
["KLW","Klawock","Klawock, AK (KLW)"]
["TYS","Knoxville","Knoxville, TN (TYS)"]
["OBU","Kobuk","Kobuk, AK (OBU)"]
["ADQ","Kodiak","Kodiak, AK (ADQ)"]
["KOA","Kona","Kona, HI - Island of Hawaii (KOA)"]
["KKH","Kongiganak","Kongiganak, AK (KKH)"]
["KOT","Kotlik","Kotlik, AK (KOT)"]
["OTZ","Kotzebue","Kotzebue, AK (OTZ)"]
["KYU","Koyukuk","Koyukuk, AK (KYU)"]
["KWT","Kwethluk","Kwethluk, AK (KWT)"]
["KWK","Kwigillingok","Kwigillingok, AK (KWK)"]
["LSE","La Crosse","La Crosse, WI (LSE)"]
["LAF","Lafayette","Lafayette, IN (LAF)"]
["LFT","Lafayette","Lafayette, LA (LFT)"]
["LCH","Lake Charles","Lake Charles, LA (LCH)"]
["HII","Lake Havasu City","Lake Havasu City, AZ (HII)"]
["LMA","Lake Minchumina","Lake Minchumina, AK (LMA)"]
["LNY","Lanai City","Lanai City, HI - Island of Lanai (LNY)"]
["LNS","Lancaster","Lancaster, PA (LNS)"]
["LAN","Lansing","Lansing, MI (LAN)"]
["LAR","Laramie","Laramie, WY (LAR)"]
["LRD","Laredo","Laredo, TX (LRD)"]
["LAS","Las Vegas","Las Vegas, NV (LAS)"]
["LBE","Latrobe","Latrobe, PA (LBE)"]
["PIB","Laurel","Laurel, MS (PIB)"]
["LAW","Lawton","Lawton, OK (LAW)"]
["LEB","Lebanon","Lebanon, NH (LEB)"]
["KLL","Levelock","Levelock, AK (KLL)"]
["LWB","Lewisburg","Lewisburg, WV (LWB)"]
["LWS","Lewiston","Lewiston, ID (LWS)"]
["LWT","Lewistown","Lewistown, MT (LWT)"]
["LEX","Lexington","Lexington, KY (LEX)"]
["LBL","Liberal","Liberal, KS (LBL)"]
["LIH","Lihue","Lihue, HI - Island of Kaui (LIH)"]
["LNK","Lincoln","Lincoln, NE (LNK)"]
["LIT","Little Rock","Little Rock, AR (LIT)"]
["LGB","Long Beach","Long Beach, CA (LGB)"]
["GGG","Longview","Longview, TX (GGG)"]
["LPS","Lopez Island","Lopez Island, WA (LPS)"]
["LAX","Los Angeles","Los Angeles, CA (LAX)"]
["SDF","Louisville","Louisville, KY (SDF)"]
["FNL","Loveland/Fort Collins","Loveland/Fort Collins, CO - Municipal Airport (FNL)"]
["QWF","Loveland/Fort Collins","Loveland/Fort Collins, CO - Bus service (QWF)"]
["LBB","Lubbock","Lubbock, TX (LBB)"]
["MCN","Macon","Macon, GA (MCN)"]
["MSN","Madison","Madison, WI (MSN)"]
{"$rows_left_out":1065}