{"text_format":"1","workbook":"xlsx","n_sheets":8,"sheets":["Instructions","ProductsList","CoolerLabelsShelves","CoolerLabelsDairy","EventData","DataSheet","DataForm","DV-IDENTITY-0"],"not_rendered":{"charts":0,"images":1,"macros":1,"external_links":1,"defined_names":106,"comments":0,"pivot_tables":0},"unopened":[],"bounds":{"document_bytes":16777216,"sheet_cells":100000,"rows_first":2000,"rows_last":500,"rows_between":2000,"halvings":0,"cell_chars":16384,"cell_head_chars":4096},"cells_cut":0,"cells_raw":0,"read":"whole","date_system":"1900"}

{"sheet":"Instructions","index":0,"n_rows":8,"n_cols":6,"rows_kept":8,"cut":false,"hidden":false,"merged":[[7,5,20,13]]}
[]
[]
[]
[]
[]
[]
[]
[null,null,null,null,null,"This tool allows you to input new data about production and raw material.                   The BIN numbers are useful for picking material and checking Inventory. Please be accurate when inputting data. The tags ColorLabelsShelves and ColorLabelsDairy allows you to create labels to identify the materials. The input form will appear automatically when you push the OK button in this window, but can be activate anytime by clicking the \"Input Data\" with the happy broccoli on the ribbon. Thank you for your Job and have fun."]

{"sheet":"ProductsList","index":1,"n_rows":122,"n_cols":23,"rows_kept":122,"cut":false,"hidden":false,"merged":[[1,16,1,21],[0,3,0,5]]}
[null,null,null,"PRODUCT",null,null,"Details"]
["BIN #","STORAGE SECTOR","INPUT DATE","ITEM","TYPE","QUANTITY","(Peculiar Obs.)",null,null,"BIN#",null,"Dairy Products",null,null,"BIN#",null,"Meats",null,null,null,null,null,"BIN#"]
["1AF01","SFG CSC","2011-12-09","LETTUCE","Romaine Cut","NA",{"$f":"DataSheet!H3","v":"NA"},null,null,"AJ01","JUICE","Orange Juice",0.5,"Gal","AJ01",null,"$FG","CSC","BEFF","Roast Beef ","Shaved","@"]
["1AF03","SFG CSC","2011-12-09","LETTUCE","Green Leaf","NA",{"$f":"DataSheet!H4","v":"NA"},null,null,"AJ02","JUICE","Orange Juice",16,"oz","AJ02",null,"$FG","CSC","CHEESE","Mild Cheddar Sliced","Sliced"]
["1AF04","SFG CSC","2011-12-09","LETTUCE","Fine Shredded bag","NA",{"$f":"DataSheet!H5","v":"NA"},null,null,"AJ03","JUICE","Orange Juice",12,"oz","AJ03",null,"$FG","CSC","CHEESE","Muenster Sliced","Sliced"]
["1AL01","SFG CSC","2011-12-09","PEPPERS","Red Bell Sliced Juliene","NA",{"$f":"DataSheet!H6","v":"NA"},null,null,"AJ04","JUICE","POG",16,"oz","AJ04",null,"$FG","CSC","CHEESE","Pepper Jack","Sliced"]
["1AL02","SFG CSC","2011-12-09","PEPPERS","Green Sliced Juliene","NA",{"$f":"DataSheet!H7","v":"NA"},null,null,"BC01","CHEESE","Cottage Cheese",1,"Lb","BC01",null,"$FG","CSC","CHEESE","Provolone","Sliced"]
["1AL03","SFG CSC","2011-12-09","ONION","Red Rings","NA",{"$f":"DataSheet!H8","v":"NA"},null,null,"BC02","CHEESE","Cottage Cheese",5,"Lb","BC02",null,"$FG","CSC","CHEESE","Swiss","Sliced"]
["1AL04","SFG CSC","2011-12-09","ONION","Green Sliced","NA",{"$f":"DataSheet!H9","v":"NA"},null,null,"BC03","CHEESE","Cottage Cheese",25,"Lb","BC03",null,"$FG","CSC","HAM",null,"Shaved"]
["1AL05","zzzCSC","2011-12-10","SQUASH","Zucchini Sliced Bag","NA",{"$f":"DataSheet!H10","v":"NA"},null,null,"DI01","ICECREAM FLAVOR","Vanila SS",1,"Gal","DI01",null,"$FG","CSC","HAM",null,"Sliced"]
["1AL06","SFG CSC","2011-12-11","PEPPERS","Green Bell 3/8\"","3/8\"",{"$f":"DataSheet!H11","v":"NA"},null,null,"DI02","ICECREAM FLAVOR","Chocolate SS",1,"Gal","DI02",null,"$FG","CSC","PASTRAMI",null,"Sliced"]
["1AL07","SFG CSC","2011-12-12","CARROT","Penny Sliced","NA",{"$f":"DataSheet!H12","v":"NA"},null,null,"EY01","YOGURT","Plain Yogurt",1,"Lb","EY01",null,"$FG","CSC","TURKEY","Roasted","Shaved"]
["1AL08","zzzCSC","2011-12-13","SQUASH","Zucchini Juliene Bag","NA",{"$f":"DataSheet!H13","v":"NA"},null,null,"EY02","YOGURT","Blueberry Yogurt",1,"Lb","EY02",null,"$FG","CSC","TURKEY",null,"Shaved"]
["1AL11","JUICE","2011-12-10","JUICE","Orange Juice 16 oz","NA",{"$f":"DataSheet!H14","v":"kkk"},null,null,"EY03","YOGURT","Boysenberry Yogurt",1,"Lb","EY03",null,"$FG","CSC","TURKEY",null,"Sliced"]
["1AL12","MILKS","2011-12-10","MILKS","Chocolate SS 1 gal","NA",{"$f":"DataSheet!H15","v":"jjjjj"},null,null,"EY04","YOGURT","Peach Yogurt",1,"Lb","EY04",null,null,"CSC","HAM","Loaf 850","BULK"]
["1AL33","$FG CSC","2011-12-10","FRUIT","Cantaloup cut","25 lb","Final",null,null,"EY05","YOGURT","Raspeberry Yogurt",1,"Lb","EY05",null,null,"CSC","TURKEY","Oven Roasted Loaf","BULK"]
["1AM02","SFG CSC","2011-12-14","CELERY","Sliced","3/8\"",{"$f":"DataSheet!H16","v":"Final"},null,null,"EY06","YOGURT","Strawberry Yogurt",1,"Lb","EY06"]
["1AM03","SFG CSC","2011-12-15","PEPPERS","Red Bell Diced","1\"",{"$f":"DataSheet!H17","v":"NA"},null,null,"FD01","DRESSING","Ranch Dressing",1,"Gal","FD01"]
["1AM04","SFG CSC","2011-12-16","ONION","Red Diced 3/8\"","1\"",{"$f":"DataSheet!H18","v":"NA"},null,null,"FD02","DRESSING","Ranch Dressing",0.5,"Gal","FD02"]
["1AM05","SFG CSC","2011-12-17","PEPPERS","Green Bell 1\"","NA",{"$f":"DataSheet!H19","v":"NA"},null,null,"FD03","DRESSING","Ranch Dressing",0.25,"Gal","FD03"]
["1AM06","SFG CSC","2011-12-18","ONION","Diced 1\"","NA",{"$f":"DataSheet!H20","v":"NA"},null,null,"FD04","DRESSING","Light Ranch Dressing",1,"Gal","FD04"]
["1AM07","SFG CSC","2011-12-19","CAULIFLOWER","Buds","1 pt",{"$f":"DataSheet!H21","v":"NA"},null,null,"FD05","DRESSING","Light Ranch Dressing",0.5,"Gal","FD05"]
["1AM08","SFG CSC","2011-12-20","CABBAGE","Red Shredded","1 lb",{"$f":"DataSheet!H22","v":"NA"},null,null,"FD06","DRESSING","Light Ranch Dressing",0.25,"Gal","FD06"]
["1AM10","$FG CSC","2011-12-10","CABBAGE","Fine Shredded bag","NA",{"$f":"DataSheet!H23","v":"NA"},null,null,"FD07","DRESSING","1000 Island Dressing",0.25,"Gal","FD07"]
["1AM69","$FG CSC","2011-12-10","HAM","Sliced","NA",{"$f":"DataSheet!H24","v":"Teste 001122"},null,null,"FD08","DRESSING","Bluecheese Dressing",0.25,"Gal","FD08"]
["1BL01","SFG CSC","2011-12-21","FRUIT","Cantaloup cut","NA",{"$f":"DataSheet!H25","v":"MMO"},null,null,"FD09","DRESSING","Teriaky Sauce",1,"Gal","FD09"]
["1BL03","SFG CSC","2011-12-22","FRUIT","Honeydew cut","NA",{"$f":"DataSheet!H26","v":"NA"},null,null,"GM01","MILKES","Cultured Butter Milk",1,"Gal","GM01"]
["1BL05","SFG CSC","2011-12-23","FRUIT","Pineapple Chunks Fresh","NA",{"$f":"DataSheet!H27","v":"NA"},null,null,"GM02","MILKES","Cultured Butter Milk",0.5,"Gal","GM02"]
["1BL07","SFG CSC","2011-12-24","CARROT","Diced","NA",{"$f":"DataSheet!H28","v":"NA"},null,null,"GM03","MILKES","Sour Cream",1,"Lb","GM03"]
["1BL08","SFG CSC","2011-12-25","ONION","Red Sliced","NA",{"$f":"DataSheet!H29","v":"NA"},null,null,"GM04","MILKES","Sour Cream",5,"Lb","GM04"]
["1BM02","SFG CSC","2011-12-26","FRUIT","Watermelon Chunks","NA",{"$f":"DataSheet!H30","v":"NA"},null,null,"GM05","MILKES","Heavy Whipping Cream",1,"Gal","GM05"]
["2AL00","SFG CSC","2011-12-27","POTATO","Fries Fresh","3/8\"",{"$f":"DataSheet!H31","v":"NA"},null,null,"GM06","MILKES","Reduced Fat Milk",1,"Gal","GM06"]
["2AL00","SFG CSC","2011-12-28","POTATO","Wedge","NA",{"$f":"DataSheet!H32","v":"NA"},null,null,"GM07","MILKES","Fat Free Milk",1,"pint","GM07"]
["2AL00","zzzCSC","2011-12-29","POTATO","Diced 3/8\"","NA",{"$f":"DataSheet!H33","v":"NA"},null,null,"GM08","MILKES","Reduced Fat Milk",1,"pint","GM08"]
["2AL02","SFG CSC","2011-12-30","CUCUMBER","Sliced","1/4\"",{"$f":"DataSheet!H34","v":"NA"},null,null,"GM09","MILKES","Reduced Fat Chocolate Milk",1,"pint","GM09"]
["2AL03","zzzCSC","2011-12-31","TOMATO","Diced Fresh","1/4\"",{"$f":"DataSheet!H35","v":"NA"},null,null,"GM10","MILKES","Egg Nog",0.5,"Gal","GM10"]
["2AL06","zzzFG CSC","2012-01-01","TOMATO","Sliced (for food) 1/4\"","3/8\"",{"$f":"DataSheet!H36","v":"NA"},null,null,"HCF01","CHEESE","shredded Mozarella",null,null,"HCF01"]
["2AL06","zzzFG CSC","2012-01-02","TOMATO","Sliced 1/4\"","5 lb",{"$f":"DataSheet!H37","v":"NA"},null,null,"HCF02","CHEESE","Grated Parmesan",null,null,"HCF02"]
["2AXB1","SFG CSC","2012-01-03","ONION","Diced 3/8\"","NA",{"$f":"DataSheet!H38","v":"NA"},null,null,"HCL11","CHEESE","Gouda",null,null,"HCL11"]
["2AXB2","SFG CSC","2012-01-04","CARROT","Shredded 5lb bag","NA",{"$f":"DataSheet!H39","v":"NA"},null,null,"HCL12","CHEESE","Smoked Gouda",null,null,"HCL12"]
["2BF01","SFG CSC","2012-01-05","LETTUCE","Romaine w/ color","3/8\"",{"$f":"DataSheet!H40","v":"NA"},null,null,"HCL13","CHEESE","Blue Chesse",null,null,"HCL13"]
["2BF03","SFG CSC","2012-01-06","LETTUCE","Romaine Blend 60% ","NA",{"$f":"DataSheet!H41","v":"NA"},null,null,"HCL21","CHEESE","Muenster",null,null,"HCL21"]
["2BL01","SFG CSC","2012-01-07","CELERY","Diced 3/8\"","NA",{"$f":"DataSheet!H42","v":"NA"},null,null,"HCL22","CHEESE","Monterrey Jack",null,null,"HCL22"]
["2BL02","SFG CSC","2012-01-08","CELERY","Sticks","NA",{"$f":"DataSheet!H43","v":"NA"},null,null,"HCL23","CHEESE","Colby Jack",null,null,"HCL23"]
["2BL03","SFG CSC","2012-01-09","ONION","Sliced","NA",{"$f":"DataSheet!H44","v":"NA"},null,null,"HCL24","CHEESE","Colby ",null,null,"HCL24"]
["2BL04","SFG CSC","2012-01-10","CARROT","Stick bag","1\"",{"$f":"DataSheet!H45","v":"NA"},null,null,"HCL31","CHEESE","Red. Fat Cheddar Cheese",null,null,"HCL31"]
["2BL05","SFG CSC","2012-01-11","CABBAGE","Coleslaw Mix","5 lb",{"$f":"DataSheet!H46","v":"NA"},null,null,"HCL32","CHEESE","Sharp Cheddar",null,null,"HCL32"]
["2BL06","SFG CSC","2012-01-12","BROCCOLI","Buds Fresh 1\"","NA",{"$f":"DataSheet!H47","v":"NA"},null,null,"HCL33","CHEESE","Medium Cheddar",null,null,"HCL33"]
["2BL07","SFG CSC","2012-01-13","CARROT","Match Stix 5lb bag","NA",{"$f":"DataSheet!H48","v":"NA"},null,null,"HCL34","CHEESE","Mild Cheddar",null,null,"HCL34"]
["2BL08","SFG CSC","2012-01-14","FAJITA","Mix Fresh","NA",{"$f":"DataSheet!H49","v":"NA"},null,null,"HCR11","CHEESE","Onions and Chives",null,null,"HCR11"]
["3BL02","$FG CSC","2012-01-22","HAM","Sliced","NA",{"$f":"DataSheet!H50","v":"NA"},null,null,"HCR12","CHEESE","Italian",null,null,"HCR12"]
["3BL04","$FG CSC","2012-01-26","TURKEY","Sliced","NA",{"$f":"DataSheet!H51","v":"NA"},null,null,"HCR21","CHEESE","Pepper Jack",null,null,"HCR21"]
["3BL06","$FG CSC","2012-01-20","CHEESE","Swiss Sliced","NA",{"$f":"DataSheet!H52","v":"NA"},null,null,"HCR22","CHEESE","Smoked Bacon",null,null,"HCR22"]
["3BL08","$FG CSC","2012-01-16","CHEESE","Mild Cheddar Sliced","NA",{"$f":"DataSheet!H53","v":"NA"},null,null,"HCR23","CHEESE","Parmesan",null,null,"HCR23"]
["3BM01","$FG CSC","2012-01-15","BEFF","Roast Beef  Shaved ","NA",{"$f":"DataSheet!H54","v":"NA"},null,null,"HCR24","CHEESE","Romano",null,null,"HCR24"]
["3BM02","$FG CSC","2012-01-17","CHEESE","Muenster Sliced","NA",{"$f":"DataSheet!H55","v":"NA"},null,null,"HCR31","CHEESE","Havarti",null,null,"HCR31"]
["3BM03","$FG CSC","2012-01-18","CHEESE","Pepper Jack Sliced","NA",{"$f":"DataSheet!H56","v":"NA"},null,null,"HCR32","CHEESE","Provolone",null,null,"HCR32"]
["3BM04","$FG CSC","2012-01-19","CHEESE","Provolone Sliced","NA",{"$f":"DataSheet!H57","v":"NA"},null,null,"HCR33","CHEESE","Mozarella",null,null,"HCR33"]
["3BM05","$FG CSC","2012-01-24","TURKEY","Roasted Shaved","NA",{"$f":"DataSheet!H58","v":"NA"},null,null,"HCR34","CHEESE","swiss",null,null,"HCR34"]
["3BM06","$FG CSC","2012-01-23","PASTRAMI","Sliced","NA",{"$f":"DataSheet!H59","v":"NA"}]
["3BM07","$FG CSC","2012-01-25","TURKEY","Shaved","1 lb","yyyy"]
["3BM08","$FG CSC","2012-01-21","HAM","Shaved","0.5 gal",{"$f":"DataSheet!H60","v":"NA"}]
["3BM11","$FG CSC","2011-12-10","PASTRAMI","Fine Shredded bag","16 oz",{"$f":"DataSheet!H61","v":"NA"}]
["AJ01","JUICE","2012-01-27","JUICE","Orange Juice 0.5 gal","12 oz",{"$f":"DataSheet!H62","v":"NA"}]
["AJ02","JUICE","2012-01-28","JUICE","Orange Juice 16 oz","16 oz",{"$f":"DataSheet!H63","v":"yyyy"}]
["AJ03","JUICE","2012-01-29","JUICE","Orange Juice 12 oz","1 lb",{"$f":"DataSheet!H64","v":"NA"}]
["AJ04","JUICE","2012-01-30","JUICE","Passion F./Orange J./Guava J. 16 oz","5 lb",{"$f":"DataSheet!H65","v":"NA"}]
["BC01","CHEESE","2012-01-31","CHEESE","Cottage Cheese 1 lb","25 lb",{"$f":"DataSheet!H66","v":"NA"}]
["BC02","CHEESE","2012-02-01","CHEESE","Cottage Cheese 5 lb","1 gal",{"$f":"DataSheet!H67","v":"NA"}]
["BC03","CHEESE","2012-02-02","CHEESE","Cottage Cheese 25 lb","1 gal",{"$f":"DataSheet!H68","v":"NA"}]
["DI01","ICECREAM FLAVOR","2012-02-03","ICECREAM FLAVOR","Vanila SS 1 gal","1 lb",{"$f":"DataSheet!H69","v":"NA"}]
["DI02","ICECREAM FLAVOR","2012-02-04","ICECREAM FLAVOR","Chocolate SS 1 gal","1 lb",{"$f":"DataSheet!H70","v":"NA"}]
["EY01","YOGURT","2012-02-05","YOGURT","Plain Yogurt 1 lb","1 lb",{"$f":"DataSheet!H71","v":"NA"}]
["EY02","YOGURT","2012-02-06","YOGURT","Blueberry Yogurt 1 lb","1 lb",{"$f":"DataSheet!H72","v":"NA"}]
["EY03","YOGURT","2012-02-07","YOGURT","Boysenberry Yogurt 1 lb","1 lb",{"$f":"DataSheet!H73","v":"NA"}]
["EY04","YOGURT","2012-02-08","YOGURT","Peach Yogurt 1 lb","1 lb",{"$f":"DataSheet!H74","v":"NA"}]
["EY05","YOGURT","2012-02-09","YOGURT","Raspeberry Yogurt 1 lb","1 gal",{"$f":"DataSheet!H75","v":"NA"}]
["EY06","YOGURT","2012-02-10","YOGURT","Strawberry Yogurt 1 lb","0.5 gal",{"$f":"DataSheet!H76","v":"NA"}]
["FD01","DRESSING","2012-02-11","DRESSING","Ranch Dressing 1 gal","0.25 gal",{"$f":"DataSheet!H77","v":"NA"}]
["FD02","DRESSING","2012-02-12","DRESSING","Ranch Dressing 0.5 gal","1 gal",{"$f":"DataSheet!H78","v":"NA"}]
["FD03","DRESSING","2012-02-13","DRESSING","Ranch Dressing 0.25 gal","0.5 gal",{"$f":"DataSheet!H79","v":"NA"}]
["FD04","DRESSING","2012-02-14","DRESSING","Light Ranch Dressing 1 gal","0.25 gal",{"$f":"DataSheet!H80","v":"NA"}]
["FD05","DRESSING","2012-02-15","DRESSING","Light Ranch Dressing 0.5 gal","0.25 gal",{"$f":"DataSheet!H81","v":"NA"}]
["FD06","DRESSING","2012-02-16","DRESSING","Light Ranch Dressing 0.25 gal",0.25,{"$f":"DataSheet!H82","v":"NA"}]
["FD07","DRESSING","2012-02-17","DRESSING","1000 Island Dressing 0.25 gal","1 gal",{"$f":"DataSheet!H83","v":"NA"}]
["FD08","DRESSING","2012-02-18","DRESSING","Bluecheese Dressing 0.25 gal","1 gal",{"$f":"DataSheet!H84","v":"NA"}]
["FD09","DRESSING","2012-02-19","DRESSING","Teriaky Sauce 1 gal","0.5 gal",{"$f":"DataSheet!H85","v":"NA"}]
["GM01","MILKS","2012-02-20","MILKS","Cultured Butter Milk 1gal","1 lb",{"$f":"DataSheet!H86","v":"NA"}]
["GM02","MILKS","2012-02-21","MILKS","Cultured Butter Milk 0.5 gal","5 lb",{"$f":"DataSheet!H87","v":"NA"}]
["GM03","MILKS","2012-02-22","MILKS","Sour Cream 1 lb","1 gal",{"$f":"DataSheet!H88","v":"NA"}]
["GM04","MILKS","2012-02-23","MILKS","Sour Cream 5 lb","1 gal",{"$f":"DataSheet!H89","v":"NA"}]
["GM05","MILKS","2012-02-24","MILKS","Heavy Whipping Cream 1 gal","1 pt",{"$f":"DataSheet!H90","v":"NA"}]
["GM06","MILKS","2012-02-25","MILKS","Reduced Fat Milk 1 gal","1 pt",{"$f":"DataSheet!H91","v":"NA"}]
["GM07","MILKS","2012-02-26","MILKS","Fat Free Milk 1 pt","1 pt",{"$f":"DataSheet!H92","v":"NA"}]
["GM08","MILKS","2012-02-27","MILKS","Reduced Fat Milk 1 pt","0.5 gal",{"$f":"DataSheet!H93","v":"NA"}]
["GM09","MILKS","2012-02-28","MILKS","Reduced Fat Chocolate Milk 1 pt","NA",{"$f":"DataSheet!H94","v":"NA"}]
["GM10","MILKS","2012-02-29","MILKS","Egg Nog 0.5 gal","NA",{"$f":"DataSheet!H95","v":"NA"}]
["HCF01","CHEESE","2012-03-01","CHEESE","shredded Mozarella","NA",{"$f":"DataSheet!H96","v":"NA"}]
["HCF02","CHEESE","2012-03-02","CHEESE","Grated Parmesan","NA",{"$f":"DataSheet!H97","v":"NA"}]
["HCL11","CHEESE","2012-03-03","CHEESE","Gouda","NA",{"$f":"DataSheet!H98","v":"NA"}]
["HCL12","CHEESE","2012-03-04","CHEESE","Smoked Gouda","NA",{"$f":"DataSheet!H99","v":"NA"}]
["HCL13","CHEESE","2012-03-05","CHEESE","Blue Chesse","NA",{"$f":"DataSheet!H100","v":"NA"}]
["HCL21","CHEESE","2012-03-06","CHEESE","Muenster","NA",{"$f":"DataSheet!H101","v":"NA"}]
["HCL22","CHEESE","2012-03-07","CHEESE","Monterrey Jack","NA",{"$f":"DataSheet!H102","v":"NA"}]
["HCL23","CHEESE","2012-03-08","CHEESE","Colby Jack","NA",{"$f":"DataSheet!H103","v":"NA"}]
["HCL24","CHEESE","2012-03-09","CHEESE","Colby ","NA",{"$f":"DataSheet!H104","v":"NA"}]
["HCL31","CHEESE","2012-03-10","CHEESE","Red. Fat Cheddar Cheese","NA",{"$f":"DataSheet!H105","v":"NA"}]
["HCL32","CHEESE","2012-03-11","CHEESE","Sharp Cheddar","NA",{"$f":"DataSheet!H106","v":"NA"}]
["HCL33","CHEESE","2012-03-12","CHEESE","Medium Cheddar","NA",{"$f":"DataSheet!H107","v":"NA"}]
["HCL34","CHEESE","2012-03-13","CHEESE","Mild Cheddar","NA",{"$f":"DataSheet!H108","v":"NA"}]
["HCR11","CHEESE","2012-03-14","CHEESE","Onions and Chives","NA",{"$f":"DataSheet!H109","v":"NA"}]
["HCR12","CHEESE","2012-03-15","CHEESE","Italian","NA",{"$f":"DataSheet!H110","v":"NA"}]
["HCR21","CHEESE","2012-03-16","CHEESE","Pepper Jack","NA",{"$f":"DataSheet!H111","v":"NA"}]
["HCR22","CHEESE","2012-03-17","CHEESE","Smoked Bacon","NA",{"$f":"DataSheet!H112","v":"NA"}]
["HCR23","CHEESE","2012-03-18","CHEESE","Parmesan","NA",{"$f":"DataSheet!H113","v":"NA"}]
["HCR24","CHEESE","2012-03-19","CHEESE","Romano","NA",{"$f":"DataSheet!H114","v":"NA"}]
["HCR31","CHEESE","2012-03-20","CHEESE","Havarti","NA",{"$f":"DataSheet!H115","v":"NA"}]
["HCR32","CHEESE","2012-03-21","CHEESE","Provolone","NA",{"$f":"DataSheet!H116","v":"NA"}]
["HCR33","CHEESE","2012-03-22","CHEESE","Mozarella","NA","NA"]
["HCR34","CHEESE","2012-03-23","CHEESE","swiss","NA","NA"]
["JJ333","$FG CSC","2011-12-10","BROCCOLI","Fine Shredded bag","12 oz","Teste"]
["JJJ444","CHEESE","2011-12-10","CHEESE","Mild Cheddar Sliced","1 lb","Teste"]

{"sheet":"CoolerLabelsShelves","index":2,"n_rows":40,"n_cols":15,"rows_kept":40,"cut":false,"hidden":false,"merged":[[18,1,18,4],[1,0,1,4],[2,1,2,4],[3,1,3,4],[4,0,5,0],[4,1,5,4],[9,0,9,4],[10,1,10,4],[11,1,11,4],[12,0,13,0],[12,1,13,4],[17,0,17,4],[36,0,37,0],[36,1,37,4],[19,1,19,4],[20,0,21,0],[20,1,21,4],[25,0,25,4],[26,1,26,4],[27,1,27,4],[28,0,29,0],[28,1,29,4],[33,0,33,4],[34,1,34,4],[35,1,35,4]]}
[]
["ITEM"]
[null,"FRUIT"]
[null,"Pineapple Chunks Fresh"]
["BIN#","1BL05"]
[]
["BACK",1,3,5,7]
["FRONT",2,4,6,8]
[]
["ITEM"]
[null,"TURKEY"]
[null,"Roasted Shaved"]
["BIN#","3BM05"]
[]
["BACK",1,3,5,7]
["FRONT",2,4,6,8]
[]
["ITEM"]
[null,"TOMATO",null,null,null,null,null,null,null,null,null,null,null,null," "]
[null,"Diced Fresh"]
["BIN#","2AL03"]
[]
["BACK",1,3,5,7]
["FRONT",2,4,6,8]
[]
["ITEM"]
[null,"PEPPERS"]
[null,"Green Bell 3/8\""]
["BIN#","1AL06"]
[]
["BACK",1,3,5,7]
["FRONT",2,4,6,8]
[]
["ITEM"]
[null,"FRUIT"]
[null,"Pineapple Chunks Fresh"]
["BIN#","1BL05"]
[]
["BACK",1,3,5,7]
["FRONT",2,4,6,8]

{"sheet":"CoolerLabelsDairy","index":3,"n_rows":37,"n_cols":15,"rows_kept":37,"cut":false,"hidden":false,"merged":[[18,1,18,4],[1,0,1,4],[2,1,2,4],[3,1,3,4],[4,0,7,0],[4,1,7,4],[9,0,9,4],[10,1,10,4],[11,1,11,4],[12,0,15,0],[12,1,15,4],[17,0,17,4],[36,0,39,0],[36,1,39,4],[19,1,19,4],[20,0,23,0],[20,1,23,4],[25,0,25,4],[26,1,26,4],[27,1,27,4],[28,0,31,0],[28,1,31,4],[33,0,33,4],[34,1,34,4],[35,1,35,4]]}
[]
["ITEM"]
[null,"CELERY"]
[null,"Sliced"]
["BIN#","1AM02"]
[]
[]
[]
[]
["ITEM"]
[null,"JUICE"]
[null,"Passion F./Orange J./Guava J. 16 oz"]
["BIN#","AJ04"]
[]
[]
[]
[]
["ITEM"]
[null,"PASTRAMI",null,null,null,null,null,null,null,null,null,null,null,null," "]
[null,"Sliced"]
["BIN#","3BM06"]
[]
[]
[]
[]
["ITEM"]
[null,"Passion F./Orange J./Guava J."]
[null,"16 oz"]
["BIN#","AJ04"]
[]
[]
[]
[]
["ITEM"]
[null,"CHEESE"]
[null,"Monterrey Jack"]
["BIN#","HCL22"]

{"sheet":"EventData","index":4,"n_rows":38,"n_cols":5,"rows_kept":38,"cut":false,"hidden":true,"merged":[]}
["STORAGE","BIN #","Date Input ","Time","Process location 1"]
[{"$f":"DataSheet!C3","v":"SFG CSC"},{"$f":"DataSheet!A3","v":"1AF01"},{"$f":"DataSheet!D3","v":"Produce"},{"$f":"DataSheet!E3","v":"LETTUCE"},{"$f":"DataSheet!F3","v":"Romaine Cut"}]
[{"$f":"DataSheet!C4","v":"SFG CSC"},{"$f":"DataSheet!A4","v":"1AF03"},{"$f":"DataSheet!D4","v":"Produce"},{"$f":"DataSheet!E4","v":"LETTUCE"},{"$f":"DataSheet!F4","v":"Green Leaf"}]
[{"$f":"DataSheet!C5","v":"SFG CSC"},{"$f":"DataSheet!A5","v":"1AF04"},{"$f":"DataSheet!D5","v":"Produce"},{"$f":"DataSheet!E5","v":"LETTUCE"},{"$f":"DataSheet!F5","v":"Fine Shredded bag"}]
[{"$f":"DataSheet!C6","v":"SFG CSC"},{"$f":"DataSheet!A6","v":"1AL01"},{"$f":"DataSheet!D6","v":"Produce"},{"$f":"DataSheet!E6","v":"PEPPERS"},{"$f":"DataSheet!F6","v":"Red Bell Sliced Juliene"}]
[{"$f":"DataSheet!C8","v":"SFG CSC"},{"$f":"DataSheet!A8","v":"1AL03"},{"$f":"DataSheet!D8","v":"Produce"},{"$f":"DataSheet!E8","v":"ONION"},{"$f":"DataSheet!F8","v":"Red Rings"}]
[{"$f":"DataSheet!C9","v":"SFG CSC"},{"$f":"DataSheet!A9","v":"1AL04"},{"$f":"DataSheet!D9","v":"Produce"},{"$f":"DataSheet!E9","v":"ONION"},{"$f":"DataSheet!F9","v":"Green Sliced"}]
[{"$f":"DataSheet!C10","v":"zzzCSC"},{"$f":"DataSheet!A10","v":"1AL05"},{"$f":"DataSheet!D10","v":"Produce"},{"$f":"DataSheet!E10","v":"SQUASH"},{"$f":"DataSheet!F10","v":"Zucchini Sliced Bag"}]
[{"$f":"DataSheet!C11","v":"SFG CSC"},{"$f":"DataSheet!A11","v":"1AL06"},{"$f":"DataSheet!D11","v":"Produce"},{"$f":"DataSheet!E11","v":"PEPPERS"},{"$f":"DataSheet!F11","v":"Green Bell 3/8\""}]
[{"$f":"DataSheet!C12","v":"SFG CSC"},{"$f":"DataSheet!A12","v":"1AL07"},{"$f":"DataSheet!D12","v":"Produce"},{"$f":"DataSheet!E12","v":"CARROT"},{"$f":"DataSheet!F12","v":"Penny Sliced"}]
[{"$f":"DataSheet!C13","v":"zzzCSC"},{"$f":"DataSheet!A13","v":"1AL08"},{"$f":"DataSheet!D13","v":"Produce"},{"$f":"DataSheet!E13","v":"SQUASH"},{"$f":"DataSheet!F13","v":"Zucchini Juliene Bag"}]
[{"$f":"DataSheet!C14","v":"JUICE"},{"$f":"DataSheet!A14","v":"1AL11"},{"$f":"DataSheet!D14","v":"Produce"},{"$f":"DataSheet!E14","v":"JUICE"},{"$f":"DataSheet!F14","v":"Orange Juice 16 oz"}]
[{"$f":"DataSheet!C15","v":"MILKS"},{"$f":"DataSheet!A15","v":"1AL12"},{"$f":"DataSheet!D15","v":"Produce"},{"$f":"DataSheet!E15","v":"MILKS"},{"$f":"DataSheet!F15","v":"Chocolate SS 1 gal"}]
[{"$f":"DataSheet!C16","v":"$FG CSC"},{"$f":"DataSheet!A16","v":"1AL33"},{"$f":"DataSheet!D16","v":"Dairy"},{"$f":"DataSheet!E16","v":"FRUIT"},{"$f":"DataSheet!F16","v":"Cantaloup cut"}]
[{"$f":"DataSheet!C17","v":"SFG CSC"},{"$f":"DataSheet!A17","v":"1AM02"},{"$f":"DataSheet!D17","v":"Produce"},{"$f":"DataSheet!E17","v":"CELERY"},{"$f":"DataSheet!F17","v":"Sliced"}]
[{"$f":"DataSheet!C18","v":"SFG CSC"},{"$f":"DataSheet!A18","v":"1AM03"},{"$f":"DataSheet!D18","v":"Produce"},{"$f":"DataSheet!E18","v":"PEPPERS"},{"$f":"DataSheet!F18","v":"Red Bell Diced"}]
[{"$f":"DataSheet!C19","v":"SFG CSC"},{"$f":"DataSheet!A19","v":"1AM04"},{"$f":"DataSheet!D19","v":"Produce"},{"$f":"DataSheet!E19","v":"ONION"},{"$f":"DataSheet!F19","v":"Red Diced 3/8\""}]
[{"$f":"DataSheet!C20","v":"SFG CSC"},{"$f":"DataSheet!A20","v":"1AM05"},{"$f":"DataSheet!D20","v":"Produce"},{"$f":"DataSheet!E20","v":"PEPPERS"},{"$f":"DataSheet!F20","v":"Green Bell 1\""}]
[{"$f":"DataSheet!C21","v":"SFG CSC"},{"$f":"DataSheet!A21","v":"1AM06"},{"$f":"DataSheet!D21","v":"Produce"},{"$f":"DataSheet!E21","v":"ONION"},{"$f":"DataSheet!F21","v":"Diced 1\""}]
[{"$f":"DataSheet!C22","v":"SFG CSC"},{"$f":"DataSheet!A22","v":"1AM07"},{"$f":"DataSheet!D22","v":"Produce"},{"$f":"DataSheet!E22","v":"CAULIFLOWER"},{"$f":"DataSheet!F22","v":"Buds"}]
[{"$f":"DataSheet!C23","v":"SFG CSC"},{"$f":"DataSheet!A23","v":"1AM08"},{"$f":"DataSheet!D23","v":"Produce"},{"$f":"DataSheet!E23","v":"CABBAGE"},{"$f":"DataSheet!F23","v":"Red Shredded"}]
[{"$f":"DataSheet!C24","v":"$FG CSC"},{"$f":"DataSheet!A24","v":"1AM10"},{"$f":"DataSheet!D24","v":"Dairy"},{"$f":"DataSheet!E24","v":"CABBAGE"},{"$f":"DataSheet!F24","v":"Fine Shredded bag"}]
[{"$f":"DataSheet!C25","v":"$FG CSC"},{"$f":"DataSheet!A25","v":"1AM69"},{"$f":"DataSheet!D25","v":"Cook/Chill"},{"$f":"DataSheet!E25","v":"HAM"},{"$f":"DataSheet!F25","v":"Sliced"}]
[{"$f":"DataSheet!C26","v":"SFG CSC"},{"$f":"DataSheet!A26","v":"1BL01"},{"$f":"DataSheet!D26","v":"Produce"},{"$f":"DataSheet!E26","v":"FRUIT"},{"$f":"DataSheet!F26","v":"Cantaloup cut"}]
[{"$f":"DataSheet!C27","v":"SFG CSC"},{"$f":"DataSheet!A27","v":"1BL03"},{"$f":"DataSheet!D27","v":"Produce"},{"$f":"DataSheet!E27","v":"FRUIT"},{"$f":"DataSheet!F27","v":"Honeydew cut"}]
[{"$f":"DataSheet!C28","v":"SFG CSC"},{"$f":"DataSheet!A28","v":"1BL05"},{"$f":"DataSheet!D28","v":"Produce"},{"$f":"DataSheet!E28","v":"FRUIT"},{"$f":"DataSheet!F28","v":"Pineapple Chunks Fresh"}]
[{"$f":"DataSheet!C29","v":"SFG CSC"},{"$f":"DataSheet!A29","v":"1BL07"},{"$f":"DataSheet!D29","v":"Produce"},{"$f":"DataSheet!E29","v":"CARROT"},{"$f":"DataSheet!F29","v":"Diced"}]
[{"$f":"DataSheet!C30","v":"SFG CSC"},{"$f":"DataSheet!A30","v":"1BL08"},{"$f":"DataSheet!D30","v":"Produce"},{"$f":"DataSheet!E30","v":"ONION"},{"$f":"DataSheet!F30","v":"Red Sliced"}]
[{"$f":"DataSheet!C31","v":"SFG CSC"},{"$f":"DataSheet!A31","v":"1BM02"},{"$f":"DataSheet!D31","v":"Produce"},{"$f":"DataSheet!E31","v":"FRUIT"},{"$f":"DataSheet!F31","v":"Watermelon Chunks"}]
[{"$f":"DataSheet!C32","v":"SFG CSC"},{"$f":"DataSheet!A32","v":"2AL00"},{"$f":"DataSheet!D32","v":"Produce"},{"$f":"DataSheet!E32","v":"POTATO"},{"$f":"DataSheet!F32","v":"Fries Fresh"}]
[{"$f":"DataSheet!C33","v":"SFG CSC"},{"$f":"DataSheet!A33","v":"2AL00"},{"$f":"DataSheet!D33","v":"Produce"},{"$f":"DataSheet!E33","v":"POTATO"},{"$f":"DataSheet!F33","v":"Wedge"}]
[{"$f":"DataSheet!C34","v":"zzzCSC"},{"$f":"DataSheet!A34","v":"2AL00"},{"$f":"DataSheet!D34","v":"Produce"},{"$f":"DataSheet!E34","v":"POTATO"},{"$f":"DataSheet!F34","v":"Diced 3/8\""}]
[{"$f":"DataSheet!C35","v":"SFG CSC"},{"$f":"DataSheet!A35","v":"2AL02"},{"$f":"DataSheet!D35","v":"Produce"},{"$f":"DataSheet!E35","v":"CUCUMBER"},{"$f":"DataSheet!F35","v":"Sliced"}]
[{"$f":"DataSheet!C36","v":"zzzCSC"},{"$f":"DataSheet!A36","v":"2AL03"},{"$f":"DataSheet!D36","v":"Produce"},{"$f":"DataSheet!E36","v":"TOMATO"},{"$f":"DataSheet!F36","v":"Diced Fresh"}]
[{"$f":"DataSheet!C37","v":"zzzFG CSC"},{"$f":"DataSheet!A37","v":"2AL06"},{"$f":"DataSheet!D37","v":"Produce"},{"$f":"DataSheet!E37","v":"TOMATO"},{"$f":"DataSheet!F37","v":"Sliced (for food) 1/4\""}]
[{"$f":"DataSheet!C38","v":"zzzFG CSC"},{"$f":"DataSheet!A38","v":"2AL06"},{"$f":"DataSheet!D38","v":"Produce"},{"$f":"DataSheet!E38","v":"TOMATO"},{"$f":"DataSheet!F38","v":"Sliced 1/4\""}]
[{"$f":"DataSheet!C39","v":"SFG CSC"},{"$f":"DataSheet!A39","v":"2AXB1"},{"$f":"DataSheet!D39","v":"Produce"},{"$f":"DataSheet!E39","v":"ONION"},{"$f":"DataSheet!F39","v":"Diced 3/8\""}]
[{"$f":"DataSheet!C40","v":"SFG CSC"},{"$f":"DataSheet!A40","v":"2AXB2"},{"$f":"DataSheet!D40","v":"Produce"},{"$f":"DataSheet!E40","v":"CARROT"},{"$f":"DataSheet!F40","v":"Shredded 5lb bag"}]

{"sheet":"DataSheet","index":5,"n_rows":124,"n_cols":8,"rows_kept":124,"cut":false,"hidden":false,"merged":[]}
["BIN ","Date","STORAGE ","SPECIALTY","PRODUCT","PRODUCT","PRODUCT","Details"]
["NUMBER"," Input ","SECTOR","(AREA)","ITEM","TYPE","QUANTITY","(Peculiar Obs.)"]
["1AF01","2011-12-09","SFG CSC","Produce","LETTUCE","Romaine Cut","NA","NA"]
["1AF03","2011-12-09","SFG CSC","Produce","LETTUCE","Green Leaf","NA","NA"]
["1AF04","2011-12-09","SFG CSC","Produce","LETTUCE","Fine Shredded bag","NA","NA"]
["1AL01","2011-12-09","SFG CSC","Produce","PEPPERS","Red Bell Sliced Juliene","NA","NA"]
["1AL02","2011-12-09","SFG CSC","Produce","PEPPERS","Green Sliced Juliene","NA","NA"]
["1AL03","2011-12-09","SFG CSC","Produce","ONION","Red Rings","NA","NA"]
["1AL04","2011-12-09","SFG CSC","Produce","ONION","Green Sliced","NA","NA"]
["1AL05","2011-12-10","zzzCSC","Produce","SQUASH","Zucchini Sliced Bag","NA","NA"]
["1AL06","2011-12-11","SFG CSC","Produce","PEPPERS","Green Bell 3/8\"","3/8\"","NA"]
["1AL07","2011-12-12","SFG CSC","Produce","CARROT","Penny Sliced","NA","NA"]
["1AL08","2011-12-13","zzzCSC","Produce","SQUASH","Zucchini Juliene Bag","NA","NA"]
["1AL11","2011-12-10","JUICE","Produce","JUICE","Orange Juice 16 oz","16 oz","kkk"]
["1AL12","2011-12-10","MILKS","Produce","MILKS","Chocolate SS 1 gal","1 gal","jjjjj"]
["1AL33","2011-12-10","$FG CSC","Dairy","FRUIT","Cantaloup cut","25 lb","Final"]
["1AM02","2011-12-14","SFG CSC","Produce","CELERY","Sliced","NA","NA"]
["1AM03","2011-12-15","SFG CSC","Produce","PEPPERS","Red Bell Diced","NA","NA"]
["1AM04","2011-12-16","SFG CSC","Produce","ONION","Red Diced 3/8\"","3/8\"","NA"]
["1AM05","2011-12-17","SFG CSC","Produce","PEPPERS","Green Bell 1\"","1\"","NA"]
["1AM06","2011-12-18","SFG CSC","Produce","ONION","Diced 1\"","1\"","NA"]
["1AM07","2011-12-19","SFG CSC","Produce","CAULIFLOWER","Buds","NA","NA"]
["1AM08","2011-12-20","SFG CSC","Produce","CABBAGE","Red Shredded","NA","NA"]
["1AM10","2011-12-10","$FG CSC","Dairy","CABBAGE","Fine Shredded bag","1 pt","Teste 001122"]
["1AM69","2011-12-10","$FG CSC","Cook/Chill","HAM","Sliced","1 lb","MMO"]
["1BL01","2011-12-21","SFG CSC","Produce","FRUIT","Cantaloup cut","NA","NA"]
["1BL03","2011-12-22","SFG CSC","Produce","FRUIT","Honeydew cut","NA","NA"]
["1BL05","2011-12-23","SFG CSC","Produce","FRUIT","Pineapple Chunks Fresh","NA","NA"]
["1BL07","2011-12-24","SFG CSC","Produce","CARROT","Diced","NA","NA"]
["1BL08","2011-12-25","SFG CSC","Produce","ONION","Red Sliced","NA","NA"]
["1BM02","2011-12-26","SFG CSC","Produce","FRUIT","Watermelon Chunks","NA","NA"]
["2AL00","2011-12-27","SFG CSC","Produce","POTATO","Fries Fresh","NA","NA"]
["2AL00","2011-12-28","SFG CSC","Produce","POTATO","Wedge","NA","NA"]
["2AL00","2011-12-29","zzzCSC","Produce","POTATO","Diced 3/8\"","3/8\"","NA"]
["2AL02","2011-12-30","SFG CSC","Produce","CUCUMBER","Sliced","NA","NA"]
["2AL03","2011-12-31","zzzCSC","Produce","TOMATO","Diced Fresh","NA","NA"]
["2AL06","2012-01-01","zzzFG CSC","Produce","TOMATO","Sliced (for food) 1/4\"","1/4\"","NA"]
["2AL06","2012-01-02","zzzFG CSC","Produce","TOMATO","Sliced 1/4\"","1/4\"","NA"]
["2AXB1","2012-01-03","SFG CSC","Produce","ONION","Diced 3/8\"","3/8\"","NA"]
["2AXB2","2012-01-04","SFG CSC","Produce","CARROT","Shredded 5lb bag","5 lb","NA"]
["2BF01","2012-01-05","SFG CSC","Produce","LETTUCE","Romaine w/ color","NA","NA"]
["2BF03","2012-01-06","SFG CSC","Produce","LETTUCE","Romaine Blend 60% ","NA","NA"]
["2BL01","2012-01-07","SFG CSC","Produce","CELERY","Diced 3/8\"","3/8\"","NA"]
["2BL02","2012-01-08","SFG CSC","Produce","CELERY","Sticks","NA","NA"]
["2BL03","2012-01-09","SFG CSC","Produce","ONION","Sliced","NA","NA"]
["2BL04","2012-01-10","SFG CSC","Produce","CARROT","Stick bag","NA","NA"]
["2BL05","2012-01-11","SFG CSC","Produce","CABBAGE","Coleslaw Mix","NA","NA"]
["2BL06","2012-01-12","SFG CSC","Produce","BROCCOLI","Buds Fresh 1\"","1\"","NA"]
["2BL07","2012-01-13","SFG CSC","Produce","CARROT","Match Stix 5lb bag","5 lb","NA"]
["2BL08","2012-01-14","SFG CSC","Produce","FAJITA","Mix Fresh","NA","NA"]
["3BL02","2012-01-22","$FG CSC","Cook/Chill","HAM","Sliced","NA","NA"]
["3BL04","2012-01-26","$FG CSC","Cook/Chill","TURKEY","Sliced","NA","NA"]
["3BL06","2012-01-20","$FG CSC","Cook/Chill","CHEESE","Swiss Sliced","NA","NA"]
["3BL08","2012-01-16","$FG CSC","Cook/Chill","CHEESE","Mild Cheddar Sliced","NA","NA"]
["3BM01","2012-01-15","$FG CSC","Cook/Chill","BEFF","Roast Beef  Shaved ","NA","NA"]
["3BM02","2012-01-17","$FG CSC","Cook/Chill","CHEESE","Muenster Sliced","NA","NA"]
["3BM03","2012-01-18","$FG CSC","Cook/Chill","CHEESE","Pepper Jack Sliced","NA","NA"]
["3BM04","2012-01-19","$FG CSC","Cook/Chill","CHEESE","Provolone Sliced","NA","NA"]
["3BM05","2012-01-24","$FG CSC","Cook/Chill","TURKEY","Roasted Shaved","NA","NA"]
["3BM06","2012-01-23","$FG CSC","Cook/Chill","PASTRAMI","Sliced","NA","NA"]
["3BM07","2012-01-25","$FG CSC","Cook/Chill","TURKEY","Shaved","NA","NA"]
["3BM08","2012-01-21","$FG CSC","Cook/Chill","HAM","Shaved","NA","NA"]
["3BM11","2011-12-10","$FG CSC","Cook/Chill","PASTRAMI","Fine Shredded bag","1 lb","yyyy"]
["AJ01","2012-01-27","JUICE","Dairy ","JUICE","Orange Juice 0.5 gal","0.5 gal","NA"]
["AJ02","2012-01-28","JUICE","Dairy ","JUICE","Orange Juice 16 oz","16 oz","NA"]
["AJ03","2012-01-29","JUICE","Dairy ","JUICE","Orange Juice 12 oz","12 oz","NA"]
["AJ04","2012-01-30","JUICE","Dairy ","JUICE","Passion F./Orange J./Guava J. 16 oz","16 oz","NA"]
["BC01","2012-01-31","CHEESE","Dairy ","CHEESE","Cottage Cheese 1 lb","1 lb","NA"]
["BC02","2012-02-01","CHEESE","Dairy ","CHEESE","Cottage Cheese 5 lb","5 lb","NA"]
["BC03","2012-02-02","CHEESE","Dairy ","CHEESE","Cottage Cheese 25 lb","25 lb","NA"]
["DI01","2012-02-03","ICECREAM FLAVOR","Dairy ","ICECREAM FLAVOR","Vanila SS 1 gal","1 gal","NA"]
["DI02","2012-02-04","ICECREAM FLAVOR","Dairy ","ICECREAM FLAVOR","Chocolate SS 1 gal","1 gal","NA"]
["EY01","2012-02-05","YOGURT","Dairy ","YOGURT","Plain Yogurt 1 lb","1 lb","NA"]
["EY02","2012-02-06","YOGURT","Dairy ","YOGURT","Blueberry Yogurt 1 lb","1 lb","NA"]
["EY03","2012-02-07","YOGURT","Dairy ","YOGURT","Boysenberry Yogurt 1 lb","1 lb","NA"]
["EY04","2012-02-08","YOGURT","Dairy ","YOGURT","Peach Yogurt 1 lb","1 lb","NA"]
["EY05","2012-02-09","YOGURT","Dairy ","YOGURT","Raspeberry Yogurt 1 lb","1 lb","NA"]
["EY06","2012-02-10","YOGURT","Dairy ","YOGURT","Strawberry Yogurt 1 lb","1 lb","NA"]
["FD01","2012-02-11","DRESSING","Dairy ","DRESSING","Ranch Dressing 1 gal","1 gal","NA"]
["FD02","2012-02-12","DRESSING","Dairy ","DRESSING","Ranch Dressing 0.5 gal","0.5 gal","NA"]
["FD03","2012-02-13","DRESSING","Dairy ","DRESSING","Ranch Dressing 0.25 gal","0.25 gal","NA"]
["FD04","2012-02-14","DRESSING","Dairy ","DRESSING","Light Ranch Dressing 1 gal","1 gal","NA"]
["FD05","2012-02-15","DRESSING","Dairy ","DRESSING","Light Ranch Dressing 0.5 gal","0.5 gal","NA"]
["FD06","2012-02-16","DRESSING","Dairy ","DRESSING","Light Ranch Dressing 0.25 gal","0.25 gal","NA"]
["FD07","2012-02-17","DRESSING","Dairy ","DRESSING","1000 Island Dressing 0.25 gal","0.25 gal","NA"]
["FD08","2012-02-18","DRESSING","Dairy ","DRESSING","Bluecheese Dressing 0.25 gal",0.25,"NA"]
["FD09","2012-02-19","DRESSING","Dairy ","DRESSING","Teriaky Sauce 1 gal","1 gal","NA"]
["GM01","2012-02-20","MILKS","Dairy ","MILKS","Cultured Butter Milk 1gal","1 gal","NA"]
["GM02","2012-02-21","MILKS","Dairy ","MILKS","Cultured Butter Milk 0.5 gal","0.5 gal","NA"]
["GM03","2012-02-22","MILKS","Dairy ","MILKS","Sour Cream 1 lb","1 lb","NA"]
["GM04","2012-02-23","MILKS","Dairy ","MILKS","Sour Cream 5 lb","5 lb","NA"]
["GM05","2012-02-24","MILKS","Dairy ","MILKS","Heavy Whipping Cream 1 gal","1 gal","NA"]
["GM06","2012-02-25","MILKS","Dairy ","MILKS","Reduced Fat Milk 1 gal","1 gal","NA"]
["GM07","2012-02-26","MILKS","Dairy ","MILKS","Fat Free Milk 1 pt","1 pt","NA"]
["GM08","2012-02-27","MILKS","Dairy ","MILKS","Reduced Fat Milk 1 pt","1 pt","NA"]
["GM09","2012-02-28","MILKS","Dairy ","MILKS","Reduced Fat Chocolate Milk 1 pt","1 pt","NA"]
["GM10","2012-02-29","MILKS","Dairy ","MILKS","Egg Nog 0.5 gal","0.5 gal","NA"]
["HCF01","2012-03-01","CHEESE","Dairy ","CHEESE","shredded Mozarella","NA","NA"]
["HCF02","2012-03-02","CHEESE","Dairy ","CHEESE","Grated Parmesan","NA","NA"]
["HCL11","2012-03-03","CHEESE","Dairy ","CHEESE","Gouda","NA","NA"]
["HCL12","2012-03-04","CHEESE","Dairy ","CHEESE","Smoked Gouda","NA","NA"]
["HCL13","2012-03-05","CHEESE","Dairy ","CHEESE","Blue Chesse","NA","NA"]
["HCL21","2012-03-06","CHEESE","Dairy ","CHEESE","Muenster","NA","NA"]
["HCL22","2012-03-07","CHEESE","Dairy ","CHEESE","Monterrey Jack","NA","NA"]
["HCL23","2012-03-08","CHEESE","Dairy ","CHEESE","Colby Jack","NA","NA"]
["HCL24","2012-03-09","CHEESE","Dairy ","CHEESE","Colby ","NA","NA"]
["HCL31","2012-03-10","CHEESE","Dairy ","CHEESE","Red. Fat Cheddar Cheese","NA","NA"]
["HCL32","2012-03-11","CHEESE","Dairy ","CHEESE","Sharp Cheddar","NA","NA"]
["HCL33","2012-03-12","CHEESE","Dairy ","CHEESE","Medium Cheddar","NA","NA"]
["HCL34","2012-03-13","CHEESE","Dairy ","CHEESE","Mild Cheddar","NA","NA"]
["HCR11","2012-03-14","CHEESE","Dairy ","CHEESE","Onions and Chives","NA","NA"]
["HCR12","2012-03-15","CHEESE","Dairy ","CHEESE","Italian","NA","NA"]
["HCR21","2012-03-16","CHEESE","Dairy ","CHEESE","Pepper Jack","NA","NA"]
["HCR22","2012-03-17","CHEESE","Dairy ","CHEESE","Smoked Bacon","NA","NA"]
["HCR23","2012-03-18","CHEESE","Dairy ","CHEESE","Parmesan","NA","NA"]
["HCR24","2012-03-19","CHEESE","Dairy ","CHEESE","Romano","NA","NA"]
["HCR31","2012-03-20","CHEESE","Dairy ","CHEESE","Havarti","NA","NA"]
["HCR32","2012-03-21","CHEESE","Dairy ","CHEESE","Provolone","NA","NA"]
["HCR33","2012-03-22","CHEESE","Dairy ","CHEESE","Mozarella","NA","NA"]
["HCR34","2012-03-23","CHEESE","Dairy ","CHEESE","swiss","NA","NA"]
["IC01","2012-03-24","CHEESE","Dairy ","CHEESE","Swiss Shredded 10 lb bag ","NA","NA"]
["IC02","2012-03-25","CHEESE","Dairy ","CHEESE","Cheddar 10lb bag","NA","NA"]
["JJ333","2011-12-10","$FG CSC","Dairy","BROCCOLI","Fine Shredded bag","12 oz","Teste"]
["JJJ444","2011-12-10","CHEESE","Produce","CHEESE","Mild Cheddar Sliced","1 lb","Teste"]

{"sheet":"DataForm","index":6,"n_rows":117,"n_cols":22,"rows_kept":117,"cut":false,"hidden":true,"merged":[[2,15,2,20]]}
[]
[]
[null,"STORAGE SECTOR","PRODUCT","TYPE","Quantity",null,null,null,"BIN#",null,"Dairy Products",null,null,"BIN#",null,"Meats",null,null,null,null,null,"BIN#"]
[null,"$FG CSC","BEFF","1000 Island Dressing 0.25 gal","NA",null,null,null,"AJ01","JUICE","Orange Juice",0.5,"Gal","AJ01",null,"$FG","CSC","BEFF","Roast Beef ","Shaved","@"]
[null,"CHEESE","BROCCOLI","Blue Chesse","5 lb",null,null,null,"AJ02","JUICE","Orange Juice",16,"oz","AJ02",null,"$FG","CSC","CHEESE","Mild Cheddar Sliced","Sliced"]
[null,"DRESSING","CABBAGE","Blueberry Yogurt 1 lb","3/8\"",null,null,null,"AJ03","JUICE","Orange Juice",12,"oz","AJ03",null,"$FG","CSC","CHEESE","Muenster Sliced","Sliced"]
[null,"ICECREAM FLAVOR","CARROT","Bluecheese Dressing 0.25 gal","25 lb",null,null,null,"AJ04","JUICE","POG",16,"oz","AJ04",null,"$FG","CSC","CHEESE","Pepper Jack","Sliced"]
[null,"JUICE","CAULIFLOWER","Boysenberry Yogurt 1 lb","16 oz",null,null,null,"BC01","CHEESE","Cottage Cheese",1,"Lb","BC01",null,"$FG","CSC","CHEESE","Provolone","Sliced"]
[null,"MILKS","CELERY","Buds","12 oz",null,null,null,"BC02","CHEESE","Cottage Cheese",5,"Lb","BC02",null,"$FG","CSC","CHEESE","Swiss","Sliced"]
[null,"SFG CSC","CHEESE","Buds Fresh 1\"","1/4\"",null,null,null,"BC03","CHEESE","Cottage Cheese",25,"Lb","BC03",null,"$FG","CSC","HAM",null,"Shaved"]
[null,"YOGURT","CUCUMBER","Cantaloup cut","1\"",null,null,null,"DI01","ICECREAM FLAVOR","Vanila SS",1,"Gal","DI01",null,"$FG","CSC","HAM",null,"Sliced"]
[null,"zzzCSC","DRESSING","Cheddar 10lb bag","1 pt",null,null,null,"DI02","ICECREAM FLAVOR","Chocolate SS",1,"Gal","DI02",null,"$FG","CSC","PASTRAMI",null,"Sliced"]
[null,"zzzFG CSC","FAJITA","Chocolate SS 1 gal","1 lb",null,null,null,"EY01","YOGURT","Plain Yogurt",1,"Lb","EY01",null,"$FG","CSC","TURKEY","Roasted","Shaved"]
[null,null,"FRUIT","Colby ","1 gal",null,null,null,"EY02","YOGURT","Blueberry Yogurt",1,"Lb","EY02",null,"$FG","CSC","TURKEY",null,"Shaved"]
[null,null,"HAM","Colby Jack","0.5 gal",null,null,null,"EY03","YOGURT","Boysenberry Yogurt",1,"Lb","EY03",null,"$FG","CSC","TURKEY",null,"Sliced"]
[null,null,"ICECREAM FLAVOR","Coleslaw Mix","0.25 gal",null,null,null,"EY04","YOGURT","Peach Yogurt",1,"Lb","EY04",null,null,"CSC","HAM","Loaf 850","BULK"]
[null,null,"JUICE","Cottage Cheese 1 lb",null,null,null,null,"EY05","YOGURT","Raspeberry Yogurt",1,"Lb","EY05",null,null,"CSC","TURKEY","Oven Roasted Loaf","BULK"]
[null,null,"LETTUCE","Cottage Cheese 25 lb",null,null,null,null,"EY06","YOGURT","Strawberry Yogurt",1,"Lb","EY06"]
[null,null,"MILKS","Cottage Cheese 5 lb",null,null,null,null,"FD01","DRESSING","Ranch Dressing",1,"Gal","FD01"]
[null,null,"ONION","Cultured Butter Milk 0.5 gal",null,null,null,null,"FD02","DRESSING","Ranch Dressing",0.5,"Gal","FD02"]
[null,null,"PASTRAMI","Cultured Butter Milk 1gal",null,null,null,null,"FD03","DRESSING","Ranch Dressing",0.25,"Gal","FD03"]
[null,null,"PEPPERS","Diced",null,null,null,null,"FD04","DRESSING","Light Ranch Dressing",1,"Gal","FD04"]
[null,null,"POTATO","Diced 1\"",null,null,null,null,"FD05","DRESSING","Light Ranch Dressing",0.5,"Gal","FD05"]
[null,null,"SQUASH","Diced 3/8\"",null,null,null,null,"FD06","DRESSING","Light Ranch Dressing",0.25,"Gal","FD06"]
[null,null,"TOMATO","Diced 3/8\"",null,null,null,null,"FD07","DRESSING","1000 Island Dressing",0.25,"Gal","FD07"]
[null,null,"TURKEY","Diced 3/8\"",null,null,null,null,"FD08","DRESSING","Bluecheese Dressing",0.25,"Gal","FD08"]
[null,null,"YOGURT","Diced Fresh",null,null,null,null,"FD09","DRESSING","Teriaky Sauce",1,"Gal","FD09"]
[null,null,null,"Egg Nog 0.5 gal",null,null,null,null,"GM01","MILKES","Cultured Butter Milk",1,"Gal","GM01"]
[null,null,null,"Fat Free Milk 1 pt",null,null,null,null,"GM02","MILKES","Cultured Butter Milk",0.5,"Gal","GM02"]
[null,null,null,"Fine Shredded bag",null,null,null,null,"GM03","MILKES","Sour Cream",1,"Lb","GM03"]
[null,null,null,"Fries Fresh",null,null,null,null,"GM04","MILKES","Sour Cream",5,"Lb","GM04"]
[null,null,null,"Gouda",null,null,null,null,"GM05","MILKES","Heavy Whipping Cream",1,"Gal","GM05"]
[null,null,null,"Grated Parmesan",null,null,null,null,"GM06","MILKES","Reduced Fat Milk",1,"Gal","GM06"]
[null,null,null,"Green Bell 1\"",null,null,null,null,"GM07","MILKES","Fat Free Milk",1,"pint","GM07"]
[null,null,null,"Green Bell 3/8\"",null,null,null,null,"GM08","MILKES","Reduced Fat Milk",1,"pint","GM08"]
[null,null,null,"Green Leaf",null,null,null,null,"GM09","MILKES","Reduced Fat Chocolate Milk",1,"pint","GM09"]
[null,null,null,"Green Sliced",null,null,null,null,"GM10","MILKES","Egg Nog",0.5,"Gal","GM10"]
[null,null,null,"Green Sliced Juliene",null,null,null,null,"HCF01","CHEESE","shredded Mozarella",null,null,"HCF01"]
[null,null,null,"Havarti",null,null,null,null,"HCF02","CHEESE","Grated Parmesan",null,null,"HCF02"]
[null,null,null,"Heavy Whipping Cream 1 gal",null,null,null,null,"HCL11","CHEESE","Gouda",null,null,"HCL11"]
[null,null,null,"Honeydew cut",null,null,null,null,"HCL12","CHEESE","Smoked Gouda",null,null,"HCL12"]
[null,null,null,"Italian",null,null,null,null,"HCL13","CHEESE","Blue Chesse",null,null,"HCL13"]
[null,null,null,"Light Ranch Dressing 0.25 gal",null,null,null,null,"HCL21","CHEESE","Muenster",null,null,"HCL21"]
[null,null,null,"Light Ranch Dressing 0.5 gal",null,null,null,null,"HCL22","CHEESE","Monterrey Jack",null,null,"HCL22"]
[null,null,null,"Light Ranch Dressing 1 gal",null,null,null,null,"HCL23","CHEESE","Colby Jack",null,null,"HCL23"]
[null,null,null,"Match Stix 5lb bag",null,null,null,null,"HCL24","CHEESE","Colby ",null,null,"HCL24"]
[null,null,null,"Medium Cheddar",null,null,null,null,"HCL31","CHEESE","Red. Fat Cheddar Cheese",null,null,"HCL31"]
[null,null,null,"Mild Cheddar",null,null,null,null,"HCL32","CHEESE","Sharp Cheddar",null,null,"HCL32"]
[null,null,null,"Mild Cheddar Sliced",null,null,null,null,"HCL33","CHEESE","Medium Cheddar",null,null,"HCL33"]
[null,null,null,"Mix Fresh",null,null,null,null,"HCL34","CHEESE","Mild Cheddar",null,null,"HCL34"]
[null,null,null,"Monterrey Jack",null,null,null,null,"HCR11","CHEESE","Onions and Chives",null,null,"HCR11"]
[null,null,null,"Mozarella",null,null,null,null,"HCR12","CHEESE","Italian",null,null,"HCR12"]
[null,null,null,"Muenster",null,null,null,null,"HCR21","CHEESE","Pepper Jack",null,null,"HCR21"]
[null,null,null,"Muenster Sliced",null,null,null,null,"HCR22","CHEESE","Smoked Bacon",null,null,"HCR22"]
[null,null,null,"Onions and Chives",null,null,null,null,"HCR23","CHEESE","Parmesan",null,null,"HCR23"]
[null,null,null,"Orange Juice 0.5 gal",null,null,null,null,"HCR24","CHEESE","Romano",null,null,"HCR24"]
[null,null,null,"Orange Juice 12 oz",null,null,null,null,"HCR31","CHEESE","Havarti",null,null,"HCR31"]
[null,null,null,"Orange Juice 16 oz",null,null,null,null,"HCR32","CHEESE","Provolone",null,null,"HCR32"]
[null,null,null,"Parmesan",null,null,null,null,"HCR33","CHEESE","Mozarella",null,null,"HCR33"]
[null,null,null,"Passion F./Orange J./Guava J. 16 oz",null,null,null,null,"HCR34","CHEESE","swiss",null,null,"HCR34"]
[null,null,null,"Peach Yogurt 1 lb"]
[null,null,null,"Penny Sliced"]
[null,null,null,"Pepper Jack"]
[null,null,null,"Pepper Jack Sliced"]
[null,null,null,"Pineapple Chunks Fresh"]
[null,null,null,"Plain Yogurt 1 lb"]
[null,null,null,"Provolone"]
[null,null,null,"Provolone Sliced"]
[null,null,null,"Ranch Dressing 0.25 gal"]
[null,null,null,"Ranch Dressing 0.5 gal"]
[null,null,null,"Ranch Dressing 1 gal"]
[null,null,null,"Raspeberry Yogurt 1 lb"]
[null,null,null,"Red Bell Diced"]
[null,null,null,"Red Bell Sliced Juliene"]
[null,null,null,"Red Diced 3/8\""]
[null,null,null,"Red Rings"]
[null,null,null,"Red Shredded"]
[null,null,null,"Red Sliced"]
[null,null,null,"Red. Fat Cheddar Cheese"]
[null,null,null,"Reduced Fat Chocolate Milk 1 pt"]
[null,null,null,"Reduced Fat Milk 1 gal"]
[null,null,null,"Reduced Fat Milk 1 pt"]
[null,null,null,"Roast Beef  Shaved "]
[null,null,null,"Roasted Shaved"]
[null,null,null,"Romaine Blend 60% "]
[null,null,null,"Romaine Cut"]
[null,null,null,"Romaine w/ color"]
[null,null,null,"Romano"]
[null,null,null,"Sharp Cheddar"]
[null,null,null,"Shaved"]
[null,null,null,"Shaved"]
[null,null,null,"Shredded 5lb bag"]
[null,null,null,"shredded Mozarella"]
[null,null,null,"Sliced"]
[null,null,null,"Sliced"]
[null,null,null,"Sliced"]
[null,null,null,"Sliced"]
[null,null,null,"Sliced"]
[null,null,null,"Sliced"]
[null,null,null,"Sliced (for food) 1/4\""]
[null,null,null,"Sliced 1/4\""]
[null,null,null,"Smoked Bacon"]
[null,null,null,"Smoked Gouda"]
[null,null,null,"Sour Cream 1 lb"]
[null,null,null,"Sour Cream 5 lb"]
[null,null,null,"Stick bag"]
[null,null,null,"Sticks"]
[null,null,null,"Strawberry Yogurt 1 lb"]
[null,null,null,"swiss"]
[null,null,null,"Swiss Shredded 10 lb bag "]
[null,null,null,"Swiss Sliced"]
[null,null,null,"Teriaky Sauce 1 gal"]
[null,null,null,"Vanila SS 1 gal"]
[null,null,null,"Watermelon Chunks"]
[null,null,null,"Wedge"]
[null,null,null,"Zucchini Juliene Bag"]
[null,null,null,"Zucchini Sliced Bag"]

{"sheet":"DV-IDENTITY-0","index":7,"n_rows":30,"n_cols":256,"rows_kept":30,"cut":false,"hidden":true,"merged":[]}
[{"$f":"IF(ProductsList!1:1,\"AAAAABf4/wA=\",0)","v":0},{"$f":"AND(ProductsList!A1,\"AAAAABf4/wE=\")","v":{"$error":"#VALUE!"}},{"$f":"AND(ProductsList!B1,\"AAAAABf4/wI=\")","v":{"$error":"#VALUE!"}},{"$f":"AND(ProductsList!C1,\"AAAAABf4/wM=\")","v":{"$error":"#VALUE!"}},{"$f":"AND(ProductsList!D1,\"AAAAABf4/wQ=\")","v":{"$error":"#VALUE!"}},{"$f":"AND(ProductsList!E1,\"AAAAABf4/wU=\")","v":{"$error":"#VALUE!"}},{"$f":"AND(ProductsList!F1,\"AAAAABf4/wY=\")","v":{"$error":"#VALUE!"}},{"$f":"AND(ProductsList!G1,\"AAAAABf4/wc=\")","v":{"$error":"#VALUE!"}},{"$f":"AND(ProductsList!H1,\"AAAAABf4/wg=\")","v":{"$error":"#VALUE!"}},{"$f":"AND(ProductsList!I1,\"AAAAABf4/wk=\")","v":{"$error":"#VALUE!"}},{"$f":"AND(ProductsList!J1,\"AAAAABf4/wo=\")","v":{"$error":"#VALUE!"}},{"$f":"AND(ProductsList!K1,\"AAAAABf4/ws=\")","v":{"$error":"#VALUE!"}},{"$f":"AND(ProductsList!L1,\"AAAAABf4/ww=\")","v":{"$error":"#VALUE!"}},{"$f":"AND(ProductsList!M1,\"AAAAABf4/w0=\")","v":{"$error":"#VALUE!"}},{"$f":"AND(ProductsList!N1,\"AAAAABf4/w4=\")","v":{"$error":"#VALUE!"}},{"$f":"AND(ProductsList!O1,\"AAAAABf4/w8=\")","v":{"$error":"#VALUE!"}},{"$f":"AND(ProductsList!P1,\"AAAAABf4/xA=\")","v":{"$error":"#VALUE!"}},{"$f":"AND(ProductsList!Q1,\"AAAAABf4/xE=\")","v":{"$error":"#VALUE!"}},{"$f":"AND(ProductsList!R1,\"AAAAABf4/xI=\")","v":{"$error":"#VALUE!"}},{"$f":"AND(ProductsList!S1,\"AAAAABf4/xM=\")","v":{"$error":"#VALUE!"}},{"$f":"AND(ProductsList!T1,\"AAAAABf4/xQ=\")","v":{"$error":"#VALUE!"}},{"$f":"AND(ProductsList!U1,\"AAAAABf4/xU=\")","v":{"$error":"#VALUE!"}},{"$f":"AND(ProductsList!V1,\"AAAAABf4/xY=\")","v":{"$error":"#VALUE!"}},{"$f":"AND(ProductsList!W1,\"AAAAABf4/xc=\")","v":{"$error":"#VALUE!"}},{"$f":"IF(ProductsList!2:2,\"AAAAABf4/xg=\",0)","v":0},{"$f":"AND(ProductsList!A2,\"AAAAABf4/xk=\")","v":{"$error":"#VALUE!"}},{"$f":"AND(ProductsList!B2,\"AAAAABf4/xo=\")","v":{"$error":"#VALUE!"}},{"$f":"AND(ProductsList!C2,\"AAAAABf4/xs=\")","v":{"$error":"#VALUE!"}},{"$f":"AND(ProductsList!D2,\"AAAAABf4/xw=\")","v":{"$error":"#VALUE!"}},{"$f":"AND(ProductsList!E2,\"AAAAABf4/x0=\")","v":{"$error":"#VALUE!"}},{"$f":"AND(ProductsList!F2,\"AAAAABf4/x4=\")","v":{"$error":"#VALUE!"}},{"$f":"AND(ProductsList!G2,\"AAAAABf4/x8=\")","v":{"$error":"#VALUE!"}},{"$f":"AND(ProductsList!H2,\"AAAAABf4/yA=\")","v":{"$error":"#VALUE!"}},{"$f":"AND(ProductsList!I2,\"AAAAABf4/yE=\")","v":{"$error":"#VALUE!"}},{"$f":"AND(ProductsList!J2,\"AAAAABf4/yI=\")","v":{"$error":"#VALUE!"}},{"$f":"AND(ProductsList!K2,\"AAAAABf4/yM=\")","v":{"$error":"#VALUE!"}},{"$f":"AND(ProductsList!L2,\"AAAAABf4/yQ=\")","v":{"$error":"#VALUE!"}},{"$f":"AND(ProductsList!M2,\"AAAAABf4/yU=\")","v":{"$error":"#VALUE!"}},{"$f":"AND(ProductsList!N2,\"AAAAABf4/yY=\")","v":{"$error":"#VALUE!"}},{"$f":"AND(ProductsList!O2,\"AAAAABf4/yc=\")","v":{"$error":"#VALUE!"}},{"$f":"AND(ProductsList!P2,\"AAAAABf4/yg=\")","v":{"$error":"#VALUE!"}},{"$f":"AND(ProductsList!Q2,\"AAAAABf4/yk=\")","v":{"$error":"#VALUE!"}},{"$f":"AND(ProductsList!R2,\"AAAAABf4/yo=\")","v":{"$error":"#VALUE!"}},{"$f":"AND(ProductsList!S2,\"AAAAABf4/ys=\")","v":{"$error":"#VALUE!"}},{"$f":"AND(ProductsList!T2,\"AAAAABf4/yw=\")","v":{"$error":"#VALUE!"}},{"$f":"AND(ProductsList!U2,\"AAAAABf4/y0=\")","v":{"$error":"#VALUE!"}},{"$f":"AND(ProductsList!V2,\"AAAAABf4/y4=\")","v":{"$error":"#VALUE!"}},{"$f":"AND(ProductsList!W2,\"AAAAABf4/y8=\")","v":{"$error":"#VALUE!"}},{"$f":"IF(ProductsList!3:3,\"AAAAABf4/zA=\",0)","v":0},{"$f":"AND(ProductsList!A3,\"AAAAABf4/zE=\")","v":{"$error":"#VALUE!"}},{"$f":"AND(ProductsList!B3,\"AAAAABf4/zI=\")","v":{"$error":"#VALUE!"}},{"$f":"AND(ProductsList!C3,\"AAAAABf4/zM=\")","v":{"$error":"#VALUE!"}},{"$f":"AND(ProductsList!D3,\"AAAAABf4/zQ=\")","v":{"$error":"#VALUE!"}},{"$f":"AND(ProductsList!E3,\"AAAAABf4/zU=\")","v":{"$error":"#VALUE!"}},{"$f":"AND(ProductsList!F3,\"AAAAABf4/zY=\")","v":{"$error":"#VALUE!"}},{"$f":"AND(ProductsList!G3,\"AAAAABf4/zc=\")","v":{"$error":"#VALUE!"}},{"$f":"AND(ProductsList!H3,\"AAAAABf4/zg=\")","v":{"$error":"#VALUE!"}},{"$f":"AND(ProductsList!I3,\"AAAAABf4/zk=\")","v":{"$error":"#VALUE!"}},{"$f":"AND(ProductsList!J3,\"AAAAABf4/zo=\")","v":{"$error":"#VALUE!"}},{"$f":"AND(ProductsList!K3,\"AAAAABf4/zs=\")","v":{"$error":"#VALUE!"}},{"$f":"AND(ProductsList!L3,\"AAAAABf4/zw=\")","v":{"$error":"#VALUE!"}},{"$f":"AND(ProductsList!M3,\"AAAAABf4/z0=\")","v":{"$error":"#VALUE!"}},{"$f":"AND(ProductsList!N3,\"AAAAABf4/z4=\")","v":{"$error":"#VALUE!"}},{"$f":"AND(ProductsList!O3,\"AAAAABf4/z8=\")","v":{"$error":"#VALUE!"}},{"$f":"AND(ProductsList!P3,\"AAAAABf4/0A=\")","v":{"$error":"#VALUE!"}},{"$f":"AND(ProductsList!Q3,\"AAAAABf4/0E=\")","v":{"$error":"#VALUE!"}},{"$f":"AND(ProductsList!R3,\"AAAAABf4/0I=\")","v":{"$error":"#VALUE!"}},{"$f":"AND(ProductsList!S3,\"AAAAABf4/0M=\")","v":{"$error":"#VALUE!"}},{"$f":"AND(ProductsList!T3,\"AAAAABf4/0Q=\")","v":{"$error":"#VALUE!"}},{"$f":"AND(ProductsList!U3,\"AAAAABf4/0U=\")","v":{"$error":"#VALUE!"}},{"$f":"AND(ProductsList!V3,\"AAAAABf4/0Y=\")","v":{"$error":"#VALUE!"}},{"$f":"AND(ProductsList!W3,\"AAAAABf4/0c=\")","v":{"$error":"#VALUE!"}},{"$f":"IF(ProductsList!4:4,\"AAAAABf4/0g=\",0)","v":0},{"$f":"AND(ProductsList!A4,\"AAAAABf4/0k=\")","v":{"$error":"#VALUE!"}},{"$f":"AND(ProductsList!B4,\"AAAAABf4/0o=\")","v":{"$error":"#VALUE!"}},{"$f":"AND(ProductsList!C4,\"AAAAABf4/0s=\")","v":{"$error":"#VALUE!"}},{"$f":"AND(ProductsList!D4,\"AAAAABf4/0w=\")","v":{"$error":"#VALUE!"}},{"$f":"AND(ProductsList!E4,\"AAAAABf4/00=\")","v":{"$error":"#VALUE!"}},{"$f":"AND(ProductsList!F4,\"AAAAABf4/04=\")","v":{"$error":"#VALUE!"}},{"$f":"AND(ProductsList!G4,\"AAAAABf4/08=\")","v":{"$error":"#VALUE!"}},{"$f":"AND(ProductsList!H4,\"AAAAABf4/1A=\")","v":{"$error":"#VALUE!"}},{"$f":"AND(ProductsList!I4,\"AAAAABf4/1E=\")","v":{"$error":"#VALUE!"}},{"$f":"AND(ProductsList!J4,\"AAAAABf4/1I=\")","v":{"$error":"#VALUE!"}},{"$f":"AND(ProductsList!K4,\"AAAAABf4/1M=\")","v":{"$error":"#VALUE!"}},{"$f":"AND(ProductsList!L4,\"AAAAABf4/1Q=\")","v":{"$error":"#VALUE!"}},{"$f":"AND(ProductsList!M4,\"AAAAABf4/1U=\")","v":{"$error":"#VALUE!"}},{"$f":"AND(ProductsList!N4,\"AAAAABf4/1Y=\")","v":{"$error":"#VALUE!"}},{"$f":"AND(ProductsList!O4,\"AAAAABf4/1c=\")","v":{"$error":"#VALUE!"}},{"$f":"AND(ProductsList!P4,\"AAAAABf4/1g=\")","v":{"$error":"#VALUE!"}},{"$f":"AND(ProductsList!Q4,\"AAAAABf4/1k=\")","v":{"$error":"#VALUE!"}},{"$f":"AND(ProductsList!R4,\"AAAAABf4/1o=\")","v":{"$error":"#VALUE!"}},{"$f":"AND(ProductsList!S4,\"AAAAABf4/1s=\")","v":{"$error":"#VALUE!"}},{"$f":"AND(ProductsList!T4,\"AAAAABf4/1w=\")","v":{"$error":"#VALUE!"}},{"$f":"AND(ProductsList!U4,\"AAAAABf4/10=\")","v":{"$error":"#VALUE!"}},{"$f":"AND(ProductsList!V4,\"AAAAABf4/14=\")","v":{"$error":"#VALUE!"}},{"$f":"AND(ProductsList!W4,\"AAAAABf4/18=\")","v":{"$error":"#VALUE!"}},{"$f":"IF(ProductsList!5:5,\"AAAAABf4/2A=\",0)","v":0},{"$f":"AND(ProductsList!A5,\"AAAAABf4/2E=\")","v":{"$error":"#VALUE!"}},{"$f":"AND(ProductsList!B5,\"AAAAABf4/2I=\")","v":{"$error":"#VALUE!"}},{"$f":"AND(ProductsList!C5,\"AAAAABf4/2M=\")","v":{"$error":"#VALUE!"}},{"$f":"AND(ProductsList!D5,\"AAAAABf4/2Q=\")","v":{"$error":"#VALUE!"}},{"$f":"AND(ProductsList!E5,\"AAAAABf4/2U=\")","v":{"$error":"#VALUE!"}},{"$f":"AND(ProductsList!F5,\"AAAAABf4/2Y=\")","v":{"$error":"#VALUE!"}},{"$f":"AND(ProductsList!G5,\"AAAAABf4/2c=\")","v":{"$error":"#VALUE!"}},{"$f":"AND(ProductsList!H5,\"AAAAABf4/2g=\")","v":{"$error":"#VALUE!"}},{"$f":"AND(ProductsList!I5,\"AAAAABf4/2k=\")","v":{"$error":"#VALUE!"}},{"$f":"AND(ProductsList!J5,\"AAAAABf4/2o=\")","v":{"$error":"#VALUE!"}},{"$f":"AND(ProductsList!K5,\"AAAAABf4/2s=\")","v":{"$error":"#VALUE!"}},{"$f":"AND(ProductsList!L5,\"AAAAABf4/2w=\")","v":{"$error":"#VALUE!"}},{"$f":"AND(ProductsList!M5,\"AAAAABf4/20=\")","v":{"$error":"#VALUE!"}},{"$f":"AND(ProductsList!N5,\"AAAAABf4/24=\")","v":{"$error":"#VALUE!"}},{"$f":"AND(ProductsList!O5,\"AAAAABf4/28=\")","v":{"$error":"#VALUE!"}},{"$f":"AND(ProductsList!P5,\"AAAAABf4/3A=\")","v":{"$error":"#VALUE!"}},{"$f":"AND(ProductsList!Q5,\"AAAAABf4/3E=\")","v":{"$error":"#VALUE!"}},{"$f":"AND(ProductsList!R5,\"AAAAABf4/3I=\")","v":{"$error":"#VALUE!"}},{"$f":"AND(ProductsList!S5,\"AAAAABf4/3M=\")","v":{"$error":"#VALUE!"}},{"$f":"AND(ProductsList!T5,\"AAAAABf4/3Q=\")","v":{"$error":"#VALUE!"}},{"$f":"AND(ProductsList!U5,\"AAAAABf4/3U=\")","v":{"$error":"#VALUE!"}},{"$f":"AND(ProductsList!V5,\"AAAAABf4/3Y=\")","v":{"$error":"#VALUE!"}},{"$f":"AND(ProductsList!W5,\"AAAAABf4/3c=\")","v":{"$error":"#VALUE!"}},{"$f":"IF(ProductsList!6:6,\"AAAAABf4/3g=\",0)","v":0},{"$f":"AND(ProductsList!A6,\"AAAAABf4/3k=\")","v":{"$error":"#VALUE!"}},{"$f":"AND(ProductsList!B6,\"AAAAABf4/3o=\")","v":{"$error":"#VALUE!"}},{"$f":"AND(ProductsList!C6,\"AAAAABf4/3s=\")","v":{"$error":"#VALUE!"}},{"$f":"AND(ProductsList!D6,\"AAAAABf4/3w=\")","v":{"$error":"#VALUE!"}},{"$f":"AND(ProductsList!E6,\"AAAAABf4/30=\")","v":{"$error":"#VALUE!"}},{"$f":"AND(ProductsList!F6,\"AAAAABf4/34=\")","v":{"$error":"#VALUE!"}},{"$f":"AND(ProductsList!G6,\"AAAAABf4/38=\")","v":{"$error":"#VALUE!"}},{"$f":"AND(ProductsList!H6,\"AAAAABf4/4A=\")","v":{"$error":"#VALUE!"}},{"$f":"AND(ProductsList!I6,\"AAAAABf4/4E=\")","v":{"$error":"#VALUE!"}},{"$f":"AND(ProductsList!J6,\"AAAAABf4/4I=\")","v":{"$error":"#VALUE!"}},{"$f":"AND(ProductsList!K6,\"AAAAABf4/4M=\")","v":{"$error":"#VALUE!"}},{"$f":"AND(ProductsList!L6,\"AAAAABf4/4Q=\")","v":{"$error":"#VALUE!"}},{"$f":"AND(ProductsList!M6,\"AAAAABf4/4U=\")","v":{"$error":"#VALUE!"}},{"$f":"AND(ProductsList!N6,\"AAAAABf4/4Y=\")","v":{"$error":"#VALUE!"}},{"$f":"AND(ProductsList!O6,\"AAAAABf4/4c=\")","v":{"$error":"#VALUE!"}},{"$f":"AND(ProductsList!P6,\"AAAAABf4/4g=\")","v":{"$error":"#VALUE!"}},{"$f":"AND(ProductsList!Q6,\"AAAAABf4/4k=\")","v":{"$error":"#VALUE!"}},{"$f":"AND(ProductsList!R6,\"AAAAABf4/4o=\")","v":{"$error":"#VALUE!"}},{"$f":"AND(ProductsList!S6,\"AAAAABf4/4s=\")","v":{"$error":"#VALUE!"}},{"$f":"AND(ProductsList!T6,\"AAAAABf4/4w=\")","v":{"$error":"#VALUE!"}},{"$f":"AND(ProductsList!U6,\"AAAAABf4/40=\")","v":{"$error":"#VALUE!"}},{"$f":"AND(ProductsList!V6,\"AAAAABf4/44=\")","v":{"$error":"#VALUE!"}},{"$f":"AND(ProductsList!W6,\"AAAAABf4/48=\")","v":{"$error":"#VALUE!"}},{"$f":"IF(ProductsList!7:7,\"AAAAABf4/5A=\",0)","v":0},{"$f":"AND(ProductsList!A7,\"AAAAABf4/5E=\")","v":{"$error":"#VALUE!"}},{"$f":"AND(ProductsList!B7,\"AAAAABf4/5I=\")","v":{"$error":"#VALUE!"}},{"$f":"AND(ProductsList!C7,\"AAAAABf4/5M=\")","v":{"$error":"#VALUE!"}},{"$f":"AND(ProductsList!D7,\"AAAAABf4/5Q=\")","v":{"$error":"#VALUE!"}},{"$f":"AND(ProductsList!E7,\"AAAAABf4/5U=\")","v":{"$error":"#VALUE!"}},{"$f":"AND(ProductsList!F7,\"AAAAABf4/5Y=\")","v":{"$error":"#VALUE!"}},{"$f":"AND(ProductsList!G7,\"AAAAABf4/5c=\")","v":{"$error":"#VALUE!"}},{"$f":"AND(ProductsList!H7,\"AAAAABf4/5g=\")","v":{"$error":"#VALUE!"}},{"$f":"AND(ProductsList!I7,\"AAAAABf4/5k=\")","v":{"$error":"#VALUE!"}},{"$f":"AND(ProductsList!J7,\"AAAAABf4/5o=\")","v":{"$error":"#VALUE!"}},{"$f":"AND(ProductsList!K7,\"AAAAABf4/5s=\")","v":{"$error":"#VALUE!"}},{"$f":"AND(ProductsList!L7,\"AAAAABf4/5w=\")","v":{"$error":"#VALUE!"}},{"$f":"AND(ProductsList!M7,\"AAAAABf4/50=\")","v":{"$error":"#VALUE!"}},{"$f":"AND(ProductsList!N7,\"AAAAABf4/54=\")","v":{"$error":"#VALUE!"}},{"$f":"AND(ProductsList!O7,\"AAAAABf4/58=\")","v":{"$error":"#VALUE!"}},{"$f":"AND(ProductsList!P7,\"AAAAABf4/6A=\")","v":{"$error":"#VALUE!"}},{"$f":"AND(ProductsList!Q7,\"AAAAABf4/6E=\")","v":{"$error":"#VALUE!"}},{"$f":"AND(ProductsList!R7,\"AAAAABf4/6I=\")","v":{"$error":"#VALUE!"}},{"$f":"AND(ProductsList!S7,\"AAAAABf4/6M=\")","v":{"$error":"#VALUE!"}},{"$f":"AND(ProductsList!T7,\"AAAAABf4/6Q=\")","v":{"$error":"#VALUE!"}},{"$f":"AND(ProductsList!U7,\"AAAAABf4/6U=\")","v":{"$error":"#VALUE!"}},{"$f":"AND(ProductsList!V7,\"AAAAABf4/6Y=\")","v":{"$error":"#VALUE!"}},{"$f":"AND(ProductsList!W7,\"AAAAABf4/6c=\")","v":{"$error":"#VALUE!"}},{"$f":"IF(ProductsList!8:8,\"AAAAABf4/6g=\",0)","v":0},{"$f":"AND(ProductsList!A8,\"AAAAABf4/6k=\")","v":{"$error":"#VALUE!"}},{"$f":"AND(ProductsList!B8,\"AAAAABf4/6o=\")","v":{"$error":"#VALUE!"}},{"$f":"AND(ProductsList!C8,\"AAAAABf4/6s=\")","v":{"$error":"#VALUE!"}},{"$f":"AND(ProductsList!D8,\"AAAAABf4/6w=\")","v":{"$error":"#VALUE!"}},{"$f":"AND(ProductsList!E8,\"AAAAABf4/60=\")","v":{"$error":"#VALUE!"}},{"$f":"AND(ProductsList!F8,\"AAAAABf4/64=\")","v":{"$error":"#VALUE!"}},{"$f":"AND(ProductsList!G8,\"AAAAABf4/68=\")","v":{"$error":"#VALUE!"}},{"$f":"AND(ProductsList!H8,\"AAAAABf4/7A=\")","v":{"$error":"#VALUE!"}},{"$f":"AND(ProductsList!I8,\"AAAAABf4/7E=\")","v":{"$error":"#VALUE!"}},{"$f":"AND(ProductsList!J8,\"AAAAABf4/7I=\")","v":{"$error":"#VALUE!"}},{"$f":"AND(ProductsList!K8,\"AAAAABf4/7M=\")","v":{"$error":"#VALUE!"}},{"$f":"AND(ProductsList!L8,\"AAAAABf4/7Q=\")","v":{"$error":"#VALUE!"}},{"$f":"AND(ProductsList!M8,\"AAAAABf4/7U=\")","v":{"$error":"#VALUE!"}},{"$f":"AND(ProductsList!N8,\"AAAAABf4/7Y=\")","v":{"$error":"#VALUE!"}},{"$f":"AND(ProductsList!O8,\"AAAAABf4/7c=\")","v":{"$error":"#VALUE!"}},{"$f":"AND(ProductsList!P8,\"AAAAABf4/7g=\")","v":{"$error":"#VALUE!"}},{"$f":"AND(ProductsList!Q8,\"AAAAABf4/7k=\")","v":{"$error":"#VALUE!"}},{"$f":"AND(ProductsList!R8,\"AAAAABf4/7o=\")","v":{"$error":"#VALUE!"}},{"$f":"AND(ProductsList!S8,\"AAAAABf4/7s=\")","v":{"$error":"#VALUE!"}},{"$f":"AND(ProductsList!T8,\"AAAAABf4/7w=\")","v":{"$error":"#VALUE!"}},{"$f":"AND(ProductsList!U8,\"AAAAABf4/70=\")","v":{"$error":"#VALUE!"}},{"$f":"AND(ProductsList!V8,\"AAAAABf4/74=\")","v":{"$error":"#VALUE!"}},{"$f":"AND(ProductsList!W8,\"AAAAABf4/78=\")","v":{"$error":"#VALUE!"}},{"$f":"IF(ProductsList!9:9,\"AAAAABf4/8A=\",0)","v":0},{"$f":"AND(ProductsList!A9,\"AAAAABf4/8E=\")","v":{"$error":"#VALUE!"}},{"$f":"AND(ProductsList!B9,\"AAAAABf4/8I=\")","v":{"$error":"#VALUE!"}},{"$f":"AND(ProductsList!C9,\"AAAAABf4/8M=\")","v":{"$error":"#VALUE!"}},{"$f":"AND(ProductsList!D9,\"AAAAABf4/8Q=\")","v":{"$error":"#VALUE!"}},{"$f":"AND(ProductsList!E9,\"AAAAABf4/8U=\")","v":{"$error":"#VALUE!"}},{"$f":"AND(ProductsList!F9,\"AAAAABf4/8Y=\")","v":{"$error":"#VALUE!"}},{"$f":"AND(ProductsList!G9,\"AAAAABf4/8c=\")","v":{"$error":"#VALUE!"}},{"$f":"AND(ProductsList!H9,\"AAAAABf4/8g=\")","v":{"$error":"#VALUE!"}},{"$f":"AND(ProductsList!I9,\"AAAAABf4/8k=\")","v":{"$error":"#VALUE!"}},{"$f":"AND(ProductsList!J9,\"AAAAABf4/8o=\")","v":{"$error":"#VALUE!"}},{"$f":"AND(ProductsList!K9,\"AAAAABf4/8s=\")","v":{"$error":"#VALUE!"}},{"$f":"AND(ProductsList!L9,\"AAAAABf4/8w=\")","v":{"$error":"#VALUE!"}},{"$f":"AND(ProductsList!M9,\"AAAAABf4/80=\")","v":{"$error":"#VALUE!"}},{"$f":"AND(ProductsList!N9,\"AAAAABf4/84=\")","v":{"$error":"#VALUE!"}},{"$f":"AND(ProductsList!O9,\"AAAAABf4/88=\")","v":{"$error":"#VALUE!"}},{"$f":"AND(ProductsList!P9,\"AAAAABf4/9A=\")","v":{"$error":"#VALUE!"}},{"$f":"AND(ProductsList!Q9,\"AAAAABf4/9E=\")","v":{"$error":"#VALUE!"}},{"$f":"AND(ProductsList!R9,\"AAAAABf4/9I=\")","v":{"$error":"#VALUE!"}},{"$f":"AND(ProductsList!S9,\"AAAAABf4/9M=\")","v":{"$error":"#VALUE!"}},{"$f":"AND(ProductsList!T9,\"AAAAABf4/9Q=\")","v":{"$error":"#VALUE!"}},{"$f":"AND(ProductsList!U9,\"AAAAABf4/9U=\")","v":{"$error":"#VALUE!"}},{"$f":"AND(ProductsList!V9,\"AAAAABf4/9Y=\")","v":{"$error":"#VALUE!"}},{"$f":"AND(ProductsList!W9,\"AAAAABf4/9c=\")","v":{"$error":"#VALUE!"}},{"$f":"IF(ProductsList!10:10,\"AAAAABf4/9g=\",0)","v":0},{"$f":"AND(ProductsList!A10,\"AAAAABf4/9k=\")","v":{"$error":"#VALUE!"}},{"$f":"AND(ProductsList!B10,\"AAAAABf4/9o=\")","v":{"$error":"#VALUE!"}},{"$f":"AND(ProductsList!C10,\"AAAAABf4/9s=\")","v":{"$error":"#VALUE!"}},{"$f":"AND(ProductsList!D10,\"AAAAABf4/9w=\")","v":{"$error":"#VALUE!"}},{"$f":"AND(ProductsList!E10,\"AAAAABf4/90=\")","v":{"$error":"#VALUE!"}},{"$f":"AND(ProductsList!F10,\"AAAAABf4/94=\")","v":{"$error":"#VALUE!"}},{"$f":"AND(ProductsList!G10,\"AAAAABf4/98=\")","v":{"$error":"#VALUE!"}},{"$f":"AND(ProductsList!H10,\"AAAAABf4/+A=\")","v":{"$error":"#VALUE!"}},{"$f":"AND(ProductsList!I10,\"AAAAABf4/+E=\")","v":{"$error":"#VALUE!"}},{"$f":"AND(ProductsList!J10,\"AAAAABf4/+I=\")","v":{"$error":"#VALUE!"}},{"$f":"AND(ProductsList!K10,\"AAAAABf4/+M=\")","v":{"$error":"#VALUE!"}},{"$f":"AND(ProductsList!L10,\"AAAAABf4/+Q=\")","v":{"$error":"#VALUE!"}},{"$f":"AND(ProductsList!M10,\"AAAAABf4/+U=\")","v":{"$error":"#VALUE!"}},{"$f":"AND(ProductsList!N10,\"AAAAABf4/+Y=\")","v":{"$error":"#VALUE!"}},{"$f":"AND(ProductsList!O10,\"AAAAABf4/+c=\")","v":{"$error":"#VALUE!"}},{"$f":"AND(ProductsList!P10,\"AAAAABf4/+g=\")","v":{"$error":"#VALUE!"}},{"$f":"AND(ProductsList!Q10,\"AAAAABf4/+k=\")","v":{"$error":"#VALUE!"}},{"$f":"AND(ProductsList!R10,\"AAAAABf4/+o=\")","v":{"$error":"#VALUE!"}},{"$f":"AND(ProductsList!S10,\"AAAAABf4/+s=\")","v":{"$error":"#VALUE!"}},{"$f":"AND(ProductsList!T10,\"AAAAABf4/+w=\")","v":{"$error":"#VALUE!"}},{"$f":"AND(ProductsList!U10,\"AAAAABf4/+0=\")","v":{"$error":"#VALUE!"}},{"$f":"AND(ProductsList!V10,\"AAAAABf4/+4=\")","v":{"$error":"#VALUE!"}},{"$f":"AND(ProductsList!W10,\"AAAAABf4/+8=\")","v":{"$error":"#VALUE!"}},{"$f":"IF(ProductsList!11:11,\"AAAAABf4//A=\",0)","v":0},{"$f":"AND(ProductsList!A11,\"AAAAABf4//E=\")","v":{"$error":"#VALUE!"}},{"$f":"AND(ProductsList!B11,\"AAAAABf4//I=\")","v":{"$error":"#VALUE!"}},{"$f":"AND(ProductsList!C11,\"AAAAABf4//M=\")","v":{"$error":"#VALUE!"}},{"$f":"AND(ProductsList!D11,\"AAAAABf4//Q=\")","v":{"$error":"#VALUE!"}},{"$f":"AND(ProductsList!E11,\"AAAAABf4//U=\")","v":{"$error":"#VALUE!"}},{"$f":"AND(ProductsList!F11,\"AAAAABf4//Y=\")","v":{"$error":"#VALUE!"}},{"$f":"AND(ProductsList!G11,\"AAAAABf4//c=\")","v":{"$error":"#VALUE!"}},{"$f":"AND(ProductsList!H11,\"AAAAABf4//g=\")","v":{"$error":"#VALUE!"}},{"$f":"AND(ProductsList!I11,\"AAAAABf4//k=\")","v":{"$error":"#VALUE!"}},{"$f":"AND(ProductsList!J11,\"AAAAABf4//o=\")","v":{"$error":"#VALUE!"}},{"$f":"AND(ProductsList!K11,\"AAAAABf4//s=\")","v":{"$error":"#VALUE!"}},{"$f":"AND(ProductsList!L11,\"AAAAABf4//w=\")","v":{"$error":"#VALUE!"}},{"$f":"AND(ProductsList!M11,\"AAAAABf4//0=\")","v":{"$error":"#VALUE!"}},{"$f":"AND(ProductsList!N11,\"AAAAABf4//4=\")","v":{"$error":"#VALUE!"}},{"$f":"AND(ProductsList!O11,\"AAAAABf4//8=\")","v":{"$error":"#VALUE!"}}]
[{"$f":"AND(ProductsList!P11,\"AAAAAF/rfwA=\")","v":{"$error":"#VALUE!"}},{"$f":"AND(ProductsList!Q11,\"AAAAAF/rfwE=\")","v":{"$error":"#VALUE!"}},{"$f":"AND(ProductsList!R11,\"AAAAAF/rfwI=\")","v":{"$error":"#VALUE!"}},{"$f":"AND(ProductsList!S11,\"AAAAAF/rfwM=\")","v":{"$error":"#VALUE!"}},{"$f":"AND(ProductsList!T11,\"AAAAAF/rfwQ=\")","v":{"$error":"#VALUE!"}},{"$f":"AND(ProductsList!U11,\"AAAAAF/rfwU=\")","v":{"$error":"#VALUE!"}},{"$f":"AND(ProductsList!V11,\"AAAAAF/rfwY=\")","v":{"$error":"#VALUE!"}},{"$f":"AND(ProductsList!W11,\"AAAAAF/rfwc=\")","v":{"$error":"#VALUE!"}},{"$f":"IF(ProductsList!12:12,\"AAAAAF/rfwg=\",0)","v":0},{"$f":"AND(ProductsList!A12,\"AAAAAF/rfwk=\")","v":{"$error":"#VALUE!"}},{"$f":"AND(ProductsList!B12,\"AAAAAF/rfwo=\")","v":{"$error":"#VALUE!"}},{"$f":"AND(ProductsList!C12,\"AAAAAF/rfws=\")","v":{"$error":"#VALUE!"}},{"$f":"AND(ProductsList!D12,\"AAAAAF/rfww=\")","v":{"$error":"#VALUE!"}},{"$f":"AND(ProductsList!E12,\"AAAAAF/rfw0=\")","v":{"$error":"#VALUE!"}},{"$f":"AND(ProductsList!F12,\"AAAAAF/rfw4=\")","v":{"$error":"#VALUE!"}},{"$f":"AND(ProductsList!G12,\"AAAAAF/rfw8=\")","v":{"$error":"#VALUE!"}},{"$f":"AND(ProductsList!H12,\"AAAAAF/rfxA=\")","v":{"$error":"#VALUE!"}},{"$f":"AND(ProductsList!I12,\"AAAAAF/rfxE=\")","v":{"$error":"#VALUE!"}},{"$f":"AND(ProductsList!J12,\"AAAAAF/rfxI=\")","v":{"$error":"#VALUE!"}},{"$f":"AND(ProductsList!K12,\"AAAAAF/rfxM=\")","v":{"$error":"#VALUE!"}},{"$f":"AND(ProductsList!L12,\"AAAAAF/rfxQ=\")","v":{"$error":"#VALUE!"}},{"$f":"AND(ProductsList!M12,\"AAAAAF/rfxU=\")","v":{"$error":"#VALUE!"}},{"$f":"AND(ProductsList!N12,\"AAAAAF/rfxY=\")","v":{"$error":"#VALUE!"}},{"$f":"AND(ProductsList!O12,\"AAAAAF/rfxc=\")","v":{"$error":"#VALUE!"}},{"$f":"AND(ProductsList!P12,\"AAAAAF/rfxg=\")","v":{"$error":"#VALUE!"}},{"$f":"AND(ProductsList!Q12,\"AAAAAF/rfxk=\")","v":{"$error":"#VALUE!"}},{"$f":"AND(ProductsList!R12,\"AAAAAF/rfxo=\")","v":{"$error":"#VALUE!"}},{"$f":"AND(ProductsList!S12,\"AAAAAF/rfxs=\")","v":{"$error":"#VALUE!"}},{"$f":"AND(ProductsList!T12,\"AAAAAF/rfxw=\")","v":{"$error":"#VALUE!"}},{"$f":"AND(ProductsList!U12,\"AAAAAF/rfx0=\")","v":{"$error":"#VALUE!"}},{"$f":"AND(ProductsList!V12,\"AAAAAF/rfx4=\")","v":{"$error":"#VALUE!"}},{"$f":"AND(ProductsList!W12,\"AAAAAF/rfx8=\")","v":{"$error":"#VALUE!"}},{"$f":"IF(ProductsList!13:13,\"AAAAAF/rfyA=\",0)","v":0},{"$f":"AND(ProductsList!A13,\"AAAAAF/rfyE=\")","v":{"$error":"#VALUE!"}},{"$f":"AND(ProductsList!B13,\"AAAAAF/rfyI=\")","v":{"$error":"#VALUE!"}},{"$f":"AND(ProductsList!C13,\"AAAAAF/rfyM=\")","v":{"$error":"#VALUE!"}},{"$f":"AND(ProductsList!D13,\"AAAAAF/rfyQ=\")","v":{"$error":"#VALUE!"}},{"$f":"AND(ProductsList!E13,\"AAAAAF/rfyU=\")","v":{"$error":"#VALUE!"}},{"$f":"AND(ProductsList!F13,\"AAAAAF/rfyY=\")","v":{"$error":"#VALUE!"}},{"$f":"AND(ProductsList!G13,\"AAAAAF/rfyc=\")","v":{"$error":"#VALUE!"}},{"$f":"AND(ProductsList!H13,\"AAAAAF/rfyg=\")","v":{"$error":"#VALUE!"}},{"$f":"AND(ProductsList!I13,\"AAAAAF/rfyk=\")","v":{"$error":"#VALUE!"}},{"$f":"AND(ProductsList!J13,\"AAAAAF/rfyo=\")","v":{"$error":"#VALUE!"}},{"$f":"AND(ProductsList!K13,\"AAAAAF/rfys=\")","v":{"$error":"#VALUE!"}},{"$f":"AND(ProductsList!L13,\"AAAAAF/rfyw=\")","v":{"$error":"#VALUE!"}},{"$f":"AND(ProductsList!M13,\"AAAAAF/rfy0=\")","v":{"$error":"#VALUE!"}},{"$f":"AND(ProductsList!N13,\"AAAAAF/rfy4=\")","v":{"$error":"#VALUE!"}},{"$f":"AND(ProductsList!O13,\"AAAAAF/rfy8=\")","v":{"$error":"#VALUE!"}},{"$f":"AND(ProductsList!P13,\"AAAAAF/rfzA=\")","v":{"$error":"#VALUE!"}},{"$f":"AND(ProductsList!Q13,\"AAAAAF/rfzE=\")","v":{"$error":"#VALUE!"}},{"$f":"AND(ProductsList!R13,\"AAAAAF/rfzI=\")","v":{"$error":"#VALUE!"}},{"$f":"AND(ProductsList!S13,\"AAAAAF/rfzM=\")","v":{"$error":"#VALUE!"}},{"$f":"AND(ProductsList!T13,\"AAAAAF/rfzQ=\")","v":{"$error":"#VALUE!"}},{"$f":"AND(ProductsList!U13,\"AAAAAF/rfzU=\")","v":{"$error":"#VALUE!"}},{"$f":"AND(ProductsList!V13,\"AAAAAF/rfzY=\")","v":{"$error":"#VALUE!"}},{"$f":"AND(ProductsList!W13,\"AAAAAF/rfzc=\")","v":{"$error":"#VALUE!"}},{"$f":"IF(ProductsList!14:14,\"AAAAAF/rfzg=\",0)","v":0},{"$f":"AND(ProductsList!A14,\"AAAAAF/rfzk=\")","v":{"$error":"#VALUE!"}},{"$f":"AND(ProductsList!B14,\"AAAAAF/rfzo=\")","v":{"$error":"#VALUE!"}},{"$f":"AND(ProductsList!C14,\"AAAAAF/rfzs=\")","v":{"$error":"#VALUE!"}},{"$f":"AND(ProductsList!D14,\"AAAAAF/rfzw=\")","v":{"$error":"#VALUE!"}},{"$f":"AND(ProductsList!E14,\"AAAAAF/rfz0=\")","v":{"$error":"#VALUE!"}},{"$f":"AND(ProductsList!F14,\"AAAAAF/rfz4=\")","v":{"$error":"#VALUE!"}},{"$f":"AND(ProductsList!G14,\"AAAAAF/rfz8=\")","v":{"$error":"#VALUE!"}},{"$f":"AND(ProductsList!H14,\"AAAAAF/rf0A=\")","v":{"$error":"#VALUE!"}},{"$f":"AND(ProductsList!I14,\"AAAAAF/rf0E=\")","v":{"$error":"#VALUE!"}},{"$f":"AND(ProductsList!J14,\"AAAAAF/rf0I=\")","v":{"$error":"#VALUE!"}},{"$f":"AND(ProductsList!K14,\"AAAAAF/rf0M=\")","v":{"$error":"#VALUE!"}},{"$f":"AND(ProductsList!L14,\"AAAAAF/rf0Q=\")","v":{"$error":"#VALUE!"}},{"$f":"AND(ProductsList!M14,\"AAAAAF/rf0U=\")","v":{"$error":"#VALUE!"}},{"$f":"AND(ProductsList!N14,\"AAAAAF/rf0Y=\")","v":{"$error":"#VALUE!"}},{"$f":"AND(ProductsList!O14,\"AAAAAF/rf0c=\")","v":{"$error":"#VALUE!"}},{"$f":"AND(ProductsList!P14,\"AAAAAF/rf0g=\")","v":{"$error":"#VALUE!"}},{"$f":"AND(ProductsList!Q14,\"AAAAAF/rf0k=\")","v":{"$error":"#VALUE!"}},{"$f":"AND(ProductsList!R14,\"AAAAAF/rf0o=\")","v":{"$error":"#VALUE!"}},{"$f":"AND(ProductsList!S14,\"AAAAAF/rf0s=\")","v":{"$error":"#VALUE!"}},{"$f":"AND(ProductsList!T14,\"AAAAAF/rf0w=\")","v":{"$error":"#VALUE!"}},{"$f":"AND(ProductsList!U14,\"AAAAAF/rf00=\")","v":{"$error":"#VALUE!"}},{"$f":"AND(ProductsList!V14,\"AAAAAF/rf04=\")","v":{"$error":"#VALUE!"}},{"$f":"AND(ProductsList!W14,\"AAAAAF/rf08=\")","v":{"$error":"#VALUE!"}},{"$f":"IF(ProductsList!15:15,\"AAAAAF/rf1A=\",0)","v":0},{"$f":"AND(ProductsList!A15,\"AAAAAF/rf1E=\")","v":{"$error":"#VALUE!"}},{"$f":"AND(ProductsList!B15,\"AAAAAF/rf1I=\")","v":{"$error":"#VALUE!"}},{"$f":"AND(ProductsList!C15,\"AAAAAF/rf1M=\")","v":{"$error":"#VALUE!"}},{"$f":"AND(ProductsList!D15,\"AAAAAF/rf1Q=\")","v":{"$error":"#VALUE!"}},{"$f":"AND(ProductsList!E15,\"AAAAAF/rf1U=\")","v":{"$error":"#VALUE!"}},{"$f":"AND(ProductsList!F15,\"AAAAAF/rf1Y=\")","v":{"$error":"#VALUE!"}},{"$f":"AND(ProductsList!G15,\"AAAAAF/rf1c=\")","v":{"$error":"#VALUE!"}},{"$f":"AND(ProductsList!H15,\"AAAAAF/rf1g=\")","v":{"$error":"#VALUE!"}},{"$f":"AND(ProductsList!I15,\"AAAAAF/rf1k=\")","v":{"$error":"#VALUE!"}},{"$f":"AND(ProductsList!J15,\"AAAAAF/rf1o=\")","v":{"$error":"#VALUE!"}},{"$f":"AND(ProductsList!K15,\"AAAAAF/rf1s=\")","v":{"$error":"#VALUE!"}},{"$f":"AND(ProductsList!L15,\"AAAAAF/rf1w=\")","v":{"$error":"#VALUE!"}},{"$f":"AND(ProductsList!M15,\"AAAAAF/rf10=\")","v":{"$error":"#VALUE!"}},{"$f":"AND(ProductsList!N15,\"AAAAAF/rf14=\")","v":{"$error":"#VALUE!"}},{"$f":"AND(ProductsList!O15,\"AAAAAF/rf18=\")","v":{"$error":"#VALUE!"}},{"$f":"AND(ProductsList!P15,\"AAAAAF/rf2A=\")","v":{"$error":"#VALUE!"}},{"$f":"AND(ProductsList!Q15,\"AAAAAF/rf2E=\")","v":{"$error":"#VALUE!"}},{"$f":"AND(ProductsList!R15,\"AAAAAF/rf2I=\")","v":{"$error":"#VALUE!"}},{"$f":"AND(ProductsList!S15,\"AAAAAF/rf2M=\")","v":{"$error":"#VALUE!"}},{"$f":"AND(ProductsList!T15,\"AAAAAF/rf2Q=\")","v":{"$error":"#VALUE!"}},{"$f":"AND(ProductsList!U15,\"AAAAAF/rf2U=\")","v":{"$error":"#VALUE!"}},{"$f":"AND(ProductsList!V15,\"AAAAAF/rf2Y=\")","v":{"$error":"#VALUE!"}},{"$f":"AND(ProductsList!W15,\"AAAAAF/rf2c=\")","v":{"$error":"#VALUE!"}},{"$f":"IF(ProductsList!16:16,\"AAAAAF/rf2g=\",0)","v":0},{"$f":"AND(ProductsList!A16,\"AAAAAF/rf2k=\")","v":{"$error":"#VALUE!"}},{"$f":"AND(ProductsList!B16,\"AAAAAF/rf2o=\")","v":{"$error":"#VALUE!"}},{"$f":"AND(ProductsList!C16,\"AAAAAF/rf2s=\")","v":{"$error":"#VALUE!"}},{"$f":"AND(ProductsList!D16,\"AAAAAF/rf2w=\")","v":{"$error":"#VALUE!"}},{"$f":"AND(ProductsList!E16,\"AAAAAF/rf20=\")","v":{"$error":"#VALUE!"}},{"$f":"AND(ProductsList!F16,\"AAAAAF/rf24=\")","v":{"$error":"#VALUE!"}},{"$f":"AND(ProductsList!G16,\"AAAAAF/rf28=\")","v":{"$error":"#VALUE!"}},{"$f":"AND(ProductsList!H16,\"AAAAAF/rf3A=\")","v":{"$error":"#VALUE!"}},{"$f":"AND(ProductsList!I16,\"AAAAAF/rf3E=\")","v":{"$error":"#VALUE!"}},{"$f":"AND(ProductsList!J16,\"AAAAAF/rf3I=\")","v":{"$error":"#VALUE!"}},{"$f":"AND(ProductsList!K16,\"AAAAAF/rf3M=\")","v":{"$error":"#VALUE!"}},{"$f":"AND(ProductsList!L16,\"AAAAAF/rf3Q=\")","v":{"$error":"#VALUE!"}},{"$f":"AND(ProductsList!M16,\"AAAAAF/rf3U=\")","v":{"$error":"#VALUE!"}},{"$f":"AND(ProductsList!N16,\"AAAAAF/rf3Y=\")","v":{"$error":"#VALUE!"}},{"$f":"AND(ProductsList!O16,\"AAAAAF/rf3c=\")","v":{"$error":"#VALUE!"}},{"$f":"AND(ProductsList!P16,\"AAAAAF/rf3g=\")","v":{"$error":"#VALUE!"}},{"$f":"AND(ProductsList!Q16,\"AAAAAF/rf3k=\")","v":{"$error":"#VALUE!"}},{"$f":"AND(ProductsList!R16,\"AAAAAF/rf3o=\")","v":{"$error":"#VALUE!"}},{"$f":"AND(ProductsList!S16,\"AAAAAF/rf3s=\")","v":{"$error":"#VALUE!"}},{"$f":"AND(ProductsList!T16,\"AAAAAF/rf3w=\")","v":{"$error":"#VALUE!"}},{"$f":"AND(ProductsList!U16,\"AAAAAF/rf30=\")","v":{"$error":"#VALUE!"}},{"$f":"AND(ProductsList!V16,\"AAAAAF/rf34=\")","v":{"$error":"#VALUE!"}},{"$f":"AND(ProductsList!W16,\"AAAAAF/rf38=\")","v":{"$error":"#VALUE!"}},{"$f":"IF(ProductsList!17:17,\"AAAAAF/rf4A=\",0)","v":0},{"$f":"AND(ProductsList!A17,\"AAAAAF/rf4E=\")","v":{"$error":"#VALUE!"}},{"$f":"AND(ProductsList!B17,\"AAAAAF/rf4I=\")","v":{"$error":"#VALUE!"}},{"$f":"AND(ProductsList!C17,\"AAAAAF/rf4M=\")","v":{"$error":"#VALUE!"}},{"$f":"AND(ProductsList!D17,\"AAAAAF/rf4Q=\")","v":{"$error":"#VALUE!"}},{"$f":"AND(ProductsList!E17,\"AAAAAF/rf4U=\")","v":{"$error":"#VALUE!"}},{"$f":"AND(ProductsList!F17,\"AAAAAF/rf4Y=\")","v":{"$error":"#VALUE!"}},{"$f":"AND(ProductsList!G17,\"AAAAAF/rf4c=\")","v":{"$error":"#VALUE!"}},{"$f":"AND(ProductsList!H17,\"AAAAAF/rf4g=\")","v":{"$error":"#VALUE!"}},{"$f":"AND(ProductsList!I17,\"AAAAAF/rf4k=\")","v":{"$error":"#VALUE!"}},{"$f":"AND(ProductsList!J17,\"AAAAAF/rf4o=\")","v":{"$error":"#VALUE!"}},{"$f":"AND(ProductsList!K17,\"AAAAAF/rf4s=\")","v":{"$error":"#VALUE!"}},{"$f":"AND(ProductsList!L17,\"AAAAAF/rf4w=\")","v":{"$error":"#VALUE!"}},{"$f":"AND(ProductsList!M17,\"AAAAAF/rf40=\")","v":{"$error":"#VALUE!"}},{"$f":"AND(ProductsList!N17,\"AAAAAF/rf44=\")","v":{"$error":"#VALUE!"}},{"$f":"AND(ProductsList!O17,\"AAAAAF/rf48=\")","v":{"$error":"#VALUE!"}},{"$f":"AND(ProductsList!P17,\"AAAAAF/rf5A=\")","v":{"$error":"#VALUE!"}},{"$f":"AND(ProductsList!Q17,\"AAAAAF/rf5E=\")","v":{"$error":"#VALUE!"}},{"$f":"AND(ProductsList!R17,\"AAAAAF/rf5I=\")","v":{"$error":"#VALUE!"}},{"$f":"AND(ProductsList!S17,\"AAAAAF/rf5M=\")","v":{"$error":"#VALUE!"}},{"$f":"AND(ProductsList!T17,\"AAAAAF/rf5Q=\")","v":{"$error":"#VALUE!"}},{"$f":"AND(ProductsList!U17,\"AAAAAF/rf5U=\")","v":{"$error":"#VALUE!"}},{"$f":"AND(ProductsList!V17,\"AAAAAF/rf5Y=\")","v":{"$error":"#VALUE!"}},{"$f":"AND(ProductsList!W17,\"AAAAAF/rf5c=\")","v":{"$error":"#VALUE!"}},{"$f":"IF(ProductsList!18:18,\"AAAAAF/rf5g=\",0)","v":0},{"$f":"AND(ProductsList!A18,\"AAAAAF/rf5k=\")","v":{"$error":"#VALUE!"}},{"$f":"AND(ProductsList!B18,\"AAAAAF/rf5o=\")","v":{"$error":"#VALUE!"}},{"$f":"AND(ProductsList!C18,\"AAAAAF/rf5s=\")","v":{"$error":"#VALUE!"}},{"$f":"AND(ProductsList!D18,\"AAAAAF/rf5w=\")","v":{"$error":"#VALUE!"}},{"$f":"AND(ProductsList!E18,\"AAAAAF/rf50=\")","v":{"$error":"#VALUE!"}},{"$f":"AND(ProductsList!F18,\"AAAAAF/rf54=\")","v":{"$error":"#VALUE!"}},{"$f":"AND(ProductsList!G18,\"AAAAAF/rf58=\")","v":{"$error":"#VALUE!"}},{"$f":"AND(ProductsList!H18,\"AAAAAF/rf6A=\")","v":{"$error":"#VALUE!"}},{"$f":"AND(ProductsList!I18,\"AAAAAF/rf6E=\")","v":{"$error":"#VALUE!"}},{"$f":"AND(ProductsList!J18,\"AAAAAF/rf6I=\")","v":{"$error":"#VALUE!"}},{"$f":"AND(ProductsList!K18,\"AAAAAF/rf6M=\")","v":{"$error":"#VALUE!"}},{"$f":"AND(ProductsList!L18,\"AAAAAF/rf6Q=\")","v":{"$error":"#VALUE!"}},{"$f":"AND(ProductsList!M18,\"AAAAAF/rf6U=\")","v":{"$error":"#VALUE!"}},{"$f":"AND(ProductsList!N18,\"AAAAAF/rf6Y=\")","v":{"$error":"#VALUE!"}},{"$f":"AND(ProductsList!O18,\"AAAAAF/rf6c=\")","v":{"$error":"#VALUE!"}},{"$f":"AND(ProductsList!P18,\"AAAAAF/rf6g=\")","v":{"$error":"#VALUE!"}},{"$f":"AND(ProductsList!Q18,\"AAAAAF/rf6k=\")","v":{"$error":"#VALUE!"}},{"$f":"AND(ProductsList!R18,\"AAAAAF/rf6o=\")","v":{"$error":"#VALUE!"}},{"$f":"AND(ProductsList!S18,\"AAAAAF/rf6s=\")","v":{"$error":"#VALUE!"}},{"$f":"AND(ProductsList!T18,\"AAAAAF/rf6w=\")","v":{"$error":"#VALUE!"}},{"$f":"AND(ProductsList!U18,\"AAAAAF/rf60=\")","v":{"$error":"#VALUE!"}},{"$f":"AND(ProductsList!V18,\"AAAAAF/rf64=\")","v":{"$error":"#VALUE!"}},{"$f":"AND(ProductsList!W18,\"AAAAAF/rf68=\")","v":{"$error":"#VALUE!"}},{"$f":"IF(ProductsList!19:19,\"AAAAAF/rf7A=\",0)","v":0},{"$f":"AND(ProductsList!A19,\"AAAAAF/rf7E=\")","v":{"$error":"#VALUE!"}},{"$f":"AND(ProductsList!B19,\"AAAAAF/rf7I=\")","v":{"$error":"#VALUE!"}},{"$f":"AND(ProductsList!C19,\"AAAAAF/rf7M=\")","v":{"$error":"#VALUE!"}},{"$f":"AND(ProductsList!D19,\"AAAAAF/rf7Q=\")","v":{"$error":"#VALUE!"}},{"$f":"AND(ProductsList!E19,\"AAAAAF/rf7U=\")","v":{"$error":"#VALUE!"}},{"$f":"AND(ProductsList!F19,\"AAAAAF/rf7Y=\")","v":{"$error":"#VALUE!"}},{"$f":"AND(ProductsList!G19,\"AAAAAF/rf7c=\")","v":{"$error":"#VALUE!"}},{"$f":"AND(ProductsList!H19,\"AAAAAF/rf7g=\")","v":{"$error":"#VALUE!"}},{"$f":"AND(ProductsList!I19,\"AAAAAF/rf7k=\")","v":{"$error":"#VALUE!"}},{"$f":"AND(ProductsList!J19,\"AAAAAF/rf7o=\")","v":{"$error":"#VALUE!"}},{"$f":"AND(ProductsList!K19,\"AAAAAF/rf7s=\")","v":{"$error":"#VALUE!"}},{"$f":"AND(ProductsList!L19,\"AAAAAF/rf7w=\")","v":{"$error":"#VALUE!"}},{"$f":"AND(ProductsList!M19,\"AAAAAF/rf70=\")","v":{"$error":"#VALUE!"}},{"$f":"AND(ProductsList!N19,\"AAAAAF/rf74=\")","v":{"$error":"#VALUE!"}},{"$f":"AND(ProductsList!O19,\"AAAAAF/rf78=\")","v":{"$error":"#VALUE!"}},{"$f":"AND(ProductsList!P19,\"AAAAAF/rf8A=\")","v":{"$error":"#VALUE!"}},{"$f":"AND(ProductsList!Q19,\"AAAAAF/rf8E=\")","v":{"$error":"#VALUE!"}},{"$f":"AND(ProductsList!R19,\"AAAAAF/rf8I=\")","v":{"$error":"#VALUE!"}},{"$f":"AND(ProductsList!S19,\"AAAAAF/rf8M=\")","v":{"$error":"#VALUE!"}},{"$f":"AND(ProductsList!T19,\"AAAAAF/rf8Q=\")","v":{"$error":"#VALUE!"}},{"$f":"AND(ProductsList!U19,\"AAAAAF/rf8U=\")","v":{"$error":"#VALUE!"}},{"$f":"AND(ProductsList!V19,\"AAAAAF/rf8Y=\")","v":{"$error":"#VALUE!"}},{"$f":"AND(ProductsList!W19,\"AAAAAF/rf8c=\")","v":{"$error":"#VALUE!"}},{"$f":"IF(ProductsList!20:20,\"AAAAAF/rf8g=\",0)","v":0},{"$f":"AND(ProductsList!A20,\"AAAAAF/rf8k=\")","v":{"$error":"#VALUE!"}},{"$f":"AND(ProductsList!B20,\"AAAAAF/rf8o=\")","v":{"$error":"#VALUE!"}},{"$f":"AND(ProductsList!C20,\"AAAAAF/rf8s=\")","v":{"$error":"#VALUE!"}},{"$f":"AND(ProductsList!D20,\"AAAAAF/rf8w=\")","v":{"$error":"#VALUE!"}},{"$f":"AND(ProductsList!E20,\"AAAAAF/rf80=\")","v":{"$error":"#VALUE!"}},{"$f":"AND(ProductsList!F20,\"AAAAAF/rf84=\")","v":{"$error":"#VALUE!"}},{"$f":"AND(ProductsList!G20,\"AAAAAF/rf88=\")","v":{"$error":"#VALUE!"}},{"$f":"AND(ProductsList!H20,\"AAAAAF/rf9A=\")","v":{"$error":"#VALUE!"}},{"$f":"AND(ProductsList!I20,\"AAAAAF/rf9E=\")","v":{"$error":"#VALUE!"}},{"$f":"AND(ProductsList!J20,\"AAAAAF/rf9I=\")","v":{"$error":"#VALUE!"}},{"$f":"AND(ProductsList!K20,\"AAAAAF/rf9M=\")","v":{"$error":"#VALUE!"}},{"$f":"AND(ProductsList!L20,\"AAAAAF/rf9Q=\")","v":{"$error":"#VALUE!"}},{"$f":"AND(ProductsList!M20,\"AAAAAF/rf9U=\")","v":{"$error":"#VALUE!"}},{"$f":"AND(ProductsList!N20,\"AAAAAF/rf9Y=\")","v":{"$error":"#VALUE!"}},{"$f":"AND(ProductsList!O20,\"AAAAAF/rf9c=\")","v":{"$error":"#VALUE!"}},{"$f":"AND(ProductsList!P20,\"AAAAAF/rf9g=\")","v":{"$error":"#VALUE!"}},{"$f":"AND(ProductsList!Q20,\"AAAAAF/rf9k=\")","v":{"$error":"#VALUE!"}},{"$f":"AND(ProductsList!R20,\"AAAAAF/rf9o=\")","v":{"$error":"#VALUE!"}},{"$f":"AND(ProductsList!S20,\"AAAAAF/rf9s=\")","v":{"$error":"#VALUE!"}},{"$f":"AND(ProductsList!T20,\"AAAAAF/rf9w=\")","v":{"$error":"#VALUE!"}},{"$f":"AND(ProductsList!U20,\"AAAAAF/rf90=\")","v":{"$error":"#VALUE!"}},{"$f":"AND(ProductsList!V20,\"AAAAAF/rf94=\")","v":{"$error":"#VALUE!"}},{"$f":"AND(ProductsList!W20,\"AAAAAF/rf98=\")","v":{"$error":"#VALUE!"}},{"$f":"IF(ProductsList!21:21,\"AAAAAF/rf+A=\",0)","v":0},{"$f":"AND(ProductsList!A21,\"AAAAAF/rf+E=\")","v":{"$error":"#VALUE!"}},{"$f":"AND(ProductsList!B21,\"AAAAAF/rf+I=\")","v":{"$error":"#VALUE!"}},{"$f":"AND(ProductsList!C21,\"AAAAAF/rf+M=\")","v":{"$error":"#VALUE!"}},{"$f":"AND(ProductsList!D21,\"AAAAAF/rf+Q=\")","v":{"$error":"#VALUE!"}},{"$f":"AND(ProductsList!E21,\"AAAAAF/rf+U=\")","v":{"$error":"#VALUE!"}},{"$f":"AND(ProductsList!F21,\"AAAAAF/rf+Y=\")","v":{"$error":"#VALUE!"}},{"$f":"AND(ProductsList!G21,\"AAAAAF/rf+c=\")","v":{"$error":"#VALUE!"}},{"$f":"AND(ProductsList!H21,\"AAAAAF/rf+g=\")","v":{"$error":"#VALUE!"}},{"$f":"AND(ProductsList!I21,\"AAAAAF/rf+k=\")","v":{"$error":"#VALUE!"}},{"$f":"AND(ProductsList!J21,\"AAAAAF/rf+o=\")","v":{"$error":"#VALUE!"}},{"$f":"AND(ProductsList!K21,\"AAAAAF/rf+s=\")","v":{"$error":"#VALUE!"}},{"$f":"AND(ProductsList!L21,\"AAAAAF/rf+w=\")","v":{"$error":"#VALUE!"}},{"$f":"AND(ProductsList!M21,\"AAAAAF/rf+0=\")","v":{"$error":"#VALUE!"}},{"$f":"AND(ProductsList!N21,\"AAAAAF/rf+4=\")","v":{"$error":"#VALUE!"}},{"$f":"AND(ProductsList!O21,\"AAAAAF/rf+8=\")","v":{"$error":"#VALUE!"}},{"$f":"AND(ProductsList!P21,\"AAAAAF/rf/A=\")","v":{"$error":"#VALUE!"}},{"$f":"AND(ProductsList!Q21,\"AAAAAF/rf/E=\")","v":{"$error":"#VALUE!"}},{"$f":"AND(ProductsList!R21,\"AAAAAF/rf/I=\")","v":{"$error":"#VALUE!"}},{"$f":"AND(ProductsList!S21,\"AAAAAF/rf/M=\")","v":{"$error":"#VALUE!"}},{"$f":"AND(ProductsList!T21,\"AAAAAF/rf/Q=\")","v":{"$error":"#VALUE!"}},{"$f":"AND(ProductsList!U21,\"AAAAAF/rf/U=\")","v":{"$error":"#VALUE!"}},{"$f":"AND(ProductsList!V21,\"AAAAAF/rf/Y=\")","v":{"$error":"#VALUE!"}},{"$f":"AND(ProductsList!W21,\"AAAAAF/rf/c=\")","v":{"$error":"#VALUE!"}},{"$f":"IF(ProductsList!22:22,\"AAAAAF/rf/g=\",0)","v":0},{"$f":"AND(ProductsList!A22,\"AAAAAF/rf/k=\")","v":{"$error":"#VALUE!"}},{"$f":"AND(ProductsList!B22,\"AAAAAF/rf/o=\")","v":{"$error":"#VALUE!"}},{"$f":"AND(ProductsList!C22,\"AAAAAF/rf/s=\")","v":{"$error":"#VALUE!"}},{"$f":"AND(ProductsList!D22,\"AAAAAF/rf/w=\")","v":{"$error":"#VALUE!"}},{"$f":"AND(ProductsList!E22,\"AAAAAF/rf/0=\")","v":{"$error":"#VALUE!"}},{"$f":"AND(ProductsList!F22,\"AAAAAF/rf/4=\")","v":{"$error":"#VALUE!"}},{"$f":"AND(ProductsList!G22,\"AAAAAF/rf/8=\")","v":{"$error":"#VALUE!"}}]
[{"$f":"AND(ProductsList!H22,\"AAAAAHp7bwA=\")","v":{"$error":"#VALUE!"}},{"$f":"AND(ProductsList!I22,\"AAAAAHp7bwE=\")","v":{"$error":"#VALUE!"}},{"$f":"AND(ProductsList!J22,\"AAAAAHp7bwI=\")","v":{"$error":"#VALUE!"}},{"$f":"AND(ProductsList!K22,\"AAAAAHp7bwM=\")","v":{"$error":"#VALUE!"}},{"$f":"AND(ProductsList!L22,\"AAAAAHp7bwQ=\")","v":{"$error":"#VALUE!"}},{"$f":"AND(ProductsList!M22,\"AAAAAHp7bwU=\")","v":{"$error":"#VALUE!"}},{"$f":"AND(ProductsList!N22,\"AAAAAHp7bwY=\")","v":{"$error":"#VALUE!"}},{"$f":"AND(ProductsList!O22,\"AAAAAHp7bwc=\")","v":{"$error":"#VALUE!"}},{"$f":"AND(ProductsList!P22,\"AAAAAHp7bwg=\")","v":{"$error":"#VALUE!"}},{"$f":"AND(ProductsList!Q22,\"AAAAAHp7bwk=\")","v":{"$error":"#VALUE!"}},{"$f":"AND(ProductsList!R22,\"AAAAAHp7bwo=\")","v":{"$error":"#VALUE!"}},{"$f":"AND(ProductsList!S22,\"AAAAAHp7bws=\")","v":{"$error":"#VALUE!"}},{"$f":"AND(ProductsList!T22,\"AAAAAHp7bww=\")","v":{"$error":"#VALUE!"}},{"$f":"AND(ProductsList!U22,\"AAAAAHp7bw0=\")","v":{"$error":"#VALUE!"}},{"$f":"AND(ProductsList!V22,\"AAAAAHp7bw4=\")","v":{"$error":"#VALUE!"}},{"$f":"AND(ProductsList!W22,\"AAAAAHp7bw8=\")","v":{"$error":"#VALUE!"}},{"$f":"IF(ProductsList!23:23,\"AAAAAHp7bxA=\",0)","v":0},{"$f":"AND(ProductsList!A23,\"AAAAAHp7bxE=\")","v":{"$error":"#VALUE!"}},{"$f":"AND(ProductsList!B23,\"AAAAAHp7bxI=\")","v":{"$error":"#VALUE!"}},{"$f":"AND(ProductsList!C23,\"AAAAAHp7bxM=\")","v":{"$error":"#VALUE!"}},{"$f":"AND(ProductsList!D23,\"AAAAAHp7bxQ=\")","v":{"$error":"#VALUE!"}},{"$f":"AND(ProductsList!E23,\"AAAAAHp7bxU=\")","v":{"$error":"#VALUE!"}},{"$f":"AND(ProductsList!F23,\"AAAAAHp7bxY=\")","v":{"$error":"#VALUE!"}},{"$f":"AND(ProductsList!G23,\"AAAAAHp7bxc=\")","v":{"$error":"#VALUE!"}},{"$f":"AND(ProductsList!H23,\"AAAAAHp7bxg=\")","v":{"$error":"#VALUE!"}},{"$f":"AND(ProductsList!I23,\"AAAAAHp7bxk=\")","v":{"$error":"#VALUE!"}},{"$f":"AND(ProductsList!J23,\"AAAAAHp7bxo=\")","v":{"$error":"#VALUE!"}},{"$f":"AND(ProductsList!K23,\"AAAAAHp7bxs=\")","v":{"$error":"#VALUE!"}},{"$f":"AND(ProductsList!L23,\"AAAAAHp7bxw=\")","v":{"$error":"#VALUE!"}},{"$f":"AND(ProductsList!M23,\"AAAAAHp7bx0=\")","v":{"$error":"#VALUE!"}},{"$f":"AND(ProductsList!N23,\"AAAAAHp7bx4=\")","v":{"$error":"#VALUE!"}},{"$f":"AND(ProductsList!O23,\"AAAAAHp7bx8=\")","v":{"$error":"#VALUE!"}},{"$f":"AND(ProductsList!P23,\"AAAAAHp7byA=\")","v":{"$error":"#VALUE!"}},{"$f":"AND(ProductsList!Q23,\"AAAAAHp7byE=\")","v":{"$error":"#VALUE!"}},{"$f":"AND(ProductsList!R23,\"AAAAAHp7byI=\")","v":{"$error":"#VALUE!"}},{"$f":"AND(ProductsList!S23,\"AAAAAHp7byM=\")","v":{"$error":"#VALUE!"}},{"$f":"AND(ProductsList!T23,\"AAAAAHp7byQ=\")","v":{"$error":"#VALUE!"}},{"$f":"AND(ProductsList!U23,\"AAAAAHp7byU=\")","v":{"$error":"#VALUE!"}},{"$f":"AND(ProductsList!V23,\"AAAAAHp7byY=\")","v":{"$error":"#VALUE!"}},{"$f":"AND(ProductsList!W23,\"AAAAAHp7byc=\")","v":{"$error":"#VALUE!"}},{"$f":"IF(ProductsList!24:24,\"AAAAAHp7byg=\",0)","v":0},{"$f":"AND(ProductsList!A24,\"AAAAAHp7byk=\")","v":{"$error":"#VALUE!"}},{"$f":"AND(ProductsList!B24,\"AAAAAHp7byo=\")","v":{"$error":"#VALUE!"}},{"$f":"AND(ProductsList!C24,\"AAAAAHp7bys=\")","v":{"$error":"#VALUE!"}},{"$f":"AND(ProductsList!D24,\"AAAAAHp7byw=\")","v":{"$error":"#VALUE!"}},{"$f":"AND(ProductsList!E24,\"AAAAAHp7by0=\")","v":{"$error":"#VALUE!"}},{"$f":"AND(ProductsList!F24,\"AAAAAHp7by4=\")","v":{"$error":"#VALUE!"}},{"$f":"AND(ProductsList!G24,\"AAAAAHp7by8=\")","v":{"$error":"#VALUE!"}},{"$f":"AND(ProductsList!H24,\"AAAAAHp7bzA=\")","v":{"$error":"#VALUE!"}},{"$f":"AND(ProductsList!I24,\"AAAAAHp7bzE=\")","v":{"$error":"#VALUE!"}},{"$f":"AND(ProductsList!J24,\"AAAAAHp7bzI=\")","v":{"$error":"#VALUE!"}},{"$f":"AND(ProductsList!K24,\"AAAAAHp7bzM=\")","v":{"$error":"#VALUE!"}},{"$f":"AND(ProductsList!L24,\"AAAAAHp7bzQ=\")","v":{"$error":"#VALUE!"}},{"$f":"AND(ProductsList!M24,\"AAAAAHp7bzU=\")","v":{"$error":"#VALUE!"}},{"$f":"AND(ProductsList!N24,\"AAAAAHp7bzY=\")","v":{"$error":"#VALUE!"}},{"$f":"AND(ProductsList!O24,\"AAAAAHp7bzc=\")","v":{"$error":"#VALUE!"}},{"$f":"AND(ProductsList!P24,\"AAAAAHp7bzg=\")","v":{"$error":"#VALUE!"}},{"$f":"AND(ProductsList!Q24,\"AAAAAHp7bzk=\")","v":{"$error":"#VALUE!"}},{"$f":"AND(ProductsList!R24,\"AAAAAHp7bzo=\")","v":{"$error":"#VALUE!"}},{"$f":"AND(ProductsList!S24,\"AAAAAHp7bzs=\")","v":{"$error":"#VALUE!"}},{"$f":"AND(ProductsList!T24,\"AAAAAHp7bzw=\")","v":{"$error":"#VALUE!"}},{"$f":"AND(ProductsList!U24,\"AAAAAHp7bz0=\")","v":{"$error":"#VALUE!"}},{"$f":"AND(ProductsList!V24,\"AAAAAHp7bz4=\")","v":{"$error":"#VALUE!"}},{"$f":"AND(ProductsList!W24,\"AAAAAHp7bz8=\")","v":{"$error":"#VALUE!"}},{"$f":"IF(ProductsList!25:25,\"AAAAAHp7b0A=\",0)","v":0},{"$f":"AND(ProductsList!A25,\"AAAAAHp7b0E=\")","v":{"$error":"#VALUE!"}},{"$f":"AND(ProductsList!B25,\"AAAAAHp7b0I=\")","v":{"$error":"#VALUE!"}},{"$f":"AND(ProductsList!C25,\"AAAAAHp7b0M=\")","v":{"$error":"#VALUE!"}},{"$f":"AND(ProductsList!D25,\"AAAAAHp7b0Q=\")","v":{"$error":"#VALUE!"}},{"$f":"AND(ProductsList!E25,\"AAAAAHp7b0U=\")","v":{"$error":"#VALUE!"}},{"$f":"AND(ProductsList!F25,\"AAAAAHp7b0Y=\")","v":{"$error":"#VALUE!"}},{"$f":"AND(ProductsList!G25,\"AAAAAHp7b0c=\")","v":{"$error":"#VALUE!"}},{"$f":"AND(ProductsList!H25,\"AAAAAHp7b0g=\")","v":{"$error":"#VALUE!"}},{"$f":"AND(ProductsList!I25,\"AAAAAHp7b0k=\")","v":{"$error":"#VALUE!"}},{"$f":"AND(ProductsList!J25,\"AAAAAHp7b0o=\")","v":{"$error":"#VALUE!"}},{"$f":"AND(ProductsList!K25,\"AAAAAHp7b0s=\")","v":{"$error":"#VALUE!"}},{"$f":"AND(ProductsList!L25,\"AAAAAHp7b0w=\")","v":{"$error":"#VALUE!"}},{"$f":"AND(ProductsList!M25,\"AAAAAHp7b00=\")","v":{"$error":"#VALUE!"}},{"$f":"AND(ProductsList!N25,\"AAAAAHp7b04=\")","v":{"$error":"#VALUE!"}},{"$f":"AND(ProductsList!O25,\"AAAAAHp7b08=\")","v":{"$error":"#VALUE!"}},{"$f":"AND(ProductsList!P25,\"AAAAAHp7b1A=\")","v":{"$error":"#VALUE!"}},{"$f":"AND(ProductsList!Q25,\"AAAAAHp7b1E=\")","v":{"$error":"#VALUE!"}},{"$f":"AND(ProductsList!R25,\"AAAAAHp7b1I=\")","v":{"$error":"#VALUE!"}},{"$f":"AND(ProductsList!S25,\"AAAAAHp7b1M=\")","v":{"$error":"#VALUE!"}},{"$f":"AND(ProductsList!T25,\"AAAAAHp7b1Q=\")","v":{"$error":"#VALUE!"}},{"$f":"AND(ProductsList!U25,\"AAAAAHp7b1U=\")","v":{"$error":"#VALUE!"}},{"$f":"AND(ProductsList!V25,\"AAAAAHp7b1Y=\")","v":{"$error":"#VALUE!"}},{"$f":"AND(ProductsList!W25,\"AAAAAHp7b1c=\")","v":{"$error":"#VALUE!"}},{"$f":"IF(ProductsList!26:26,\"AAAAAHp7b1g=\",0)","v":0},{"$f":"AND(ProductsList!A26,\"AAAAAHp7b1k=\")","v":{"$error":"#VALUE!"}},{"$f":"AND(ProductsList!B26,\"AAAAAHp7b1o=\")","v":{"$error":"#VALUE!"}},{"$f":"AND(ProductsList!C26,\"AAAAAHp7b1s=\")","v":{"$error":"#VALUE!"}},{"$f":"AND(ProductsList!D26,\"AAAAAHp7b1w=\")","v":{"$error":"#VALUE!"}},{"$f":"AND(ProductsList!E26,\"AAAAAHp7b10=\")","v":{"$error":"#VALUE!"}},{"$f":"AND(ProductsList!F26,\"AAAAAHp7b14=\")","v":{"$error":"#VALUE!"}},{"$f":"AND(ProductsList!G26,\"AAAAAHp7b18=\")","v":{"$error":"#VALUE!"}},{"$f":"AND(ProductsList!H26,\"AAAAAHp7b2A=\")","v":{"$error":"#VALUE!"}},{"$f":"AND(ProductsList!I26,\"AAAAAHp7b2E=\")","v":{"$error":"#VALUE!"}},{"$f":"AND(ProductsList!J26,\"AAAAAHp7b2I=\")","v":{"$error":"#VALUE!"}},{"$f":"AND(ProductsList!K26,\"AAAAAHp7b2M=\")","v":{"$error":"#VALUE!"}},{"$f":"AND(ProductsList!L26,\"AAAAAHp7b2Q=\")","v":{"$error":"#VALUE!"}},{"$f":"AND(ProductsList!M26,\"AAAAAHp7b2U=\")","v":{"$error":"#VALUE!"}},{"$f":"AND(ProductsList!N26,\"AAAAAHp7b2Y=\")","v":{"$error":"#VALUE!"}},{"$f":"AND(ProductsList!O26,\"AAAAAHp7b2c=\")","v":{"$error":"#VALUE!"}},{"$f":"AND(ProductsList!P26,\"AAAAAHp7b2g=\")","v":{"$error":"#VALUE!"}},{"$f":"AND(ProductsList!Q26,\"AAAAAHp7b2k=\")","v":{"$error":"#VALUE!"}},{"$f":"AND(ProductsList!R26,\"AAAAAHp7b2o=\")","v":{"$error":"#VALUE!"}},{"$f":"AND(ProductsList!S26,\"AAAAAHp7b2s=\")","v":{"$error":"#VALUE!"}},{"$f":"AND(ProductsList!T26,\"AAAAAHp7b2w=\")","v":{"$error":"#VALUE!"}},{"$f":"AND(ProductsList!U26,\"AAAAAHp7b20=\")","v":{"$error":"#VALUE!"}},{"$f":"AND(ProductsList!V26,\"AAAAAHp7b24=\")","v":{"$error":"#VALUE!"}},{"$f":"AND(ProductsList!W26,\"AAAAAHp7b28=\")","v":{"$error":"#VALUE!"}},{"$f":"IF(ProductsList!27:27,\"AAAAAHp7b3A=\",0)","v":0},{"$f":"AND(ProductsList!A27,\"AAAAAHp7b3E=\")","v":{"$error":"#VALUE!"}},{"$f":"AND(ProductsList!B27,\"AAAAAHp7b3I=\")","v":{"$error":"#VALUE!"}},{"$f":"AND(ProductsList!C27,\"AAAAAHp7b3M=\")","v":{"$error":"#VALUE!"}},{"$f":"AND(ProductsList!D27,\"AAAAAHp7b3Q=\")","v":{"$error":"#VALUE!"}},{"$f":"AND(ProductsList!E27,\"AAAAAHp7b3U=\")","v":{"$error":"#VALUE!"}},{"$f":"AND(ProductsList!F27,\"AAAAAHp7b3Y=\")","v":{"$error":"#VALUE!"}},{"$f":"AND(ProductsList!G27,\"AAAAAHp7b3c=\")","v":{"$error":"#VALUE!"}},{"$f":"AND(ProductsList!H27,\"AAAAAHp7b3g=\")","v":{"$error":"#VALUE!"}},{"$f":"AND(ProductsList!I27,\"AAAAAHp7b3k=\")","v":{"$error":"#VALUE!"}},{"$f":"AND(ProductsList!J27,\"AAAAAHp7b3o=\")","v":{"$error":"#VALUE!"}},{"$f":"AND(ProductsList!K27,\"AAAAAHp7b3s=\")","v":{"$error":"#VALUE!"}},{"$f":"AND(ProductsList!L27,\"AAAAAHp7b3w=\")","v":{"$error":"#VALUE!"}},{"$f":"AND(ProductsList!M27,\"AAAAAHp7b30=\")","v":{"$error":"#VALUE!"}},{"$f":"AND(ProductsList!N27,\"AAAAAHp7b34=\")","v":{"$error":"#VALUE!"}},{"$f":"AND(ProductsList!O27,\"AAAAAHp7b38=\")","v":{"$error":"#VALUE!"}},{"$f":"AND(ProductsList!P27,\"AAAAAHp7b4A=\")","v":{"$error":"#VALUE!"}},{"$f":"AND(ProductsList!Q27,\"AAAAAHp7b4E=\")","v":{"$error":"#VALUE!"}},{"$f":"AND(ProductsList!R27,\"AAAAAHp7b4I=\")","v":{"$error":"#VALUE!"}},{"$f":"AND(ProductsList!S27,\"AAAAAHp7b4M=\")","v":{"$error":"#VALUE!"}},{"$f":"AND(ProductsList!T27,\"AAAAAHp7b4Q=\")","v":{"$error":"#VALUE!"}},{"$f":"AND(ProductsList!U27,\"AAAAAHp7b4U=\")","v":{"$error":"#VALUE!"}},{"$f":"AND(ProductsList!V27,\"AAAAAHp7b4Y=\")","v":{"$error":"#VALUE!"}},{"$f":"AND(ProductsList!W27,\"AAAAAHp7b4c=\")","v":{"$error":"#VALUE!"}},{"$f":"IF(ProductsList!28:28,\"AAAAAHp7b4g=\",0)","v":0},{"$f":"AND(ProductsList!A28,\"AAAAAHp7b4k=\")","v":{"$error":"#VALUE!"}},{"$f":"AND(ProductsList!B28,\"AAAAAHp7b4o=\")","v":{"$error":"#VALUE!"}},{"$f":"AND(ProductsList!C28,\"AAAAAHp7b4s=\")","v":{"$error":"#VALUE!"}},{"$f":"AND(ProductsList!D28,\"AAAAAHp7b4w=\")","v":{"$error":"#VALUE!"}},{"$f":"AND(ProductsList!E28,\"AAAAAHp7b40=\")","v":{"$error":"#VALUE!"}},{"$f":"AND(ProductsList!F28,\"AAAAAHp7b44=\")","v":{"$error":"#VALUE!"}},{"$f":"AND(ProductsList!G28,\"AAAAAHp7b48=\")","v":{"$error":"#VALUE!"}},{"$f":"AND(ProductsList!H28,\"AAAAAHp7b5A=\")","v":{"$error":"#VALUE!"}},{"$f":"AND(ProductsList!I28,\"AAAAAHp7b5E=\")","v":{"$error":"#VALUE!"}},{"$f":"AND(ProductsList!J28,\"AAAAAHp7b5I=\")","v":{"$error":"#VALUE!"}},{"$f":"AND(ProductsList!K28,\"AAAAAHp7b5M=\")","v":{"$error":"#VALUE!"}},{"$f":"AND(ProductsList!L28,\"AAAAAHp7b5Q=\")","v":{"$error":"#VALUE!"}},{"$f":"AND(ProductsList!M28,\"AAAAAHp7b5U=\")","v":{"$error":"#VALUE!"}},{"$f":"AND(ProductsList!N28,\"AAAAAHp7b5Y=\")","v":{"$error":"#VALUE!"}},{"$f":"AND(ProductsList!O28,\"AAAAAHp7b5c=\")","v":{"$error":"#VALUE!"}},{"$f":"AND(ProductsList!P28,\"AAAAAHp7b5g=\")","v":{"$error":"#VALUE!"}},{"$f":"AND(ProductsList!Q28,\"AAAAAHp7b5k=\")","v":{"$error":"#VALUE!"}},{"$f":"AND(ProductsList!R28,\"AAAAAHp7b5o=\")","v":{"$error":"#VALUE!"}},{"$f":"AND(ProductsList!S28,\"AAAAAHp7b5s=\")","v":{"$error":"#VALUE!"}},{"$f":"AND(ProductsList!T28,\"AAAAAHp7b5w=\")","v":{"$error":"#VALUE!"}},{"$f":"AND(ProductsList!U28,\"AAAAAHp7b50=\")","v":{"$error":"#VALUE!"}},{"$f":"AND(ProductsList!V28,\"AAAAAHp7b54=\")","v":{"$error":"#VALUE!"}},{"$f":"AND(ProductsList!W28,\"AAAAAHp7b58=\")","v":{"$error":"#VALUE!"}},{"$f":"IF(ProductsList!29:29,\"AAAAAHp7b6A=\",0)","v":0},{"$f":"AND(ProductsList!A29,\"AAAAAHp7b6E=\")","v":{"$error":"#VALUE!"}},{"$f":"AND(ProductsList!B29,\"AAAAAHp7b6I=\")","v":{"$error":"#VALUE!"}},{"$f":"AND(ProductsList!C29,\"AAAAAHp7b6M=\")","v":{"$error":"#VALUE!"}},{"$f":"AND(ProductsList!D29,\"AAAAAHp7b6Q=\")","v":{"$error":"#VALUE!"}},{"$f":"AND(ProductsList!E29,\"AAAAAHp7b6U=\")","v":{"$error":"#VALUE!"}},{"$f":"AND(ProductsList!F29,\"AAAAAHp7b6Y=\")","v":{"$error":"#VALUE!"}},{"$f":"AND(ProductsList!G29,\"AAAAAHp7b6c=\")","v":{"$error":"#VALUE!"}},{"$f":"AND(ProductsList!H29,\"AAAAAHp7b6g=\")","v":{"$error":"#VALUE!"}},{"$f":"AND(ProductsList!I29,\"AAAAAHp7b6k=\")","v":{"$error":"#VALUE!"}},{"$f":"AND(ProductsList!J29,\"AAAAAHp7b6o=\")","v":{"$error":"#VALUE!"}},{"$f":"AND(ProductsList!K29,\"AAAAAHp7b6s=\")","v":{"$error":"#VALUE!"}},{"$f":"AND(ProductsList!L29,\"AAAAAHp7b6w=\")","v":{"$error":"#VALUE!"}},{"$f":"AND(ProductsList!M29,\"AAAAAHp7b60=\")","v":{"$error":"#VALUE!"}},{"$f":"AND(ProductsList!N29,\"AAAAAHp7b64=\")","v":{"$error":"#VALUE!"}},{"$f":"AND(ProductsList!O29,\"AAAAAHp7b68=\")","v":{"$error":"#VALUE!"}},{"$f":"AND(ProductsList!P29,\"AAAAAHp7b7A=\")","v":{"$error":"#VALUE!"}},{"$f":"AND(ProductsList!Q29,\"AAAAAHp7b7E=\")","v":{"$error":"#VALUE!"}},{"$f":"AND(ProductsList!R29,\"AAAAAHp7b7I=\")","v":{"$error":"#VALUE!"}},{"$f":"AND(ProductsList!S29,\"AAAAAHp7b7M=\")","v":{"$error":"#VALUE!"}},{"$f":"AND(ProductsList!T29,\"AAAAAHp7b7Q=\")","v":{"$error":"#VALUE!"}},{"$f":"AND(ProductsList!U29,\"AAAAAHp7b7U=\")","v":{"$error":"#VALUE!"}},{"$f":"AND(ProductsList!V29,\"AAAAAHp7b7Y=\")","v":{"$error":"#VALUE!"}},{"$f":"AND(ProductsList!W29,\"AAAAAHp7b7c=\")","v":{"$error":"#VALUE!"}},{"$f":"IF(ProductsList!30:30,\"AAAAAHp7b7g=\",0)","v":0},{"$f":"AND(ProductsList!A30,\"AAAAAHp7b7k=\")","v":{"$error":"#VALUE!"}},{"$f":"AND(ProductsList!B30,\"AAAAAHp7b7o=\")","v":{"$error":"#VALUE!"}},{"$f":"AND(ProductsList!C30,\"AAAAAHp7b7s=\")","v":{"$error":"#VALUE!"}},{"$f":"AND(ProductsList!D30,\"AAAAAHp7b7w=\")","v":{"$error":"#VALUE!"}},{"$f":"AND(ProductsList!E30,\"AAAAAHp7b70=\")","v":{"$error":"#VALUE!"}},{"$f":"AND(ProductsList!F30,\"AAAAAHp7b74=\")","v":{"$error":"#VALUE!"}},{"$f":"AND(ProductsList!G30,\"AAAAAHp7b78=\")","v":{"$error":"#VALUE!"}},{"$f":"AND(ProductsList!H30,\"AAAAAHp7b8A=\")","v":{"$error":"#VALUE!"}},{"$f":"AND(ProductsList!I30,\"AAAAAHp7b8E=\")","v":{"$error":"#VALUE!"}},{"$f":"AND(ProductsList!J30,\"AAAAAHp7b8I=\")","v":{"$error":"#VALUE!"}},{"$f":"AND(ProductsList!K30,\"AAAAAHp7b8M=\")","v":{"$error":"#VALUE!"}},{"$f":"AND(ProductsList!L30,\"AAAAAHp7b8Q=\")","v":{"$error":"#VALUE!"}},{"$f":"AND(ProductsList!M30,\"AAAAAHp7b8U=\")","v":{"$error":"#VALUE!"}},{"$f":"AND(ProductsList!N30,\"AAAAAHp7b8Y=\")","v":{"$error":"#VALUE!"}},{"$f":"AND(ProductsList!O30,\"AAAAAHp7b8c=\")","v":{"$error":"#VALUE!"}},{"$f":"AND(ProductsList!P30,\"AAAAAHp7b8g=\")","v":{"$error":"#VALUE!"}},{"$f":"AND(ProductsList!Q30,\"AAAAAHp7b8k=\")","v":{"$error":"#VALUE!"}},{"$f":"AND(ProductsList!R30,\"AAAAAHp7b8o=\")","v":{"$error":"#VALUE!"}},{"$f":"AND(ProductsList!S30,\"AAAAAHp7b8s=\")","v":{"$error":"#VALUE!"}},{"$f":"AND(ProductsList!T30,\"AAAAAHp7b8w=\")","v":{"$error":"#VALUE!"}},{"$f":"AND(ProductsList!U30,\"AAAAAHp7b80=\")","v":{"$error":"#VALUE!"}},{"$f":"AND(ProductsList!V30,\"AAAAAHp7b84=\")","v":{"$error":"#VALUE!"}},{"$f":"AND(ProductsList!W30,\"AAAAAHp7b88=\")","v":{"$error":"#VALUE!"}},{"$f":"IF(ProductsList!31:31,\"AAAAAHp7b9A=\",0)","v":0},{"$f":"AND(ProductsList!A31,\"AAAAAHp7b9E=\")","v":{"$error":"#VALUE!"}},{"$f":"AND(ProductsList!B31,\"AAAAAHp7b9I=\")","v":{"$error":"#VALUE!"}},{"$f":"AND(ProductsList!C31,\"AAAAAHp7b9M=\")","v":{"$error":"#VALUE!"}},{"$f":"AND(ProductsList!D31,\"AAAAAHp7b9Q=\")","v":{"$error":"#VALUE!"}},{"$f":"AND(ProductsList!E31,\"AAAAAHp7b9U=\")","v":{"$error":"#VALUE!"}},{"$f":"AND(ProductsList!F31,\"AAAAAHp7b9Y=\")","v":{"$error":"#VALUE!"}},{"$f":"AND(ProductsList!G31,\"AAAAAHp7b9c=\")","v":{"$error":"#VALUE!"}},{"$f":"AND(ProductsList!H31,\"AAAAAHp7b9g=\")","v":{"$error":"#VALUE!"}},{"$f":"AND(ProductsList!I31,\"AAAAAHp7b9k=\")","v":{"$error":"#VALUE!"}},{"$f":"AND(ProductsList!J31,\"AAAAAHp7b9o=\")","v":{"$error":"#VALUE!"}},{"$f":"AND(ProductsList!K31,\"AAAAAHp7b9s=\")","v":{"$error":"#VALUE!"}},{"$f":"AND(ProductsList!L31,\"AAAAAHp7b9w=\")","v":{"$error":"#VALUE!"}},{"$f":"AND(ProductsList!M31,\"AAAAAHp7b90=\")","v":{"$error":"#VALUE!"}},{"$f":"AND(ProductsList!N31,\"AAAAAHp7b94=\")","v":{"$error":"#VALUE!"}},{"$f":"AND(ProductsList!O31,\"AAAAAHp7b98=\")","v":{"$error":"#VALUE!"}},{"$f":"AND(ProductsList!P31,\"AAAAAHp7b+A=\")","v":{"$error":"#VALUE!"}},{"$f":"AND(ProductsList!Q31,\"AAAAAHp7b+E=\")","v":{"$error":"#VALUE!"}},{"$f":"AND(ProductsList!R31,\"AAAAAHp7b+I=\")","v":{"$error":"#VALUE!"}},{"$f":"AND(ProductsList!S31,\"AAAAAHp7b+M=\")","v":{"$error":"#VALUE!"}},{"$f":"AND(ProductsList!T31,\"AAAAAHp7b+Q=\")","v":{"$error":"#VALUE!"}},{"$f":"AND(ProductsList!U31,\"AAAAAHp7b+U=\")","v":{"$error":"#VALUE!"}},{"$f":"AND(ProductsList!V31,\"AAAAAHp7b+Y=\")","v":{"$error":"#VALUE!"}},{"$f":"AND(ProductsList!W31,\"AAAAAHp7b+c=\")","v":{"$error":"#VALUE!"}},{"$f":"IF(ProductsList!32:32,\"AAAAAHp7b+g=\",0)","v":0},{"$f":"AND(ProductsList!A32,\"AAAAAHp7b+k=\")","v":{"$error":"#VALUE!"}},{"$f":"AND(ProductsList!B32,\"AAAAAHp7b+o=\")","v":{"$error":"#VALUE!"}},{"$f":"AND(ProductsList!C32,\"AAAAAHp7b+s=\")","v":{"$error":"#VALUE!"}},{"$f":"AND(ProductsList!D32,\"AAAAAHp7b+w=\")","v":{"$error":"#VALUE!"}},{"$f":"AND(ProductsList!E32,\"AAAAAHp7b+0=\")","v":{"$error":"#VALUE!"}},{"$f":"AND(ProductsList!F32,\"AAAAAHp7b+4=\")","v":{"$error":"#VALUE!"}},{"$f":"AND(ProductsList!G32,\"AAAAAHp7b+8=\")","v":{"$error":"#VALUE!"}},{"$f":"AND(ProductsList!H32,\"AAAAAHp7b/A=\")","v":{"$error":"#VALUE!"}},{"$f":"AND(ProductsList!I32,\"AAAAAHp7b/E=\")","v":{"$error":"#VALUE!"}},{"$f":"AND(ProductsList!J32,\"AAAAAHp7b/I=\")","v":{"$error":"#VALUE!"}},{"$f":"AND(ProductsList!K32,\"AAAAAHp7b/M=\")","v":{"$error":"#VALUE!"}},{"$f":"AND(ProductsList!L32,\"AAAAAHp7b/Q=\")","v":{"$error":"#VALUE!"}},{"$f":"AND(ProductsList!M32,\"AAAAAHp7b/U=\")","v":{"$error":"#VALUE!"}},{"$f":"AND(ProductsList!N32,\"AAAAAHp7b/Y=\")","v":{"$error":"#VALUE!"}},{"$f":"AND(ProductsList!O32,\"AAAAAHp7b/c=\")","v":{"$error":"#VALUE!"}},{"$f":"AND(ProductsList!P32,\"AAAAAHp7b/g=\")","v":{"$error":"#VALUE!"}},{"$f":"AND(ProductsList!Q32,\"AAAAAHp7b/k=\")","v":{"$error":"#VALUE!"}},{"$f":"AND(ProductsList!R32,\"AAAAAHp7b/o=\")","v":{"$error":"#VALUE!"}},{"$f":"AND(ProductsList!S32,\"AAAAAHp7b/s=\")","v":{"$error":"#VALUE!"}},{"$f":"AND(ProductsList!T32,\"AAAAAHp7b/w=\")","v":{"$error":"#VALUE!"}},{"$f":"AND(ProductsList!U32,\"AAAAAHp7b/0=\")","v":{"$error":"#VALUE!"}},{"$f":"AND(ProductsList!V32,\"AAAAAHp7b/4=\")","v":{"$error":"#VALUE!"}},{"$f":"AND(ProductsList!W32,\"AAAAAHp7b/8=\")","v":{"$error":"#VALUE!"}}]
[{"$f":"IF(ProductsList!33:33,\"AAAAAHRX7wA=\",0)","v":{"$error":"#VALUE!"}},{"$f":"AND(ProductsList!A33,\"AAAAAHRX7wE=\")","v":{"$error":"#VALUE!"}},{"$f":"AND(ProductsList!B33,\"AAAAAHRX7wI=\")","v":{"$error":"#VALUE!"}},{"$f":"AND(ProductsList!C33,\"AAAAAHRX7wM=\")","v":{"$error":"#VALUE!"}},{"$f":"AND(ProductsList!D33,\"AAAAAHRX7wQ=\")","v":{"$error":"#VALUE!"}},{"$f":"AND(ProductsList!E33,\"AAAAAHRX7wU=\")","v":{"$error":"#VALUE!"}},{"$f":"AND(ProductsList!F33,\"AAAAAHRX7wY=\")","v":{"$error":"#VALUE!"}},{"$f":"AND(ProductsList!G33,\"AAAAAHRX7wc=\")","v":{"$error":"#VALUE!"}},{"$f":"AND(ProductsList!H33,\"AAAAAHRX7wg=\")","v":{"$error":"#VALUE!"}},{"$f":"AND(ProductsList!I33,\"AAAAAHRX7wk=\")","v":{"$error":"#VALUE!"}},{"$f":"AND(ProductsList!J33,\"AAAAAHRX7wo=\")","v":{"$error":"#VALUE!"}},{"$f":"AND(ProductsList!K33,\"AAAAAHRX7ws=\")","v":{"$error":"#VALUE!"}},{"$f":"AND(ProductsList!L33,\"AAAAAHRX7ww=\")","v":{"$error":"#VALUE!"}},{"$f":"AND(ProductsList!M33,\"AAAAAHRX7w0=\")","v":{"$error":"#VALUE!"}},{"$f":"AND(ProductsList!N33,\"AAAAAHRX7w4=\")","v":{"$error":"#VALUE!"}},{"$f":"AND(ProductsList!O33,\"AAAAAHRX7w8=\")","v":{"$error":"#VALUE!"}},{"$f":"AND(ProductsList!P33,\"AAAAAHRX7xA=\")","v":{"$error":"#VALUE!"}},{"$f":"AND(ProductsList!Q33,\"AAAAAHRX7xE=\")","v":{"$error":"#VALUE!"}},{"$f":"AND(ProductsList!R33,\"AAAAAHRX7xI=\")","v":{"$error":"#VALUE!"}},{"$f":"AND(ProductsList!S33,\"AAAAAHRX7xM=\")","v":{"$error":"#VALUE!"}},{"$f":"AND(ProductsList!T33,\"AAAAAHRX7xQ=\")","v":{"$error":"#VALUE!"}},{"$f":"AND(ProductsList!U33,\"AAAAAHRX7xU=\")","v":{"$error":"#VALUE!"}},{"$f":"AND(ProductsList!V33,\"AAAAAHRX7xY=\")","v":{"$error":"#VALUE!"}},{"$f":"AND(ProductsList!W33,\"AAAAAHRX7xc=\")","v":{"$error":"#VALUE!"}},{"$f":"IF(ProductsList!34:34,\"AAAAAHRX7xg=\",0)","v":0},{"$f":"AND(ProductsList!A34,\"AAAAAHRX7xk=\")","v":{"$error":"#VALUE!"}},{"$f":"AND(ProductsList!B34,\"AAAAAHRX7xo=\")","v":{"$error":"#VALUE!"}},{"$f":"AND(ProductsList!C34,\"AAAAAHRX7xs=\")","v":{"$error":"#VALUE!"}},{"$f":"AND(ProductsList!D34,\"AAAAAHRX7xw=\")","v":{"$error":"#VALUE!"}},{"$f":"AND(ProductsList!E34,\"AAAAAHRX7x0=\")","v":{"$error":"#VALUE!"}},{"$f":"AND(ProductsList!F34,\"AAAAAHRX7x4=\")","v":{"$error":"#VALUE!"}},{"$f":"AND(ProductsList!G34,\"AAAAAHRX7x8=\")","v":{"$error":"#VALUE!"}},{"$f":"AND(ProductsList!H34,\"AAAAAHRX7yA=\")","v":{"$error":"#VALUE!"}},{"$f":"AND(ProductsList!I34,\"AAAAAHRX7yE=\")","v":{"$error":"#VALUE!"}},{"$f":"AND(ProductsList!J34,\"AAAAAHRX7yI=\")","v":{"$error":"#VALUE!"}},{"$f":"AND(ProductsList!K34,\"AAAAAHRX7yM=\")","v":{"$error":"#VALUE!"}},{"$f":"AND(ProductsList!L34,\"AAAAAHRX7yQ=\")","v":{"$error":"#VALUE!"}},{"$f":"AND(ProductsList!M34,\"AAAAAHRX7yU=\")","v":{"$error":"#VALUE!"}},{"$f":"AND(ProductsList!N34,\"AAAAAHRX7yY=\")","v":{"$error":"#VALUE!"}},{"$f":"AND(ProductsList!O34,\"AAAAAHRX7yc=\")","v":{"$error":"#VALUE!"}},{"$f":"AND(ProductsList!P34,\"AAAAAHRX7yg=\")","v":{"$error":"#VALUE!"}},{"$f":"AND(ProductsList!Q34,\"AAAAAHRX7yk=\")","v":{"$error":"#VALUE!"}},{"$f":"AND(ProductsList!R34,\"AAAAAHRX7yo=\")","v":{"$error":"#VALUE!"}},{"$f":"AND(ProductsList!S34,\"AAAAAHRX7ys=\")","v":{"$error":"#VALUE!"}},{"$f":"AND(ProductsList!T34,\"AAAAAHRX7yw=\")","v":{"$error":"#VALUE!"}},{"$f":"AND(ProductsList!U34,\"AAAAAHRX7y0=\")","v":{"$error":"#VALUE!"}},{"$f":"AND(ProductsList!V34,\"AAAAAHRX7y4=\")","v":{"$error":"#VALUE!"}},{"$f":"AND(ProductsList!W34,\"AAAAAHRX7y8=\")","v":{"$error":"#VALUE!"}},{"$f":"IF(ProductsList!35:35,\"AAAAAHRX7zA=\",0)","v":0},{"$f":"AND(ProductsList!A35,\"AAAAAHRX7zE=\")","v":{"$error":"#VALUE!"}},{"$f":"AND(ProductsList!B35,\"AAAAAHRX7zI=\")","v":{"$error":"#VALUE!"}},{"$f":"AND(ProductsList!C35,\"AAAAAHRX7zM=\")","v":{"$error":"#VALUE!"}},{"$f":"AND(ProductsList!D35,\"AAAAAHRX7zQ=\")","v":{"$error":"#VALUE!"}},{"$f":"AND(ProductsList!E35,\"AAAAAHRX7zU=\")","v":{"$error":"#VALUE!"}},{"$f":"AND(ProductsList!F35,\"AAAAAHRX7zY=\")","v":{"$error":"#VALUE!"}},{"$f":"AND(ProductsList!G35,\"AAAAAHRX7zc=\")","v":{"$error":"#VALUE!"}},{"$f":"AND(ProductsList!H35,\"AAAAAHRX7zg=\")","v":{"$error":"#VALUE!"}},{"$f":"AND(ProductsList!I35,\"AAAAAHRX7zk=\")","v":{"$error":"#VALUE!"}},{"$f":"AND(ProductsList!J35,\"AAAAAHRX7zo=\")","v":{"$error":"#VALUE!"}},{"$f":"AND(ProductsList!K35,\"AAAAAHRX7zs=\")","v":{"$error":"#VALUE!"}},{"$f":"AND(ProductsList!L35,\"AAAAAHRX7zw=\")","v":{"$error":"#VALUE!"}},{"$f":"AND(ProductsList!M35,\"AAAAAHRX7z0=\")","v":{"$error":"#VALUE!"}},{"$f":"AND(ProductsList!N35,\"AAAAAHRX7z4=\")","v":{"$error":"#VALUE!"}},{"$f":"AND(ProductsList!O35,\"AAAAAHRX7z8=\")","v":{"$error":"#VALUE!"}},{"$f":"AND(ProductsList!P35,\"AAAAAHRX70A=\")","v":{"$error":"#VALUE!"}},{"$f":"AND(ProductsList!Q35,\"AAAAAHRX70E=\")","v":{"$error":"#VALUE!"}},{"$f":"AND(ProductsList!R35,\"AAAAAHRX70I=\")","v":{"$error":"#VALUE!"}},{"$f":"AND(ProductsList!S35,\"AAAAAHRX70M=\")","v":{"$error":"#VALUE!"}},{"$f":"AND(ProductsList!T35,\"AAAAAHRX70Q=\")","v":{"$error":"#VALUE!"}},{"$f":"AND(ProductsList!U35,\"AAAAAHRX70U=\")","v":{"$error":"#VALUE!"}},{"$f":"AND(ProductsList!V35,\"AAAAAHRX70Y=\")","v":{"$error":"#VALUE!"}},{"$f":"AND(ProductsList!W35,\"AAAAAHRX70c=\")","v":{"$error":"#VALUE!"}},{"$f":"IF(ProductsList!36:36,\"AAAAAHRX70g=\",0)","v":0},{"$f":"AND(ProductsList!A36,\"AAAAAHRX70k=\")","v":{"$error":"#VALUE!"}},{"$f":"AND(ProductsList!B36,\"AAAAAHRX70o=\")","v":{"$error":"#VALUE!"}},{"$f":"AND(ProductsList!C36,\"AAAAAHRX70s=\")","v":{"$error":"#VALUE!"}},{"$f":"AND(ProductsList!D36,\"AAAAAHRX70w=\")","v":{"$error":"#VALUE!"}},{"$f":"AND(ProductsList!E36,\"AAAAAHRX700=\")","v":{"$error":"#VALUE!"}},{"$f":"AND(ProductsList!F36,\"AAAAAHRX704=\")","v":{"$error":"#VALUE!"}},{"$f":"AND(ProductsList!G36,\"AAAAAHRX708=\")","v":{"$error":"#VALUE!"}},{"$f":"AND(ProductsList!H36,\"AAAAAHRX71A=\")","v":{"$error":"#VALUE!"}},{"$f":"AND(ProductsList!I36,\"AAAAAHRX71E=\")","v":{"$error":"#VALUE!"}},{"$f":"AND(ProductsList!J36,\"AAAAAHRX71I=\")","v":{"$error":"#VALUE!"}},{"$f":"AND(ProductsList!K36,\"AAAAAHRX71M=\")","v":{"$error":"#VALUE!"}},{"$f":"AND(ProductsList!L36,\"AAAAAHRX71Q=\")","v":{"$error":"#VALUE!"}},{"$f":"AND(ProductsList!M36,\"AAAAAHRX71U=\")","v":{"$error":"#VALUE!"}},{"$f":"AND(ProductsList!N36,\"AAAAAHRX71Y=\")","v":{"$error":"#VALUE!"}},{"$f":"AND(ProductsList!O36,\"AAAAAHRX71c=\")","v":{"$error":"#VALUE!"}},{"$f":"AND(ProductsList!P36,\"AAAAAHRX71g=\")","v":{"$error":"#VALUE!"}},{"$f":"AND(ProductsList!Q36,\"AAAAAHRX71k=\")","v":{"$error":"#VALUE!"}},{"$f":"AND(ProductsList!R36,\"AAAAAHRX71o=\")","v":{"$error":"#VALUE!"}},{"$f":"AND(ProductsList!S36,\"AAAAAHRX71s=\")","v":{"$error":"#VALUE!"}},{"$f":"AND(ProductsList!T36,\"AAAAAHRX71w=\")","v":{"$error":"#VALUE!"}},{"$f":"AND(ProductsList!U36,\"AAAAAHRX710=\")","v":{"$error":"#VALUE!"}},{"$f":"AND(ProductsList!V36,\"AAAAAHRX714=\")","v":{"$error":"#VALUE!"}},{"$f":"AND(ProductsList!W36,\"AAAAAHRX718=\")","v":{"$error":"#VALUE!"}},{"$f":"IF(ProductsList!37:37,\"AAAAAHRX72A=\",0)","v":0},{"$f":"AND(ProductsList!A37,\"AAAAAHRX72E=\")","v":{"$error":"#VALUE!"}},{"$f":"AND(ProductsList!B37,\"AAAAAHRX72I=\")","v":{"$error":"#VALUE!"}},{"$f":"AND(ProductsList!C37,\"AAAAAHRX72M=\")","v":{"$error":"#VALUE!"}},{"$f":"AND(ProductsList!D37,\"AAAAAHRX72Q=\")","v":{"$error":"#VALUE!"}},{"$f":"AND(ProductsList!E37,\"AAAAAHRX72U=\")","v":{"$error":"#VALUE!"}},{"$f":"AND(ProductsList!F37,\"AAAAAHRX72Y=\")","v":{"$error":"#VALUE!"}},{"$f":"AND(ProductsList!G37,\"AAAAAHRX72c=\")","v":{"$error":"#VALUE!"}},{"$f":"AND(ProductsList!H37,\"AAAAAHRX72g=\")","v":{"$error":"#VALUE!"}},{"$f":"AND(ProductsList!I37,\"AAAAAHRX72k=\")","v":{"$error":"#VALUE!"}},{"$f":"AND(ProductsList!J37,\"AAAAAHRX72o=\")","v":{"$error":"#VALUE!"}},{"$f":"AND(ProductsList!K37,\"AAAAAHRX72s=\")","v":{"$error":"#VALUE!"}},{"$f":"AND(ProductsList!L37,\"AAAAAHRX72w=\")","v":{"$error":"#VALUE!"}},{"$f":"AND(ProductsList!M37,\"AAAAAHRX720=\")","v":{"$error":"#VALUE!"}},{"$f":"AND(ProductsList!N37,\"AAAAAHRX724=\")","v":{"$error":"#VALUE!"}},{"$f":"AND(ProductsList!O37,\"AAAAAHRX728=\")","v":{"$error":"#VALUE!"}},{"$f":"AND(ProductsList!P37,\"AAAAAHRX73A=\")","v":{"$error":"#VALUE!"}},{"$f":"AND(ProductsList!Q37,\"AAAAAHRX73E=\")","v":{"$error":"#VALUE!"}},{"$f":"AND(ProductsList!R37,\"AAAAAHRX73I=\")","v":{"$error":"#VALUE!"}},{"$f":"AND(ProductsList!S37,\"AAAAAHRX73M=\")","v":{"$error":"#VALUE!"}},{"$f":"AND(ProductsList!T37,\"AAAAAHRX73Q=\")","v":{"$error":"#VALUE!"}},{"$f":"AND(ProductsList!U37,\"AAAAAHRX73U=\")","v":{"$error":"#VALUE!"}},{"$f":"AND(ProductsList!V37,\"AAAAAHRX73Y=\")","v":{"$error":"#VALUE!"}},{"$f":"AND(ProductsList!W37,\"AAAAAHRX73c=\")","v":{"$error":"#VALUE!"}},{"$f":"IF(ProductsList!38:38,\"AAAAAHRX73g=\",0)","v":0},{"$f":"AND(ProductsList!A38,\"AAAAAHRX73k=\")","v":{"$error":"#VALUE!"}},{"$f":"AND(ProductsList!B38,\"AAAAAHRX73o=\")","v":{"$error":"#VALUE!"}},{"$f":"AND(ProductsList!C38,\"AAAAAHRX73s=\")","v":{"$error":"#VALUE!"}},{"$f":"AND(ProductsList!D38,\"AAAAAHRX73w=\")","v":{"$error":"#VALUE!"}},{"$f":"AND(ProductsList!E38,\"AAAAAHRX730=\")","v":{"$error":"#VALUE!"}},{"$f":"AND(ProductsList!F38,\"AAAAAHRX734=\")","v":{"$error":"#VALUE!"}},{"$f":"AND(ProductsList!G38,\"AAAAAHRX738=\")","v":{"$error":"#VALUE!"}},{"$f":"AND(ProductsList!H38,\"AAAAAHRX74A=\")","v":{"$error":"#VALUE!"}},{"$f":"AND(ProductsList!I38,\"AAAAAHRX74E=\")","v":{"$error":"#VALUE!"}},{"$f":"AND(ProductsList!J38,\"AAAAAHRX74I=\")","v":{"$error":"#VALUE!"}},{"$f":"AND(ProductsList!K38,\"AAAAAHRX74M=\")","v":{"$error":"#VALUE!"}},{"$f":"AND(ProductsList!L38,\"AAAAAHRX74Q=\")","v":{"$error":"#VALUE!"}},{"$f":"AND(ProductsList!M38,\"AAAAAHRX74U=\")","v":{"$error":"#VALUE!"}},{"$f":"AND(ProductsList!N38,\"AAAAAHRX74Y=\")","v":{"$error":"#VALUE!"}},{"$f":"AND(ProductsList!O38,\"AAAAAHRX74c=\")","v":{"$error":"#VALUE!"}},{"$f":"AND(ProductsList!P38,\"AAAAAHRX74g=\")","v":{"$error":"#VALUE!"}},{"$f":"AND(ProductsList!Q38,\"AAAAAHRX74k=\")","v":{"$error":"#VALUE!"}},{"$f":"AND(ProductsList!R38,\"AAAAAHRX74o=\")","v":{"$error":"#VALUE!"}},{"$f":"AND(ProductsList!S38,\"AAAAAHRX74s=\")","v":{"$error":"#VALUE!"}},{"$f":"AND(ProductsList!T38,\"AAAAAHRX74w=\")","v":{"$error":"#VALUE!"}},{"$f":"AND(ProductsList!U38,\"AAAAAHRX740=\")","v":{"$error":"#VALUE!"}},{"$f":"AND(ProductsList!V38,\"AAAAAHRX744=\")","v":{"$error":"#VALUE!"}},{"$f":"AND(ProductsList!W38,\"AAAAAHRX748=\")","v":{"$error":"#VALUE!"}},{"$f":"IF(ProductsList!39:39,\"AAAAAHRX75A=\",0)","v":0},{"$f":"AND(ProductsList!A39,\"AAAAAHRX75E=\")","v":{"$error":"#VALUE!"}},{"$f":"AND(ProductsList!B39,\"AAAAAHRX75I=\")","v":{"$error":"#VALUE!"}},{"$f":"AND(ProductsList!C39,\"AAAAAHRX75M=\")","v":{"$error":"#VALUE!"}},{"$f":"AND(ProductsList!D39,\"AAAAAHRX75Q=\")","v":{"$error":"#VALUE!"}},{"$f":"AND(ProductsList!E39,\"AAAAAHRX75U=\")","v":{"$error":"#VALUE!"}},{"$f":"AND(ProductsList!F39,\"AAAAAHRX75Y=\")","v":{"$error":"#VALUE!"}},{"$f":"AND(ProductsList!G39,\"AAAAAHRX75c=\")","v":{"$error":"#VALUE!"}},{"$f":"AND(ProductsList!H39,\"AAAAAHRX75g=\")","v":{"$error":"#VALUE!"}},{"$f":"AND(ProductsList!I39,\"AAAAAHRX75k=\")","v":{"$error":"#VALUE!"}},{"$f":"AND(ProductsList!J39,\"AAAAAHRX75o=\")","v":{"$error":"#VALUE!"}},{"$f":"AND(ProductsList!K39,\"AAAAAHRX75s=\")","v":{"$error":"#VALUE!"}},{"$f":"AND(ProductsList!L39,\"AAAAAHRX75w=\")","v":{"$error":"#VALUE!"}},{"$f":"AND(ProductsList!M39,\"AAAAAHRX750=\")","v":{"$error":"#VALUE!"}},{"$f":"AND(ProductsList!N39,\"AAAAAHRX754=\")","v":{"$error":"#VALUE!"}},{"$f":"AND(ProductsList!O39,\"AAAAAHRX758=\")","v":{"$error":"#VALUE!"}},{"$f":"AND(ProductsList!P39,\"AAAAAHRX76A=\")","v":{"$error":"#VALUE!"}},{"$f":"AND(ProductsList!Q39,\"AAAAAHRX76E=\")","v":{"$error":"#VALUE!"}},{"$f":"AND(ProductsList!R39,\"AAAAAHRX76I=\")","v":{"$error":"#VALUE!"}},{"$f":"AND(ProductsList!S39,\"AAAAAHRX76M=\")","v":{"$error":"#VALUE!"}},{"$f":"AND(ProductsList!T39,\"AAAAAHRX76Q=\")","v":{"$error":"#VALUE!"}},{"$f":"AND(ProductsList!U39,\"AAAAAHRX76U=\")","v":{"$error":"#VALUE!"}},{"$f":"AND(ProductsList!V39,\"AAAAAHRX76Y=\")","v":{"$error":"#VALUE!"}},{"$f":"AND(ProductsList!W39,\"AAAAAHRX76c=\")","v":{"$error":"#VALUE!"}},{"$f":"IF(ProductsList!40:40,\"AAAAAHRX76g=\",0)","v":0},{"$f":"AND(ProductsList!A40,\"AAAAAHRX76k=\")","v":{"$error":"#VALUE!"}},{"$f":"AND(ProductsList!B40,\"AAAAAHRX76o=\")","v":{"$error":"#VALUE!"}},{"$f":"AND(ProductsList!C40,\"AAAAAHRX76s=\")","v":{"$error":"#VALUE!"}},{"$f":"AND(ProductsList!D40,\"AAAAAHRX76w=\")","v":{"$error":"#VALUE!"}},{"$f":"AND(ProductsList!E40,\"AAAAAHRX760=\")","v":{"$error":"#VALUE!"}},{"$f":"AND(ProductsList!F40,\"AAAAAHRX764=\")","v":{"$error":"#VALUE!"}},{"$f":"AND(ProductsList!G40,\"AAAAAHRX768=\")","v":{"$error":"#VALUE!"}},{"$f":"AND(ProductsList!H40,\"AAAAAHRX77A=\")","v":{"$error":"#VALUE!"}},{"$f":"AND(ProductsList!I40,\"AAAAAHRX77E=\")","v":{"$error":"#VALUE!"}},{"$f":"AND(ProductsList!J40,\"AAAAAHRX77I=\")","v":{"$error":"#VALUE!"}},{"$f":"AND(ProductsList!K40,\"AAAAAHRX77M=\")","v":{"$error":"#VALUE!"}},{"$f":"AND(ProductsList!L40,\"AAAAAHRX77Q=\")","v":{"$error":"#VALUE!"}},{"$f":"AND(ProductsList!M40,\"AAAAAHRX77U=\")","v":{"$error":"#VALUE!"}},{"$f":"AND(ProductsList!N40,\"AAAAAHRX77Y=\")","v":{"$error":"#VALUE!"}},{"$f":"AND(ProductsList!O40,\"AAAAAHRX77c=\")","v":{"$error":"#VALUE!"}},{"$f":"AND(ProductsList!P40,\"AAAAAHRX77g=\")","v":{"$error":"#VALUE!"}},{"$f":"AND(ProductsList!Q40,\"AAAAAHRX77k=\")","v":{"$error":"#VALUE!"}},{"$f":"AND(ProductsList!R40,\"AAAAAHRX77o=\")","v":{"$error":"#VALUE!"}},{"$f":"AND(ProductsList!S40,\"AAAAAHRX77s=\")","v":{"$error":"#VALUE!"}},{"$f":"AND(ProductsList!T40,\"AAAAAHRX77w=\")","v":{"$error":"#VALUE!"}},{"$f":"AND(ProductsList!U40,\"AAAAAHRX770=\")","v":{"$error":"#VALUE!"}},{"$f":"AND(ProductsList!V40,\"AAAAAHRX774=\")","v":{"$error":"#VALUE!"}},{"$f":"AND(ProductsList!W40,\"AAAAAHRX778=\")","v":{"$error":"#VALUE!"}},{"$f":"IF(ProductsList!41:41,\"AAAAAHRX78A=\",0)","v":0},{"$f":"AND(ProductsList!A41,\"AAAAAHRX78E=\")","v":{"$error":"#VALUE!"}},{"$f":"AND(ProductsList!B41,\"AAAAAHRX78I=\")","v":{"$error":"#VALUE!"}},{"$f":"AND(ProductsList!C41,\"AAAAAHRX78M=\")","v":{"$error":"#VALUE!"}},{"$f":"AND(ProductsList!D41,\"AAAAAHRX78Q=\")","v":{"$error":"#VALUE!"}},{"$f":"AND(ProductsList!E41,\"AAAAAHRX78U=\")","v":{"$error":"#VALUE!"}},{"$f":"AND(ProductsList!F41,\"AAAAAHRX78Y=\")","v":{"$error":"#VALUE!"}},{"$f":"AND(ProductsList!G41,\"AAAAAHRX78c=\")","v":{"$error":"#VALUE!"}},{"$f":"AND(ProductsList!H41,\"AAAAAHRX78g=\")","v":{"$error":"#VALUE!"}},{"$f":"AND(ProductsList!I41,\"AAAAAHRX78k=\")","v":{"$error":"#VALUE!"}},{"$f":"AND(ProductsList!J41,\"AAAAAHRX78o=\")","v":{"$error":"#VALUE!"}},{"$f":"AND(ProductsList!K41,\"AAAAAHRX78s=\")","v":{"$error":"#VALUE!"}},{"$f":"AND(ProductsList!L41,\"AAAAAHRX78w=\")","v":{"$error":"#VALUE!"}},{"$f":"AND(ProductsList!M41,\"AAAAAHRX780=\")","v":{"$error":"#VALUE!"}},{"$f":"AND(ProductsList!N41,\"AAAAAHRX784=\")","v":{"$error":"#VALUE!"}},{"$f":"AND(ProductsList!O41,\"AAAAAHRX788=\")","v":{"$error":"#VALUE!"}},{"$f":"AND(ProductsList!P41,\"AAAAAHRX79A=\")","v":{"$error":"#VALUE!"}},{"$f":"AND(ProductsList!Q41,\"AAAAAHRX79E=\")","v":{"$error":"#VALUE!"}},{"$f":"AND(ProductsList!R41,\"AAAAAHRX79I=\")","v":{"$error":"#VALUE!"}},{"$f":"AND(ProductsList!S41,\"AAAAAHRX79M=\")","v":{"$error":"#VALUE!"}},{"$f":"AND(ProductsList!T41,\"AAAAAHRX79Q=\")","v":{"$error":"#VALUE!"}},{"$f":"AND(ProductsList!U41,\"AAAAAHRX79U=\")","v":{"$error":"#VALUE!"}},{"$f":"AND(ProductsList!V41,\"AAAAAHRX79Y=\")","v":{"$error":"#VALUE!"}},{"$f":"AND(ProductsList!W41,\"AAAAAHRX79c=\")","v":{"$error":"#VALUE!"}},{"$f":"IF(ProductsList!42:42,\"AAAAAHRX79g=\",0)","v":0},{"$f":"AND(ProductsList!A42,\"AAAAAHRX79k=\")","v":{"$error":"#VALUE!"}},{"$f":"AND(ProductsList!B42,\"AAAAAHRX79o=\")","v":{"$error":"#VALUE!"}},{"$f":"AND(ProductsList!C42,\"AAAAAHRX79s=\")","v":{"$error":"#VALUE!"}},{"$f":"AND(ProductsList!D42,\"AAAAAHRX79w=\")","v":{"$error":"#VALUE!"}},{"$f":"AND(ProductsList!E42,\"AAAAAHRX790=\")","v":{"$error":"#VALUE!"}},{"$f":"AND(ProductsList!F42,\"AAAAAHRX794=\")","v":{"$error":"#VALUE!"}},{"$f":"AND(ProductsList!G42,\"AAAAAHRX798=\")","v":{"$error":"#VALUE!"}},{"$f":"AND(ProductsList!H42,\"AAAAAHRX7+A=\")","v":{"$error":"#VALUE!"}},{"$f":"AND(ProductsList!I42,\"AAAAAHRX7+E=\")","v":{"$error":"#VALUE!"}},{"$f":"AND(ProductsList!J42,\"AAAAAHRX7+I=\")","v":{"$error":"#VALUE!"}},{"$f":"AND(ProductsList!K42,\"AAAAAHRX7+M=\")","v":{"$error":"#VALUE!"}},{"$f":"AND(ProductsList!L42,\"AAAAAHRX7+Q=\")","v":{"$error":"#VALUE!"}},{"$f":"AND(ProductsList!M42,\"AAAAAHRX7+U=\")","v":{"$error":"#VALUE!"}},{"$f":"AND(ProductsList!N42,\"AAAAAHRX7+Y=\")","v":{"$error":"#VALUE!"}},{"$f":"AND(ProductsList!O42,\"AAAAAHRX7+c=\")","v":{"$error":"#VALUE!"}},{"$f":"AND(ProductsList!P42,\"AAAAAHRX7+g=\")","v":{"$error":"#VALUE!"}},{"$f":"AND(ProductsList!Q42,\"AAAAAHRX7+k=\")","v":{"$error":"#VALUE!"}},{"$f":"AND(ProductsList!R42,\"AAAAAHRX7+o=\")","v":{"$error":"#VALUE!"}},{"$f":"AND(ProductsList!S42,\"AAAAAHRX7+s=\")","v":{"$error":"#VALUE!"}},{"$f":"AND(ProductsList!T42,\"AAAAAHRX7+w=\")","v":{"$error":"#VALUE!"}},{"$f":"AND(ProductsList!U42,\"AAAAAHRX7+0=\")","v":{"$error":"#VALUE!"}},{"$f":"AND(ProductsList!V42,\"AAAAAHRX7+4=\")","v":{"$error":"#VALUE!"}},{"$f":"AND(ProductsList!W42,\"AAAAAHRX7+8=\")","v":{"$error":"#VALUE!"}},{"$f":"IF(ProductsList!43:43,\"AAAAAHRX7/A=\",0)","v":0},{"$f":"AND(ProductsList!A43,\"AAAAAHRX7/E=\")","v":{"$error":"#VALUE!"}},{"$f":"AND(ProductsList!B43,\"AAAAAHRX7/I=\")","v":{"$error":"#VALUE!"}},{"$f":"AND(ProductsList!C43,\"AAAAAHRX7/M=\")","v":{"$error":"#VALUE!"}},{"$f":"AND(ProductsList!D43,\"AAAAAHRX7/Q=\")","v":{"$error":"#VALUE!"}},{"$f":"AND(ProductsList!E43,\"AAAAAHRX7/U=\")","v":{"$error":"#VALUE!"}},{"$f":"AND(ProductsList!F43,\"AAAAAHRX7/Y=\")","v":{"$error":"#VALUE!"}},{"$f":"AND(ProductsList!G43,\"AAAAAHRX7/c=\")","v":{"$error":"#VALUE!"}},{"$f":"AND(ProductsList!H43,\"AAAAAHRX7/g=\")","v":{"$error":"#VALUE!"}},{"$f":"AND(ProductsList!I43,\"AAAAAHRX7/k=\")","v":{"$error":"#VALUE!"}},{"$f":"AND(ProductsList!J43,\"AAAAAHRX7/o=\")","v":{"$error":"#VALUE!"}},{"$f":"AND(ProductsList!K43,\"AAAAAHRX7/s=\")","v":{"$error":"#VALUE!"}},{"$f":"AND(ProductsList!L43,\"AAAAAHRX7/w=\")","v":{"$error":"#VALUE!"}},{"$f":"AND(ProductsList!M43,\"AAAAAHRX7/0=\")","v":{"$error":"#VALUE!"}},{"$f":"AND(ProductsList!N43,\"AAAAAHRX7/4=\")","v":{"$error":"#VALUE!"}},{"$f":"AND(ProductsList!O43,\"AAAAAHRX7/8=\")","v":{"$error":"#VALUE!"}}]
[{"$f":"AND(ProductsList!P43,\"AAAAAFf3XwA=\")","v":{"$error":"#VALUE!"}},{"$f":"AND(ProductsList!Q43,\"AAAAAFf3XwE=\")","v":{"$error":"#VALUE!"}},{"$f":"AND(ProductsList!R43,\"AAAAAFf3XwI=\")","v":{"$error":"#VALUE!"}},{"$f":"AND(ProductsList!S43,\"AAAAAFf3XwM=\")","v":{"$error":"#VALUE!"}},{"$f":"AND(ProductsList!T43,\"AAAAAFf3XwQ=\")","v":{"$error":"#VALUE!"}},{"$f":"AND(ProductsList!U43,\"AAAAAFf3XwU=\")","v":{"$error":"#VALUE!"}},{"$f":"AND(ProductsList!V43,\"AAAAAFf3XwY=\")","v":{"$error":"#VALUE!"}},{"$f":"AND(ProductsList!W43,\"AAAAAFf3Xwc=\")","v":{"$error":"#VALUE!"}},{"$f":"IF(ProductsList!44:44,\"AAAAAFf3Xwg=\",0)","v":0},{"$f":"AND(ProductsList!A44,\"AAAAAFf3Xwk=\")","v":{"$error":"#VALUE!"}},{"$f":"AND(ProductsList!B44,\"AAAAAFf3Xwo=\")","v":{"$error":"#VALUE!"}},{"$f":"AND(ProductsList!C44,\"AAAAAFf3Xws=\")","v":{"$error":"#VALUE!"}},{"$f":"AND(ProductsList!D44,\"AAAAAFf3Xww=\")","v":{"$error":"#VALUE!"}},{"$f":"AND(ProductsList!E44,\"AAAAAFf3Xw0=\")","v":{"$error":"#VALUE!"}},{"$f":"AND(ProductsList!F44,\"AAAAAFf3Xw4=\")","v":{"$error":"#VALUE!"}},{"$f":"AND(ProductsList!G44,\"AAAAAFf3Xw8=\")","v":{"$error":"#VALUE!"}},{"$f":"AND(ProductsList!H44,\"AAAAAFf3XxA=\")","v":{"$error":"#VALUE!"}},{"$f":"AND(ProductsList!I44,\"AAAAAFf3XxE=\")","v":{"$error":"#VALUE!"}},{"$f":"AND(ProductsList!J44,\"AAAAAFf3XxI=\")","v":{"$error":"#VALUE!"}},{"$f":"AND(ProductsList!K44,\"AAAAAFf3XxM=\")","v":{"$error":"#VALUE!"}},{"$f":"AND(ProductsList!L44,\"AAAAAFf3XxQ=\")","v":{"$error":"#VALUE!"}},{"$f":"AND(ProductsList!M44,\"AAAAAFf3XxU=\")","v":{"$error":"#VALUE!"}},{"$f":"AND(ProductsList!N44,\"AAAAAFf3XxY=\")","v":{"$error":"#VALUE!"}},{"$f":"AND(ProductsList!O44,\"AAAAAFf3Xxc=\")","v":{"$error":"#VALUE!"}},{"$f":"AND(ProductsList!P44,\"AAAAAFf3Xxg=\")","v":{"$error":"#VALUE!"}},{"$f":"AND(ProductsList!Q44,\"AAAAAFf3Xxk=\")","v":{"$error":"#VALUE!"}},{"$f":"AND(ProductsList!R44,\"AAAAAFf3Xxo=\")","v":{"$error":"#VALUE!"}},{"$f":"AND(ProductsList!S44,\"AAAAAFf3Xxs=\")","v":{"$error":"#VALUE!"}},{"$f":"AND(ProductsList!T44,\"AAAAAFf3Xxw=\")","v":{"$error":"#VALUE!"}},{"$f":"AND(ProductsList!U44,\"AAAAAFf3Xx0=\")","v":{"$error":"#VALUE!"}},{"$f":"AND(ProductsList!V44,\"AAAAAFf3Xx4=\")","v":{"$error":"#VALUE!"}},{"$f":"AND(ProductsList!W44,\"AAAAAFf3Xx8=\")","v":{"$error":"#VALUE!"}},{"$f":"IF(ProductsList!45:45,\"AAAAAFf3XyA=\",0)","v":0},{"$f":"AND(ProductsList!A45,\"AAAAAFf3XyE=\")","v":{"$error":"#VALUE!"}},{"$f":"AND(ProductsList!B45,\"AAAAAFf3XyI=\")","v":{"$error":"#VALUE!"}},{"$f":"AND(ProductsList!C45,\"AAAAAFf3XyM=\")","v":{"$error":"#VALUE!"}},{"$f":"AND(ProductsList!D45,\"AAAAAFf3XyQ=\")","v":{"$error":"#VALUE!"}},{"$f":"AND(ProductsList!E45,\"AAAAAFf3XyU=\")","v":{"$error":"#VALUE!"}},{"$f":"AND(ProductsList!F45,\"AAAAAFf3XyY=\")","v":{"$error":"#VALUE!"}},{"$f":"AND(ProductsList!G45,\"AAAAAFf3Xyc=\")","v":{"$error":"#VALUE!"}},{"$f":"AND(ProductsList!H45,\"AAAAAFf3Xyg=\")","v":{"$error":"#VALUE!"}},{"$f":"AND(ProductsList!I45,\"AAAAAFf3Xyk=\")","v":{"$error":"#VALUE!"}},{"$f":"AND(ProductsList!J45,\"AAAAAFf3Xyo=\")","v":{"$error":"#VALUE!"}},{"$f":"AND(ProductsList!K45,\"AAAAAFf3Xys=\")","v":{"$error":"#VALUE!"}},{"$f":"AND(ProductsList!L45,\"AAAAAFf3Xyw=\")","v":{"$error":"#VALUE!"}},{"$f":"AND(ProductsList!M45,\"AAAAAFf3Xy0=\")","v":{"$error":"#VALUE!"}},{"$f":"AND(ProductsList!N45,\"AAAAAFf3Xy4=\")","v":{"$error":"#VALUE!"}},{"$f":"AND(ProductsList!O45,\"AAAAAFf3Xy8=\")","v":{"$error":"#VALUE!"}},{"$f":"AND(ProductsList!P45,\"AAAAAFf3XzA=\")","v":{"$error":"#VALUE!"}},{"$f":"AND(ProductsList!Q45,\"AAAAAFf3XzE=\")","v":{"$error":"#VALUE!"}},{"$f":"AND(ProductsList!R45,\"AAAAAFf3XzI=\")","v":{"$error":"#VALUE!"}},{"$f":"AND(ProductsList!S45,\"AAAAAFf3XzM=\")","v":{"$error":"#VALUE!"}},{"$f":"AND(ProductsList!T45,\"AAAAAFf3XzQ=\")","v":{"$error":"#VALUE!"}},{"$f":"AND(ProductsList!U45,\"AAAAAFf3XzU=\")","v":{"$error":"#VALUE!"}},{"$f":"AND(ProductsList!V45,\"AAAAAFf3XzY=\")","v":{"$error":"#VALUE!"}},{"$f":"AND(ProductsList!W45,\"AAAAAFf3Xzc=\")","v":{"$error":"#VALUE!"}},{"$f":"IF(ProductsList!46:46,\"AAAAAFf3Xzg=\",0)","v":0},{"$f":"AND(ProductsList!A46,\"AAAAAFf3Xzk=\")","v":{"$error":"#VALUE!"}},{"$f":"AND(ProductsList!B46,\"AAAAAFf3Xzo=\")","v":{"$error":"#VALUE!"}},{"$f":"AND(ProductsList!C46,\"AAAAAFf3Xzs=\")","v":{"$error":"#VALUE!"}},{"$f":"AND(ProductsList!D46,\"AAAAAFf3Xzw=\")","v":{"$error":"#VALUE!"}},{"$f":"AND(ProductsList!E46,\"AAAAAFf3Xz0=\")","v":{"$error":"#VALUE!"}},{"$f":"AND(ProductsList!F46,\"AAAAAFf3Xz4=\")","v":{"$error":"#VALUE!"}},{"$f":"AND(ProductsList!G46,\"AAAAAFf3Xz8=\")","v":{"$error":"#VALUE!"}},{"$f":"AND(ProductsList!H46,\"AAAAAFf3X0A=\")","v":{"$error":"#VALUE!"}},{"$f":"AND(ProductsList!I46,\"AAAAAFf3X0E=\")","v":{"$error":"#VALUE!"}},{"$f":"AND(ProductsList!J46,\"AAAAAFf3X0I=\")","v":{"$error":"#VALUE!"}},{"$f":"AND(ProductsList!K46,\"AAAAAFf3X0M=\")","v":{"$error":"#VALUE!"}},{"$f":"AND(ProductsList!L46,\"AAAAAFf3X0Q=\")","v":{"$error":"#VALUE!"}},{"$f":"AND(ProductsList!M46,\"AAAAAFf3X0U=\")","v":{"$error":"#VALUE!"}},{"$f":"AND(ProductsList!N46,\"AAAAAFf3X0Y=\")","v":{"$error":"#VALUE!"}},{"$f":"AND(ProductsList!O46,\"AAAAAFf3X0c=\")","v":{"$error":"#VALUE!"}},{"$f":"AND(ProductsList!P46,\"AAAAAFf3X0g=\")","v":{"$error":"#VALUE!"}},{"$f":"AND(ProductsList!Q46,\"AAAAAFf3X0k=\")","v":{"$error":"#VALUE!"}},{"$f":"AND(ProductsList!R46,\"AAAAAFf3X0o=\")","v":{"$error":"#VALUE!"}},{"$f":"AND(ProductsList!S46,\"AAAAAFf3X0s=\")","v":{"$error":"#VALUE!"}},{"$f":"AND(ProductsList!T46,\"AAAAAFf3X0w=\")","v":{"$error":"#VALUE!"}},{"$f":"AND(ProductsList!U46,\"AAAAAFf3X00=\")","v":{"$error":"#VALUE!"}},{"$f":"AND(ProductsList!V46,\"AAAAAFf3X04=\")","v":{"$error":"#VALUE!"}},{"$f":"AND(ProductsList!W46,\"AAAAAFf3X08=\")","v":{"$error":"#VALUE!"}},{"$f":"IF(ProductsList!47:47,\"AAAAAFf3X1A=\",0)","v":0},{"$f":"AND(ProductsList!A47,\"AAAAAFf3X1E=\")","v":{"$error":"#VALUE!"}},{"$f":"AND(ProductsList!B47,\"AAAAAFf3X1I=\")","v":{"$error":"#VALUE!"}},{"$f":"AND(ProductsList!C47,\"AAAAAFf3X1M=\")","v":{"$error":"#VALUE!"}},{"$f":"AND(ProductsList!D47,\"AAAAAFf3X1Q=\")","v":{"$error":"#VALUE!"}},{"$f":"AND(ProductsList!E47,\"AAAAAFf3X1U=\")","v":{"$error":"#VALUE!"}},{"$f":"AND(ProductsList!F47,\"AAAAAFf3X1Y=\")","v":{"$error":"#VALUE!"}},{"$f":"AND(ProductsList!G47,\"AAAAAFf3X1c=\")","v":{"$error":"#VALUE!"}},{"$f":"AND(ProductsList!H47,\"AAAAAFf3X1g=\")","v":{"$error":"#VALUE!"}},{"$f":"AND(ProductsList!I47,\"AAAAAFf3X1k=\")","v":{"$error":"#VALUE!"}},{"$f":"AND(ProductsList!J47,\"AAAAAFf3X1o=\")","v":{"$error":"#VALUE!"}},{"$f":"AND(ProductsList!K47,\"AAAAAFf3X1s=\")","v":{"$error":"#VALUE!"}},{"$f":"AND(ProductsList!L47,\"AAAAAFf3X1w=\")","v":{"$error":"#VALUE!"}},{"$f":"AND(ProductsList!M47,\"AAAAAFf3X10=\")","v":{"$error":"#VALUE!"}},{"$f":"AND(ProductsList!N47,\"AAAAAFf3X14=\")","v":{"$error":"#VALUE!"}},{"$f":"AND(ProductsList!O47,\"AAAAAFf3X18=\")","v":{"$error":"#VALUE!"}},{"$f":"AND(ProductsList!P47,\"AAAAAFf3X2A=\")","v":{"$error":"#VALUE!"}},{"$f":"AND(ProductsList!Q47,\"AAAAAFf3X2E=\")","v":{"$error":"#VALUE!"}},{"$f":"AND(ProductsList!R47,\"AAAAAFf3X2I=\")","v":{"$error":"#VALUE!"}},{"$f":"AND(ProductsList!S47,\"AAAAAFf3X2M=\")","v":{"$error":"#VALUE!"}},{"$f":"AND(ProductsList!T47,\"AAAAAFf3X2Q=\")","v":{"$error":"#VALUE!"}},{"$f":"AND(ProductsList!U47,\"AAAAAFf3X2U=\")","v":{"$error":"#VALUE!"}},{"$f":"AND(ProductsList!V47,\"AAAAAFf3X2Y=\")","v":{"$error":"#VALUE!"}},{"$f":"AND(ProductsList!W47,\"AAAAAFf3X2c=\")","v":{"$error":"#VALUE!"}},{"$f":"IF(ProductsList!48:48,\"AAAAAFf3X2g=\",0)","v":0},{"$f":"AND(ProductsList!A48,\"AAAAAFf3X2k=\")","v":{"$error":"#VALUE!"}},{"$f":"AND(ProductsList!B48,\"AAAAAFf3X2o=\")","v":{"$error":"#VALUE!"}},{"$f":"AND(ProductsList!C48,\"AAAAAFf3X2s=\")","v":{"$error":"#VALUE!"}},{"$f":"AND(ProductsList!D48,\"AAAAAFf3X2w=\")","v":{"$error":"#VALUE!"}},{"$f":"AND(ProductsList!E48,\"AAAAAFf3X20=\")","v":{"$error":"#VALUE!"}},{"$f":"AND(ProductsList!F48,\"AAAAAFf3X24=\")","v":{"$error":"#VALUE!"}},{"$f":"AND(ProductsList!G48,\"AAAAAFf3X28=\")","v":{"$error":"#VALUE!"}},{"$f":"AND(ProductsList!H48,\"AAAAAFf3X3A=\")","v":{"$error":"#VALUE!"}},{"$f":"AND(ProductsList!I48,\"AAAAAFf3X3E=\")","v":{"$error":"#VALUE!"}},{"$f":"AND(ProductsList!J48,\"AAAAAFf3X3I=\")","v":{"$error":"#VALUE!"}},{"$f":"AND(ProductsList!K48,\"AAAAAFf3X3M=\")","v":{"$error":"#VALUE!"}},{"$f":"AND(ProductsList!L48,\"AAAAAFf3X3Q=\")","v":{"$error":"#VALUE!"}},{"$f":"AND(ProductsList!M48,\"AAAAAFf3X3U=\")","v":{"$error":"#VALUE!"}},{"$f":"AND(ProductsList!N48,\"AAAAAFf3X3Y=\")","v":{"$error":"#VALUE!"}},{"$f":"AND(ProductsList!O48,\"AAAAAFf3X3c=\")","v":{"$error":"#VALUE!"}},{"$f":"AND(ProductsList!P48,\"AAAAAFf3X3g=\")","v":{"$error":"#VALUE!"}},{"$f":"AND(ProductsList!Q48,\"AAAAAFf3X3k=\")","v":{"$error":"#VALUE!"}},{"$f":"AND(ProductsList!R48,\"AAAAAFf3X3o=\")","v":{"$error":"#VALUE!"}},{"$f":"AND(ProductsList!S48,\"AAAAAFf3X3s=\")","v":{"$error":"#VALUE!"}},{"$f":"AND(ProductsList!T48,\"AAAAAFf3X3w=\")","v":{"$error":"#VALUE!"}},{"$f":"AND(ProductsList!U48,\"AAAAAFf3X30=\")","v":{"$error":"#VALUE!"}},{"$f":"AND(ProductsList!V48,\"AAAAAFf3X34=\")","v":{"$error":"#VALUE!"}},{"$f":"AND(ProductsList!W48,\"AAAAAFf3X38=\")","v":{"$error":"#VALUE!"}},{"$f":"IF(ProductsList!49:49,\"AAAAAFf3X4A=\",0)","v":0},{"$f":"AND(ProductsList!A49,\"AAAAAFf3X4E=\")","v":{"$error":"#VALUE!"}},{"$f":"AND(ProductsList!B49,\"AAAAAFf3X4I=\")","v":{"$error":"#VALUE!"}},{"$f":"AND(ProductsList!C49,\"AAAAAFf3X4M=\")","v":{"$error":"#VALUE!"}},{"$f":"AND(ProductsList!D49,\"AAAAAFf3X4Q=\")","v":{"$error":"#VALUE!"}},{"$f":"AND(ProductsList!E49,\"AAAAAFf3X4U=\")","v":{"$error":"#VALUE!"}},{"$f":"AND(ProductsList!F49,\"AAAAAFf3X4Y=\")","v":{"$error":"#VALUE!"}},{"$f":"AND(ProductsList!G49,\"AAAAAFf3X4c=\")","v":{"$error":"#VALUE!"}},{"$f":"AND(ProductsList!H49,\"AAAAAFf3X4g=\")","v":{"$error":"#VALUE!"}},{"$f":"AND(ProductsList!I49,\"AAAAAFf3X4k=\")","v":{"$error":"#VALUE!"}},{"$f":"AND(ProductsList!J49,\"AAAAAFf3X4o=\")","v":{"$error":"#VALUE!"}},{"$f":"AND(ProductsList!K49,\"AAAAAFf3X4s=\")","v":{"$error":"#VALUE!"}},{"$f":"AND(ProductsList!L49,\"AAAAAFf3X4w=\")","v":{"$error":"#VALUE!"}},{"$f":"AND(ProductsList!M49,\"AAAAAFf3X40=\")","v":{"$error":"#VALUE!"}},{"$f":"AND(ProductsList!N49,\"AAAAAFf3X44=\")","v":{"$error":"#VALUE!"}},{"$f":"AND(ProductsList!O49,\"AAAAAFf3X48=\")","v":{"$error":"#VALUE!"}},{"$f":"AND(ProductsList!P49,\"AAAAAFf3X5A=\")","v":{"$error":"#VALUE!"}},{"$f":"AND(ProductsList!Q49,\"AAAAAFf3X5E=\")","v":{"$error":"#VALUE!"}},{"$f":"AND(ProductsList!R49,\"AAAAAFf3X5I=\")","v":{"$error":"#VALUE!"}},{"$f":"AND(ProductsList!S49,\"AAAAAFf3X5M=\")","v":{"$error":"#VALUE!"}},{"$f":"AND(ProductsList!T49,\"AAAAAFf3X5Q=\")","v":{"$error":"#VALUE!"}},{"$f":"AND(ProductsList!U49,\"AAAAAFf3X5U=\")","v":{"$error":"#VALUE!"}},{"$f":"AND(ProductsList!V49,\"AAAAAFf3X5Y=\")","v":{"$error":"#VALUE!"}},{"$f":"AND(ProductsList!W49,\"AAAAAFf3X5c=\")","v":{"$error":"#VALUE!"}},{"$f":"IF(ProductsList!50:50,\"AAAAAFf3X5g=\",0)","v":0},{"$f":"AND(ProductsList!A50,\"AAAAAFf3X5k=\")","v":{"$error":"#VALUE!"}},{"$f":"AND(ProductsList!B50,\"AAAAAFf3X5o=\")","v":{"$error":"#VALUE!"}},{"$f":"AND(ProductsList!C50,\"AAAAAFf3X5s=\")","v":{"$error":"#VALUE!"}},{"$f":"AND(ProductsList!D50,\"AAAAAFf3X5w=\")","v":{"$error":"#VALUE!"}},{"$f":"AND(ProductsList!E50,\"AAAAAFf3X50=\")","v":{"$error":"#VALUE!"}},{"$f":"AND(ProductsList!F50,\"AAAAAFf3X54=\")","v":{"$error":"#VALUE!"}},{"$f":"AND(ProductsList!G50,\"AAAAAFf3X58=\")","v":{"$error":"#VALUE!"}},{"$f":"AND(ProductsList!H50,\"AAAAAFf3X6A=\")","v":{"$error":"#VALUE!"}},{"$f":"AND(ProductsList!I50,\"AAAAAFf3X6E=\")","v":{"$error":"#VALUE!"}},{"$f":"AND(ProductsList!J50,\"AAAAAFf3X6I=\")","v":{"$error":"#VALUE!"}},{"$f":"AND(ProductsList!K50,\"AAAAAFf3X6M=\")","v":{"$error":"#VALUE!"}},{"$f":"AND(ProductsList!L50,\"AAAAAFf3X6Q=\")","v":{"$error":"#VALUE!"}},{"$f":"AND(ProductsList!M50,\"AAAAAFf3X6U=\")","v":{"$error":"#VALUE!"}},{"$f":"AND(ProductsList!N50,\"AAAAAFf3X6Y=\")","v":{"$error":"#VALUE!"}},{"$f":"AND(ProductsList!O50,\"AAAAAFf3X6c=\")","v":{"$error":"#VALUE!"}},{"$f":"AND(ProductsList!P50,\"AAAAAFf3X6g=\")","v":{"$error":"#VALUE!"}},{"$f":"AND(ProductsList!Q50,\"AAAAAFf3X6k=\")","v":{"$error":"#VALUE!"}},{"$f":"AND(ProductsList!R50,\"AAAAAFf3X6o=\")","v":{"$error":"#VALUE!"}},{"$f":"AND(ProductsList!S50,\"AAAAAFf3X6s=\")","v":{"$error":"#VALUE!"}},{"$f":"AND(ProductsList!T50,\"AAAAAFf3X6w=\")","v":{"$error":"#VALUE!"}},{"$f":"AND(ProductsList!U50,\"AAAAAFf3X60=\")","v":{"$error":"#VALUE!"}},{"$f":"AND(ProductsList!V50,\"AAAAAFf3X64=\")","v":{"$error":"#VALUE!"}},{"$f":"AND(ProductsList!W50,\"AAAAAFf3X68=\")","v":{"$error":"#VALUE!"}},{"$f":"IF(ProductsList!51:51,\"AAAAAFf3X7A=\",0)","v":0},{"$f":"AND(ProductsList!A51,\"AAAAAFf3X7E=\")","v":{"$error":"#VALUE!"}},{"$f":"AND(ProductsList!B51,\"AAAAAFf3X7I=\")","v":{"$error":"#VALUE!"}},{"$f":"AND(ProductsList!C51,\"AAAAAFf3X7M=\")","v":{"$error":"#VALUE!"}},{"$f":"AND(ProductsList!D51,\"AAAAAFf3X7Q=\")","v":{"$error":"#VALUE!"}},{"$f":"AND(ProductsList!E51,\"AAAAAFf3X7U=\")","v":{"$error":"#VALUE!"}},{"$f":"AND(ProductsList!F51,\"AAAAAFf3X7Y=\")","v":{"$error":"#VALUE!"}},{"$f":"AND(ProductsList!G51,\"AAAAAFf3X7c=\")","v":{"$error":"#VALUE!"}},{"$f":"AND(ProductsList!H51,\"AAAAAFf3X7g=\")","v":{"$error":"#VALUE!"}},{"$f":"AND(ProductsList!I51,\"AAAAAFf3X7k=\")","v":{"$error":"#VALUE!"}},{"$f":"AND(ProductsList!J51,\"AAAAAFf3X7o=\")","v":{"$error":"#VALUE!"}},{"$f":"AND(ProductsList!K51,\"AAAAAFf3X7s=\")","v":{"$error":"#VALUE!"}},{"$f":"AND(ProductsList!L51,\"AAAAAFf3X7w=\")","v":{"$error":"#VALUE!"}},{"$f":"AND(ProductsList!M51,\"AAAAAFf3X70=\")","v":{"$error":"#VALUE!"}},{"$f":"AND(ProductsList!N51,\"AAAAAFf3X74=\")","v":{"$error":"#VALUE!"}},{"$f":"AND(ProductsList!O51,\"AAAAAFf3X78=\")","v":{"$error":"#VALUE!"}},{"$f":"AND(ProductsList!P51,\"AAAAAFf3X8A=\")","v":{"$error":"#VALUE!"}},{"$f":"AND(ProductsList!Q51,\"AAAAAFf3X8E=\")","v":{"$error":"#VALUE!"}},{"$f":"AND(ProductsList!R51,\"AAAAAFf3X8I=\")","v":{"$error":"#VALUE!"}},{"$f":"AND(ProductsList!S51,\"AAAAAFf3X8M=\")","v":{"$error":"#VALUE!"}},{"$f":"AND(ProductsList!T51,\"AAAAAFf3X8Q=\")","v":{"$error":"#VALUE!"}},{"$f":"AND(ProductsList!U51,\"AAAAAFf3X8U=\")","v":{"$error":"#VALUE!"}},{"$f":"AND(ProductsList!V51,\"AAAAAFf3X8Y=\")","v":{"$error":"#VALUE!"}},{"$f":"AND(ProductsList!W51,\"AAAAAFf3X8c=\")","v":{"$error":"#VALUE!"}},{"$f":"IF(ProductsList!52:52,\"AAAAAFf3X8g=\",0)","v":0},{"$f":"AND(ProductsList!A52,\"AAAAAFf3X8k=\")","v":{"$error":"#VALUE!"}},{"$f":"AND(ProductsList!B52,\"AAAAAFf3X8o=\")","v":{"$error":"#VALUE!"}},{"$f":"AND(ProductsList!C52,\"AAAAAFf3X8s=\")","v":{"$error":"#VALUE!"}},{"$f":"AND(ProductsList!D52,\"AAAAAFf3X8w=\")","v":{"$error":"#VALUE!"}},{"$f":"AND(ProductsList!E52,\"AAAAAFf3X80=\")","v":{"$error":"#VALUE!"}},{"$f":"AND(ProductsList!F52,\"AAAAAFf3X84=\")","v":{"$error":"#VALUE!"}},{"$f":"AND(ProductsList!G52,\"AAAAAFf3X88=\")","v":{"$error":"#VALUE!"}},{"$f":"AND(ProductsList!H52,\"AAAAAFf3X9A=\")","v":{"$error":"#VALUE!"}},{"$f":"AND(ProductsList!I52,\"AAAAAFf3X9E=\")","v":{"$error":"#VALUE!"}},{"$f":"AND(ProductsList!J52,\"AAAAAFf3X9I=\")","v":{"$error":"#VALUE!"}},{"$f":"AND(ProductsList!K52,\"AAAAAFf3X9M=\")","v":{"$error":"#VALUE!"}},{"$f":"AND(ProductsList!L52,\"AAAAAFf3X9Q=\")","v":{"$error":"#VALUE!"}},{"$f":"AND(ProductsList!M52,\"AAAAAFf3X9U=\")","v":{"$error":"#VALUE!"}},{"$f":"AND(ProductsList!N52,\"AAAAAFf3X9Y=\")","v":{"$error":"#VALUE!"}},{"$f":"AND(ProductsList!O52,\"AAAAAFf3X9c=\")","v":{"$error":"#VALUE!"}},{"$f":"AND(ProductsList!P52,\"AAAAAFf3X9g=\")","v":{"$error":"#VALUE!"}},{"$f":"AND(ProductsList!Q52,\"AAAAAFf3X9k=\")","v":{"$error":"#VALUE!"}},{"$f":"AND(ProductsList!R52,\"AAAAAFf3X9o=\")","v":{"$error":"#VALUE!"}},{"$f":"AND(ProductsList!S52,\"AAAAAFf3X9s=\")","v":{"$error":"#VALUE!"}},{"$f":"AND(ProductsList!T52,\"AAAAAFf3X9w=\")","v":{"$error":"#VALUE!"}},{"$f":"AND(ProductsList!U52,\"AAAAAFf3X90=\")","v":{"$error":"#VALUE!"}},{"$f":"AND(ProductsList!V52,\"AAAAAFf3X94=\")","v":{"$error":"#VALUE!"}},{"$f":"AND(ProductsList!W52,\"AAAAAFf3X98=\")","v":{"$error":"#VALUE!"}},{"$f":"IF(ProductsList!53:53,\"AAAAAFf3X+A=\",0)","v":0},{"$f":"AND(ProductsList!A53,\"AAAAAFf3X+E=\")","v":{"$error":"#VALUE!"}},{"$f":"AND(ProductsList!B53,\"AAAAAFf3X+I=\")","v":{"$error":"#VALUE!"}},{"$f":"AND(ProductsList!C53,\"AAAAAFf3X+M=\")","v":{"$error":"#VALUE!"}},{"$f":"AND(ProductsList!D53,\"AAAAAFf3X+Q=\")","v":{"$error":"#VALUE!"}},{"$f":"AND(ProductsList!E53,\"AAAAAFf3X+U=\")","v":{"$error":"#VALUE!"}},{"$f":"AND(ProductsList!F53,\"AAAAAFf3X+Y=\")","v":{"$error":"#VALUE!"}},{"$f":"AND(ProductsList!G53,\"AAAAAFf3X+c=\")","v":{"$error":"#VALUE!"}},{"$f":"AND(ProductsList!H53,\"AAAAAFf3X+g=\")","v":{"$error":"#VALUE!"}},{"$f":"AND(ProductsList!I53,\"AAAAAFf3X+k=\")","v":{"$error":"#VALUE!"}},{"$f":"AND(ProductsList!J53,\"AAAAAFf3X+o=\")","v":{"$error":"#VALUE!"}},{"$f":"AND(ProductsList!K53,\"AAAAAFf3X+s=\")","v":{"$error":"#VALUE!"}},{"$f":"AND(ProductsList!L53,\"AAAAAFf3X+w=\")","v":{"$error":"#VALUE!"}},{"$f":"AND(ProductsList!M53,\"AAAAAFf3X+0=\")","v":{"$error":"#VALUE!"}},{"$f":"AND(ProductsList!N53,\"AAAAAFf3X+4=\")","v":{"$error":"#VALUE!"}},{"$f":"AND(ProductsList!O53,\"AAAAAFf3X+8=\")","v":{"$error":"#VALUE!"}},{"$f":"AND(ProductsList!P53,\"AAAAAFf3X/A=\")","v":{"$error":"#VALUE!"}},{"$f":"AND(ProductsList!Q53,\"AAAAAFf3X/E=\")","v":{"$error":"#VALUE!"}},{"$f":"AND(ProductsList!R53,\"AAAAAFf3X/I=\")","v":{"$error":"#VALUE!"}},{"$f":"AND(ProductsList!S53,\"AAAAAFf3X/M=\")","v":{"$error":"#VALUE!"}},{"$f":"AND(ProductsList!T53,\"AAAAAFf3X/Q=\")","v":{"$error":"#VALUE!"}},{"$f":"AND(ProductsList!U53,\"AAAAAFf3X/U=\")","v":{"$error":"#VALUE!"}},{"$f":"AND(ProductsList!V53,\"AAAAAFf3X/Y=\")","v":{"$error":"#VALUE!"}},{"$f":"AND(ProductsList!W53,\"AAAAAFf3X/c=\")","v":{"$error":"#VALUE!"}},{"$f":"IF(ProductsList!54:54,\"AAAAAFf3X/g=\",0)","v":0},{"$f":"AND(ProductsList!A54,\"AAAAAFf3X/k=\")","v":{"$error":"#VALUE!"}},{"$f":"AND(ProductsList!B54,\"AAAAAFf3X/o=\")","v":{"$error":"#VALUE!"}},{"$f":"AND(ProductsList!C54,\"AAAAAFf3X/s=\")","v":{"$error":"#VALUE!"}},{"$f":"AND(ProductsList!D54,\"AAAAAFf3X/w=\")","v":{"$error":"#VALUE!"}},{"$f":"AND(ProductsList!E54,\"AAAAAFf3X/0=\")","v":{"$error":"#VALUE!"}},{"$f":"AND(ProductsList!F54,\"AAAAAFf3X/4=\")","v":{"$error":"#VALUE!"}},{"$f":"AND(ProductsList!G54,\"AAAAAFf3X/8=\")","v":{"$error":"#VALUE!"}}]
[{"$f":"AND(ProductsList!H54,\"AAAAAHP6wwA=\")","v":{"$error":"#VALUE!"}},{"$f":"AND(ProductsList!I54,\"AAAAAHP6wwE=\")","v":{"$error":"#VALUE!"}},{"$f":"AND(ProductsList!J54,\"AAAAAHP6wwI=\")","v":{"$error":"#VALUE!"}},{"$f":"AND(ProductsList!K54,\"AAAAAHP6wwM=\")","v":{"$error":"#VALUE!"}},{"$f":"AND(ProductsList!L54,\"AAAAAHP6wwQ=\")","v":{"$error":"#VALUE!"}},{"$f":"AND(ProductsList!M54,\"AAAAAHP6wwU=\")","v":{"$error":"#VALUE!"}},{"$f":"AND(ProductsList!N54,\"AAAAAHP6wwY=\")","v":{"$error":"#VALUE!"}},{"$f":"AND(ProductsList!O54,\"AAAAAHP6wwc=\")","v":{"$error":"#VALUE!"}},{"$f":"AND(ProductsList!P54,\"AAAAAHP6wwg=\")","v":{"$error":"#VALUE!"}},{"$f":"AND(ProductsList!Q54,\"AAAAAHP6wwk=\")","v":{"$error":"#VALUE!"}},{"$f":"AND(ProductsList!R54,\"AAAAAHP6wwo=\")","v":{"$error":"#VALUE!"}},{"$f":"AND(ProductsList!S54,\"AAAAAHP6wws=\")","v":{"$error":"#VALUE!"}},{"$f":"AND(ProductsList!T54,\"AAAAAHP6www=\")","v":{"$error":"#VALUE!"}},{"$f":"AND(ProductsList!U54,\"AAAAAHP6ww0=\")","v":{"$error":"#VALUE!"}},{"$f":"AND(ProductsList!V54,\"AAAAAHP6ww4=\")","v":{"$error":"#VALUE!"}},{"$f":"AND(ProductsList!W54,\"AAAAAHP6ww8=\")","v":{"$error":"#VALUE!"}},{"$f":"IF(ProductsList!55:55,\"AAAAAHP6wxA=\",0)","v":0},{"$f":"AND(ProductsList!A55,\"AAAAAHP6wxE=\")","v":{"$error":"#VALUE!"}},{"$f":"AND(ProductsList!B55,\"AAAAAHP6wxI=\")","v":{"$error":"#VALUE!"}},{"$f":"AND(ProductsList!C55,\"AAAAAHP6wxM=\")","v":{"$error":"#VALUE!"}},{"$f":"AND(ProductsList!D55,\"AAAAAHP6wxQ=\")","v":{"$error":"#VALUE!"}},{"$f":"AND(ProductsList!E55,\"AAAAAHP6wxU=\")","v":{"$error":"#VALUE!"}},{"$f":"AND(ProductsList!F55,\"AAAAAHP6wxY=\")","v":{"$error":"#VALUE!"}},{"$f":"AND(ProductsList!G55,\"AAAAAHP6wxc=\")","v":{"$error":"#VALUE!"}},{"$f":"AND(ProductsList!H55,\"AAAAAHP6wxg=\")","v":{"$error":"#VALUE!"}},{"$f":"AND(ProductsList!I55,\"AAAAAHP6wxk=\")","v":{"$error":"#VALUE!"}},{"$f":"AND(ProductsList!J55,\"AAAAAHP6wxo=\")","v":{"$error":"#VALUE!"}},{"$f":"AND(ProductsList!K55,\"AAAAAHP6wxs=\")","v":{"$error":"#VALUE!"}},{"$f":"AND(ProductsList!L55,\"AAAAAHP6wxw=\")","v":{"$error":"#VALUE!"}},{"$f":"AND(ProductsList!M55,\"AAAAAHP6wx0=\")","v":{"$error":"#VALUE!"}},{"$f":"AND(ProductsList!N55,\"AAAAAHP6wx4=\")","v":{"$error":"#VALUE!"}},{"$f":"AND(ProductsList!O55,\"AAAAAHP6wx8=\")","v":{"$error":"#VALUE!"}},{"$f":"AND(ProductsList!P55,\"AAAAAHP6wyA=\")","v":{"$error":"#VALUE!"}},{"$f":"AND(ProductsList!Q55,\"AAAAAHP6wyE=\")","v":{"$error":"#VALUE!"}},{"$f":"AND(ProductsList!R55,\"AAAAAHP6wyI=\")","v":{"$error":"#VALUE!"}},{"$f":"AND(ProductsList!S55,\"AAAAAHP6wyM=\")","v":{"$error":"#VALUE!"}},{"$f":"AND(ProductsList!T55,\"AAAAAHP6wyQ=\")","v":{"$error":"#VALUE!"}},{"$f":"AND(ProductsList!U55,\"AAAAAHP6wyU=\")","v":{"$error":"#VALUE!"}},{"$f":"AND(ProductsList!V55,\"AAAAAHP6wyY=\")","v":{"$error":"#VALUE!"}},{"$f":"AND(ProductsList!W55,\"AAAAAHP6wyc=\")","v":{"$error":"#VALUE!"}},{"$f":"IF(ProductsList!56:56,\"AAAAAHP6wyg=\",0)","v":0},{"$f":"AND(ProductsList!A56,\"AAAAAHP6wyk=\")","v":{"$error":"#VALUE!"}},{"$f":"AND(ProductsList!B56,\"AAAAAHP6wyo=\")","v":{"$error":"#VALUE!"}},{"$f":"AND(ProductsList!C56,\"AAAAAHP6wys=\")","v":{"$error":"#VALUE!"}},{"$f":"AND(ProductsList!D56,\"AAAAAHP6wyw=\")","v":{"$error":"#VALUE!"}},{"$f":"AND(ProductsList!E56,\"AAAAAHP6wy0=\")","v":{"$error":"#VALUE!"}},{"$f":"AND(ProductsList!F56,\"AAAAAHP6wy4=\")","v":{"$error":"#VALUE!"}},{"$f":"AND(ProductsList!G56,\"AAAAAHP6wy8=\")","v":{"$error":"#VALUE!"}},{"$f":"AND(ProductsList!H56,\"AAAAAHP6wzA=\")","v":{"$error":"#VALUE!"}},{"$f":"AND(ProductsList!I56,\"AAAAAHP6wzE=\")","v":{"$error":"#VALUE!"}},{"$f":"AND(ProductsList!J56,\"AAAAAHP6wzI=\")","v":{"$error":"#VALUE!"}},{"$f":"AND(ProductsList!K56,\"AAAAAHP6wzM=\")","v":{"$error":"#VALUE!"}},{"$f":"AND(ProductsList!L56,\"AAAAAHP6wzQ=\")","v":{"$error":"#VALUE!"}},{"$f":"AND(ProductsList!M56,\"AAAAAHP6wzU=\")","v":{"$error":"#VALUE!"}},{"$f":"AND(ProductsList!N56,\"AAAAAHP6wzY=\")","v":{"$error":"#VALUE!"}},{"$f":"AND(ProductsList!O56,\"AAAAAHP6wzc=\")","v":{"$error":"#VALUE!"}},{"$f":"AND(ProductsList!P56,\"AAAAAHP6wzg=\")","v":{"$error":"#VALUE!"}},{"$f":"AND(ProductsList!Q56,\"AAAAAHP6wzk=\")","v":{"$error":"#VALUE!"}},{"$f":"AND(ProductsList!R56,\"AAAAAHP6wzo=\")","v":{"$error":"#VALUE!"}},{"$f":"AND(ProductsList!S56,\"AAAAAHP6wzs=\")","v":{"$error":"#VALUE!"}},{"$f":"AND(ProductsList!T56,\"AAAAAHP6wzw=\")","v":{"$error":"#VALUE!"}},{"$f":"AND(ProductsList!U56,\"AAAAAHP6wz0=\")","v":{"$error":"#VALUE!"}},{"$f":"AND(ProductsList!V56,\"AAAAAHP6wz4=\")","v":{"$error":"#VALUE!"}},{"$f":"AND(ProductsList!W56,\"AAAAAHP6wz8=\")","v":{"$error":"#VALUE!"}},{"$f":"IF(ProductsList!57:57,\"AAAAAHP6w0A=\",0)","v":0},{"$f":"AND(ProductsList!A57,\"AAAAAHP6w0E=\")","v":{"$error":"#VALUE!"}},{"$f":"AND(ProductsList!B57,\"AAAAAHP6w0I=\")","v":{"$error":"#VALUE!"}},{"$f":"AND(ProductsList!C57,\"AAAAAHP6w0M=\")","v":{"$error":"#VALUE!"}},{"$f":"AND(ProductsList!D57,\"AAAAAHP6w0Q=\")","v":{"$error":"#VALUE!"}},{"$f":"AND(ProductsList!E57,\"AAAAAHP6w0U=\")","v":{"$error":"#VALUE!"}},{"$f":"AND(ProductsList!F57,\"AAAAAHP6w0Y=\")","v":{"$error":"#VALUE!"}},{"$f":"AND(ProductsList!G57,\"AAAAAHP6w0c=\")","v":{"$error":"#VALUE!"}},{"$f":"AND(ProductsList!H57,\"AAAAAHP6w0g=\")","v":{"$error":"#VALUE!"}},{"$f":"AND(ProductsList!I57,\"AAAAAHP6w0k=\")","v":{"$error":"#VALUE!"}},{"$f":"AND(ProductsList!J57,\"AAAAAHP6w0o=\")","v":{"$error":"#VALUE!"}},{"$f":"AND(ProductsList!K57,\"AAAAAHP6w0s=\")","v":{"$error":"#VALUE!"}},{"$f":"AND(ProductsList!L57,\"AAAAAHP6w0w=\")","v":{"$error":"#VALUE!"}},{"$f":"AND(ProductsList!M57,\"AAAAAHP6w00=\")","v":{"$error":"#VALUE!"}},{"$f":"AND(ProductsList!N57,\"AAAAAHP6w04=\")","v":{"$error":"#VALUE!"}},{"$f":"AND(ProductsList!O57,\"AAAAAHP6w08=\")","v":{"$error":"#VALUE!"}},{"$f":"AND(ProductsList!P57,\"AAAAAHP6w1A=\")","v":{"$error":"#VALUE!"}},{"$f":"AND(ProductsList!Q57,\"AAAAAHP6w1E=\")","v":{"$error":"#VALUE!"}},{"$f":"AND(ProductsList!R57,\"AAAAAHP6w1I=\")","v":{"$error":"#VALUE!"}},{"$f":"AND(ProductsList!S57,\"AAAAAHP6w1M=\")","v":{"$error":"#VALUE!"}},{"$f":"AND(ProductsList!T57,\"AAAAAHP6w1Q=\")","v":{"$error":"#VALUE!"}},{"$f":"AND(ProductsList!U57,\"AAAAAHP6w1U=\")","v":{"$error":"#VALUE!"}},{"$f":"AND(ProductsList!V57,\"AAAAAHP6w1Y=\")","v":{"$error":"#VALUE!"}},{"$f":"AND(ProductsList!W57,\"AAAAAHP6w1c=\")","v":{"$error":"#VALUE!"}},{"$f":"IF(ProductsList!58:58,\"AAAAAHP6w1g=\",0)","v":0},{"$f":"AND(ProductsList!A58,\"AAAAAHP6w1k=\")","v":{"$error":"#VALUE!"}},{"$f":"AND(ProductsList!B58,\"AAAAAHP6w1o=\")","v":{"$error":"#VALUE!"}},{"$f":"AND(ProductsList!C58,\"AAAAAHP6w1s=\")","v":{"$error":"#VALUE!"}},{"$f":"AND(ProductsList!D58,\"AAAAAHP6w1w=\")","v":{"$error":"#VALUE!"}},{"$f":"AND(ProductsList!E58,\"AAAAAHP6w10=\")","v":{"$error":"#VALUE!"}},{"$f":"AND(ProductsList!F58,\"AAAAAHP6w14=\")","v":{"$error":"#VALUE!"}},{"$f":"AND(ProductsList!G58,\"AAAAAHP6w18=\")","v":{"$error":"#VALUE!"}},{"$f":"AND(ProductsList!H58,\"AAAAAHP6w2A=\")","v":{"$error":"#VALUE!"}},{"$f":"AND(ProductsList!I58,\"AAAAAHP6w2E=\")","v":{"$error":"#VALUE!"}},{"$f":"AND(ProductsList!J58,\"AAAAAHP6w2I=\")","v":{"$error":"#VALUE!"}},{"$f":"AND(ProductsList!K58,\"AAAAAHP6w2M=\")","v":{"$error":"#VALUE!"}},{"$f":"AND(ProductsList!L58,\"AAAAAHP6w2Q=\")","v":{"$error":"#VALUE!"}},{"$f":"AND(ProductsList!M58,\"AAAAAHP6w2U=\")","v":{"$error":"#VALUE!"}},{"$f":"AND(ProductsList!N58,\"AAAAAHP6w2Y=\")","v":{"$error":"#VALUE!"}},{"$f":"AND(ProductsList!O58,\"AAAAAHP6w2c=\")","v":{"$error":"#VALUE!"}},{"$f":"AND(ProductsList!P58,\"AAAAAHP6w2g=\")","v":{"$error":"#VALUE!"}},{"$f":"AND(ProductsList!Q58,\"AAAAAHP6w2k=\")","v":{"$error":"#VALUE!"}},{"$f":"AND(ProductsList!R58,\"AAAAAHP6w2o=\")","v":{"$error":"#VALUE!"}},{"$f":"AND(ProductsList!S58,\"AAAAAHP6w2s=\")","v":{"$error":"#VALUE!"}},{"$f":"AND(ProductsList!T58,\"AAAAAHP6w2w=\")","v":{"$error":"#VALUE!"}},{"$f":"AND(ProductsList!U58,\"AAAAAHP6w20=\")","v":{"$error":"#VALUE!"}},{"$f":"AND(ProductsList!V58,\"AAAAAHP6w24=\")","v":{"$error":"#VALUE!"}},{"$f":"AND(ProductsList!W58,\"AAAAAHP6w28=\")","v":{"$error":"#VALUE!"}},{"$f":"IF(ProductsList!59:59,\"AAAAAHP6w3A=\",0)","v":0},{"$f":"AND(ProductsList!A59,\"AAAAAHP6w3E=\")","v":{"$error":"#VALUE!"}},{"$f":"AND(ProductsList!B59,\"AAAAAHP6w3I=\")","v":{"$error":"#VALUE!"}},{"$f":"AND(ProductsList!C59,\"AAAAAHP6w3M=\")","v":{"$error":"#VALUE!"}},{"$f":"AND(ProductsList!D59,\"AAAAAHP6w3Q=\")","v":{"$error":"#VALUE!"}},{"$f":"AND(ProductsList!E59,\"AAAAAHP6w3U=\")","v":{"$error":"#VALUE!"}},{"$f":"AND(ProductsList!F59,\"AAAAAHP6w3Y=\")","v":{"$error":"#VALUE!"}},{"$f":"AND(ProductsList!G59,\"AAAAAHP6w3c=\")","v":{"$error":"#VALUE!"}},{"$f":"AND(ProductsList!H59,\"AAAAAHP6w3g=\")","v":{"$error":"#VALUE!"}},{"$f":"AND(ProductsList!I59,\"AAAAAHP6w3k=\")","v":{"$error":"#VALUE!"}},{"$f":"AND(ProductsList!J59,\"AAAAAHP6w3o=\")","v":{"$error":"#VALUE!"}},{"$f":"AND(ProductsList!K59,\"AAAAAHP6w3s=\")","v":{"$error":"#VALUE!"}},{"$f":"AND(ProductsList!L59,\"AAAAAHP6w3w=\")","v":{"$error":"#VALUE!"}},{"$f":"AND(ProductsList!M59,\"AAAAAHP6w30=\")","v":{"$error":"#VALUE!"}},{"$f":"AND(ProductsList!N59,\"AAAAAHP6w34=\")","v":{"$error":"#VALUE!"}},{"$f":"AND(ProductsList!O59,\"AAAAAHP6w38=\")","v":{"$error":"#VALUE!"}},{"$f":"AND(ProductsList!P59,\"AAAAAHP6w4A=\")","v":{"$error":"#VALUE!"}},{"$f":"AND(ProductsList!Q59,\"AAAAAHP6w4E=\")","v":{"$error":"#VALUE!"}},{"$f":"AND(ProductsList!R59,\"AAAAAHP6w4I=\")","v":{"$error":"#VALUE!"}},{"$f":"AND(ProductsList!S59,\"AAAAAHP6w4M=\")","v":{"$error":"#VALUE!"}},{"$f":"AND(ProductsList!T59,\"AAAAAHP6w4Q=\")","v":{"$error":"#VALUE!"}},{"$f":"AND(ProductsList!U59,\"AAAAAHP6w4U=\")","v":{"$error":"#VALUE!"}},{"$f":"AND(ProductsList!V59,\"AAAAAHP6w4Y=\")","v":{"$error":"#VALUE!"}},{"$f":"AND(ProductsList!W59,\"AAAAAHP6w4c=\")","v":{"$error":"#VALUE!"}},{"$f":"IF(ProductsList!60:60,\"AAAAAHP6w4g=\",0)","v":0},{"$f":"AND(ProductsList!A60,\"AAAAAHP6w4k=\")","v":{"$error":"#VALUE!"}},{"$f":"AND(ProductsList!B60,\"AAAAAHP6w4o=\")","v":{"$error":"#VALUE!"}},{"$f":"AND(ProductsList!C60,\"AAAAAHP6w4s=\")","v":{"$error":"#VALUE!"}},{"$f":"AND(ProductsList!D60,\"AAAAAHP6w4w=\")","v":{"$error":"#VALUE!"}},{"$f":"AND(ProductsList!E60,\"AAAAAHP6w40=\")","v":{"$error":"#VALUE!"}},{"$f":"AND(ProductsList!F60,\"AAAAAHP6w44=\")","v":{"$error":"#VALUE!"}},{"$f":"AND(ProductsList!G60,\"AAAAAHP6w48=\")","v":{"$error":"#VALUE!"}},{"$f":"IF(ProductsList!61:61,\"AAAAAHP6w5A=\",0)","v":0},{"$f":"AND(ProductsList!A61,\"AAAAAHP6w5E=\")","v":{"$error":"#VALUE!"}},{"$f":"AND(ProductsList!B61,\"AAAAAHP6w5I=\")","v":{"$error":"#VALUE!"}},{"$f":"AND(ProductsList!C61,\"AAAAAHP6w5M=\")","v":{"$error":"#VALUE!"}},{"$f":"AND(ProductsList!D61,\"AAAAAHP6w5Q=\")","v":{"$error":"#VALUE!"}},{"$f":"AND(ProductsList!E61,\"AAAAAHP6w5U=\")","v":{"$error":"#VALUE!"}},{"$f":"AND(ProductsList!F61,\"AAAAAHP6w5Y=\")","v":{"$error":"#VALUE!"}},{"$f":"AND(ProductsList!G61,\"AAAAAHP6w5c=\")","v":{"$error":"#VALUE!"}},{"$f":"IF(ProductsList!62:62,\"AAAAAHP6w5g=\",0)","v":0},{"$f":"AND(ProductsList!A62,\"AAAAAHP6w5k=\")","v":{"$error":"#VALUE!"}},{"$f":"AND(ProductsList!B62,\"AAAAAHP6w5o=\")","v":{"$error":"#VALUE!"}},{"$f":"AND(ProductsList!C62,\"AAAAAHP6w5s=\")","v":{"$error":"#VALUE!"}},{"$f":"AND(ProductsList!D62,\"AAAAAHP6w5w=\")","v":{"$error":"#VALUE!"}},{"$f":"AND(ProductsList!E62,\"AAAAAHP6w50=\")","v":{"$error":"#VALUE!"}},{"$f":"AND(ProductsList!F62,\"AAAAAHP6w54=\")","v":{"$error":"#VALUE!"}},{"$f":"AND(ProductsList!G62,\"AAAAAHP6w58=\")","v":{"$error":"#VALUE!"}},{"$f":"IF(ProductsList!63:63,\"AAAAAHP6w6A=\",0)","v":0},{"$f":"AND(ProductsList!A63,\"AAAAAHP6w6E=\")","v":{"$error":"#VALUE!"}},{"$f":"AND(ProductsList!B63,\"AAAAAHP6w6I=\")","v":{"$error":"#VALUE!"}},{"$f":"AND(ProductsList!C63,\"AAAAAHP6w6M=\")","v":{"$error":"#VALUE!"}},{"$f":"AND(ProductsList!D63,\"AAAAAHP6w6Q=\")","v":{"$error":"#VALUE!"}},{"$f":"AND(ProductsList!E63,\"AAAAAHP6w6U=\")","v":{"$error":"#VALUE!"}},{"$f":"AND(ProductsList!F63,\"AAAAAHP6w6Y=\")","v":{"$error":"#VALUE!"}},{"$f":"AND(ProductsList!G63,\"AAAAAHP6w6c=\")","v":{"$error":"#VALUE!"}},{"$f":"IF(ProductsList!64:64,\"AAAAAHP6w6g=\",0)","v":0},{"$f":"AND(ProductsList!A64,\"AAAAAHP6w6k=\")","v":{"$error":"#VALUE!"}},{"$f":"AND(ProductsList!B64,\"AAAAAHP6w6o=\")","v":{"$error":"#VALUE!"}},{"$f":"AND(ProductsList!C64,\"AAAAAHP6w6s=\")","v":{"$error":"#VALUE!"}},{"$f":"AND(ProductsList!D64,\"AAAAAHP6w6w=\")","v":{"$error":"#VALUE!"}},{"$f":"AND(ProductsList!E64,\"AAAAAHP6w60=\")","v":{"$error":"#VALUE!"}},{"$f":"AND(ProductsList!F64,\"AAAAAHP6w64=\")","v":{"$error":"#VALUE!"}},{"$f":"AND(ProductsList!G64,\"AAAAAHP6w68=\")","v":{"$error":"#VALUE!"}},{"$f":"IF(ProductsList!65:65,\"AAAAAHP6w7A=\",0)","v":0},{"$f":"AND(ProductsList!A65,\"AAAAAHP6w7E=\")","v":{"$error":"#VALUE!"}},{"$f":"AND(ProductsList!B65,\"AAAAAHP6w7I=\")","v":{"$error":"#VALUE!"}},{"$f":"AND(ProductsList!C65,\"AAAAAHP6w7M=\")","v":{"$error":"#VALUE!"}},{"$f":"AND(ProductsList!D65,\"AAAAAHP6w7Q=\")","v":{"$error":"#VALUE!"}},{"$f":"AND(ProductsList!E65,\"AAAAAHP6w7U=\")","v":{"$error":"#VALUE!"}},{"$f":"AND(ProductsList!F65,\"AAAAAHP6w7Y=\")","v":{"$error":"#VALUE!"}},{"$f":"AND(ProductsList!G65,\"AAAAAHP6w7c=\")","v":{"$error":"#VALUE!"}},{"$f":"IF(ProductsList!66:66,\"AAAAAHP6w7g=\",0)","v":0},{"$f":"AND(ProductsList!A66,\"AAAAAHP6w7k=\")","v":{"$error":"#VALUE!"}},{"$f":"AND(ProductsList!B66,\"AAAAAHP6w7o=\")","v":{"$error":"#VALUE!"}},{"$f":"AND(ProductsList!C66,\"AAAAAHP6w7s=\")","v":{"$error":"#VALUE!"}},{"$f":"AND(ProductsList!D66,\"AAAAAHP6w7w=\")","v":{"$error":"#VALUE!"}},{"$f":"AND(ProductsList!E66,\"AAAAAHP6w70=\")","v":{"$error":"#VALUE!"}},{"$f":"AND(ProductsList!F66,\"AAAAAHP6w74=\")","v":{"$error":"#VALUE!"}},{"$f":"AND(ProductsList!G66,\"AAAAAHP6w78=\")","v":{"$error":"#VALUE!"}},{"$f":"IF(ProductsList!67:67,\"AAAAAHP6w8A=\",0)","v":0},{"$f":"AND(ProductsList!A67,\"AAAAAHP6w8E=\")","v":{"$error":"#VALUE!"}},{"$f":"AND(ProductsList!B67,\"AAAAAHP6w8I=\")","v":{"$error":"#VALUE!"}},{"$f":"AND(ProductsList!C67,\"AAAAAHP6w8M=\")","v":{"$error":"#VALUE!"}},{"$f":"AND(ProductsList!D67,\"AAAAAHP6w8Q=\")","v":{"$error":"#VALUE!"}},{"$f":"AND(ProductsList!E67,\"AAAAAHP6w8U=\")","v":{"$error":"#VALUE!"}},{"$f":"AND(ProductsList!F67,\"AAAAAHP6w8Y=\")","v":{"$error":"#VALUE!"}},{"$f":"AND(ProductsList!G67,\"AAAAAHP6w8c=\")","v":{"$error":"#VALUE!"}},{"$f":"IF(ProductsList!68:68,\"AAAAAHP6w8g=\",0)","v":0},{"$f":"AND(ProductsList!A68,\"AAAAAHP6w8k=\")","v":{"$error":"#VALUE!"}},{"$f":"AND(ProductsList!B68,\"AAAAAHP6w8o=\")","v":{"$error":"#VALUE!"}},{"$f":"AND(ProductsList!C68,\"AAAAAHP6w8s=\")","v":{"$error":"#VALUE!"}},{"$f":"AND(ProductsList!D68,\"AAAAAHP6w8w=\")","v":{"$error":"#VALUE!"}},{"$f":"AND(ProductsList!E68,\"AAAAAHP6w80=\")","v":{"$error":"#VALUE!"}},{"$f":"AND(ProductsList!F68,\"AAAAAHP6w84=\")","v":{"$error":"#VALUE!"}},{"$f":"AND(ProductsList!G68,\"AAAAAHP6w88=\")","v":{"$error":"#VALUE!"}},{"$f":"IF(ProductsList!69:69,\"AAAAAHP6w9A=\",0)","v":0},{"$f":"AND(ProductsList!A69,\"AAAAAHP6w9E=\")","v":{"$error":"#VALUE!"}},{"$f":"AND(ProductsList!B69,\"AAAAAHP6w9I=\")","v":{"$error":"#VALUE!"}},{"$f":"AND(ProductsList!C69,\"AAAAAHP6w9M=\")","v":{"$error":"#VALUE!"}},{"$f":"AND(ProductsList!D69,\"AAAAAHP6w9Q=\")","v":{"$error":"#VALUE!"}},{"$f":"AND(ProductsList!E69,\"AAAAAHP6w9U=\")","v":{"$error":"#VALUE!"}},{"$f":"AND(ProductsList!F69,\"AAAAAHP6w9Y=\")","v":{"$error":"#VALUE!"}},{"$f":"AND(ProductsList!G69,\"AAAAAHP6w9c=\")","v":{"$error":"#VALUE!"}},{"$f":"IF(ProductsList!70:70,\"AAAAAHP6w9g=\",0)","v":0},{"$f":"AND(ProductsList!A70,\"AAAAAHP6w9k=\")","v":{"$error":"#VALUE!"}},{"$f":"AND(ProductsList!B70,\"AAAAAHP6w9o=\")","v":{"$error":"#VALUE!"}},{"$f":"AND(ProductsList!C70,\"AAAAAHP6w9s=\")","v":{"$error":"#VALUE!"}},{"$f":"AND(ProductsList!D70,\"AAAAAHP6w9w=\")","v":{"$error":"#VALUE!"}},{"$f":"AND(ProductsList!E70,\"AAAAAHP6w90=\")","v":{"$error":"#VALUE!"}},{"$f":"AND(ProductsList!F70,\"AAAAAHP6w94=\")","v":{"$error":"#VALUE!"}},{"$f":"AND(ProductsList!G70,\"AAAAAHP6w98=\")","v":{"$error":"#VALUE!"}},{"$f":"IF(ProductsList!71:71,\"AAAAAHP6w+A=\",0)","v":0},{"$f":"AND(ProductsList!A71,\"AAAAAHP6w+E=\")","v":{"$error":"#VALUE!"}},{"$f":"AND(ProductsList!B71,\"AAAAAHP6w+I=\")","v":{"$error":"#VALUE!"}},{"$f":"AND(ProductsList!C71,\"AAAAAHP6w+M=\")","v":{"$error":"#VALUE!"}},{"$f":"AND(ProductsList!D71,\"AAAAAHP6w+Q=\")","v":{"$error":"#VALUE!"}},{"$f":"AND(ProductsList!E71,\"AAAAAHP6w+U=\")","v":{"$error":"#VALUE!"}},{"$f":"AND(ProductsList!F71,\"AAAAAHP6w+Y=\")","v":{"$error":"#VALUE!"}},{"$f":"AND(ProductsList!G71,\"AAAAAHP6w+c=\")","v":{"$error":"#VALUE!"}},{"$f":"IF(ProductsList!72:72,\"AAAAAHP6w+g=\",0)","v":0},{"$f":"AND(ProductsList!A72,\"AAAAAHP6w+k=\")","v":{"$error":"#VALUE!"}},{"$f":"AND(ProductsList!B72,\"AAAAAHP6w+o=\")","v":{"$error":"#VALUE!"}},{"$f":"AND(ProductsList!C72,\"AAAAAHP6w+s=\")","v":{"$error":"#VALUE!"}},{"$f":"AND(ProductsList!D72,\"AAAAAHP6w+w=\")","v":{"$error":"#VALUE!"}},{"$f":"AND(ProductsList!E72,\"AAAAAHP6w+0=\")","v":{"$error":"#VALUE!"}},{"$f":"AND(ProductsList!F72,\"AAAAAHP6w+4=\")","v":{"$error":"#VALUE!"}},{"$f":"AND(ProductsList!G72,\"AAAAAHP6w+8=\")","v":{"$error":"#VALUE!"}},{"$f":"IF(ProductsList!73:73,\"AAAAAHP6w/A=\",0)","v":0},{"$f":"AND(ProductsList!A73,\"AAAAAHP6w/E=\")","v":{"$error":"#VALUE!"}},{"$f":"AND(ProductsList!B73,\"AAAAAHP6w/I=\")","v":{"$error":"#VALUE!"}},{"$f":"AND(ProductsList!C73,\"AAAAAHP6w/M=\")","v":{"$error":"#VALUE!"}},{"$f":"AND(ProductsList!D73,\"AAAAAHP6w/Q=\")","v":{"$error":"#VALUE!"}},{"$f":"AND(ProductsList!E73,\"AAAAAHP6w/U=\")","v":{"$error":"#VALUE!"}},{"$f":"AND(ProductsList!F73,\"AAAAAHP6w/Y=\")","v":{"$error":"#VALUE!"}},{"$f":"AND(ProductsList!G73,\"AAAAAHP6w/c=\")","v":{"$error":"#VALUE!"}},{"$f":"IF(ProductsList!74:74,\"AAAAAHP6w/g=\",0)","v":0},{"$f":"AND(ProductsList!A74,\"AAAAAHP6w/k=\")","v":{"$error":"#VALUE!"}},{"$f":"AND(ProductsList!B74,\"AAAAAHP6w/o=\")","v":{"$error":"#VALUE!"}},{"$f":"AND(ProductsList!C74,\"AAAAAHP6w/s=\")","v":{"$error":"#VALUE!"}},{"$f":"AND(ProductsList!D74,\"AAAAAHP6w/w=\")","v":{"$error":"#VALUE!"}},{"$f":"AND(ProductsList!E74,\"AAAAAHP6w/0=\")","v":{"$error":"#VALUE!"}},{"$f":"AND(ProductsList!F74,\"AAAAAHP6w/4=\")","v":{"$error":"#VALUE!"}},{"$f":"AND(ProductsList!G74,\"AAAAAHP6w/8=\")","v":{"$error":"#VALUE!"}}]
[{"$f":"IF(ProductsList!75:75,\"AAAAACrSfwA=\",0)","v":{"$error":"#VALUE!"}},{"$f":"AND(ProductsList!A75,\"AAAAACrSfwE=\")","v":{"$error":"#VALUE!"}},{"$f":"AND(ProductsList!B75,\"AAAAACrSfwI=\")","v":{"$error":"#VALUE!"}},{"$f":"AND(ProductsList!C75,\"AAAAACrSfwM=\")","v":{"$error":"#VALUE!"}},{"$f":"AND(ProductsList!D75,\"AAAAACrSfwQ=\")","v":{"$error":"#VALUE!"}},{"$f":"AND(ProductsList!E75,\"AAAAACrSfwU=\")","v":{"$error":"#VALUE!"}},{"$f":"AND(ProductsList!F75,\"AAAAACrSfwY=\")","v":{"$error":"#VALUE!"}},{"$f":"AND(ProductsList!G75,\"AAAAACrSfwc=\")","v":{"$error":"#VALUE!"}},{"$f":"IF(ProductsList!76:76,\"AAAAACrSfwg=\",0)","v":0},{"$f":"AND(ProductsList!A76,\"AAAAACrSfwk=\")","v":{"$error":"#VALUE!"}},{"$f":"AND(ProductsList!B76,\"AAAAACrSfwo=\")","v":{"$error":"#VALUE!"}},{"$f":"AND(ProductsList!C76,\"AAAAACrSfws=\")","v":{"$error":"#VALUE!"}},{"$f":"AND(ProductsList!D76,\"AAAAACrSfww=\")","v":{"$error":"#VALUE!"}},{"$f":"AND(ProductsList!E76,\"AAAAACrSfw0=\")","v":{"$error":"#VALUE!"}},{"$f":"AND(ProductsList!F76,\"AAAAACrSfw4=\")","v":{"$error":"#VALUE!"}},{"$f":"AND(ProductsList!G76,\"AAAAACrSfw8=\")","v":{"$error":"#VALUE!"}},{"$f":"IF(ProductsList!77:77,\"AAAAACrSfxA=\",0)","v":0},{"$f":"AND(ProductsList!A77,\"AAAAACrSfxE=\")","v":{"$error":"#VALUE!"}},{"$f":"AND(ProductsList!B77,\"AAAAACrSfxI=\")","v":{"$error":"#VALUE!"}},{"$f":"AND(ProductsList!C77,\"AAAAACrSfxM=\")","v":{"$error":"#VALUE!"}},{"$f":"AND(ProductsList!D77,\"AAAAACrSfxQ=\")","v":{"$error":"#VALUE!"}},{"$f":"AND(ProductsList!E77,\"AAAAACrSfxU=\")","v":{"$error":"#VALUE!"}},{"$f":"AND(ProductsList!F77,\"AAAAACrSfxY=\")","v":{"$error":"#VALUE!"}},{"$f":"AND(ProductsList!G77,\"AAAAACrSfxc=\")","v":{"$error":"#VALUE!"}},{"$f":"IF(ProductsList!78:78,\"AAAAACrSfxg=\",0)","v":0},{"$f":"AND(ProductsList!A78,\"AAAAACrSfxk=\")","v":{"$error":"#VALUE!"}},{"$f":"AND(ProductsList!B78,\"AAAAACrSfxo=\")","v":{"$error":"#VALUE!"}},{"$f":"AND(ProductsList!C78,\"AAAAACrSfxs=\")","v":{"$error":"#VALUE!"}},{"$f":"AND(ProductsList!D78,\"AAAAACrSfxw=\")","v":{"$error":"#VALUE!"}},{"$f":"AND(ProductsList!E78,\"AAAAACrSfx0=\")","v":{"$error":"#VALUE!"}},{"$f":"AND(ProductsList!F78,\"AAAAACrSfx4=\")","v":{"$error":"#VALUE!"}},{"$f":"AND(ProductsList!G78,\"AAAAACrSfx8=\")","v":{"$error":"#VALUE!"}},{"$f":"IF(ProductsList!79:79,\"AAAAACrSfyA=\",0)","v":0},{"$f":"AND(ProductsList!A79,\"AAAAACrSfyE=\")","v":{"$error":"#VALUE!"}},{"$f":"AND(ProductsList!B79,\"AAAAACrSfyI=\")","v":{"$error":"#VALUE!"}},{"$f":"AND(ProductsList!C79,\"AAAAACrSfyM=\")","v":{"$error":"#VALUE!"}},{"$f":"AND(ProductsList!D79,\"AAAAACrSfyQ=\")","v":{"$error":"#VALUE!"}},{"$f":"AND(ProductsList!E79,\"AAAAACrSfyU=\")","v":{"$error":"#VALUE!"}},{"$f":"AND(ProductsList!F79,\"AAAAACrSfyY=\")","v":{"$error":"#VALUE!"}},{"$f":"AND(ProductsList!G79,\"AAAAACrSfyc=\")","v":{"$error":"#VALUE!"}},{"$f":"IF(ProductsList!80:80,\"AAAAACrSfyg=\",0)","v":0},{"$f":"AND(ProductsList!A80,\"AAAAACrSfyk=\")","v":{"$error":"#VALUE!"}},{"$f":"AND(ProductsList!B80,\"AAAAACrSfyo=\")","v":{"$error":"#VALUE!"}},{"$f":"AND(ProductsList!C80,\"AAAAACrSfys=\")","v":{"$error":"#VALUE!"}},{"$f":"AND(ProductsList!D80,\"AAAAACrSfyw=\")","v":{"$error":"#VALUE!"}},{"$f":"AND(ProductsList!E80,\"AAAAACrSfy0=\")","v":{"$error":"#VALUE!"}},{"$f":"AND(ProductsList!F80,\"AAAAACrSfy4=\")","v":{"$error":"#VALUE!"}},{"$f":"AND(ProductsList!G80,\"AAAAACrSfy8=\")","v":{"$error":"#VALUE!"}},{"$f":"IF(ProductsList!81:81,\"AAAAACrSfzA=\",0)","v":0},{"$f":"AND(ProductsList!A81,\"AAAAACrSfzE=\")","v":{"$error":"#VALUE!"}},{"$f":"AND(ProductsList!B81,\"AAAAACrSfzI=\")","v":{"$error":"#VALUE!"}},{"$f":"AND(ProductsList!C81,\"AAAAACrSfzM=\")","v":{"$error":"#VALUE!"}},{"$f":"AND(ProductsList!D81,\"AAAAACrSfzQ=\")","v":{"$error":"#VALUE!"}},{"$f":"AND(ProductsList!E81,\"AAAAACrSfzU=\")","v":{"$error":"#VALUE!"}},{"$f":"AND(ProductsList!F81,\"AAAAACrSfzY=\")","v":{"$error":"#VALUE!"}},{"$f":"AND(ProductsList!G81,\"AAAAACrSfzc=\")","v":{"$error":"#VALUE!"}},{"$f":"IF(ProductsList!82:82,\"AAAAACrSfzg=\",0)","v":0},{"$f":"AND(ProductsList!A82,\"AAAAACrSfzk=\")","v":{"$error":"#VALUE!"}},{"$f":"AND(ProductsList!B82,\"AAAAACrSfzo=\")","v":{"$error":"#VALUE!"}},{"$f":"AND(ProductsList!C82,\"AAAAACrSfzs=\")","v":{"$error":"#VALUE!"}},{"$f":"AND(ProductsList!D82,\"AAAAACrSfzw=\")","v":{"$error":"#VALUE!"}},{"$f":"AND(ProductsList!E82,\"AAAAACrSfz0=\")","v":{"$error":"#VALUE!"}},{"$f":"AND(ProductsList!F82,\"AAAAACrSfz4=\")","v":{"$error":"#VALUE!"}},{"$f":"AND(ProductsList!G82,\"AAAAACrSfz8=\")","v":{"$error":"#VALUE!"}},{"$f":"IF(ProductsList!83:83,\"AAAAACrSf0A=\",0)","v":0},{"$f":"AND(ProductsList!A83,\"AAAAACrSf0E=\")","v":{"$error":"#VALUE!"}},{"$f":"AND(ProductsList!B83,\"AAAAACrSf0I=\")","v":{"$error":"#VALUE!"}},{"$f":"AND(ProductsList!C83,\"AAAAACrSf0M=\")","v":{"$error":"#VALUE!"}},{"$f":"AND(ProductsList!D83,\"AAAAACrSf0Q=\")","v":{"$error":"#VALUE!"}},{"$f":"AND(ProductsList!E83,\"AAAAACrSf0U=\")","v":{"$error":"#VALUE!"}},{"$f":"AND(ProductsList!F83,\"AAAAACrSf0Y=\")","v":{"$error":"#VALUE!"}},{"$f":"AND(ProductsList!G83,\"AAAAACrSf0c=\")","v":{"$error":"#VALUE!"}},{"$f":"IF(ProductsList!84:84,\"AAAAACrSf0g=\",0)","v":0},{"$f":"AND(ProductsList!A84,\"AAAAACrSf0k=\")","v":{"$error":"#VALUE!"}},{"$f":"AND(ProductsList!B84,\"AAAAACrSf0o=\")","v":{"$error":"#VALUE!"}},{"$f":"AND(ProductsList!C84,\"AAAAACrSf0s=\")","v":{"$error":"#VALUE!"}},{"$f":"AND(ProductsList!D84,\"AAAAACrSf0w=\")","v":{"$error":"#VALUE!"}},{"$f":"AND(ProductsList!E84,\"AAAAACrSf00=\")","v":{"$error":"#VALUE!"}},{"$f":"AND(ProductsList!F84,\"AAAAACrSf04=\")","v":{"$error":"#VALUE!"}},{"$f":"AND(ProductsList!G84,\"AAAAACrSf08=\")","v":{"$error":"#VALUE!"}},{"$f":"IF(ProductsList!85:85,\"AAAAACrSf1A=\",0)","v":0},{"$f":"AND(ProductsList!A85,\"AAAAACrSf1E=\")","v":{"$error":"#VALUE!"}},{"$f":"AND(ProductsList!B85,\"AAAAACrSf1I=\")","v":{"$error":"#VALUE!"}},{"$f":"AND(ProductsList!C85,\"AAAAACrSf1M=\")","v":{"$error":"#VALUE!"}},{"$f":"AND(ProductsList!D85,\"AAAAACrSf1Q=\")","v":{"$error":"#VALUE!"}},{"$f":"AND(ProductsList!E85,\"AAAAACrSf1U=\")","v":{"$error":"#VALUE!"}},{"$f":"AND(ProductsList!F85,\"AAAAACrSf1Y=\")","v":{"$error":"#VALUE!"}},{"$f":"AND(ProductsList!G85,\"AAAAACrSf1c=\")","v":{"$error":"#VALUE!"}},{"$f":"IF(ProductsList!86:86,\"AAAAACrSf1g=\",0)","v":0},{"$f":"AND(ProductsList!A86,\"AAAAACrSf1k=\")","v":{"$error":"#VALUE!"}},{"$f":"AND(ProductsList!B86,\"AAAAACrSf1o=\")","v":{"$error":"#VALUE!"}},{"$f":"AND(ProductsList!C86,\"AAAAACrSf1s=\")","v":{"$error":"#VALUE!"}},{"$f":"AND(ProductsList!D86,\"AAAAACrSf1w=\")","v":{"$error":"#VALUE!"}},{"$f":"AND(ProductsList!E86,\"AAAAACrSf10=\")","v":{"$error":"#VALUE!"}},{"$f":"AND(ProductsList!F86,\"AAAAACrSf14=\")","v":{"$error":"#VALUE!"}},{"$f":"AND(ProductsList!G86,\"AAAAACrSf18=\")","v":{"$error":"#VALUE!"}},{"$f":"IF(ProductsList!87:87,\"AAAAACrSf2A=\",0)","v":0},{"$f":"AND(ProductsList!A87,\"AAAAACrSf2E=\")","v":{"$error":"#VALUE!"}},{"$f":"AND(ProductsList!B87,\"AAAAACrSf2I=\")","v":{"$error":"#VALUE!"}},{"$f":"AND(ProductsList!C87,\"AAAAACrSf2M=\")","v":{"$error":"#VALUE!"}},{"$f":"AND(ProductsList!D87,\"AAAAACrSf2Q=\")","v":{"$error":"#VALUE!"}},{"$f":"AND(ProductsList!E87,\"AAAAACrSf2U=\")","v":{"$error":"#VALUE!"}},{"$f":"AND(ProductsList!F87,\"AAAAACrSf2Y=\")","v":{"$error":"#VALUE!"}},{"$f":"AND(ProductsList!G87,\"AAAAACrSf2c=\")","v":{"$error":"#VALUE!"}},{"$f":"IF(ProductsList!88:88,\"AAAAACrSf2g=\",0)","v":0},{"$f":"AND(ProductsList!A88,\"AAAAACrSf2k=\")","v":{"$error":"#VALUE!"}},{"$f":"AND(ProductsList!B88,\"AAAAACrSf2o=\")","v":{"$error":"#VALUE!"}},{"$f":"AND(ProductsList!C88,\"AAAAACrSf2s=\")","v":{"$error":"#VALUE!"}},{"$f":"AND(ProductsList!D88,\"AAAAACrSf2w=\")","v":{"$error":"#VALUE!"}},{"$f":"AND(ProductsList!E88,\"AAAAACrSf20=\")","v":{"$error":"#VALUE!"}},{"$f":"AND(ProductsList!F88,\"AAAAACrSf24=\")","v":{"$error":"#VALUE!"}},{"$f":"AND(ProductsList!G88,\"AAAAACrSf28=\")","v":{"$error":"#VALUE!"}},{"$f":"IF(ProductsList!89:89,\"AAAAACrSf3A=\",0)","v":0},{"$f":"AND(ProductsList!A89,\"AAAAACrSf3E=\")","v":{"$error":"#VALUE!"}},{"$f":"AND(ProductsList!B89,\"AAAAACrSf3I=\")","v":{"$error":"#VALUE!"}},{"$f":"AND(ProductsList!C89,\"AAAAACrSf3M=\")","v":{"$error":"#VALUE!"}},{"$f":"AND(ProductsList!D89,\"AAAAACrSf3Q=\")","v":{"$error":"#VALUE!"}},{"$f":"AND(ProductsList!E89,\"AAAAACrSf3U=\")","v":{"$error":"#VALUE!"}},{"$f":"AND(ProductsList!F89,\"AAAAACrSf3Y=\")","v":{"$error":"#VALUE!"}},{"$f":"AND(ProductsList!G89,\"AAAAACrSf3c=\")","v":{"$error":"#VALUE!"}},{"$f":"IF(ProductsList!90:90,\"AAAAACrSf3g=\",0)","v":0},{"$f":"AND(ProductsList!A90,\"AAAAACrSf3k=\")","v":{"$error":"#VALUE!"}},{"$f":"AND(ProductsList!B90,\"AAAAACrSf3o=\")","v":{"$error":"#VALUE!"}},{"$f":"AND(ProductsList!C90,\"AAAAACrSf3s=\")","v":{"$error":"#VALUE!"}},{"$f":"AND(ProductsList!D90,\"AAAAACrSf3w=\")","v":{"$error":"#VALUE!"}},{"$f":"AND(ProductsList!E90,\"AAAAACrSf30=\")","v":{"$error":"#VALUE!"}},{"$f":"AND(ProductsList!F90,\"AAAAACrSf34=\")","v":{"$error":"#VALUE!"}},{"$f":"AND(ProductsList!G90,\"AAAAACrSf38=\")","v":{"$error":"#VALUE!"}},{"$f":"IF(ProductsList!91:91,\"AAAAACrSf4A=\",0)","v":0},{"$f":"AND(ProductsList!A91,\"AAAAACrSf4E=\")","v":{"$error":"#VALUE!"}},{"$f":"AND(ProductsList!B91,\"AAAAACrSf4I=\")","v":{"$error":"#VALUE!"}},{"$f":"AND(ProductsList!C91,\"AAAAACrSf4M=\")","v":{"$error":"#VALUE!"}},{"$f":"AND(ProductsList!D91,\"AAAAACrSf4Q=\")","v":{"$error":"#VALUE!"}},{"$f":"AND(ProductsList!E91,\"AAAAACrSf4U=\")","v":{"$error":"#VALUE!"}},{"$f":"AND(ProductsList!F91,\"AAAAACrSf4Y=\")","v":{"$error":"#VALUE!"}},{"$f":"AND(ProductsList!G91,\"AAAAACrSf4c=\")","v":{"$error":"#VALUE!"}},{"$f":"IF(ProductsList!92:92,\"AAAAACrSf4g=\",0)","v":0},{"$f":"AND(ProductsList!A92,\"AAAAACrSf4k=\")","v":{"$error":"#VALUE!"}},{"$f":"AND(ProductsList!B92,\"AAAAACrSf4o=\")","v":{"$error":"#VALUE!"}},{"$f":"AND(ProductsList!C92,\"AAAAACrSf4s=\")","v":{"$error":"#VALUE!"}},{"$f":"AND(ProductsList!D92,\"AAAAACrSf4w=\")","v":{"$error":"#VALUE!"}},{"$f":"AND(ProductsList!E92,\"AAAAACrSf40=\")","v":{"$error":"#VALUE!"}},{"$f":"AND(ProductsList!F92,\"AAAAACrSf44=\")","v":{"$error":"#VALUE!"}},{"$f":"AND(ProductsList!G92,\"AAAAACrSf48=\")","v":{"$error":"#VALUE!"}},{"$f":"IF(ProductsList!93:93,\"AAAAACrSf5A=\",0)","v":0},{"$f":"AND(ProductsList!A93,\"AAAAACrSf5E=\")","v":{"$error":"#VALUE!"}},{"$f":"AND(ProductsList!B93,\"AAAAACrSf5I=\")","v":{"$error":"#VALUE!"}},{"$f":"AND(ProductsList!C93,\"AAAAACrSf5M=\")","v":{"$error":"#VALUE!"}},{"$f":"AND(ProductsList!D93,\"AAAAACrSf5Q=\")","v":{"$error":"#VALUE!"}},{"$f":"AND(ProductsList!E93,\"AAAAACrSf5U=\")","v":{"$error":"#VALUE!"}},{"$f":"AND(ProductsList!F93,\"AAAAACrSf5Y=\")","v":{"$error":"#VALUE!"}},{"$f":"AND(ProductsList!G93,\"AAAAACrSf5c=\")","v":{"$error":"#VALUE!"}},{"$f":"IF(ProductsList!94:94,\"AAAAACrSf5g=\",0)","v":0},{"$f":"AND(ProductsList!A94,\"AAAAACrSf5k=\")","v":{"$error":"#VALUE!"}},{"$f":"AND(ProductsList!B94,\"AAAAACrSf5o=\")","v":{"$error":"#VALUE!"}},{"$f":"AND(ProductsList!C94,\"AAAAACrSf5s=\")","v":{"$error":"#VALUE!"}},{"$f":"AND(ProductsList!D94,\"AAAAACrSf5w=\")","v":{"$error":"#VALUE!"}},{"$f":"AND(ProductsList!E94,\"AAAAACrSf50=\")","v":{"$error":"#VALUE!"}},{"$f":"AND(ProductsList!F94,\"AAAAACrSf54=\")","v":{"$error":"#VALUE!"}},{"$f":"AND(ProductsList!G94,\"AAAAACrSf58=\")","v":{"$error":"#VALUE!"}},{"$f":"IF(ProductsList!95:95,\"AAAAACrSf6A=\",0)","v":0},{"$f":"AND(ProductsList!A95,\"AAAAACrSf6E=\")","v":{"$error":"#VALUE!"}},{"$f":"AND(ProductsList!B95,\"AAAAACrSf6I=\")","v":{"$error":"#VALUE!"}},{"$f":"AND(ProductsList!C95,\"AAAAACrSf6M=\")","v":{"$error":"#VALUE!"}},{"$f":"AND(ProductsList!D95,\"AAAAACrSf6Q=\")","v":{"$error":"#VALUE!"}},{"$f":"AND(ProductsList!E95,\"AAAAACrSf6U=\")","v":{"$error":"#VALUE!"}},{"$f":"AND(ProductsList!F95,\"AAAAACrSf6Y=\")","v":{"$error":"#VALUE!"}},{"$f":"AND(ProductsList!G95,\"AAAAACrSf6c=\")","v":{"$error":"#VALUE!"}},{"$f":"IF(ProductsList!96:96,\"AAAAACrSf6g=\",0)","v":0},{"$f":"AND(ProductsList!A96,\"AAAAACrSf6k=\")","v":{"$error":"#VALUE!"}},{"$f":"AND(ProductsList!B96,\"AAAAACrSf6o=\")","v":{"$error":"#VALUE!"}},{"$f":"AND(ProductsList!C96,\"AAAAACrSf6s=\")","v":{"$error":"#VALUE!"}},{"$f":"AND(ProductsList!D96,\"AAAAACrSf6w=\")","v":{"$error":"#VALUE!"}},{"$f":"AND(ProductsList!E96,\"AAAAACrSf60=\")","v":{"$error":"#VALUE!"}},{"$f":"AND(ProductsList!F96,\"AAAAACrSf64=\")","v":{"$error":"#VALUE!"}},{"$f":"AND(ProductsList!G96,\"AAAAACrSf68=\")","v":{"$error":"#VALUE!"}},{"$f":"IF(ProductsList!97:97,\"AAAAACrSf7A=\",0)","v":0},{"$f":"AND(ProductsList!A97,\"AAAAACrSf7E=\")","v":{"$error":"#VALUE!"}},{"$f":"AND(ProductsList!B97,\"AAAAACrSf7I=\")","v":{"$error":"#VALUE!"}},{"$f":"AND(ProductsList!C97,\"AAAAACrSf7M=\")","v":{"$error":"#VALUE!"}},{"$f":"AND(ProductsList!D97,\"AAAAACrSf7Q=\")","v":{"$error":"#VALUE!"}},{"$f":"AND(ProductsList!E97,\"AAAAACrSf7U=\")","v":{"$error":"#VALUE!"}},{"$f":"AND(ProductsList!F97,\"AAAAACrSf7Y=\")","v":{"$error":"#VALUE!"}},{"$f":"AND(ProductsList!G97,\"AAAAACrSf7c=\")","v":{"$error":"#VALUE!"}},{"$f":"IF(ProductsList!98:98,\"AAAAACrSf7g=\",0)","v":0},{"$f":"AND(ProductsList!A98,\"AAAAACrSf7k=\")","v":{"$error":"#VALUE!"}},{"$f":"AND(ProductsList!B98,\"AAAAACrSf7o=\")","v":{"$error":"#VALUE!"}},{"$f":"AND(ProductsList!C98,\"AAAAACrSf7s=\")","v":{"$error":"#VALUE!"}},{"$f":"AND(ProductsList!D98,\"AAAAACrSf7w=\")","v":{"$error":"#VALUE!"}},{"$f":"AND(ProductsList!E98,\"AAAAACrSf70=\")","v":{"$error":"#VALUE!"}},{"$f":"AND(ProductsList!F98,\"AAAAACrSf74=\")","v":{"$error":"#VALUE!"}},{"$f":"AND(ProductsList!G98,\"AAAAACrSf78=\")","v":{"$error":"#VALUE!"}},{"$f":"IF(ProductsList!99:99,\"AAAAACrSf8A=\",0)","v":0},{"$f":"AND(ProductsList!A99,\"AAAAACrSf8E=\")","v":{"$error":"#VALUE!"}},{"$f":"AND(ProductsList!B99,\"AAAAACrSf8I=\")","v":{"$error":"#VALUE!"}},{"$f":"AND(ProductsList!C99,\"AAAAACrSf8M=\")","v":{"$error":"#VALUE!"}},{"$f":"AND(ProductsList!D99,\"AAAAACrSf8Q=\")","v":{"$error":"#VALUE!"}},{"$f":"AND(ProductsList!E99,\"AAAAACrSf8U=\")","v":{"$error":"#VALUE!"}},{"$f":"AND(ProductsList!F99,\"AAAAACrSf8Y=\")","v":{"$error":"#VALUE!"}},{"$f":"AND(ProductsList!G99,\"AAAAACrSf8c=\")","v":{"$error":"#VALUE!"}},{"$f":"IF(ProductsList!100:100,\"AAAAACrSf8g=\",0)","v":0},{"$f":"AND(ProductsList!A100,\"AAAAACrSf8k=\")","v":{"$error":"#VALUE!"}},{"$f":"AND(ProductsList!B100,\"AAAAACrSf8o=\")","v":{"$error":"#VALUE!"}},{"$f":"AND(ProductsList!C100,\"AAAAACrSf8s=\")","v":{"$error":"#VALUE!"}},{"$f":"AND(ProductsList!D100,\"AAAAACrSf8w=\")","v":{"$error":"#VALUE!"}},{"$f":"AND(ProductsList!E100,\"AAAAACrSf80=\")","v":{"$error":"#VALUE!"}},{"$f":"AND(ProductsList!F100,\"AAAAACrSf84=\")","v":{"$error":"#VALUE!"}},{"$f":"AND(ProductsList!G100,\"AAAAACrSf88=\")","v":{"$error":"#VALUE!"}},{"$f":"IF(ProductsList!101:101,\"AAAAACrSf9A=\",0)","v":0},{"$f":"AND(ProductsList!A101,\"AAAAACrSf9E=\")","v":{"$error":"#VALUE!"}},{"$f":"AND(ProductsList!B101,\"AAAAACrSf9I=\")","v":{"$error":"#VALUE!"}},{"$f":"AND(ProductsList!C101,\"AAAAACrSf9M=\")","v":{"$error":"#VALUE!"}},{"$f":"AND(ProductsList!D101,\"AAAAACrSf9Q=\")","v":{"$error":"#VALUE!"}},{"$f":"AND(ProductsList!E101,\"AAAAACrSf9U=\")","v":{"$error":"#VALUE!"}},{"$f":"AND(ProductsList!F101,\"AAAAACrSf9Y=\")","v":{"$error":"#VALUE!"}},{"$f":"AND(ProductsList!G101,\"AAAAACrSf9c=\")","v":{"$error":"#VALUE!"}},{"$f":"IF(ProductsList!102:102,\"AAAAACrSf9g=\",0)","v":0},{"$f":"AND(ProductsList!A102,\"AAAAACrSf9k=\")","v":{"$error":"#VALUE!"}},{"$f":"AND(ProductsList!B102,\"AAAAACrSf9o=\")","v":{"$error":"#VALUE!"}},{"$f":"AND(ProductsList!C102,\"AAAAACrSf9s=\")","v":{"$error":"#VALUE!"}},{"$f":"AND(ProductsList!D102,\"AAAAACrSf9w=\")","v":{"$error":"#VALUE!"}},{"$f":"AND(ProductsList!E102,\"AAAAACrSf90=\")","v":{"$error":"#VALUE!"}},{"$f":"AND(ProductsList!F102,\"AAAAACrSf94=\")","v":{"$error":"#VALUE!"}},{"$f":"AND(ProductsList!G102,\"AAAAACrSf98=\")","v":{"$error":"#VALUE!"}},{"$f":"IF(ProductsList!103:103,\"AAAAACrSf+A=\",0)","v":0},{"$f":"AND(ProductsList!A103,\"AAAAACrSf+E=\")","v":{"$error":"#VALUE!"}},{"$f":"AND(ProductsList!B103,\"AAAAACrSf+I=\")","v":{"$error":"#VALUE!"}},{"$f":"AND(ProductsList!C103,\"AAAAACrSf+M=\")","v":{"$error":"#VALUE!"}},{"$f":"AND(ProductsList!D103,\"AAAAACrSf+Q=\")","v":{"$error":"#VALUE!"}},{"$f":"AND(ProductsList!E103,\"AAAAACrSf+U=\")","v":{"$error":"#VALUE!"}},{"$f":"AND(ProductsList!F103,\"AAAAACrSf+Y=\")","v":{"$error":"#VALUE!"}},{"$f":"AND(ProductsList!G103,\"AAAAACrSf+c=\")","v":{"$error":"#VALUE!"}},{"$f":"IF(ProductsList!104:104,\"AAAAACrSf+g=\",0)","v":0},{"$f":"AND(ProductsList!A104,\"AAAAACrSf+k=\")","v":{"$error":"#VALUE!"}},{"$f":"AND(ProductsList!B104,\"AAAAACrSf+o=\")","v":{"$error":"#VALUE!"}},{"$f":"AND(ProductsList!C104,\"AAAAACrSf+s=\")","v":{"$error":"#VALUE!"}},{"$f":"AND(ProductsList!D104,\"AAAAACrSf+w=\")","v":{"$error":"#VALUE!"}},{"$f":"AND(ProductsList!E104,\"AAAAACrSf+0=\")","v":{"$error":"#VALUE!"}},{"$f":"AND(ProductsList!F104,\"AAAAACrSf+4=\")","v":{"$error":"#VALUE!"}},{"$f":"AND(ProductsList!G104,\"AAAAACrSf+8=\")","v":{"$error":"#VALUE!"}},{"$f":"IF(ProductsList!105:105,\"AAAAACrSf/A=\",0)","v":0},{"$f":"AND(ProductsList!A105,\"AAAAACrSf/E=\")","v":{"$error":"#VALUE!"}},{"$f":"AND(ProductsList!B105,\"AAAAACrSf/I=\")","v":{"$error":"#VALUE!"}},{"$f":"AND(ProductsList!C105,\"AAAAACrSf/M=\")","v":{"$error":"#VALUE!"}},{"$f":"AND(ProductsList!D105,\"AAAAACrSf/Q=\")","v":{"$error":"#VALUE!"}},{"$f":"AND(ProductsList!E105,\"AAAAACrSf/U=\")","v":{"$error":"#VALUE!"}},{"$f":"AND(ProductsList!F105,\"AAAAACrSf/Y=\")","v":{"$error":"#VALUE!"}},{"$f":"AND(ProductsList!G105,\"AAAAACrSf/c=\")","v":{"$error":"#VALUE!"}},{"$f":"IF(ProductsList!106:106,\"AAAAACrSf/g=\",0)","v":0},{"$f":"AND(ProductsList!A106,\"AAAAACrSf/k=\")","v":{"$error":"#VALUE!"}},{"$f":"AND(ProductsList!B106,\"AAAAACrSf/o=\")","v":{"$error":"#VALUE!"}},{"$f":"AND(ProductsList!C106,\"AAAAACrSf/s=\")","v":{"$error":"#VALUE!"}},{"$f":"AND(ProductsList!D106,\"AAAAACrSf/w=\")","v":{"$error":"#VALUE!"}},{"$f":"AND(ProductsList!E106,\"AAAAACrSf/0=\")","v":{"$error":"#VALUE!"}},{"$f":"AND(ProductsList!F106,\"AAAAACrSf/4=\")","v":{"$error":"#VALUE!"}},{"$f":"AND(ProductsList!G106,\"AAAAACrSf/8=\")","v":{"$error":"#VALUE!"}}]
[{"$f":"IF(ProductsList!107:107,\"AAAAACaxfwA=\",0)","v":{"$error":"#VALUE!"}},{"$f":"AND(ProductsList!A107,\"AAAAACaxfwE=\")","v":{"$error":"#VALUE!"}},{"$f":"AND(ProductsList!B107,\"AAAAACaxfwI=\")","v":{"$error":"#VALUE!"}},{"$f":"AND(ProductsList!C107,\"AAAAACaxfwM=\")","v":{"$error":"#VALUE!"}},{"$f":"AND(ProductsList!D107,\"AAAAACaxfwQ=\")","v":{"$error":"#VALUE!"}},{"$f":"AND(ProductsList!E107,\"AAAAACaxfwU=\")","v":{"$error":"#VALUE!"}},{"$f":"AND(ProductsList!F107,\"AAAAACaxfwY=\")","v":{"$error":"#VALUE!"}},{"$f":"AND(ProductsList!G107,\"AAAAACaxfwc=\")","v":{"$error":"#VALUE!"}},{"$f":"IF(ProductsList!108:108,\"AAAAACaxfwg=\",0)","v":0},{"$f":"AND(ProductsList!A108,\"AAAAACaxfwk=\")","v":{"$error":"#VALUE!"}},{"$f":"AND(ProductsList!B108,\"AAAAACaxfwo=\")","v":{"$error":"#VALUE!"}},{"$f":"AND(ProductsList!C108,\"AAAAACaxfws=\")","v":{"$error":"#VALUE!"}},{"$f":"AND(ProductsList!D108,\"AAAAACaxfww=\")","v":{"$error":"#VALUE!"}},{"$f":"AND(ProductsList!E108,\"AAAAACaxfw0=\")","v":{"$error":"#VALUE!"}},{"$f":"AND(ProductsList!F108,\"AAAAACaxfw4=\")","v":{"$error":"#VALUE!"}},{"$f":"AND(ProductsList!G108,\"AAAAACaxfw8=\")","v":{"$error":"#VALUE!"}},{"$f":"IF(ProductsList!109:109,\"AAAAACaxfxA=\",0)","v":0},{"$f":"AND(ProductsList!A109,\"AAAAACaxfxE=\")","v":{"$error":"#VALUE!"}},{"$f":"AND(ProductsList!B109,\"AAAAACaxfxI=\")","v":{"$error":"#VALUE!"}},{"$f":"AND(ProductsList!C109,\"AAAAACaxfxM=\")","v":{"$error":"#VALUE!"}},{"$f":"AND(ProductsList!D109,\"AAAAACaxfxQ=\")","v":{"$error":"#VALUE!"}},{"$f":"AND(ProductsList!E109,\"AAAAACaxfxU=\")","v":{"$error":"#VALUE!"}},{"$f":"AND(ProductsList!F109,\"AAAAACaxfxY=\")","v":{"$error":"#VALUE!"}},{"$f":"AND(ProductsList!G109,\"AAAAACaxfxc=\")","v":{"$error":"#VALUE!"}},{"$f":"IF(ProductsList!110:110,\"AAAAACaxfxg=\",0)","v":0},{"$f":"AND(ProductsList!A110,\"AAAAACaxfxk=\")","v":{"$error":"#VALUE!"}},{"$f":"AND(ProductsList!B110,\"AAAAACaxfxo=\")","v":{"$error":"#VALUE!"}},{"$f":"AND(ProductsList!C110,\"AAAAACaxfxs=\")","v":{"$error":"#VALUE!"}},{"$f":"AND(ProductsList!D110,\"AAAAACaxfxw=\")","v":{"$error":"#VALUE!"}},{"$f":"AND(ProductsList!E110,\"AAAAACaxfx0=\")","v":{"$error":"#VALUE!"}},{"$f":"AND(ProductsList!F110,\"AAAAACaxfx4=\")","v":{"$error":"#VALUE!"}},{"$f":"AND(ProductsList!G110,\"AAAAACaxfx8=\")","v":{"$error":"#VALUE!"}},{"$f":"IF(ProductsList!111:111,\"AAAAACaxfyA=\",0)","v":0},{"$f":"AND(ProductsList!A111,\"AAAAACaxfyE=\")","v":{"$error":"#VALUE!"}},{"$f":"AND(ProductsList!B111,\"AAAAACaxfyI=\")","v":{"$error":"#VALUE!"}},{"$f":"AND(ProductsList!C111,\"AAAAACaxfyM=\")","v":{"$error":"#VALUE!"}},{"$f":"AND(ProductsList!D111,\"AAAAACaxfyQ=\")","v":{"$error":"#VALUE!"}},{"$f":"AND(ProductsList!E111,\"AAAAACaxfyU=\")","v":{"$error":"#VALUE!"}},{"$f":"AND(ProductsList!F111,\"AAAAACaxfyY=\")","v":{"$error":"#VALUE!"}},{"$f":"AND(ProductsList!G111,\"AAAAACaxfyc=\")","v":{"$error":"#VALUE!"}},{"$f":"IF(ProductsList!112:112,\"AAAAACaxfyg=\",0)","v":0},{"$f":"AND(ProductsList!A112,\"AAAAACaxfyk=\")","v":{"$error":"#VALUE!"}},{"$f":"AND(ProductsList!B112,\"AAAAACaxfyo=\")","v":{"$error":"#VALUE!"}},{"$f":"AND(ProductsList!C112,\"AAAAACaxfys=\")","v":{"$error":"#VALUE!"}},{"$f":"AND(ProductsList!D112,\"AAAAACaxfyw=\")","v":{"$error":"#VALUE!"}},{"$f":"AND(ProductsList!E112,\"AAAAACaxfy0=\")","v":{"$error":"#VALUE!"}},{"$f":"AND(ProductsList!F112,\"AAAAACaxfy4=\")","v":{"$error":"#VALUE!"}},{"$f":"AND(ProductsList!G112,\"AAAAACaxfy8=\")","v":{"$error":"#VALUE!"}},{"$f":"IF(ProductsList!113:113,\"AAAAACaxfzA=\",0)","v":0},{"$f":"AND(ProductsList!A113,\"AAAAACaxfzE=\")","v":{"$error":"#VALUE!"}},{"$f":"AND(ProductsList!B113,\"AAAAACaxfzI=\")","v":{"$error":"#VALUE!"}},{"$f":"AND(ProductsList!C113,\"AAAAACaxfzM=\")","v":{"$error":"#VALUE!"}},{"$f":"AND(ProductsList!D113,\"AAAAACaxfzQ=\")","v":{"$error":"#VALUE!"}},{"$f":"AND(ProductsList!E113,\"AAAAACaxfzU=\")","v":{"$error":"#VALUE!"}},{"$f":"AND(ProductsList!F113,\"AAAAACaxfzY=\")","v":{"$error":"#VALUE!"}},{"$f":"AND(ProductsList!G113,\"AAAAACaxfzc=\")","v":{"$error":"#VALUE!"}},{"$f":"IF(ProductsList!114:114,\"AAAAACaxfzg=\",0)","v":0},{"$f":"AND(ProductsList!A114,\"AAAAACaxfzk=\")","v":{"$error":"#VALUE!"}},{"$f":"AND(ProductsList!B114,\"AAAAACaxfzo=\")","v":{"$error":"#VALUE!"}},{"$f":"AND(ProductsList!C114,\"AAAAACaxfzs=\")","v":{"$error":"#VALUE!"}},{"$f":"AND(ProductsList!D114,\"AAAAACaxfzw=\")","v":{"$error":"#VALUE!"}},{"$f":"AND(ProductsList!E114,\"AAAAACaxfz0=\")","v":{"$error":"#VALUE!"}},{"$f":"AND(ProductsList!F114,\"AAAAACaxfz4=\")","v":{"$error":"#VALUE!"}},{"$f":"AND(ProductsList!G114,\"AAAAACaxfz8=\")","v":{"$error":"#VALUE!"}},{"$f":"IF(ProductsList!115:115,\"AAAAACaxf0A=\",0)","v":0},{"$f":"AND(ProductsList!A115,\"AAAAACaxf0E=\")","v":{"$error":"#VALUE!"}},{"$f":"AND(ProductsList!B115,\"AAAAACaxf0I=\")","v":{"$error":"#VALUE!"}},{"$f":"AND(ProductsList!C115,\"AAAAACaxf0M=\")","v":{"$error":"#VALUE!"}},{"$f":"AND(ProductsList!D115,\"AAAAACaxf0Q=\")","v":{"$error":"#VALUE!"}},{"$f":"AND(ProductsList!E115,\"AAAAACaxf0U=\")","v":{"$error":"#VALUE!"}},{"$f":"AND(ProductsList!F115,\"AAAAACaxf0Y=\")","v":{"$error":"#VALUE!"}},{"$f":"AND(ProductsList!G115,\"AAAAACaxf0c=\")","v":{"$error":"#VALUE!"}},{"$f":"IF(ProductsList!116:116,\"AAAAACaxf0g=\",0)","v":0},{"$f":"AND(ProductsList!A116,\"AAAAACaxf0k=\")","v":{"$error":"#VALUE!"}},{"$f":"AND(ProductsList!B116,\"AAAAACaxf0o=\")","v":{"$error":"#VALUE!"}},{"$f":"AND(ProductsList!C116,\"AAAAACaxf0s=\")","v":{"$error":"#VALUE!"}},{"$f":"AND(ProductsList!D116,\"AAAAACaxf0w=\")","v":{"$error":"#VALUE!"}},{"$f":"AND(ProductsList!E116,\"AAAAACaxf00=\")","v":{"$error":"#VALUE!"}},{"$f":"AND(ProductsList!F116,\"AAAAACaxf04=\")","v":{"$error":"#VALUE!"}},{"$f":"AND(ProductsList!G116,\"AAAAACaxf08=\")","v":{"$error":"#VALUE!"}},{"$f":"IF(ProductsList!117:117,\"AAAAACaxf1A=\",0)","v":0},{"$f":"AND(ProductsList!A117,\"AAAAACaxf1E=\")","v":{"$error":"#VALUE!"}},{"$f":"AND(ProductsList!B117,\"AAAAACaxf1I=\")","v":{"$error":"#VALUE!"}},{"$f":"AND(ProductsList!C117,\"AAAAACaxf1M=\")","v":{"$error":"#VALUE!"}},{"$f":"AND(ProductsList!D117,\"AAAAACaxf1Q=\")","v":{"$error":"#VALUE!"}},{"$f":"AND(ProductsList!E117,\"AAAAACaxf1U=\")","v":{"$error":"#VALUE!"}},{"$f":"AND(ProductsList!F117,\"AAAAACaxf1Y=\")","v":{"$error":"#VALUE!"}},{"$f":"AND(ProductsList!G117,\"AAAAACaxf1c=\")","v":{"$error":"#VALUE!"}},{"$f":"IF(ProductsList!118:118,\"AAAAACaxf1g=\",0)","v":0},{"$f":"AND(ProductsList!A118,\"AAAAACaxf1k=\")","v":{"$error":"#VALUE!"}},{"$f":"AND(ProductsList!B118,\"AAAAACaxf1o=\")","v":{"$error":"#VALUE!"}},{"$f":"AND(ProductsList!C118,\"AAAAACaxf1s=\")","v":{"$error":"#VALUE!"}},{"$f":"AND(ProductsList!D118,\"AAAAACaxf1w=\")","v":{"$error":"#VALUE!"}},{"$f":"AND(ProductsList!E118,\"AAAAACaxf10=\")","v":{"$error":"#VALUE!"}},{"$f":"AND(ProductsList!F118,\"AAAAACaxf14=\")","v":{"$error":"#VALUE!"}},{"$f":"AND(ProductsList!G118,\"AAAAACaxf18=\")","v":{"$error":"#VALUE!"}},{"$f":"IF(ProductsList!119:119,\"AAAAACaxf2A=\",0)","v":0},{"$f":"AND(ProductsList!A119,\"AAAAACaxf2E=\")","v":{"$error":"#VALUE!"}},{"$f":"AND(ProductsList!B119,\"AAAAACaxf2I=\")","v":{"$error":"#VALUE!"}},{"$f":"AND(ProductsList!C119,\"AAAAACaxf2M=\")","v":{"$error":"#VALUE!"}},{"$f":"AND(ProductsList!D119,\"AAAAACaxf2Q=\")","v":{"$error":"#VALUE!"}},{"$f":"AND(ProductsList!E119,\"AAAAACaxf2U=\")","v":{"$error":"#VALUE!"}},{"$f":"AND(ProductsList!F119,\"AAAAACaxf2Y=\")","v":{"$error":"#VALUE!"}},{"$f":"AND(ProductsList!G119,\"AAAAACaxf2c=\")","v":{"$error":"#VALUE!"}},{"$f":"IF(ProductsList!120:120,\"AAAAACaxf2g=\",0)","v":0},{"$f":"AND(ProductsList!A120,\"AAAAACaxf2k=\")","v":{"$error":"#VALUE!"}},{"$f":"AND(ProductsList!B120,\"AAAAACaxf2o=\")","v":{"$error":"#VALUE!"}},{"$f":"AND(ProductsList!C120,\"AAAAACaxf2s=\")","v":{"$error":"#VALUE!"}},{"$f":"AND(ProductsList!D120,\"AAAAACaxf2w=\")","v":{"$error":"#VALUE!"}},{"$f":"AND(ProductsList!E120,\"AAAAACaxf20=\")","v":{"$error":"#VALUE!"}},{"$f":"AND(ProductsList!F120,\"AAAAACaxf24=\")","v":{"$error":"#VALUE!"}},{"$f":"AND(ProductsList!G120,\"AAAAACaxf28=\")","v":{"$error":"#VALUE!"}},{"$f":"IF(ProductsList!121:121,\"AAAAACaxf3A=\",0)","v":0},{"$f":"AND(ProductsList!A121,\"AAAAACaxf3E=\")","v":{"$error":"#VALUE!"}},{"$f":"AND(ProductsList!B121,\"AAAAACaxf3I=\")","v":{"$error":"#VALUE!"}},{"$f":"AND(ProductsList!C121,\"AAAAACaxf3M=\")","v":{"$error":"#VALUE!"}},{"$f":"AND(ProductsList!D121,\"AAAAACaxf3Q=\")","v":{"$error":"#VALUE!"}},{"$f":"AND(ProductsList!E121,\"AAAAACaxf3U=\")","v":{"$error":"#VALUE!"}},{"$f":"AND(ProductsList!F121,\"AAAAACaxf3Y=\")","v":{"$error":"#VALUE!"}},{"$f":"AND(ProductsList!G121,\"AAAAACaxf3c=\")","v":{"$error":"#VALUE!"}},{"$f":"IF(ProductsList!122:122,\"AAAAACaxf3g=\",0)","v":0},{"$f":"AND(ProductsList!A122,\"AAAAACaxf3k=\")","v":{"$error":"#VALUE!"}},{"$f":"AND(ProductsList!B122,\"AAAAACaxf3o=\")","v":{"$error":"#VALUE!"}},{"$f":"AND(ProductsList!C122,\"AAAAACaxf3s=\")","v":{"$error":"#VALUE!"}},{"$f":"AND(ProductsList!D122,\"AAAAACaxf3w=\")","v":{"$error":"#VALUE!"}},{"$f":"AND(ProductsList!E122,\"AAAAACaxf30=\")","v":{"$error":"#VALUE!"}},{"$f":"AND(ProductsList!F122,\"AAAAACaxf34=\")","v":{"$error":"#VALUE!"}},{"$f":"AND(ProductsList!G122,\"AAAAACaxf38=\")","v":{"$error":"#VALUE!"}},{"$f":"IF(ProductsList!123:123,\"AAAAACaxf4A=\",0)","v":0},{"$f":"AND(ProductsList!A123,\"AAAAACaxf4E=\")","v":{"$error":"#VALUE!"}},{"$f":"AND(ProductsList!B123,\"AAAAACaxf4I=\")","v":{"$error":"#VALUE!"}},{"$f":"AND(ProductsList!C123,\"AAAAACaxf4M=\")","v":{"$error":"#VALUE!"}},{"$f":"AND(ProductsList!D123,\"AAAAACaxf4Q=\")","v":{"$error":"#VALUE!"}},{"$f":"AND(ProductsList!E123,\"AAAAACaxf4U=\")","v":{"$error":"#VALUE!"}},{"$f":"AND(ProductsList!F123,\"AAAAACaxf4Y=\")","v":{"$error":"#VALUE!"}},{"$f":"AND(ProductsList!G123,\"AAAAACaxf4c=\")","v":{"$error":"#VALUE!"}},{"$f":"IF(ProductsList!124:124,\"AAAAACaxf4g=\",0)","v":0},{"$f":"AND(ProductsList!A124,\"AAAAACaxf4k=\")","v":{"$error":"#VALUE!"}},{"$f":"AND(ProductsList!B124,\"AAAAACaxf4o=\")","v":{"$error":"#VALUE!"}},{"$f":"AND(ProductsList!C124,\"AAAAACaxf4s=\")","v":{"$error":"#VALUE!"}},{"$f":"AND(ProductsList!D124,\"AAAAACaxf4w=\")","v":{"$error":"#VALUE!"}},{"$f":"AND(ProductsList!E124,\"AAAAACaxf40=\")","v":{"$error":"#VALUE!"}},{"$f":"AND(ProductsList!F124,\"AAAAACaxf44=\")","v":{"$error":"#VALUE!"}},{"$f":"AND(ProductsList!G124,\"AAAAACaxf48=\")","v":{"$error":"#VALUE!"}},{"$f":"IF(ProductsList!125:125,\"AAAAACaxf5A=\",0)","v":0},{"$f":"AND(ProductsList!A125,\"AAAAACaxf5E=\")","v":{"$error":"#VALUE!"}},{"$f":"AND(ProductsList!B125,\"AAAAACaxf5I=\")","v":{"$error":"#VALUE!"}},{"$f":"AND(ProductsList!C125,\"AAAAACaxf5M=\")","v":{"$error":"#VALUE!"}},{"$f":"AND(ProductsList!D125,\"AAAAACaxf5Q=\")","v":{"$error":"#VALUE!"}},{"$f":"AND(ProductsList!E125,\"AAAAACaxf5U=\")","v":{"$error":"#VALUE!"}},{"$f":"AND(ProductsList!F125,\"AAAAACaxf5Y=\")","v":{"$error":"#VALUE!"}},{"$f":"AND(ProductsList!G125,\"AAAAACaxf5c=\")","v":{"$error":"#VALUE!"}},{"$f":"IF(ProductsList!126:126,\"AAAAACaxf5g=\",0)","v":0},{"$f":"AND(ProductsList!A126,\"AAAAACaxf5k=\")","v":{"$error":"#VALUE!"}},{"$f":"AND(ProductsList!B126,\"AAAAACaxf5o=\")","v":{"$error":"#VALUE!"}},{"$f":"AND(ProductsList!C126,\"AAAAACaxf5s=\")","v":{"$error":"#VALUE!"}},{"$f":"AND(ProductsList!D126,\"AAAAACaxf5w=\")","v":{"$error":"#VALUE!"}},{"$f":"AND(ProductsList!E126,\"AAAAACaxf50=\")","v":{"$error":"#VALUE!"}},{"$f":"AND(ProductsList!F126,\"AAAAACaxf54=\")","v":{"$error":"#VALUE!"}},{"$f":"AND(ProductsList!G126,\"AAAAACaxf58=\")","v":{"$error":"#VALUE!"}},{"$f":"IF(ProductsList!127:127,\"AAAAACaxf6A=\",0)","v":0},{"$f":"AND(ProductsList!A127,\"AAAAACaxf6E=\")","v":{"$error":"#VALUE!"}},{"$f":"AND(ProductsList!B127,\"AAAAACaxf6I=\")","v":{"$error":"#VALUE!"}},{"$f":"AND(ProductsList!C127,\"AAAAACaxf6M=\")","v":{"$error":"#VALUE!"}},{"$f":"AND(ProductsList!D127,\"AAAAACaxf6Q=\")","v":{"$error":"#VALUE!"}},{"$f":"AND(ProductsList!E127,\"AAAAACaxf6U=\")","v":{"$error":"#VALUE!"}},{"$f":"AND(ProductsList!F127,\"AAAAACaxf6Y=\")","v":{"$error":"#VALUE!"}},{"$f":"AND(ProductsList!G127,\"AAAAACaxf6c=\")","v":{"$error":"#VALUE!"}},{"$f":"IF(ProductsList!128:128,\"AAAAACaxf6g=\",0)","v":0},{"$f":"AND(ProductsList!A128,\"AAAAACaxf6k=\")","v":{"$error":"#VALUE!"}},{"$f":"AND(ProductsList!B128,\"AAAAACaxf6o=\")","v":{"$error":"#VALUE!"}},{"$f":"AND(ProductsList!C128,\"AAAAACaxf6s=\")","v":{"$error":"#VALUE!"}},{"$f":"AND(ProductsList!D128,\"AAAAACaxf6w=\")","v":{"$error":"#VALUE!"}},{"$f":"AND(ProductsList!E128,\"AAAAACaxf60=\")","v":{"$error":"#VALUE!"}},{"$f":"AND(ProductsList!F128,\"AAAAACaxf64=\")","v":{"$error":"#VALUE!"}},{"$f":"AND(ProductsList!G128,\"AAAAACaxf68=\")","v":{"$error":"#VALUE!"}},{"$f":"IF(ProductsList!129:129,\"AAAAACaxf7A=\",0)","v":0},{"$f":"AND(ProductsList!A129,\"AAAAACaxf7E=\")","v":{"$error":"#VALUE!"}},{"$f":"AND(ProductsList!B129,\"AAAAACaxf7I=\")","v":{"$error":"#VALUE!"}},{"$f":"AND(ProductsList!C129,\"AAAAACaxf7M=\")","v":{"$error":"#VALUE!"}},{"$f":"AND(ProductsList!D129,\"AAAAACaxf7Q=\")","v":{"$error":"#VALUE!"}},{"$f":"AND(ProductsList!E129,\"AAAAACaxf7U=\")","v":{"$error":"#VALUE!"}},{"$f":"AND(ProductsList!F129,\"AAAAACaxf7Y=\")","v":{"$error":"#VALUE!"}},{"$f":"AND(ProductsList!G129,\"AAAAACaxf7c=\")","v":{"$error":"#VALUE!"}},{"$f":"IF(ProductsList!130:130,\"AAAAACaxf7g=\",0)","v":0},{"$f":"AND(ProductsList!A130,\"AAAAACaxf7k=\")","v":{"$error":"#VALUE!"}},{"$f":"AND(ProductsList!B130,\"AAAAACaxf7o=\")","v":{"$error":"#VALUE!"}},{"$f":"AND(ProductsList!C130,\"AAAAACaxf7s=\")","v":{"$error":"#VALUE!"}},{"$f":"AND(ProductsList!D130,\"AAAAACaxf7w=\")","v":{"$error":"#VALUE!"}},{"$f":"AND(ProductsList!E130,\"AAAAACaxf70=\")","v":{"$error":"#VALUE!"}},{"$f":"AND(ProductsList!F130,\"AAAAACaxf74=\")","v":{"$error":"#VALUE!"}},{"$f":"AND(ProductsList!G130,\"AAAAACaxf78=\")","v":{"$error":"#VALUE!"}},{"$f":"IF(ProductsList!131:131,\"AAAAACaxf8A=\",0)","v":0},{"$f":"AND(ProductsList!A131,\"AAAAACaxf8E=\")","v":{"$error":"#VALUE!"}},{"$f":"AND(ProductsList!B131,\"AAAAACaxf8I=\")","v":{"$error":"#VALUE!"}},{"$f":"AND(ProductsList!C131,\"AAAAACaxf8M=\")","v":{"$error":"#VALUE!"}},{"$f":"AND(ProductsList!D131,\"AAAAACaxf8Q=\")","v":{"$error":"#VALUE!"}},{"$f":"AND(ProductsList!E131,\"AAAAACaxf8U=\")","v":{"$error":"#VALUE!"}},{"$f":"AND(ProductsList!F131,\"AAAAACaxf8Y=\")","v":{"$error":"#VALUE!"}},{"$f":"AND(ProductsList!G131,\"AAAAACaxf8c=\")","v":{"$error":"#VALUE!"}},{"$f":"IF(ProductsList!132:132,\"AAAAACaxf8g=\",0)","v":0},{"$f":"AND(ProductsList!A132,\"AAAAACaxf8k=\")","v":{"$error":"#VALUE!"}},{"$f":"AND(ProductsList!B132,\"AAAAACaxf8o=\")","v":{"$error":"#VALUE!"}},{"$f":"AND(ProductsList!C132,\"AAAAACaxf8s=\")","v":{"$error":"#VALUE!"}},{"$f":"AND(ProductsList!D132,\"AAAAACaxf8w=\")","v":{"$error":"#VALUE!"}},{"$f":"AND(ProductsList!E132,\"AAAAACaxf80=\")","v":{"$error":"#VALUE!"}},{"$f":"AND(ProductsList!F132,\"AAAAACaxf84=\")","v":{"$error":"#VALUE!"}},{"$f":"AND(ProductsList!G132,\"AAAAACaxf88=\")","v":{"$error":"#VALUE!"}},{"$f":"IF(ProductsList!133:133,\"AAAAACaxf9A=\",0)","v":0},{"$f":"AND(ProductsList!A133,\"AAAAACaxf9E=\")","v":{"$error":"#VALUE!"}},{"$f":"AND(ProductsList!B133,\"AAAAACaxf9I=\")","v":{"$error":"#VALUE!"}},{"$f":"AND(ProductsList!C133,\"AAAAACaxf9M=\")","v":{"$error":"#VALUE!"}},{"$f":"AND(ProductsList!D133,\"AAAAACaxf9Q=\")","v":{"$error":"#VALUE!"}},{"$f":"AND(ProductsList!E133,\"AAAAACaxf9U=\")","v":{"$error":"#VALUE!"}},{"$f":"AND(ProductsList!F133,\"AAAAACaxf9Y=\")","v":{"$error":"#VALUE!"}},{"$f":"AND(ProductsList!G133,\"AAAAACaxf9c=\")","v":{"$error":"#VALUE!"}},{"$f":"IF(ProductsList!134:134,\"AAAAACaxf9g=\",0)","v":0},{"$f":"AND(ProductsList!A134,\"AAAAACaxf9k=\")","v":{"$error":"#VALUE!"}},{"$f":"AND(ProductsList!B134,\"AAAAACaxf9o=\")","v":{"$error":"#VALUE!"}},{"$f":"AND(ProductsList!C134,\"AAAAACaxf9s=\")","v":{"$error":"#VALUE!"}},{"$f":"AND(ProductsList!D134,\"AAAAACaxf9w=\")","v":{"$error":"#VALUE!"}},{"$f":"AND(ProductsList!E134,\"AAAAACaxf90=\")","v":{"$error":"#VALUE!"}},{"$f":"AND(ProductsList!F134,\"AAAAACaxf94=\")","v":{"$error":"#VALUE!"}},{"$f":"AND(ProductsList!G134,\"AAAAACaxf98=\")","v":{"$error":"#VALUE!"}},{"$f":"IF(ProductsList!135:135,\"AAAAACaxf+A=\",0)","v":0},{"$f":"AND(ProductsList!A135,\"AAAAACaxf+E=\")","v":{"$error":"#VALUE!"}},{"$f":"AND(ProductsList!B135,\"AAAAACaxf+I=\")","v":{"$error":"#VALUE!"}},{"$f":"AND(ProductsList!C135,\"AAAAACaxf+M=\")","v":{"$error":"#VALUE!"}},{"$f":"AND(ProductsList!D135,\"AAAAACaxf+Q=\")","v":{"$error":"#VALUE!"}},{"$f":"AND(ProductsList!E135,\"AAAAACaxf+U=\")","v":{"$error":"#VALUE!"}},{"$f":"AND(ProductsList!F135,\"AAAAACaxf+Y=\")","v":{"$error":"#VALUE!"}},{"$f":"AND(ProductsList!G135,\"AAAAACaxf+c=\")","v":{"$error":"#VALUE!"}},{"$f":"IF(ProductsList!136:136,\"AAAAACaxf+g=\",0)","v":0},{"$f":"AND(ProductsList!A136,\"AAAAACaxf+k=\")","v":{"$error":"#VALUE!"}},{"$f":"AND(ProductsList!B136,\"AAAAACaxf+o=\")","v":{"$error":"#VALUE!"}},{"$f":"AND(ProductsList!C136,\"AAAAACaxf+s=\")","v":{"$error":"#VALUE!"}},{"$f":"AND(ProductsList!D136,\"AAAAACaxf+w=\")","v":{"$error":"#VALUE!"}},{"$f":"AND(ProductsList!E136,\"AAAAACaxf+0=\")","v":{"$error":"#VALUE!"}},{"$f":"AND(ProductsList!F136,\"AAAAACaxf+4=\")","v":{"$error":"#VALUE!"}},{"$f":"AND(ProductsList!G136,\"AAAAACaxf+8=\")","v":{"$error":"#VALUE!"}},{"$f":"IF(ProductsList!137:137,\"AAAAACaxf/A=\",0)","v":0},{"$f":"AND(ProductsList!A137,\"AAAAACaxf/E=\")","v":{"$error":"#VALUE!"}},{"$f":"AND(ProductsList!B137,\"AAAAACaxf/I=\")","v":{"$error":"#VALUE!"}},{"$f":"AND(ProductsList!C137,\"AAAAACaxf/M=\")","v":{"$error":"#VALUE!"}},{"$f":"AND(ProductsList!D137,\"AAAAACaxf/Q=\")","v":{"$error":"#VALUE!"}},{"$f":"AND(ProductsList!E137,\"AAAAACaxf/U=\")","v":{"$error":"#VALUE!"}},{"$f":"AND(ProductsList!F137,\"AAAAACaxf/Y=\")","v":{"$error":"#VALUE!"}},{"$f":"AND(ProductsList!G137,\"AAAAACaxf/c=\")","v":{"$error":"#VALUE!"}},{"$f":"IF(ProductsList!138:138,\"AAAAACaxf/g=\",0)","v":0},{"$f":"AND(ProductsList!A138,\"AAAAACaxf/k=\")","v":{"$error":"#VALUE!"}},{"$f":"AND(ProductsList!B138,\"AAAAACaxf/o=\")","v":{"$error":"#VALUE!"}},{"$f":"AND(ProductsList!C138,\"AAAAACaxf/s=\")","v":{"$error":"#VALUE!"}},{"$f":"AND(ProductsList!D138,\"AAAAACaxf/w=\")","v":{"$error":"#VALUE!"}},{"$f":"AND(ProductsList!E138,\"AAAAACaxf/0=\")","v":{"$error":"#VALUE!"}},{"$f":"AND(ProductsList!F138,\"AAAAACaxf/4=\")","v":{"$error":"#VALUE!"}},{"$f":"AND(ProductsList!G138,\"AAAAACaxf/8=\")","v":{"$error":"#VALUE!"}}]
[{"$f":"IF(ProductsList!139:139,\"AAAAAF72tQA=\",0)","v":0},{"$f":"AND(ProductsList!A139,\"AAAAAF72tQE=\")","v":{"$error":"#VALUE!"}},{"$f":"AND(ProductsList!B139,\"AAAAAF72tQI=\")","v":{"$error":"#VALUE!"}},{"$f":"AND(ProductsList!C139,\"AAAAAF72tQM=\")","v":{"$error":"#VALUE!"}},{"$f":"AND(ProductsList!D139,\"AAAAAF72tQQ=\")","v":{"$error":"#VALUE!"}},{"$f":"AND(ProductsList!E139,\"AAAAAF72tQU=\")","v":{"$error":"#VALUE!"}},{"$f":"AND(ProductsList!F139,\"AAAAAF72tQY=\")","v":{"$error":"#VALUE!"}},{"$f":"AND(ProductsList!G139,\"AAAAAF72tQc=\")","v":{"$error":"#VALUE!"}},{"$f":"IF(ProductsList!140:140,\"AAAAAF72tQg=\",0)","v":0},{"$f":"AND(ProductsList!A140,\"AAAAAF72tQk=\")","v":{"$error":"#VALUE!"}},{"$f":"AND(ProductsList!B140,\"AAAAAF72tQo=\")","v":{"$error":"#VALUE!"}},{"$f":"AND(ProductsList!C140,\"AAAAAF72tQs=\")","v":{"$error":"#VALUE!"}},{"$f":"AND(ProductsList!D140,\"AAAAAF72tQw=\")","v":{"$error":"#VALUE!"}},{"$f":"AND(ProductsList!E140,\"AAAAAF72tQ0=\")","v":{"$error":"#VALUE!"}},{"$f":"AND(ProductsList!F140,\"AAAAAF72tQ4=\")","v":{"$error":"#VALUE!"}},{"$f":"AND(ProductsList!G140,\"AAAAAF72tQ8=\")","v":{"$error":"#VALUE!"}},{"$f":"IF(ProductsList!141:141,\"AAAAAF72tRA=\",0)","v":0},{"$f":"AND(ProductsList!A141,\"AAAAAF72tRE=\")","v":{"$error":"#VALUE!"}},{"$f":"AND(ProductsList!B141,\"AAAAAF72tRI=\")","v":{"$error":"#VALUE!"}},{"$f":"AND(ProductsList!C141,\"AAAAAF72tRM=\")","v":{"$error":"#VALUE!"}},{"$f":"AND(ProductsList!D141,\"AAAAAF72tRQ=\")","v":{"$error":"#VALUE!"}},{"$f":"AND(ProductsList!E141,\"AAAAAF72tRU=\")","v":{"$error":"#VALUE!"}},{"$f":"AND(ProductsList!F141,\"AAAAAF72tRY=\")","v":{"$error":"#VALUE!"}},{"$f":"AND(ProductsList!G141,\"AAAAAF72tRc=\")","v":{"$error":"#VALUE!"}},{"$f":"IF(ProductsList!142:142,\"AAAAAF72tRg=\",0)","v":0},{"$f":"AND(ProductsList!A142,\"AAAAAF72tRk=\")","v":{"$error":"#VALUE!"}},{"$f":"AND(ProductsList!B142,\"AAAAAF72tRo=\")","v":{"$error":"#VALUE!"}},{"$f":"AND(ProductsList!C142,\"AAAAAF72tRs=\")","v":{"$error":"#VALUE!"}},{"$f":"AND(ProductsList!D142,\"AAAAAF72tRw=\")","v":{"$error":"#VALUE!"}},{"$f":"AND(ProductsList!E142,\"AAAAAF72tR0=\")","v":{"$error":"#VALUE!"}},{"$f":"AND(ProductsList!F142,\"AAAAAF72tR4=\")","v":{"$error":"#VALUE!"}},{"$f":"AND(ProductsList!G142,\"AAAAAF72tR8=\")","v":{"$error":"#VALUE!"}},{"$f":"IF(ProductsList!143:143,\"AAAAAF72tSA=\",0)","v":0},{"$f":"AND(ProductsList!A143,\"AAAAAF72tSE=\")","v":{"$error":"#VALUE!"}},{"$f":"AND(ProductsList!B143,\"AAAAAF72tSI=\")","v":{"$error":"#VALUE!"}},{"$f":"AND(ProductsList!C143,\"AAAAAF72tSM=\")","v":{"$error":"#VALUE!"}},{"$f":"AND(ProductsList!D143,\"AAAAAF72tSQ=\")","v":{"$error":"#VALUE!"}},{"$f":"AND(ProductsList!E143,\"AAAAAF72tSU=\")","v":{"$error":"#VALUE!"}},{"$f":"AND(ProductsList!F143,\"AAAAAF72tSY=\")","v":{"$error":"#VALUE!"}},{"$f":"AND(ProductsList!G143,\"AAAAAF72tSc=\")","v":{"$error":"#VALUE!"}},{"$f":"IF(ProductsList!144:144,\"AAAAAF72tSg=\",0)","v":0},{"$f":"AND(ProductsList!A144,\"AAAAAF72tSk=\")","v":{"$error":"#VALUE!"}},{"$f":"AND(ProductsList!B144,\"AAAAAF72tSo=\")","v":{"$error":"#VALUE!"}},{"$f":"AND(ProductsList!C144,\"AAAAAF72tSs=\")","v":{"$error":"#VALUE!"}},{"$f":"AND(ProductsList!D144,\"AAAAAF72tSw=\")","v":{"$error":"#VALUE!"}},{"$f":"AND(ProductsList!E144,\"AAAAAF72tS0=\")","v":{"$error":"#VALUE!"}},{"$f":"AND(ProductsList!F144,\"AAAAAF72tS4=\")","v":{"$error":"#VALUE!"}},{"$f":"AND(ProductsList!G144,\"AAAAAF72tS8=\")","v":{"$error":"#VALUE!"}},{"$f":"IF(ProductsList!145:145,\"AAAAAF72tTA=\",0)","v":0},{"$f":"AND(ProductsList!A145,\"AAAAAF72tTE=\")","v":{"$error":"#VALUE!"}},{"$f":"AND(ProductsList!B145,\"AAAAAF72tTI=\")","v":{"$error":"#VALUE!"}},{"$f":"AND(ProductsList!C145,\"AAAAAF72tTM=\")","v":{"$error":"#VALUE!"}},{"$f":"AND(ProductsList!D145,\"AAAAAF72tTQ=\")","v":{"$error":"#VALUE!"}},{"$f":"AND(ProductsList!E145,\"AAAAAF72tTU=\")","v":{"$error":"#VALUE!"}},{"$f":"AND(ProductsList!F145,\"AAAAAF72tTY=\")","v":{"$error":"#VALUE!"}},{"$f":"AND(ProductsList!G145,\"AAAAAF72tTc=\")","v":{"$error":"#VALUE!"}},{"$f":"IF(ProductsList!146:146,\"AAAAAF72tTg=\",0)","v":0},{"$f":"AND(ProductsList!A146,\"AAAAAF72tTk=\")","v":{"$error":"#VALUE!"}},{"$f":"AND(ProductsList!B146,\"AAAAAF72tTo=\")","v":{"$error":"#VALUE!"}},{"$f":"AND(ProductsList!C146,\"AAAAAF72tTs=\")","v":{"$error":"#VALUE!"}},{"$f":"AND(ProductsList!D146,\"AAAAAF72tTw=\")","v":{"$error":"#VALUE!"}},{"$f":"AND(ProductsList!E146,\"AAAAAF72tT0=\")","v":{"$error":"#VALUE!"}},{"$f":"AND(ProductsList!F146,\"AAAAAF72tT4=\")","v":{"$error":"#VALUE!"}},{"$f":"AND(ProductsList!G146,\"AAAAAF72tT8=\")","v":{"$error":"#VALUE!"}},{"$f":"IF(ProductsList!147:147,\"AAAAAF72tUA=\",0)","v":0},{"$f":"AND(ProductsList!A147,\"AAAAAF72tUE=\")","v":{"$error":"#VALUE!"}},{"$f":"AND(ProductsList!B147,\"AAAAAF72tUI=\")","v":{"$error":"#VALUE!"}},{"$f":"AND(ProductsList!C147,\"AAAAAF72tUM=\")","v":{"$error":"#VALUE!"}},{"$f":"AND(ProductsList!D147,\"AAAAAF72tUQ=\")","v":{"$error":"#VALUE!"}},{"$f":"AND(ProductsList!E147,\"AAAAAF72tUU=\")","v":{"$error":"#VALUE!"}},{"$f":"AND(ProductsList!F147,\"AAAAAF72tUY=\")","v":{"$error":"#VALUE!"}},{"$f":"AND(ProductsList!G147,\"AAAAAF72tUc=\")","v":{"$error":"#VALUE!"}},{"$f":"IF(ProductsList!148:148,\"AAAAAF72tUg=\",0)","v":0},{"$f":"AND(ProductsList!A148,\"AAAAAF72tUk=\")","v":{"$error":"#VALUE!"}},{"$f":"AND(ProductsList!B148,\"AAAAAF72tUo=\")","v":{"$error":"#VALUE!"}},{"$f":"AND(ProductsList!C148,\"AAAAAF72tUs=\")","v":{"$error":"#VALUE!"}},{"$f":"AND(ProductsList!D148,\"AAAAAF72tUw=\")","v":{"$error":"#VALUE!"}},{"$f":"AND(ProductsList!E148,\"AAAAAF72tU0=\")","v":{"$error":"#VALUE!"}},{"$f":"AND(ProductsList!F148,\"AAAAAF72tU4=\")","v":{"$error":"#VALUE!"}},{"$f":"AND(ProductsList!G148,\"AAAAAF72tU8=\")","v":{"$error":"#VALUE!"}},{"$f":"IF(ProductsList!149:149,\"AAAAAF72tVA=\",0)","v":0},{"$f":"AND(ProductsList!A149,\"AAAAAF72tVE=\")","v":{"$error":"#VALUE!"}},{"$f":"AND(ProductsList!B149,\"AAAAAF72tVI=\")","v":{"$error":"#VALUE!"}},{"$f":"AND(ProductsList!C149,\"AAAAAF72tVM=\")","v":{"$error":"#VALUE!"}},{"$f":"AND(ProductsList!D149,\"AAAAAF72tVQ=\")","v":{"$error":"#VALUE!"}},{"$f":"AND(ProductsList!E149,\"AAAAAF72tVU=\")","v":{"$error":"#VALUE!"}},{"$f":"AND(ProductsList!F149,\"AAAAAF72tVY=\")","v":{"$error":"#VALUE!"}},{"$f":"AND(ProductsList!G149,\"AAAAAF72tVc=\")","v":{"$error":"#VALUE!"}},{"$f":"IF(ProductsList!150:150,\"AAAAAF72tVg=\",0)","v":0},{"$f":"AND(ProductsList!A150,\"AAAAAF72tVk=\")","v":{"$error":"#VALUE!"}},{"$f":"AND(ProductsList!B150,\"AAAAAF72tVo=\")","v":{"$error":"#VALUE!"}},{"$f":"AND(ProductsList!C150,\"AAAAAF72tVs=\")","v":{"$error":"#VALUE!"}},{"$f":"AND(ProductsList!D150,\"AAAAAF72tVw=\")","v":{"$error":"#VALUE!"}},{"$f":"AND(ProductsList!E150,\"AAAAAF72tV0=\")","v":{"$error":"#VALUE!"}},{"$f":"AND(ProductsList!F150,\"AAAAAF72tV4=\")","v":{"$error":"#VALUE!"}},{"$f":"AND(ProductsList!G150,\"AAAAAF72tV8=\")","v":{"$error":"#VALUE!"}},{"$f":"IF(ProductsList!151:151,\"AAAAAF72tWA=\",0)","v":0},{"$f":"AND(ProductsList!A151,\"AAAAAF72tWE=\")","v":{"$error":"#VALUE!"}},{"$f":"AND(ProductsList!B151,\"AAAAAF72tWI=\")","v":{"$error":"#VALUE!"}},{"$f":"AND(ProductsList!C151,\"AAAAAF72tWM=\")","v":{"$error":"#VALUE!"}},{"$f":"AND(ProductsList!D151,\"AAAAAF72tWQ=\")","v":{"$error":"#VALUE!"}},{"$f":"AND(ProductsList!E151,\"AAAAAF72tWU=\")","v":{"$error":"#VALUE!"}},{"$f":"AND(ProductsList!F151,\"AAAAAF72tWY=\")","v":{"$error":"#VALUE!"}},{"$f":"AND(ProductsList!G151,\"AAAAAF72tWc=\")","v":{"$error":"#VALUE!"}},{"$f":"IF(ProductsList!152:152,\"AAAAAF72tWg=\",0)","v":0},{"$f":"AND(ProductsList!A152,\"AAAAAF72tWk=\")","v":{"$error":"#VALUE!"}},{"$f":"AND(ProductsList!B152,\"AAAAAF72tWo=\")","v":{"$error":"#VALUE!"}},{"$f":"AND(ProductsList!C152,\"AAAAAF72tWs=\")","v":{"$error":"#VALUE!"}},{"$f":"AND(ProductsList!D152,\"AAAAAF72tWw=\")","v":{"$error":"#VALUE!"}},{"$f":"AND(ProductsList!E152,\"AAAAAF72tW0=\")","v":{"$error":"#VALUE!"}},{"$f":"AND(ProductsList!F152,\"AAAAAF72tW4=\")","v":{"$error":"#VALUE!"}},{"$f":"AND(ProductsList!G152,\"AAAAAF72tW8=\")","v":{"$error":"#VALUE!"}},{"$f":"IF(ProductsList!153:153,\"AAAAAF72tXA=\",0)","v":0},{"$f":"AND(ProductsList!A153,\"AAAAAF72tXE=\")","v":{"$error":"#VALUE!"}},{"$f":"AND(ProductsList!B153,\"AAAAAF72tXI=\")","v":{"$error":"#VALUE!"}},{"$f":"AND(ProductsList!C153,\"AAAAAF72tXM=\")","v":{"$error":"#VALUE!"}},{"$f":"AND(ProductsList!D153,\"AAAAAF72tXQ=\")","v":{"$error":"#VALUE!"}},{"$f":"AND(ProductsList!E153,\"AAAAAF72tXU=\")","v":{"$error":"#VALUE!"}},{"$f":"AND(ProductsList!F153,\"AAAAAF72tXY=\")","v":{"$error":"#VALUE!"}},{"$f":"AND(ProductsList!G153,\"AAAAAF72tXc=\")","v":{"$error":"#VALUE!"}},{"$f":"IF(ProductsList!154:154,\"AAAAAF72tXg=\",0)","v":0},{"$f":"AND(ProductsList!A154,\"AAAAAF72tXk=\")","v":{"$error":"#VALUE!"}},{"$f":"AND(ProductsList!B154,\"AAAAAF72tXo=\")","v":{"$error":"#VALUE!"}},{"$f":"AND(ProductsList!C154,\"AAAAAF72tXs=\")","v":{"$error":"#VALUE!"}},{"$f":"AND(ProductsList!D154,\"AAAAAF72tXw=\")","v":{"$error":"#VALUE!"}},{"$f":"AND(ProductsList!E154,\"AAAAAF72tX0=\")","v":{"$error":"#VALUE!"}},{"$f":"AND(ProductsList!F154,\"AAAAAF72tX4=\")","v":{"$error":"#VALUE!"}},{"$f":"AND(ProductsList!G154,\"AAAAAF72tX8=\")","v":{"$error":"#VALUE!"}},{"$f":"IF(ProductsList!A:A,\"AAAAAF72tYA=\",0)","v":{"$error":"#VALUE!"}},{"$f":"IF(ProductsList!B:B,\"AAAAAF72tYE=\",0)","v":{"$error":"#VALUE!"}},{"$f":"IF(ProductsList!C:C,\"AAAAAF72tYI=\",0)","v":"AAAAAF72tYI="},{"$f":"IF(ProductsList!D:D,\"AAAAAF72tYM=\",0)","v":{"$error":"#VALUE!"}},{"$f":"IF(ProductsList!E:E,\"AAAAAF72tYQ=\",0)","v":{"$error":"#VALUE!"}},{"$f":"IF(ProductsList!F:F,\"AAAAAF72tYU=\",0)","v":{"$error":"#VALUE!"}},{"$f":"IF(ProductsList!G:G,\"AAAAAF72tYY=\",0)","v":{"$error":"#VALUE!"}},{"$f":"IF(ProductsList!H:H,\"AAAAAF72tYc=\",0)","v":0},{"$f":"IF(ProductsList!I:I,\"AAAAAF72tYg=\",0)","v":0},{"$f":"IF(ProductsList!J:J,\"AAAAAF72tYk=\",0)","v":{"$error":"#VALUE!"}},{"$f":"IF(ProductsList!K:K,\"AAAAAF72tYo=\",0)","v":{"$error":"#VALUE!"}},{"$f":"IF(ProductsList!L:L,\"AAAAAF72tYs=\",0)","v":{"$error":"#VALUE!"}},{"$f":"IF(ProductsList!M:M,\"AAAAAF72tYw=\",0)","v":"AAAAAF72tYw="},{"$f":"IF(ProductsList!N:N,\"AAAAAF72tY0=\",0)","v":{"$error":"#VALUE!"}},{"$f":"IF(ProductsList!O:O,\"AAAAAF72tY4=\",0)","v":{"$error":"#VALUE!"}},{"$f":"IF(ProductsList!P:P,\"AAAAAF72tY8=\",0)","v":0},{"$f":"IF(ProductsList!Q:Q,\"AAAAAF72tZA=\",0)","v":{"$error":"#VALUE!"}},{"$f":"IF(ProductsList!R:R,\"AAAAAF72tZE=\",0)","v":{"$error":"#VALUE!"}},{"$f":"IF(ProductsList!S:S,\"AAAAAF72tZI=\",0)","v":{"$error":"#VALUE!"}},{"$f":"IF(ProductsList!T:T,\"AAAAAF72tZM=\",0)","v":0},{"$f":"IF(ProductsList!U:U,\"AAAAAF72tZQ=\",0)","v":{"$error":"#VALUE!"}},{"$f":"IF(ProductsList!V:V,\"AAAAAF72tZU=\",0)","v":0},{"$f":"IF(ProductsList!W:W,\"AAAAAF72tZY=\",0)","v":0},{"$f":"IF(CoolerLabelsShelves!1:1,\"AAAAAF72tZc=\",0)","v":0},{"$f":"AND(CoolerLabelsShelves!A1,\"AAAAAF72tZg=\")","v":{"$error":"#VALUE!"}},{"$f":"AND(CoolerLabelsShelves!B1,\"AAAAAF72tZk=\")","v":{"$error":"#VALUE!"}},{"$f":"AND(CoolerLabelsShelves!C1,\"AAAAAF72tZo=\")","v":{"$error":"#VALUE!"}},{"$f":"AND(CoolerLabelsShelves!D1,\"AAAAAF72tZs=\")","v":{"$error":"#VALUE!"}},{"$f":"AND(CoolerLabelsShelves!E1,\"AAAAAF72tZw=\")","v":{"$error":"#VALUE!"}},{"$f":"AND(CoolerLabelsShelves!F1,\"AAAAAF72tZ0=\")","v":{"$error":"#VALUE!"}},{"$f":"AND(CoolerLabelsShelves!G1,\"AAAAAF72tZ4=\")","v":{"$error":"#VALUE!"}},{"$f":"AND(CoolerLabelsShelves!H1,\"AAAAAF72tZ8=\")","v":{"$error":"#VALUE!"}},{"$f":"AND(CoolerLabelsShelves!I1,\"AAAAAF72taA=\")","v":{"$error":"#VALUE!"}},{"$f":"AND(CoolerLabelsShelves!J1,\"AAAAAF72taE=\")","v":{"$error":"#VALUE!"}},{"$f":"AND(CoolerLabelsShelves!K1,\"AAAAAF72taI=\")","v":{"$error":"#VALUE!"}},{"$f":"AND(CoolerLabelsShelves!L1,\"AAAAAF72taM=\")","v":{"$error":"#VALUE!"}},{"$f":"AND(CoolerLabelsShelves!M1,\"AAAAAF72taQ=\")","v":{"$error":"#VALUE!"}},{"$f":"AND(CoolerLabelsShelves!N1,\"AAAAAF72taU=\")","v":{"$error":"#VALUE!"}},{"$f":"AND(CoolerLabelsShelves!O1,\"AAAAAF72taY=\")","v":{"$error":"#VALUE!"}},{"$f":"AND(CoolerLabelsShelves!P1,\"AAAAAF72tac=\")","v":{"$error":"#VALUE!"}},{"$f":"AND(CoolerLabelsShelves!Q1,\"AAAAAF72tag=\")","v":{"$error":"#VALUE!"}},{"$f":"AND(CoolerLabelsShelves!R1,\"AAAAAF72tak=\")","v":{"$error":"#VALUE!"}},{"$f":"AND(CoolerLabelsShelves!S1,\"AAAAAF72tao=\")","v":{"$error":"#VALUE!"}},{"$f":"AND(CoolerLabelsShelves!T1,\"AAAAAF72tas=\")","v":{"$error":"#VALUE!"}},{"$f":"AND(CoolerLabelsShelves!U1,\"AAAAAF72taw=\")","v":{"$error":"#VALUE!"}},{"$f":"AND(CoolerLabelsShelves!V1,\"AAAAAF72ta0=\")","v":{"$error":"#VALUE!"}},{"$f":"AND(CoolerLabelsShelves!W1,\"AAAAAF72ta4=\")","v":{"$error":"#VALUE!"}},{"$f":"AND(CoolerLabelsShelves!X1,\"AAAAAF72ta8=\")","v":{"$error":"#VALUE!"}},{"$f":"AND(CoolerLabelsShelves!Y1,\"AAAAAF72tbA=\")","v":{"$error":"#VALUE!"}},{"$f":"AND(CoolerLabelsShelves!Z1,\"AAAAAF72tbE=\")","v":{"$error":"#VALUE!"}},{"$f":"AND(CoolerLabelsShelves!AA1,\"AAAAAF72tbI=\")","v":{"$error":"#VALUE!"}},{"$f":"IF(CoolerLabelsShelves!2:2,\"AAAAAF72tbM=\",0)","v":0},{"$f":"AND(CoolerLabelsShelves!A2,\"AAAAAF72tbQ=\")","v":{"$error":"#VALUE!"}},{"$f":"AND(CoolerLabelsShelves!B2,\"AAAAAF72tbU=\")","v":{"$error":"#VALUE!"}},{"$f":"AND(CoolerLabelsShelves!C2,\"AAAAAF72tbY=\")","v":{"$error":"#VALUE!"}},{"$f":"AND(CoolerLabelsShelves!D2,\"AAAAAF72tbc=\")","v":{"$error":"#VALUE!"}},{"$f":"AND(CoolerLabelsShelves!E2,\"AAAAAF72tbg=\")","v":{"$error":"#VALUE!"}},{"$f":"AND(CoolerLabelsShelves!F2,\"AAAAAF72tbk=\")","v":{"$error":"#VALUE!"}},{"$f":"AND(CoolerLabelsShelves!G2,\"AAAAAF72tbo=\")","v":{"$error":"#VALUE!"}},{"$f":"AND(CoolerLabelsShelves!H2,\"AAAAAF72tbs=\")","v":{"$error":"#VALUE!"}},{"$f":"AND(CoolerLabelsShelves!I2,\"AAAAAF72tbw=\")","v":{"$error":"#VALUE!"}},{"$f":"AND(CoolerLabelsShelves!J2,\"AAAAAF72tb0=\")","v":{"$error":"#VALUE!"}},{"$f":"AND(CoolerLabelsShelves!K2,\"AAAAAF72tb4=\")","v":{"$error":"#VALUE!"}},{"$f":"AND(CoolerLabelsShelves!L2,\"AAAAAF72tb8=\")","v":{"$error":"#VALUE!"}},{"$f":"AND(CoolerLabelsShelves!M2,\"AAAAAF72tcA=\")","v":{"$error":"#VALUE!"}},{"$f":"AND(CoolerLabelsShelves!N2,\"AAAAAF72tcE=\")","v":{"$error":"#VALUE!"}},{"$f":"AND(CoolerLabelsShelves!O2,\"AAAAAF72tcI=\")","v":{"$error":"#VALUE!"}},{"$f":"AND(CoolerLabelsShelves!P2,\"AAAAAF72tcM=\")","v":{"$error":"#VALUE!"}},{"$f":"AND(CoolerLabelsShelves!Q2,\"AAAAAF72tcQ=\")","v":{"$error":"#VALUE!"}},{"$f":"AND(CoolerLabelsShelves!R2,\"AAAAAF72tcU=\")","v":{"$error":"#VALUE!"}},{"$f":"AND(CoolerLabelsShelves!S2,\"AAAAAF72tcY=\")","v":{"$error":"#VALUE!"}},{"$f":"AND(CoolerLabelsShelves!T2,\"AAAAAF72tcc=\")","v":{"$error":"#VALUE!"}},{"$f":"AND(CoolerLabelsShelves!U2,\"AAAAAF72tcg=\")","v":{"$error":"#VALUE!"}},{"$f":"AND(CoolerLabelsShelves!V2,\"AAAAAF72tck=\")","v":{"$error":"#VALUE!"}},{"$f":"AND(CoolerLabelsShelves!W2,\"AAAAAF72tco=\")","v":{"$error":"#VALUE!"}},{"$f":"AND(CoolerLabelsShelves!X2,\"AAAAAF72tcs=\")","v":{"$error":"#VALUE!"}},{"$f":"AND(CoolerLabelsShelves!Y2,\"AAAAAF72tcw=\")","v":{"$error":"#VALUE!"}},{"$f":"AND(CoolerLabelsShelves!Z2,\"AAAAAF72tc0=\")","v":{"$error":"#VALUE!"}},{"$f":"AND(CoolerLabelsShelves!AA2,\"AAAAAF72tc4=\")","v":{"$error":"#VALUE!"}},{"$f":"IF(CoolerLabelsShelves!3:3,\"AAAAAF72tc8=\",0)","v":0},{"$f":"AND(CoolerLabelsShelves!A3,\"AAAAAF72tdA=\")","v":{"$error":"#VALUE!"}},{"$f":"AND(CoolerLabelsShelves!B3,\"AAAAAF72tdE=\")","v":{"$error":"#VALUE!"}},{"$f":"AND(CoolerLabelsShelves!C3,\"AAAAAF72tdI=\")","v":{"$error":"#VALUE!"}},{"$f":"AND(CoolerLabelsShelves!D3,\"AAAAAF72tdM=\")","v":{"$error":"#VALUE!"}},{"$f":"AND(CoolerLabelsShelves!E3,\"AAAAAF72tdQ=\")","v":{"$error":"#VALUE!"}},{"$f":"AND(CoolerLabelsShelves!F3,\"AAAAAF72tdU=\")","v":{"$error":"#VALUE!"}},{"$f":"AND(CoolerLabelsShelves!G3,\"AAAAAF72tdY=\")","v":{"$error":"#VALUE!"}},{"$f":"AND(CoolerLabelsShelves!H3,\"AAAAAF72tdc=\")","v":{"$error":"#VALUE!"}},{"$f":"AND(CoolerLabelsShelves!I3,\"AAAAAF72tdg=\")","v":{"$error":"#VALUE!"}},{"$f":"AND(CoolerLabelsShelves!J3,\"AAAAAF72tdk=\")","v":{"$error":"#VALUE!"}},{"$f":"AND(CoolerLabelsShelves!K3,\"AAAAAF72tdo=\")","v":{"$error":"#VALUE!"}},{"$f":"AND(CoolerLabelsShelves!L3,\"AAAAAF72tds=\")","v":{"$error":"#VALUE!"}},{"$f":"AND(CoolerLabelsShelves!M3,\"AAAAAF72tdw=\")","v":{"$error":"#VALUE!"}},{"$f":"AND(CoolerLabelsShelves!N3,\"AAAAAF72td0=\")","v":{"$error":"#VALUE!"}},{"$f":"AND(CoolerLabelsShelves!O3,\"AAAAAF72td4=\")","v":{"$error":"#VALUE!"}},{"$f":"AND(CoolerLabelsShelves!P3,\"AAAAAF72td8=\")","v":{"$error":"#VALUE!"}},{"$f":"AND(CoolerLabelsShelves!Q3,\"AAAAAF72teA=\")","v":{"$error":"#VALUE!"}},{"$f":"AND(CoolerLabelsShelves!R3,\"AAAAAF72teE=\")","v":{"$error":"#VALUE!"}},{"$f":"AND(CoolerLabelsShelves!S3,\"AAAAAF72teI=\")","v":{"$error":"#VALUE!"}},{"$f":"AND(CoolerLabelsShelves!T3,\"AAAAAF72teM=\")","v":{"$error":"#VALUE!"}},{"$f":"AND(CoolerLabelsShelves!U3,\"AAAAAF72teQ=\")","v":{"$error":"#VALUE!"}},{"$f":"AND(CoolerLabelsShelves!V3,\"AAAAAF72teU=\")","v":{"$error":"#VALUE!"}},{"$f":"AND(CoolerLabelsShelves!W3,\"AAAAAF72teY=\")","v":{"$error":"#VALUE!"}},{"$f":"AND(CoolerLabelsShelves!X3,\"AAAAAF72tec=\")","v":{"$error":"#VALUE!"}},{"$f":"AND(CoolerLabelsShelves!Y3,\"AAAAAF72teg=\")","v":{"$error":"#VALUE!"}},{"$f":"AND(CoolerLabelsShelves!Z3,\"AAAAAF72tek=\")","v":{"$error":"#VALUE!"}},{"$f":"AND(CoolerLabelsShelves!AA3,\"AAAAAF72teo=\")","v":{"$error":"#VALUE!"}},{"$f":"IF(CoolerLabelsShelves!4:4,\"AAAAAF72tes=\",0)","v":0},{"$f":"AND(CoolerLabelsShelves!A4,\"AAAAAF72tew=\")","v":{"$error":"#VALUE!"}},{"$f":"AND(CoolerLabelsShelves!B4,\"AAAAAF72te0=\")","v":{"$error":"#VALUE!"}},{"$f":"AND(CoolerLabelsShelves!C4,\"AAAAAF72te4=\")","v":{"$error":"#VALUE!"}},{"$f":"AND(CoolerLabelsShelves!D4,\"AAAAAF72te8=\")","v":{"$error":"#VALUE!"}},{"$f":"AND(CoolerLabelsShelves!E4,\"AAAAAF72tfA=\")","v":{"$error":"#VALUE!"}},{"$f":"AND(CoolerLabelsShelves!F4,\"AAAAAF72tfE=\")","v":{"$error":"#VALUE!"}},{"$f":"AND(CoolerLabelsShelves!G4,\"AAAAAF72tfI=\")","v":{"$error":"#VALUE!"}},{"$f":"AND(CoolerLabelsShelves!H4,\"AAAAAF72tfM=\")","v":{"$error":"#VALUE!"}},{"$f":"AND(CoolerLabelsShelves!I4,\"AAAAAF72tfQ=\")","v":{"$error":"#VALUE!"}},{"$f":"AND(CoolerLabelsShelves!J4,\"AAAAAF72tfU=\")","v":{"$error":"#VALUE!"}},{"$f":"AND(CoolerLabelsShelves!K4,\"AAAAAF72tfY=\")","v":{"$error":"#VALUE!"}},{"$f":"AND(CoolerLabelsShelves!L4,\"AAAAAF72tfc=\")","v":{"$error":"#VALUE!"}},{"$f":"AND(CoolerLabelsShelves!M4,\"AAAAAF72tfg=\")","v":{"$error":"#VALUE!"}},{"$f":"AND(CoolerLabelsShelves!N4,\"AAAAAF72tfk=\")","v":{"$error":"#VALUE!"}},{"$f":"AND(CoolerLabelsShelves!O4,\"AAAAAF72tfo=\")","v":{"$error":"#VALUE!"}},{"$f":"AND(CoolerLabelsShelves!P4,\"AAAAAF72tfs=\")","v":{"$error":"#VALUE!"}},{"$f":"AND(CoolerLabelsShelves!Q4,\"AAAAAF72tfw=\")","v":{"$error":"#VALUE!"}},{"$f":"AND(CoolerLabelsShelves!R4,\"AAAAAF72tf0=\")","v":{"$error":"#VALUE!"}},{"$f":"AND(CoolerLabelsShelves!S4,\"AAAAAF72tf4=\")","v":{"$error":"#VALUE!"}},{"$f":"AND(CoolerLabelsShelves!T4,\"AAAAAF72tf8=\")","v":{"$error":"#VALUE!"}}]
[{"$f":"AND(CoolerLabelsShelves!U4,\"AAAAAG/xGQA=\")","v":{"$error":"#VALUE!"}},{"$f":"AND(CoolerLabelsShelves!V4,\"AAAAAG/xGQE=\")","v":{"$error":"#VALUE!"}},{"$f":"AND(CoolerLabelsShelves!W4,\"AAAAAG/xGQI=\")","v":{"$error":"#VALUE!"}},{"$f":"AND(CoolerLabelsShelves!X4,\"AAAAAG/xGQM=\")","v":{"$error":"#VALUE!"}},{"$f":"AND(CoolerLabelsShelves!Y4,\"AAAAAG/xGQQ=\")","v":{"$error":"#VALUE!"}},{"$f":"AND(CoolerLabelsShelves!Z4,\"AAAAAG/xGQU=\")","v":{"$error":"#VALUE!"}},{"$f":"AND(CoolerLabelsShelves!AA4,\"AAAAAG/xGQY=\")","v":{"$error":"#VALUE!"}},{"$f":"IF(CoolerLabelsShelves!5:5,\"AAAAAG/xGQc=\",0)","v":0},{"$f":"AND(CoolerLabelsShelves!A5,\"AAAAAG/xGQg=\")","v":{"$error":"#VALUE!"}},{"$f":"AND(CoolerLabelsShelves!B5,\"AAAAAG/xGQk=\")","v":{"$error":"#VALUE!"}},{"$f":"AND(CoolerLabelsShelves!C5,\"AAAAAG/xGQo=\")","v":{"$error":"#VALUE!"}},{"$f":"AND(CoolerLabelsShelves!D5,\"AAAAAG/xGQs=\")","v":{"$error":"#VALUE!"}},{"$f":"AND(CoolerLabelsShelves!E5,\"AAAAAG/xGQw=\")","v":{"$error":"#VALUE!"}},{"$f":"AND(CoolerLabelsShelves!F5,\"AAAAAG/xGQ0=\")","v":{"$error":"#VALUE!"}},{"$f":"AND(CoolerLabelsShelves!G5,\"AAAAAG/xGQ4=\")","v":{"$error":"#VALUE!"}},{"$f":"AND(CoolerLabelsShelves!H5,\"AAAAAG/xGQ8=\")","v":{"$error":"#VALUE!"}},{"$f":"AND(CoolerLabelsShelves!I5,\"AAAAAG/xGRA=\")","v":{"$error":"#VALUE!"}},{"$f":"AND(CoolerLabelsShelves!J5,\"AAAAAG/xGRE=\")","v":{"$error":"#VALUE!"}},{"$f":"AND(CoolerLabelsShelves!K5,\"AAAAAG/xGRI=\")","v":{"$error":"#VALUE!"}},{"$f":"AND(CoolerLabelsShelves!L5,\"AAAAAG/xGRM=\")","v":{"$error":"#VALUE!"}},{"$f":"AND(CoolerLabelsShelves!M5,\"AAAAAG/xGRQ=\")","v":{"$error":"#VALUE!"}},{"$f":"AND(CoolerLabelsShelves!N5,\"AAAAAG/xGRU=\")","v":{"$error":"#VALUE!"}},{"$f":"AND(CoolerLabelsShelves!O5,\"AAAAAG/xGRY=\")","v":{"$error":"#VALUE!"}},{"$f":"AND(CoolerLabelsShelves!P5,\"AAAAAG/xGRc=\")","v":{"$error":"#VALUE!"}},{"$f":"AND(CoolerLabelsShelves!Q5,\"AAAAAG/xGRg=\")","v":{"$error":"#VALUE!"}},{"$f":"AND(CoolerLabelsShelves!R5,\"AAAAAG/xGRk=\")","v":{"$error":"#VALUE!"}},{"$f":"AND(CoolerLabelsShelves!S5,\"AAAAAG/xGRo=\")","v":{"$error":"#VALUE!"}},{"$f":"AND(CoolerLabelsShelves!T5,\"AAAAAG/xGRs=\")","v":{"$error":"#VALUE!"}},{"$f":"AND(CoolerLabelsShelves!U5,\"AAAAAG/xGRw=\")","v":{"$error":"#VALUE!"}},{"$f":"AND(CoolerLabelsShelves!V5,\"AAAAAG/xGR0=\")","v":{"$error":"#VALUE!"}},{"$f":"AND(CoolerLabelsShelves!W5,\"AAAAAG/xGR4=\")","v":{"$error":"#VALUE!"}},{"$f":"AND(CoolerLabelsShelves!X5,\"AAAAAG/xGR8=\")","v":{"$error":"#VALUE!"}},{"$f":"AND(CoolerLabelsShelves!Y5,\"AAAAAG/xGSA=\")","v":{"$error":"#VALUE!"}},{"$f":"AND(CoolerLabelsShelves!Z5,\"AAAAAG/xGSE=\")","v":{"$error":"#VALUE!"}},{"$f":"AND(CoolerLabelsShelves!AA5,\"AAAAAG/xGSI=\")","v":{"$error":"#VALUE!"}},{"$f":"IF(CoolerLabelsShelves!6:6,\"AAAAAG/xGSM=\",0)","v":0},{"$f":"AND(CoolerLabelsShelves!A6,\"AAAAAG/xGSQ=\")","v":{"$error":"#VALUE!"}},{"$f":"AND(CoolerLabelsShelves!B6,\"AAAAAG/xGSU=\")","v":{"$error":"#VALUE!"}},{"$f":"AND(CoolerLabelsShelves!C6,\"AAAAAG/xGSY=\")","v":{"$error":"#VALUE!"}},{"$f":"AND(CoolerLabelsShelves!D6,\"AAAAAG/xGSc=\")","v":{"$error":"#VALUE!"}},{"$f":"AND(CoolerLabelsShelves!E6,\"AAAAAG/xGSg=\")","v":{"$error":"#VALUE!"}},{"$f":"AND(CoolerLabelsShelves!F6,\"AAAAAG/xGSk=\")","v":{"$error":"#VALUE!"}},{"$f":"AND(CoolerLabelsShelves!G6,\"AAAAAG/xGSo=\")","v":{"$error":"#VALUE!"}},{"$f":"AND(CoolerLabelsShelves!H6,\"AAAAAG/xGSs=\")","v":{"$error":"#VALUE!"}},{"$f":"AND(CoolerLabelsShelves!I6,\"AAAAAG/xGSw=\")","v":{"$error":"#VALUE!"}},{"$f":"AND(CoolerLabelsShelves!J6,\"AAAAAG/xGS0=\")","v":{"$error":"#VALUE!"}},{"$f":"AND(CoolerLabelsShelves!K6,\"AAAAAG/xGS4=\")","v":{"$error":"#VALUE!"}},{"$f":"AND(CoolerLabelsShelves!L6,\"AAAAAG/xGS8=\")","v":{"$error":"#VALUE!"}},{"$f":"AND(CoolerLabelsShelves!M6,\"AAAAAG/xGTA=\")","v":{"$error":"#VALUE!"}},{"$f":"AND(CoolerLabelsShelves!N6,\"AAAAAG/xGTE=\")","v":{"$error":"#VALUE!"}},{"$f":"AND(CoolerLabelsShelves!O6,\"AAAAAG/xGTI=\")","v":{"$error":"#VALUE!"}},{"$f":"AND(CoolerLabelsShelves!P6,\"AAAAAG/xGTM=\")","v":{"$error":"#VALUE!"}},{"$f":"AND(CoolerLabelsShelves!Q6,\"AAAAAG/xGTQ=\")","v":{"$error":"#VALUE!"}},{"$f":"AND(CoolerLabelsShelves!R6,\"AAAAAG/xGTU=\")","v":{"$error":"#VALUE!"}},{"$f":"AND(CoolerLabelsShelves!S6,\"AAAAAG/xGTY=\")","v":{"$error":"#VALUE!"}},{"$f":"AND(CoolerLabelsShelves!T6,\"AAAAAG/xGTc=\")","v":{"$error":"#VALUE!"}},{"$f":"AND(CoolerLabelsShelves!U6,\"AAAAAG/xGTg=\")","v":{"$error":"#VALUE!"}},{"$f":"AND(CoolerLabelsShelves!V6,\"AAAAAG/xGTk=\")","v":{"$error":"#VALUE!"}},{"$f":"AND(CoolerLabelsShelves!W6,\"AAAAAG/xGTo=\")","v":{"$error":"#VALUE!"}},{"$f":"AND(CoolerLabelsShelves!X6,\"AAAAAG/xGTs=\")","v":{"$error":"#VALUE!"}},{"$f":"AND(CoolerLabelsShelves!Y6,\"AAAAAG/xGTw=\")","v":{"$error":"#VALUE!"}},{"$f":"AND(CoolerLabelsShelves!Z6,\"AAAAAG/xGT0=\")","v":{"$error":"#VALUE!"}},{"$f":"AND(CoolerLabelsShelves!AA6,\"AAAAAG/xGT4=\")","v":{"$error":"#VALUE!"}},{"$f":"IF(CoolerLabelsShelves!7:7,\"AAAAAG/xGT8=\",0)","v":0},{"$f":"AND(CoolerLabelsShelves!A7,\"AAAAAG/xGUA=\")","v":{"$error":"#VALUE!"}},{"$f":"AND(CoolerLabelsShelves!B7,\"AAAAAG/xGUE=\")","v":{"$error":"#VALUE!"}},{"$f":"AND(CoolerLabelsShelves!C7,\"AAAAAG/xGUI=\")","v":{"$error":"#VALUE!"}},{"$f":"AND(CoolerLabelsShelves!D7,\"AAAAAG/xGUM=\")","v":{"$error":"#VALUE!"}},{"$f":"AND(CoolerLabelsShelves!E7,\"AAAAAG/xGUQ=\")","v":{"$error":"#VALUE!"}},{"$f":"AND(CoolerLabelsShelves!F7,\"AAAAAG/xGUU=\")","v":{"$error":"#VALUE!"}},{"$f":"AND(CoolerLabelsShelves!G7,\"AAAAAG/xGUY=\")","v":{"$error":"#VALUE!"}},{"$f":"AND(CoolerLabelsShelves!H7,\"AAAAAG/xGUc=\")","v":{"$error":"#VALUE!"}},{"$f":"AND(CoolerLabelsShelves!I7,\"AAAAAG/xGUg=\")","v":{"$error":"#VALUE!"}},{"$f":"AND(CoolerLabelsShelves!J7,\"AAAAAG/xGUk=\")","v":{"$error":"#VALUE!"}},{"$f":"AND(CoolerLabelsShelves!K7,\"AAAAAG/xGUo=\")","v":{"$error":"#VALUE!"}},{"$f":"AND(CoolerLabelsShelves!L7,\"AAAAAG/xGUs=\")","v":{"$error":"#VALUE!"}},{"$f":"AND(CoolerLabelsShelves!M7,\"AAAAAG/xGUw=\")","v":{"$error":"#VALUE!"}},{"$f":"AND(CoolerLabelsShelves!N7,\"AAAAAG/xGU0=\")","v":{"$error":"#VALUE!"}},{"$f":"AND(CoolerLabelsShelves!O7,\"AAAAAG/xGU4=\")","v":{"$error":"#VALUE!"}},{"$f":"AND(CoolerLabelsShelves!P7,\"AAAAAG/xGU8=\")","v":{"$error":"#VALUE!"}},{"$f":"AND(CoolerLabelsShelves!Q7,\"AAAAAG/xGVA=\")","v":{"$error":"#VALUE!"}},{"$f":"AND(CoolerLabelsShelves!R7,\"AAAAAG/xGVE=\")","v":{"$error":"#VALUE!"}},{"$f":"AND(CoolerLabelsShelves!S7,\"AAAAAG/xGVI=\")","v":{"$error":"#VALUE!"}},{"$f":"AND(CoolerLabelsShelves!T7,\"AAAAAG/xGVM=\")","v":{"$error":"#VALUE!"}},{"$f":"AND(CoolerLabelsShelves!U7,\"AAAAAG/xGVQ=\")","v":{"$error":"#VALUE!"}},{"$f":"AND(CoolerLabelsShelves!V7,\"AAAAAG/xGVU=\")","v":{"$error":"#VALUE!"}},{"$f":"AND(CoolerLabelsShelves!W7,\"AAAAAG/xGVY=\")","v":{"$error":"#VALUE!"}},{"$f":"AND(CoolerLabelsShelves!X7,\"AAAAAG/xGVc=\")","v":{"$error":"#VALUE!"}},{"$f":"AND(CoolerLabelsShelves!Y7,\"AAAAAG/xGVg=\")","v":{"$error":"#VALUE!"}},{"$f":"AND(CoolerLabelsShelves!Z7,\"AAAAAG/xGVk=\")","v":{"$error":"#VALUE!"}},{"$f":"AND(CoolerLabelsShelves!AA7,\"AAAAAG/xGVo=\")","v":{"$error":"#VALUE!"}},{"$f":"IF(CoolerLabelsShelves!8:8,\"AAAAAG/xGVs=\",0)","v":0},{"$f":"AND(CoolerLabelsShelves!A8,\"AAAAAG/xGVw=\")","v":{"$error":"#VALUE!"}},{"$f":"AND(CoolerLabelsShelves!B8,\"AAAAAG/xGV0=\")","v":{"$error":"#VALUE!"}},{"$f":"AND(CoolerLabelsShelves!C8,\"AAAAAG/xGV4=\")","v":{"$error":"#VALUE!"}},{"$f":"AND(CoolerLabelsShelves!D8,\"AAAAAG/xGV8=\")","v":{"$error":"#VALUE!"}},{"$f":"AND(CoolerLabelsShelves!E8,\"AAAAAG/xGWA=\")","v":{"$error":"#VALUE!"}},{"$f":"AND(CoolerLabelsShelves!F8,\"AAAAAG/xGWE=\")","v":{"$error":"#VALUE!"}},{"$f":"AND(CoolerLabelsShelves!G8,\"AAAAAG/xGWI=\")","v":{"$error":"#VALUE!"}},{"$f":"AND(CoolerLabelsShelves!H8,\"AAAAAG/xGWM=\")","v":{"$error":"#VALUE!"}},{"$f":"AND(CoolerLabelsShelves!I8,\"AAAAAG/xGWQ=\")","v":{"$error":"#VALUE!"}},{"$f":"AND(CoolerLabelsShelves!J8,\"AAAAAG/xGWU=\")","v":{"$error":"#VALUE!"}},{"$f":"AND(CoolerLabelsShelves!K8,\"AAAAAG/xGWY=\")","v":{"$error":"#VALUE!"}},{"$f":"AND(CoolerLabelsShelves!L8,\"AAAAAG/xGWc=\")","v":{"$error":"#VALUE!"}},{"$f":"AND(CoolerLabelsShelves!M8,\"AAAAAG/xGWg=\")","v":{"$error":"#VALUE!"}},{"$f":"AND(CoolerLabelsShelves!N8,\"AAAAAG/xGWk=\")","v":{"$error":"#VALUE!"}},{"$f":"AND(CoolerLabelsShelves!O8,\"AAAAAG/xGWo=\")","v":{"$error":"#VALUE!"}},{"$f":"AND(CoolerLabelsShelves!P8,\"AAAAAG/xGWs=\")","v":{"$error":"#VALUE!"}},{"$f":"AND(CoolerLabelsShelves!Q8,\"AAAAAG/xGWw=\")","v":{"$error":"#VALUE!"}},{"$f":"AND(CoolerLabelsShelves!R8,\"AAAAAG/xGW0=\")","v":{"$error":"#VALUE!"}},{"$f":"AND(CoolerLabelsShelves!S8,\"AAAAAG/xGW4=\")","v":{"$error":"#VALUE!"}},{"$f":"AND(CoolerLabelsShelves!T8,\"AAAAAG/xGW8=\")","v":{"$error":"#VALUE!"}},{"$f":"AND(CoolerLabelsShelves!U8,\"AAAAAG/xGXA=\")","v":{"$error":"#VALUE!"}},{"$f":"AND(CoolerLabelsShelves!V8,\"AAAAAG/xGXE=\")","v":{"$error":"#VALUE!"}},{"$f":"AND(CoolerLabelsShelves!W8,\"AAAAAG/xGXI=\")","v":{"$error":"#VALUE!"}},{"$f":"AND(CoolerLabelsShelves!X8,\"AAAAAG/xGXM=\")","v":{"$error":"#VALUE!"}},{"$f":"AND(CoolerLabelsShelves!Y8,\"AAAAAG/xGXQ=\")","v":{"$error":"#VALUE!"}},{"$f":"AND(CoolerLabelsShelves!Z8,\"AAAAAG/xGXU=\")","v":{"$error":"#VALUE!"}},{"$f":"AND(CoolerLabelsShelves!AA8,\"AAAAAG/xGXY=\")","v":{"$error":"#VALUE!"}},{"$f":"IF(CoolerLabelsShelves!9:9,\"AAAAAG/xGXc=\",0)","v":0},{"$f":"AND(CoolerLabelsShelves!A9,\"AAAAAG/xGXg=\")","v":{"$error":"#VALUE!"}},{"$f":"AND(CoolerLabelsShelves!B9,\"AAAAAG/xGXk=\")","v":{"$error":"#VALUE!"}},{"$f":"AND(CoolerLabelsShelves!C9,\"AAAAAG/xGXo=\")","v":{"$error":"#VALUE!"}},{"$f":"AND(CoolerLabelsShelves!D9,\"AAAAAG/xGXs=\")","v":{"$error":"#VALUE!"}},{"$f":"AND(CoolerLabelsShelves!E9,\"AAAAAG/xGXw=\")","v":{"$error":"#VALUE!"}},{"$f":"AND(CoolerLabelsShelves!F9,\"AAAAAG/xGX0=\")","v":{"$error":"#VALUE!"}},{"$f":"AND(CoolerLabelsShelves!G9,\"AAAAAG/xGX4=\")","v":{"$error":"#VALUE!"}},{"$f":"AND(CoolerLabelsShelves!H9,\"AAAAAG/xGX8=\")","v":{"$error":"#VALUE!"}},{"$f":"AND(CoolerLabelsShelves!I9,\"AAAAAG/xGYA=\")","v":{"$error":"#VALUE!"}},{"$f":"AND(CoolerLabelsShelves!J9,\"AAAAAG/xGYE=\")","v":{"$error":"#VALUE!"}},{"$f":"AND(CoolerLabelsShelves!K9,\"AAAAAG/xGYI=\")","v":{"$error":"#VALUE!"}},{"$f":"AND(CoolerLabelsShelves!L9,\"AAAAAG/xGYM=\")","v":{"$error":"#VALUE!"}},{"$f":"AND(CoolerLabelsShelves!M9,\"AAAAAG/xGYQ=\")","v":{"$error":"#VALUE!"}},{"$f":"AND(CoolerLabelsShelves!N9,\"AAAAAG/xGYU=\")","v":{"$error":"#VALUE!"}},{"$f":"AND(CoolerLabelsShelves!O9,\"AAAAAG/xGYY=\")","v":{"$error":"#VALUE!"}},{"$f":"AND(CoolerLabelsShelves!P9,\"AAAAAG/xGYc=\")","v":{"$error":"#VALUE!"}},{"$f":"AND(CoolerLabelsShelves!Q9,\"AAAAAG/xGYg=\")","v":{"$error":"#VALUE!"}},{"$f":"AND(CoolerLabelsShelves!R9,\"AAAAAG/xGYk=\")","v":{"$error":"#VALUE!"}},{"$f":"AND(CoolerLabelsShelves!S9,\"AAAAAG/xGYo=\")","v":{"$error":"#VALUE!"}},{"$f":"AND(CoolerLabelsShelves!T9,\"AAAAAG/xGYs=\")","v":{"$error":"#VALUE!"}},{"$f":"AND(CoolerLabelsShelves!U9,\"AAAAAG/xGYw=\")","v":{"$error":"#VALUE!"}},{"$f":"AND(CoolerLabelsShelves!V9,\"AAAAAG/xGY0=\")","v":{"$error":"#VALUE!"}},{"$f":"AND(CoolerLabelsShelves!W9,\"AAAAAG/xGY4=\")","v":{"$error":"#VALUE!"}},{"$f":"AND(CoolerLabelsShelves!X9,\"AAAAAG/xGY8=\")","v":{"$error":"#VALUE!"}},{"$f":"AND(CoolerLabelsShelves!Y9,\"AAAAAG/xGZA=\")","v":{"$error":"#VALUE!"}},{"$f":"AND(CoolerLabelsShelves!Z9,\"AAAAAG/xGZE=\")","v":{"$error":"#VALUE!"}},{"$f":"AND(CoolerLabelsShelves!AA9,\"AAAAAG/xGZI=\")","v":{"$error":"#VALUE!"}},{"$f":"IF(CoolerLabelsShelves!10:10,\"AAAAAG/xGZM=\",0)","v":0},{"$f":"AND(CoolerLabelsShelves!A10,\"AAAAAG/xGZQ=\")","v":{"$error":"#VALUE!"}},{"$f":"AND(CoolerLabelsShelves!B10,\"AAAAAG/xGZU=\")","v":{"$error":"#VALUE!"}},{"$f":"AND(CoolerLabelsShelves!C10,\"AAAAAG/xGZY=\")","v":{"$error":"#VALUE!"}},{"$f":"AND(CoolerLabelsShelves!D10,\"AAAAAG/xGZc=\")","v":{"$error":"#VALUE!"}},{"$f":"AND(CoolerLabelsShelves!E10,\"AAAAAG/xGZg=\")","v":{"$error":"#VALUE!"}},{"$f":"AND(CoolerLabelsShelves!F10,\"AAAAAG/xGZk=\")","v":{"$error":"#VALUE!"}},{"$f":"AND(CoolerLabelsShelves!G10,\"AAAAAG/xGZo=\")","v":{"$error":"#VALUE!"}},{"$f":"AND(CoolerLabelsShelves!H10,\"AAAAAG/xGZs=\")","v":{"$error":"#VALUE!"}},{"$f":"AND(CoolerLabelsShelves!I10,\"AAAAAG/xGZw=\")","v":{"$error":"#VALUE!"}},{"$f":"AND(CoolerLabelsShelves!J10,\"AAAAAG/xGZ0=\")","v":{"$error":"#VALUE!"}},{"$f":"AND(CoolerLabelsShelves!K10,\"AAAAAG/xGZ4=\")","v":{"$error":"#VALUE!"}},{"$f":"AND(CoolerLabelsShelves!L10,\"AAAAAG/xGZ8=\")","v":{"$error":"#VALUE!"}},{"$f":"AND(CoolerLabelsShelves!M10,\"AAAAAG/xGaA=\")","v":{"$error":"#VALUE!"}},{"$f":"AND(CoolerLabelsShelves!N10,\"AAAAAG/xGaE=\")","v":{"$error":"#VALUE!"}},{"$f":"AND(CoolerLabelsShelves!O10,\"AAAAAG/xGaI=\")","v":{"$error":"#VALUE!"}},{"$f":"AND(CoolerLabelsShelves!P10,\"AAAAAG/xGaM=\")","v":{"$error":"#VALUE!"}},{"$f":"AND(CoolerLabelsShelves!Q10,\"AAAAAG/xGaQ=\")","v":{"$error":"#VALUE!"}},{"$f":"AND(CoolerLabelsShelves!R10,\"AAAAAG/xGaU=\")","v":{"$error":"#VALUE!"}},{"$f":"AND(CoolerLabelsShelves!S10,\"AAAAAG/xGaY=\")","v":{"$error":"#VALUE!"}},{"$f":"AND(CoolerLabelsShelves!T10,\"AAAAAG/xGac=\")","v":{"$error":"#VALUE!"}},{"$f":"AND(CoolerLabelsShelves!U10,\"AAAAAG/xGag=\")","v":{"$error":"#VALUE!"}},{"$f":"AND(CoolerLabelsShelves!V10,\"AAAAAG/xGak=\")","v":{"$error":"#VALUE!"}},{"$f":"AND(CoolerLabelsShelves!W10,\"AAAAAG/xGao=\")","v":{"$error":"#VALUE!"}},{"$f":"AND(CoolerLabelsShelves!X10,\"AAAAAG/xGas=\")","v":{"$error":"#VALUE!"}},{"$f":"AND(CoolerLabelsShelves!Y10,\"AAAAAG/xGaw=\")","v":{"$error":"#VALUE!"}},{"$f":"AND(CoolerLabelsShelves!Z10,\"AAAAAG/xGa0=\")","v":{"$error":"#VALUE!"}},{"$f":"AND(CoolerLabelsShelves!AA10,\"AAAAAG/xGa4=\")","v":{"$error":"#VALUE!"}},{"$f":"IF(CoolerLabelsShelves!11:11,\"AAAAAG/xGa8=\",0)","v":0},{"$f":"AND(CoolerLabelsShelves!A11,\"AAAAAG/xGbA=\")","v":{"$error":"#VALUE!"}},{"$f":"AND(CoolerLabelsShelves!B11,\"AAAAAG/xGbE=\")","v":{"$error":"#VALUE!"}},{"$f":"AND(CoolerLabelsShelves!C11,\"AAAAAG/xGbI=\")","v":{"$error":"#VALUE!"}},{"$f":"AND(CoolerLabelsShelves!D11,\"AAAAAG/xGbM=\")","v":{"$error":"#VALUE!"}},{"$f":"AND(CoolerLabelsShelves!E11,\"AAAAAG/xGbQ=\")","v":{"$error":"#VALUE!"}},{"$f":"AND(CoolerLabelsShelves!F11,\"AAAAAG/xGbU=\")","v":{"$error":"#VALUE!"}},{"$f":"AND(CoolerLabelsShelves!G11,\"AAAAAG/xGbY=\")","v":{"$error":"#VALUE!"}},{"$f":"AND(CoolerLabelsShelves!H11,\"AAAAAG/xGbc=\")","v":{"$error":"#VALUE!"}},{"$f":"AND(CoolerLabelsShelves!I11,\"AAAAAG/xGbg=\")","v":{"$error":"#VALUE!"}},{"$f":"AND(CoolerLabelsShelves!J11,\"AAAAAG/xGbk=\")","v":{"$error":"#VALUE!"}},{"$f":"AND(CoolerLabelsShelves!K11,\"AAAAAG/xGbo=\")","v":{"$error":"#VALUE!"}},{"$f":"AND(CoolerLabelsShelves!L11,\"AAAAAG/xGbs=\")","v":{"$error":"#VALUE!"}},{"$f":"AND(CoolerLabelsShelves!M11,\"AAAAAG/xGbw=\")","v":{"$error":"#VALUE!"}},{"$f":"AND(CoolerLabelsShelves!N11,\"AAAAAG/xGb0=\")","v":{"$error":"#VALUE!"}},{"$f":"AND(CoolerLabelsShelves!O11,\"AAAAAG/xGb4=\")","v":{"$error":"#VALUE!"}},{"$f":"AND(CoolerLabelsShelves!P11,\"AAAAAG/xGb8=\")","v":{"$error":"#VALUE!"}},{"$f":"AND(CoolerLabelsShelves!Q11,\"AAAAAG/xGcA=\")","v":{"$error":"#VALUE!"}},{"$f":"AND(CoolerLabelsShelves!R11,\"AAAAAG/xGcE=\")","v":{"$error":"#VALUE!"}},{"$f":"AND(CoolerLabelsShelves!S11,\"AAAAAG/xGcI=\")","v":{"$error":"#VALUE!"}},{"$f":"AND(CoolerLabelsShelves!T11,\"AAAAAG/xGcM=\")","v":{"$error":"#VALUE!"}},{"$f":"AND(CoolerLabelsShelves!U11,\"AAAAAG/xGcQ=\")","v":{"$error":"#VALUE!"}},{"$f":"AND(CoolerLabelsShelves!V11,\"AAAAAG/xGcU=\")","v":{"$error":"#VALUE!"}},{"$f":"AND(CoolerLabelsShelves!W11,\"AAAAAG/xGcY=\")","v":{"$error":"#VALUE!"}},{"$f":"AND(CoolerLabelsShelves!X11,\"AAAAAG/xGcc=\")","v":{"$error":"#VALUE!"}},{"$f":"AND(CoolerLabelsShelves!Y11,\"AAAAAG/xGcg=\")","v":{"$error":"#VALUE!"}},{"$f":"AND(CoolerLabelsShelves!Z11,\"AAAAAG/xGck=\")","v":{"$error":"#VALUE!"}},{"$f":"AND(CoolerLabelsShelves!AA11,\"AAAAAG/xGco=\")","v":{"$error":"#VALUE!"}},{"$f":"IF(CoolerLabelsShelves!12:12,\"AAAAAG/xGcs=\",0)","v":0},{"$f":"AND(CoolerLabelsShelves!A12,\"AAAAAG/xGcw=\")","v":{"$error":"#VALUE!"}},{"$f":"AND(CoolerLabelsShelves!B12,\"AAAAAG/xGc0=\")","v":{"$error":"#VALUE!"}},{"$f":"AND(CoolerLabelsShelves!C12,\"AAAAAG/xGc4=\")","v":{"$error":"#VALUE!"}},{"$f":"AND(CoolerLabelsShelves!D12,\"AAAAAG/xGc8=\")","v":{"$error":"#VALUE!"}},{"$f":"AND(CoolerLabelsShelves!E12,\"AAAAAG/xGdA=\")","v":{"$error":"#VALUE!"}},{"$f":"AND(CoolerLabelsShelves!F12,\"AAAAAG/xGdE=\")","v":{"$error":"#VALUE!"}},{"$f":"AND(CoolerLabelsShelves!G12,\"AAAAAG/xGdI=\")","v":{"$error":"#VALUE!"}},{"$f":"AND(CoolerLabelsShelves!H12,\"AAAAAG/xGdM=\")","v":{"$error":"#VALUE!"}},{"$f":"AND(CoolerLabelsShelves!I12,\"AAAAAG/xGdQ=\")","v":{"$error":"#VALUE!"}},{"$f":"AND(CoolerLabelsShelves!J12,\"AAAAAG/xGdU=\")","v":{"$error":"#VALUE!"}},{"$f":"AND(CoolerLabelsShelves!K12,\"AAAAAG/xGdY=\")","v":{"$error":"#VALUE!"}},{"$f":"AND(CoolerLabelsShelves!L12,\"AAAAAG/xGdc=\")","v":{"$error":"#VALUE!"}},{"$f":"AND(CoolerLabelsShelves!M12,\"AAAAAG/xGdg=\")","v":{"$error":"#VALUE!"}},{"$f":"AND(CoolerLabelsShelves!N12,\"AAAAAG/xGdk=\")","v":{"$error":"#VALUE!"}},{"$f":"AND(CoolerLabelsShelves!O12,\"AAAAAG/xGdo=\")","v":{"$error":"#VALUE!"}},{"$f":"AND(CoolerLabelsShelves!P12,\"AAAAAG/xGds=\")","v":{"$error":"#VALUE!"}},{"$f":"AND(CoolerLabelsShelves!Q12,\"AAAAAG/xGdw=\")","v":{"$error":"#VALUE!"}},{"$f":"AND(CoolerLabelsShelves!R12,\"AAAAAG/xGd0=\")","v":{"$error":"#VALUE!"}},{"$f":"AND(CoolerLabelsShelves!S12,\"AAAAAG/xGd4=\")","v":{"$error":"#VALUE!"}},{"$f":"AND(CoolerLabelsShelves!T12,\"AAAAAG/xGd8=\")","v":{"$error":"#VALUE!"}},{"$f":"AND(CoolerLabelsShelves!U12,\"AAAAAG/xGeA=\")","v":{"$error":"#VALUE!"}},{"$f":"AND(CoolerLabelsShelves!V12,\"AAAAAG/xGeE=\")","v":{"$error":"#VALUE!"}},{"$f":"AND(CoolerLabelsShelves!W12,\"AAAAAG/xGeI=\")","v":{"$error":"#VALUE!"}},{"$f":"AND(CoolerLabelsShelves!X12,\"AAAAAG/xGeM=\")","v":{"$error":"#VALUE!"}},{"$f":"AND(CoolerLabelsShelves!Y12,\"AAAAAG/xGeQ=\")","v":{"$error":"#VALUE!"}},{"$f":"AND(CoolerLabelsShelves!Z12,\"AAAAAG/xGeU=\")","v":{"$error":"#VALUE!"}},{"$f":"AND(CoolerLabelsShelves!AA12,\"AAAAAG/xGeY=\")","v":{"$error":"#VALUE!"}},{"$f":"IF(CoolerLabelsShelves!13:13,\"AAAAAG/xGec=\",0)","v":0},{"$f":"AND(CoolerLabelsShelves!A13,\"AAAAAG/xGeg=\")","v":{"$error":"#VALUE!"}},{"$f":"AND(CoolerLabelsShelves!B13,\"AAAAAG/xGek=\")","v":{"$error":"#VALUE!"}},{"$f":"AND(CoolerLabelsShelves!C13,\"AAAAAG/xGeo=\")","v":{"$error":"#VALUE!"}},{"$f":"AND(CoolerLabelsShelves!D13,\"AAAAAG/xGes=\")","v":{"$error":"#VALUE!"}},{"$f":"AND(CoolerLabelsShelves!E13,\"AAAAAG/xGew=\")","v":{"$error":"#VALUE!"}},{"$f":"AND(CoolerLabelsShelves!F13,\"AAAAAG/xGe0=\")","v":{"$error":"#VALUE!"}},{"$f":"AND(CoolerLabelsShelves!G13,\"AAAAAG/xGe4=\")","v":{"$error":"#VALUE!"}},{"$f":"AND(CoolerLabelsShelves!H13,\"AAAAAG/xGe8=\")","v":{"$error":"#VALUE!"}},{"$f":"AND(CoolerLabelsShelves!I13,\"AAAAAG/xGfA=\")","v":{"$error":"#VALUE!"}},{"$f":"AND(CoolerLabelsShelves!J13,\"AAAAAG/xGfE=\")","v":{"$error":"#VALUE!"}},{"$f":"AND(CoolerLabelsShelves!K13,\"AAAAAG/xGfI=\")","v":{"$error":"#VALUE!"}},{"$f":"AND(CoolerLabelsShelves!L13,\"AAAAAG/xGfM=\")","v":{"$error":"#VALUE!"}},{"$f":"AND(CoolerLabelsShelves!M13,\"AAAAAG/xGfQ=\")","v":{"$error":"#VALUE!"}},{"$f":"AND(CoolerLabelsShelves!N13,\"AAAAAG/xGfU=\")","v":{"$error":"#VALUE!"}},{"$f":"AND(CoolerLabelsShelves!O13,\"AAAAAG/xGfY=\")","v":{"$error":"#VALUE!"}},{"$f":"AND(CoolerLabelsShelves!P13,\"AAAAAG/xGfc=\")","v":{"$error":"#VALUE!"}},{"$f":"AND(CoolerLabelsShelves!Q13,\"AAAAAG/xGfg=\")","v":{"$error":"#VALUE!"}},{"$f":"AND(CoolerLabelsShelves!R13,\"AAAAAG/xGfk=\")","v":{"$error":"#VALUE!"}},{"$f":"AND(CoolerLabelsShelves!S13,\"AAAAAG/xGfo=\")","v":{"$error":"#VALUE!"}},{"$f":"AND(CoolerLabelsShelves!T13,\"AAAAAG/xGfs=\")","v":{"$error":"#VALUE!"}},{"$f":"AND(CoolerLabelsShelves!U13,\"AAAAAG/xGfw=\")","v":{"$error":"#VALUE!"}},{"$f":"AND(CoolerLabelsShelves!V13,\"AAAAAG/xGf0=\")","v":{"$error":"#VALUE!"}},{"$f":"AND(CoolerLabelsShelves!W13,\"AAAAAG/xGf4=\")","v":{"$error":"#VALUE!"}},{"$f":"AND(CoolerLabelsShelves!X13,\"AAAAAG/xGf8=\")","v":{"$error":"#VALUE!"}}]
[{"$f":"AND(CoolerLabelsShelves!Y13,\"AAAAAHf98QA=\")","v":{"$error":"#VALUE!"}},{"$f":"AND(CoolerLabelsShelves!Z13,\"AAAAAHf98QE=\")","v":{"$error":"#VALUE!"}},{"$f":"AND(CoolerLabelsShelves!AA13,\"AAAAAHf98QI=\")","v":{"$error":"#VALUE!"}},{"$f":"IF(CoolerLabelsShelves!14:14,\"AAAAAHf98QM=\",0)","v":0},{"$f":"AND(CoolerLabelsShelves!A14,\"AAAAAHf98QQ=\")","v":{"$error":"#VALUE!"}},{"$f":"AND(CoolerLabelsShelves!B14,\"AAAAAHf98QU=\")","v":{"$error":"#VALUE!"}},{"$f":"AND(CoolerLabelsShelves!C14,\"AAAAAHf98QY=\")","v":{"$error":"#VALUE!"}},{"$f":"AND(CoolerLabelsShelves!D14,\"AAAAAHf98Qc=\")","v":{"$error":"#VALUE!"}},{"$f":"AND(CoolerLabelsShelves!E14,\"AAAAAHf98Qg=\")","v":{"$error":"#VALUE!"}},{"$f":"AND(CoolerLabelsShelves!F14,\"AAAAAHf98Qk=\")","v":{"$error":"#VALUE!"}},{"$f":"AND(CoolerLabelsShelves!G14,\"AAAAAHf98Qo=\")","v":{"$error":"#VALUE!"}},{"$f":"AND(CoolerLabelsShelves!H14,\"AAAAAHf98Qs=\")","v":{"$error":"#VALUE!"}},{"$f":"AND(CoolerLabelsShelves!I14,\"AAAAAHf98Qw=\")","v":{"$error":"#VALUE!"}},{"$f":"AND(CoolerLabelsShelves!J14,\"AAAAAHf98Q0=\")","v":{"$error":"#VALUE!"}},{"$f":"AND(CoolerLabelsShelves!K14,\"AAAAAHf98Q4=\")","v":{"$error":"#VALUE!"}},{"$f":"AND(CoolerLabelsShelves!L14,\"AAAAAHf98Q8=\")","v":{"$error":"#VALUE!"}},{"$f":"AND(CoolerLabelsShelves!M14,\"AAAAAHf98RA=\")","v":{"$error":"#VALUE!"}},{"$f":"AND(CoolerLabelsShelves!N14,\"AAAAAHf98RE=\")","v":{"$error":"#VALUE!"}},{"$f":"AND(CoolerLabelsShelves!O14,\"AAAAAHf98RI=\")","v":{"$error":"#VALUE!"}},{"$f":"AND(CoolerLabelsShelves!P14,\"AAAAAHf98RM=\")","v":{"$error":"#VALUE!"}},{"$f":"AND(CoolerLabelsShelves!Q14,\"AAAAAHf98RQ=\")","v":{"$error":"#VALUE!"}},{"$f":"AND(CoolerLabelsShelves!R14,\"AAAAAHf98RU=\")","v":{"$error":"#VALUE!"}},{"$f":"AND(CoolerLabelsShelves!S14,\"AAAAAHf98RY=\")","v":{"$error":"#VALUE!"}},{"$f":"AND(CoolerLabelsShelves!T14,\"AAAAAHf98Rc=\")","v":{"$error":"#VALUE!"}},{"$f":"AND(CoolerLabelsShelves!U14,\"AAAAAHf98Rg=\")","v":{"$error":"#VALUE!"}},{"$f":"AND(CoolerLabelsShelves!V14,\"AAAAAHf98Rk=\")","v":{"$error":"#VALUE!"}},{"$f":"AND(CoolerLabelsShelves!W14,\"AAAAAHf98Ro=\")","v":{"$error":"#VALUE!"}},{"$f":"AND(CoolerLabelsShelves!X14,\"AAAAAHf98Rs=\")","v":{"$error":"#VALUE!"}},{"$f":"AND(CoolerLabelsShelves!Y14,\"AAAAAHf98Rw=\")","v":{"$error":"#VALUE!"}},{"$f":"AND(CoolerLabelsShelves!Z14,\"AAAAAHf98R0=\")","v":{"$error":"#VALUE!"}},{"$f":"AND(CoolerLabelsShelves!AA14,\"AAAAAHf98R4=\")","v":{"$error":"#VALUE!"}},{"$f":"IF(CoolerLabelsShelves!15:15,\"AAAAAHf98R8=\",0)","v":0},{"$f":"AND(CoolerLabelsShelves!A15,\"AAAAAHf98SA=\")","v":{"$error":"#VALUE!"}},{"$f":"AND(CoolerLabelsShelves!B15,\"AAAAAHf98SE=\")","v":{"$error":"#VALUE!"}},{"$f":"AND(CoolerLabelsShelves!C15,\"AAAAAHf98SI=\")","v":{"$error":"#VALUE!"}},{"$f":"AND(CoolerLabelsShelves!D15,\"AAAAAHf98SM=\")","v":{"$error":"#VALUE!"}},{"$f":"AND(CoolerLabelsShelves!E15,\"AAAAAHf98SQ=\")","v":{"$error":"#VALUE!"}},{"$f":"AND(CoolerLabelsShelves!F15,\"AAAAAHf98SU=\")","v":{"$error":"#VALUE!"}},{"$f":"AND(CoolerLabelsShelves!G15,\"AAAAAHf98SY=\")","v":{"$error":"#VALUE!"}},{"$f":"AND(CoolerLabelsShelves!H15,\"AAAAAHf98Sc=\")","v":{"$error":"#VALUE!"}},{"$f":"AND(CoolerLabelsShelves!I15,\"AAAAAHf98Sg=\")","v":{"$error":"#VALUE!"}},{"$f":"AND(CoolerLabelsShelves!J15,\"AAAAAHf98Sk=\")","v":{"$error":"#VALUE!"}},{"$f":"AND(CoolerLabelsShelves!K15,\"AAAAAHf98So=\")","v":{"$error":"#VALUE!"}},{"$f":"AND(CoolerLabelsShelves!L15,\"AAAAAHf98Ss=\")","v":{"$error":"#VALUE!"}},{"$f":"AND(CoolerLabelsShelves!M15,\"AAAAAHf98Sw=\")","v":{"$error":"#VALUE!"}},{"$f":"AND(CoolerLabelsShelves!N15,\"AAAAAHf98S0=\")","v":{"$error":"#VALUE!"}},{"$f":"AND(CoolerLabelsShelves!O15,\"AAAAAHf98S4=\")","v":{"$error":"#VALUE!"}},{"$f":"AND(CoolerLabelsShelves!P15,\"AAAAAHf98S8=\")","v":{"$error":"#VALUE!"}},{"$f":"AND(CoolerLabelsShelves!Q15,\"AAAAAHf98TA=\")","v":{"$error":"#VALUE!"}},{"$f":"AND(CoolerLabelsShelves!R15,\"AAAAAHf98TE=\")","v":{"$error":"#VALUE!"}},{"$f":"AND(CoolerLabelsShelves!S15,\"AAAAAHf98TI=\")","v":{"$error":"#VALUE!"}},{"$f":"AND(CoolerLabelsShelves!T15,\"AAAAAHf98TM=\")","v":{"$error":"#VALUE!"}},{"$f":"AND(CoolerLabelsShelves!U15,\"AAAAAHf98TQ=\")","v":{"$error":"#VALUE!"}},{"$f":"AND(CoolerLabelsShelves!V15,\"AAAAAHf98TU=\")","v":{"$error":"#VALUE!"}},{"$f":"AND(CoolerLabelsShelves!W15,\"AAAAAHf98TY=\")","v":{"$error":"#VALUE!"}},{"$f":"AND(CoolerLabelsShelves!X15,\"AAAAAHf98Tc=\")","v":{"$error":"#VALUE!"}},{"$f":"AND(CoolerLabelsShelves!Y15,\"AAAAAHf98Tg=\")","v":{"$error":"#VALUE!"}},{"$f":"AND(CoolerLabelsShelves!Z15,\"AAAAAHf98Tk=\")","v":{"$error":"#VALUE!"}},{"$f":"AND(CoolerLabelsShelves!AA15,\"AAAAAHf98To=\")","v":{"$error":"#VALUE!"}},{"$f":"IF(CoolerLabelsShelves!16:16,\"AAAAAHf98Ts=\",0)","v":0},{"$f":"AND(CoolerLabelsShelves!A16,\"AAAAAHf98Tw=\")","v":{"$error":"#VALUE!"}},{"$f":"AND(CoolerLabelsShelves!B16,\"AAAAAHf98T0=\")","v":{"$error":"#VALUE!"}},{"$f":"AND(CoolerLabelsShelves!C16,\"AAAAAHf98T4=\")","v":{"$error":"#VALUE!"}},{"$f":"AND(CoolerLabelsShelves!D16,\"AAAAAHf98T8=\")","v":{"$error":"#VALUE!"}},{"$f":"AND(CoolerLabelsShelves!E16,\"AAAAAHf98UA=\")","v":{"$error":"#VALUE!"}},{"$f":"AND(CoolerLabelsShelves!F16,\"AAAAAHf98UE=\")","v":{"$error":"#VALUE!"}},{"$f":"AND(CoolerLabelsShelves!G16,\"AAAAAHf98UI=\")","v":{"$error":"#VALUE!"}},{"$f":"AND(CoolerLabelsShelves!H16,\"AAAAAHf98UM=\")","v":{"$error":"#VALUE!"}},{"$f":"AND(CoolerLabelsShelves!I16,\"AAAAAHf98UQ=\")","v":{"$error":"#VALUE!"}},{"$f":"AND(CoolerLabelsShelves!J16,\"AAAAAHf98UU=\")","v":{"$error":"#VALUE!"}},{"$f":"AND(CoolerLabelsShelves!K16,\"AAAAAHf98UY=\")","v":{"$error":"#VALUE!"}},{"$f":"AND(CoolerLabelsShelves!L16,\"AAAAAHf98Uc=\")","v":{"$error":"#VALUE!"}},{"$f":"AND(CoolerLabelsShelves!M16,\"AAAAAHf98Ug=\")","v":{"$error":"#VALUE!"}},{"$f":"AND(CoolerLabelsShelves!N16,\"AAAAAHf98Uk=\")","v":{"$error":"#VALUE!"}},{"$f":"AND(CoolerLabelsShelves!O16,\"AAAAAHf98Uo=\")","v":{"$error":"#VALUE!"}},{"$f":"AND(CoolerLabelsShelves!P16,\"AAAAAHf98Us=\")","v":{"$error":"#VALUE!"}},{"$f":"AND(CoolerLabelsShelves!Q16,\"AAAAAHf98Uw=\")","v":{"$error":"#VALUE!"}},{"$f":"AND(CoolerLabelsShelves!R16,\"AAAAAHf98U0=\")","v":{"$error":"#VALUE!"}},{"$f":"AND(CoolerLabelsShelves!S16,\"AAAAAHf98U4=\")","v":{"$error":"#VALUE!"}},{"$f":"AND(CoolerLabelsShelves!T16,\"AAAAAHf98U8=\")","v":{"$error":"#VALUE!"}},{"$f":"AND(CoolerLabelsShelves!U16,\"AAAAAHf98VA=\")","v":{"$error":"#VALUE!"}},{"$f":"AND(CoolerLabelsShelves!V16,\"AAAAAHf98VE=\")","v":{"$error":"#VALUE!"}},{"$f":"AND(CoolerLabelsShelves!W16,\"AAAAAHf98VI=\")","v":{"$error":"#VALUE!"}},{"$f":"AND(CoolerLabelsShelves!X16,\"AAAAAHf98VM=\")","v":{"$error":"#VALUE!"}},{"$f":"AND(CoolerLabelsShelves!Y16,\"AAAAAHf98VQ=\")","v":{"$error":"#VALUE!"}},{"$f":"AND(CoolerLabelsShelves!Z16,\"AAAAAHf98VU=\")","v":{"$error":"#VALUE!"}},{"$f":"AND(CoolerLabelsShelves!AA16,\"AAAAAHf98VY=\")","v":{"$error":"#VALUE!"}},{"$f":"IF(CoolerLabelsShelves!17:17,\"AAAAAHf98Vc=\",0)","v":0},{"$f":"AND(CoolerLabelsShelves!A17,\"AAAAAHf98Vg=\")","v":{"$error":"#VALUE!"}},{"$f":"AND(CoolerLabelsShelves!B17,\"AAAAAHf98Vk=\")","v":{"$error":"#VALUE!"}},{"$f":"AND(CoolerLabelsShelves!C17,\"AAAAAHf98Vo=\")","v":{"$error":"#VALUE!"}},{"$f":"AND(CoolerLabelsShelves!D17,\"AAAAAHf98Vs=\")","v":{"$error":"#VALUE!"}},{"$f":"AND(CoolerLabelsShelves!E17,\"AAAAAHf98Vw=\")","v":{"$error":"#VALUE!"}},{"$f":"AND(CoolerLabelsShelves!F17,\"AAAAAHf98V0=\")","v":{"$error":"#VALUE!"}},{"$f":"AND(CoolerLabelsShelves!G17,\"AAAAAHf98V4=\")","v":{"$error":"#VALUE!"}},{"$f":"AND(CoolerLabelsShelves!H17,\"AAAAAHf98V8=\")","v":{"$error":"#VALUE!"}},{"$f":"AND(CoolerLabelsShelves!I17,\"AAAAAHf98WA=\")","v":{"$error":"#VALUE!"}},{"$f":"AND(CoolerLabelsShelves!J17,\"AAAAAHf98WE=\")","v":{"$error":"#VALUE!"}},{"$f":"AND(CoolerLabelsShelves!K17,\"AAAAAHf98WI=\")","v":{"$error":"#VALUE!"}},{"$f":"AND(CoolerLabelsShelves!L17,\"AAAAAHf98WM=\")","v":{"$error":"#VALUE!"}},{"$f":"AND(CoolerLabelsShelves!M17,\"AAAAAHf98WQ=\")","v":{"$error":"#VALUE!"}},{"$f":"AND(CoolerLabelsShelves!N17,\"AAAAAHf98WU=\")","v":{"$error":"#VALUE!"}},{"$f":"AND(CoolerLabelsShelves!O17,\"AAAAAHf98WY=\")","v":{"$error":"#VALUE!"}},{"$f":"AND(CoolerLabelsShelves!P17,\"AAAAAHf98Wc=\")","v":{"$error":"#VALUE!"}},{"$f":"AND(CoolerLabelsShelves!Q17,\"AAAAAHf98Wg=\")","v":{"$error":"#VALUE!"}},{"$f":"AND(CoolerLabelsShelves!R17,\"AAAAAHf98Wk=\")","v":{"$error":"#VALUE!"}},{"$f":"AND(CoolerLabelsShelves!S17,\"AAAAAHf98Wo=\")","v":{"$error":"#VALUE!"}},{"$f":"AND(CoolerLabelsShelves!T17,\"AAAAAHf98Ws=\")","v":{"$error":"#VALUE!"}},{"$f":"AND(CoolerLabelsShelves!U17,\"AAAAAHf98Ww=\")","v":{"$error":"#VALUE!"}},{"$f":"AND(CoolerLabelsShelves!V17,\"AAAAAHf98W0=\")","v":{"$error":"#VALUE!"}},{"$f":"AND(CoolerLabelsShelves!W17,\"AAAAAHf98W4=\")","v":{"$error":"#VALUE!"}},{"$f":"AND(CoolerLabelsShelves!X17,\"AAAAAHf98W8=\")","v":{"$error":"#VALUE!"}},{"$f":"AND(CoolerLabelsShelves!Y17,\"AAAAAHf98XA=\")","v":{"$error":"#VALUE!"}},{"$f":"AND(CoolerLabelsShelves!Z17,\"AAAAAHf98XE=\")","v":{"$error":"#VALUE!"}},{"$f":"AND(CoolerLabelsShelves!AA17,\"AAAAAHf98XI=\")","v":{"$error":"#VALUE!"}},{"$f":"IF(CoolerLabelsShelves!18:18,\"AAAAAHf98XM=\",0)","v":0},{"$f":"AND(CoolerLabelsShelves!A18,\"AAAAAHf98XQ=\")","v":{"$error":"#VALUE!"}},{"$f":"AND(CoolerLabelsShelves!B18,\"AAAAAHf98XU=\")","v":{"$error":"#VALUE!"}},{"$f":"AND(CoolerLabelsShelves!C18,\"AAAAAHf98XY=\")","v":{"$error":"#VALUE!"}},{"$f":"AND(CoolerLabelsShelves!D18,\"AAAAAHf98Xc=\")","v":{"$error":"#VALUE!"}},{"$f":"AND(CoolerLabelsShelves!E18,\"AAAAAHf98Xg=\")","v":{"$error":"#VALUE!"}},{"$f":"AND(CoolerLabelsShelves!F18,\"AAAAAHf98Xk=\")","v":{"$error":"#VALUE!"}},{"$f":"AND(CoolerLabelsShelves!G18,\"AAAAAHf98Xo=\")","v":{"$error":"#VALUE!"}},{"$f":"AND(CoolerLabelsShelves!H18,\"AAAAAHf98Xs=\")","v":{"$error":"#VALUE!"}},{"$f":"AND(CoolerLabelsShelves!I18,\"AAAAAHf98Xw=\")","v":{"$error":"#VALUE!"}},{"$f":"AND(CoolerLabelsShelves!J18,\"AAAAAHf98X0=\")","v":{"$error":"#VALUE!"}},{"$f":"AND(CoolerLabelsShelves!K18,\"AAAAAHf98X4=\")","v":{"$error":"#VALUE!"}},{"$f":"AND(CoolerLabelsShelves!L18,\"AAAAAHf98X8=\")","v":{"$error":"#VALUE!"}},{"$f":"AND(CoolerLabelsShelves!M18,\"AAAAAHf98YA=\")","v":{"$error":"#VALUE!"}},{"$f":"AND(CoolerLabelsShelves!N18,\"AAAAAHf98YE=\")","v":{"$error":"#VALUE!"}},{"$f":"AND(CoolerLabelsShelves!O18,\"AAAAAHf98YI=\")","v":{"$error":"#VALUE!"}},{"$f":"AND(CoolerLabelsShelves!P18,\"AAAAAHf98YM=\")","v":{"$error":"#VALUE!"}},{"$f":"AND(CoolerLabelsShelves!Q18,\"AAAAAHf98YQ=\")","v":{"$error":"#VALUE!"}},{"$f":"AND(CoolerLabelsShelves!R18,\"AAAAAHf98YU=\")","v":{"$error":"#VALUE!"}},{"$f":"AND(CoolerLabelsShelves!S18,\"AAAAAHf98YY=\")","v":{"$error":"#VALUE!"}},{"$f":"AND(CoolerLabelsShelves!T18,\"AAAAAHf98Yc=\")","v":{"$error":"#VALUE!"}},{"$f":"AND(CoolerLabelsShelves!U18,\"AAAAAHf98Yg=\")","v":{"$error":"#VALUE!"}},{"$f":"AND(CoolerLabelsShelves!V18,\"AAAAAHf98Yk=\")","v":{"$error":"#VALUE!"}},{"$f":"AND(CoolerLabelsShelves!W18,\"AAAAAHf98Yo=\")","v":{"$error":"#VALUE!"}},{"$f":"AND(CoolerLabelsShelves!X18,\"AAAAAHf98Ys=\")","v":{"$error":"#VALUE!"}},{"$f":"AND(CoolerLabelsShelves!Y18,\"AAAAAHf98Yw=\")","v":{"$error":"#VALUE!"}},{"$f":"AND(CoolerLabelsShelves!Z18,\"AAAAAHf98Y0=\")","v":{"$error":"#VALUE!"}},{"$f":"AND(CoolerLabelsShelves!AA18,\"AAAAAHf98Y4=\")","v":{"$error":"#VALUE!"}},{"$f":"IF(CoolerLabelsShelves!19:19,\"AAAAAHf98Y8=\",0)","v":0},{"$f":"AND(CoolerLabelsShelves!A19,\"AAAAAHf98ZA=\")","v":{"$error":"#VALUE!"}},{"$f":"AND(CoolerLabelsShelves!B19,\"AAAAAHf98ZE=\")","v":{"$error":"#VALUE!"}},{"$f":"AND(CoolerLabelsShelves!C19,\"AAAAAHf98ZI=\")","v":{"$error":"#VALUE!"}},{"$f":"AND(CoolerLabelsShelves!D19,\"AAAAAHf98ZM=\")","v":{"$error":"#VALUE!"}},{"$f":"AND(CoolerLabelsShelves!E19,\"AAAAAHf98ZQ=\")","v":{"$error":"#VALUE!"}},{"$f":"AND(CoolerLabelsShelves!F19,\"AAAAAHf98ZU=\")","v":{"$error":"#VALUE!"}},{"$f":"AND(CoolerLabelsShelves!G19,\"AAAAAHf98ZY=\")","v":{"$error":"#VALUE!"}},{"$f":"AND(CoolerLabelsShelves!H19,\"AAAAAHf98Zc=\")","v":{"$error":"#VALUE!"}},{"$f":"AND(CoolerLabelsShelves!I19,\"AAAAAHf98Zg=\")","v":{"$error":"#VALUE!"}},{"$f":"AND(CoolerLabelsShelves!J19,\"AAAAAHf98Zk=\")","v":{"$error":"#VALUE!"}},{"$f":"AND(CoolerLabelsShelves!K19,\"AAAAAHf98Zo=\")","v":{"$error":"#VALUE!"}},{"$f":"AND(CoolerLabelsShelves!L19,\"AAAAAHf98Zs=\")","v":{"$error":"#VALUE!"}},{"$f":"AND(CoolerLabelsShelves!M19,\"AAAAAHf98Zw=\")","v":{"$error":"#VALUE!"}},{"$f":"AND(CoolerLabelsShelves!N19,\"AAAAAHf98Z0=\")","v":{"$error":"#VALUE!"}},{"$f":"AND(CoolerLabelsShelves!O19,\"AAAAAHf98Z4=\")","v":{"$error":"#VALUE!"}},{"$f":"AND(CoolerLabelsShelves!P19,\"AAAAAHf98Z8=\")","v":{"$error":"#VALUE!"}},{"$f":"AND(CoolerLabelsShelves!Q19,\"AAAAAHf98aA=\")","v":{"$error":"#VALUE!"}},{"$f":"AND(CoolerLabelsShelves!R19,\"AAAAAHf98aE=\")","v":{"$error":"#VALUE!"}},{"$f":"AND(CoolerLabelsShelves!S19,\"AAAAAHf98aI=\")","v":{"$error":"#VALUE!"}},{"$f":"AND(CoolerLabelsShelves!T19,\"AAAAAHf98aM=\")","v":{"$error":"#VALUE!"}},{"$f":"AND(CoolerLabelsShelves!U19,\"AAAAAHf98aQ=\")","v":{"$error":"#VALUE!"}},{"$f":"AND(CoolerLabelsShelves!V19,\"AAAAAHf98aU=\")","v":{"$error":"#VALUE!"}},{"$f":"AND(CoolerLabelsShelves!W19,\"AAAAAHf98aY=\")","v":{"$error":"#VALUE!"}},{"$f":"AND(CoolerLabelsShelves!X19,\"AAAAAHf98ac=\")","v":{"$error":"#VALUE!"}},{"$f":"AND(CoolerLabelsShelves!Y19,\"AAAAAHf98ag=\")","v":{"$error":"#VALUE!"}},{"$f":"AND(CoolerLabelsShelves!Z19,\"AAAAAHf98ak=\")","v":{"$error":"#VALUE!"}},{"$f":"AND(CoolerLabelsShelves!AA19,\"AAAAAHf98ao=\")","v":{"$error":"#VALUE!"}},{"$f":"IF(CoolerLabelsShelves!20:20,\"AAAAAHf98as=\",0)","v":0},{"$f":"AND(CoolerLabelsShelves!A20,\"AAAAAHf98aw=\")","v":{"$error":"#VALUE!"}},{"$f":"AND(CoolerLabelsShelves!B20,\"AAAAAHf98a0=\")","v":{"$error":"#VALUE!"}},{"$f":"AND(CoolerLabelsShelves!C20,\"AAAAAHf98a4=\")","v":{"$error":"#VALUE!"}},{"$f":"AND(CoolerLabelsShelves!D20,\"AAAAAHf98a8=\")","v":{"$error":"#VALUE!"}},{"$f":"AND(CoolerLabelsShelves!E20,\"AAAAAHf98bA=\")","v":{"$error":"#VALUE!"}},{"$f":"AND(CoolerLabelsShelves!F20,\"AAAAAHf98bE=\")","v":{"$error":"#VALUE!"}},{"$f":"AND(CoolerLabelsShelves!G20,\"AAAAAHf98bI=\")","v":{"$error":"#VALUE!"}},{"$f":"AND(CoolerLabelsShelves!H20,\"AAAAAHf98bM=\")","v":{"$error":"#VALUE!"}},{"$f":"AND(CoolerLabelsShelves!I20,\"AAAAAHf98bQ=\")","v":{"$error":"#VALUE!"}},{"$f":"AND(CoolerLabelsShelves!J20,\"AAAAAHf98bU=\")","v":{"$error":"#VALUE!"}},{"$f":"AND(CoolerLabelsShelves!K20,\"AAAAAHf98bY=\")","v":{"$error":"#VALUE!"}},{"$f":"AND(CoolerLabelsShelves!L20,\"AAAAAHf98bc=\")","v":{"$error":"#VALUE!"}},{"$f":"AND(CoolerLabelsShelves!M20,\"AAAAAHf98bg=\")","v":{"$error":"#VALUE!"}},{"$f":"AND(CoolerLabelsShelves!N20,\"AAAAAHf98bk=\")","v":{"$error":"#VALUE!"}},{"$f":"AND(CoolerLabelsShelves!O20,\"AAAAAHf98bo=\")","v":{"$error":"#VALUE!"}},{"$f":"AND(CoolerLabelsShelves!P20,\"AAAAAHf98bs=\")","v":{"$error":"#VALUE!"}},{"$f":"AND(CoolerLabelsShelves!Q20,\"AAAAAHf98bw=\")","v":{"$error":"#VALUE!"}},{"$f":"AND(CoolerLabelsShelves!R20,\"AAAAAHf98b0=\")","v":{"$error":"#VALUE!"}},{"$f":"AND(CoolerLabelsShelves!S20,\"AAAAAHf98b4=\")","v":{"$error":"#VALUE!"}},{"$f":"AND(CoolerLabelsShelves!T20,\"AAAAAHf98b8=\")","v":{"$error":"#VALUE!"}},{"$f":"AND(CoolerLabelsShelves!U20,\"AAAAAHf98cA=\")","v":{"$error":"#VALUE!"}},{"$f":"AND(CoolerLabelsShelves!V20,\"AAAAAHf98cE=\")","v":{"$error":"#VALUE!"}},{"$f":"AND(CoolerLabelsShelves!W20,\"AAAAAHf98cI=\")","v":{"$error":"#VALUE!"}},{"$f":"AND(CoolerLabelsShelves!X20,\"AAAAAHf98cM=\")","v":{"$error":"#VALUE!"}},{"$f":"AND(CoolerLabelsShelves!Y20,\"AAAAAHf98cQ=\")","v":{"$error":"#VALUE!"}},{"$f":"AND(CoolerLabelsShelves!Z20,\"AAAAAHf98cU=\")","v":{"$error":"#VALUE!"}},{"$f":"AND(CoolerLabelsShelves!AA20,\"AAAAAHf98cY=\")","v":{"$error":"#VALUE!"}},{"$f":"IF(CoolerLabelsShelves!21:21,\"AAAAAHf98cc=\",0)","v":0},{"$f":"AND(CoolerLabelsShelves!A21,\"AAAAAHf98cg=\")","v":{"$error":"#VALUE!"}},{"$f":"AND(CoolerLabelsShelves!B21,\"AAAAAHf98ck=\")","v":{"$error":"#VALUE!"}},{"$f":"AND(CoolerLabelsShelves!C21,\"AAAAAHf98co=\")","v":{"$error":"#VALUE!"}},{"$f":"AND(CoolerLabelsShelves!D21,\"AAAAAHf98cs=\")","v":{"$error":"#VALUE!"}},{"$f":"AND(CoolerLabelsShelves!E21,\"AAAAAHf98cw=\")","v":{"$error":"#VALUE!"}},{"$f":"AND(CoolerLabelsShelves!F21,\"AAAAAHf98c0=\")","v":{"$error":"#VALUE!"}},{"$f":"AND(CoolerLabelsShelves!G21,\"AAAAAHf98c4=\")","v":{"$error":"#VALUE!"}},{"$f":"AND(CoolerLabelsShelves!H21,\"AAAAAHf98c8=\")","v":{"$error":"#VALUE!"}},{"$f":"AND(CoolerLabelsShelves!I21,\"AAAAAHf98dA=\")","v":{"$error":"#VALUE!"}},{"$f":"AND(CoolerLabelsShelves!J21,\"AAAAAHf98dE=\")","v":{"$error":"#VALUE!"}},{"$f":"AND(CoolerLabelsShelves!K21,\"AAAAAHf98dI=\")","v":{"$error":"#VALUE!"}},{"$f":"AND(CoolerLabelsShelves!L21,\"AAAAAHf98dM=\")","v":{"$error":"#VALUE!"}},{"$f":"AND(CoolerLabelsShelves!M21,\"AAAAAHf98dQ=\")","v":{"$error":"#VALUE!"}},{"$f":"AND(CoolerLabelsShelves!N21,\"AAAAAHf98dU=\")","v":{"$error":"#VALUE!"}},{"$f":"AND(CoolerLabelsShelves!O21,\"AAAAAHf98dY=\")","v":{"$error":"#VALUE!"}},{"$f":"AND(CoolerLabelsShelves!P21,\"AAAAAHf98dc=\")","v":{"$error":"#VALUE!"}},{"$f":"AND(CoolerLabelsShelves!Q21,\"AAAAAHf98dg=\")","v":{"$error":"#VALUE!"}},{"$f":"AND(CoolerLabelsShelves!R21,\"AAAAAHf98dk=\")","v":{"$error":"#VALUE!"}},{"$f":"AND(CoolerLabelsShelves!S21,\"AAAAAHf98do=\")","v":{"$error":"#VALUE!"}},{"$f":"AND(CoolerLabelsShelves!T21,\"AAAAAHf98ds=\")","v":{"$error":"#VALUE!"}},{"$f":"AND(CoolerLabelsShelves!U21,\"AAAAAHf98dw=\")","v":{"$error":"#VALUE!"}},{"$f":"AND(CoolerLabelsShelves!V21,\"AAAAAHf98d0=\")","v":{"$error":"#VALUE!"}},{"$f":"AND(CoolerLabelsShelves!W21,\"AAAAAHf98d4=\")","v":{"$error":"#VALUE!"}},{"$f":"AND(CoolerLabelsShelves!X21,\"AAAAAHf98d8=\")","v":{"$error":"#VALUE!"}},{"$f":"AND(CoolerLabelsShelves!Y21,\"AAAAAHf98eA=\")","v":{"$error":"#VALUE!"}},{"$f":"AND(CoolerLabelsShelves!Z21,\"AAAAAHf98eE=\")","v":{"$error":"#VALUE!"}},{"$f":"AND(CoolerLabelsShelves!AA21,\"AAAAAHf98eI=\")","v":{"$error":"#VALUE!"}},{"$f":"IF(CoolerLabelsShelves!22:22,\"AAAAAHf98eM=\",0)","v":0},{"$f":"AND(CoolerLabelsShelves!A22,\"AAAAAHf98eQ=\")","v":{"$error":"#VALUE!"}},{"$f":"AND(CoolerLabelsShelves!B22,\"AAAAAHf98eU=\")","v":{"$error":"#VALUE!"}},{"$f":"AND(CoolerLabelsShelves!C22,\"AAAAAHf98eY=\")","v":{"$error":"#VALUE!"}},{"$f":"AND(CoolerLabelsShelves!D22,\"AAAAAHf98ec=\")","v":{"$error":"#VALUE!"}},{"$f":"AND(CoolerLabelsShelves!E22,\"AAAAAHf98eg=\")","v":{"$error":"#VALUE!"}},{"$f":"AND(CoolerLabelsShelves!F22,\"AAAAAHf98ek=\")","v":{"$error":"#VALUE!"}},{"$f":"AND(CoolerLabelsShelves!G22,\"AAAAAHf98eo=\")","v":{"$error":"#VALUE!"}},{"$f":"AND(CoolerLabelsShelves!H22,\"AAAAAHf98es=\")","v":{"$error":"#VALUE!"}},{"$f":"AND(CoolerLabelsShelves!I22,\"AAAAAHf98ew=\")","v":{"$error":"#VALUE!"}},{"$f":"AND(CoolerLabelsShelves!J22,\"AAAAAHf98e0=\")","v":{"$error":"#VALUE!"}},{"$f":"AND(CoolerLabelsShelves!K22,\"AAAAAHf98e4=\")","v":{"$error":"#VALUE!"}},{"$f":"AND(CoolerLabelsShelves!L22,\"AAAAAHf98e8=\")","v":{"$error":"#VALUE!"}},{"$f":"AND(CoolerLabelsShelves!M22,\"AAAAAHf98fA=\")","v":{"$error":"#VALUE!"}},{"$f":"AND(CoolerLabelsShelves!N22,\"AAAAAHf98fE=\")","v":{"$error":"#VALUE!"}},{"$f":"AND(CoolerLabelsShelves!O22,\"AAAAAHf98fI=\")","v":{"$error":"#VALUE!"}},{"$f":"AND(CoolerLabelsShelves!P22,\"AAAAAHf98fM=\")","v":{"$error":"#VALUE!"}},{"$f":"AND(CoolerLabelsShelves!Q22,\"AAAAAHf98fQ=\")","v":{"$error":"#VALUE!"}},{"$f":"AND(CoolerLabelsShelves!R22,\"AAAAAHf98fU=\")","v":{"$error":"#VALUE!"}},{"$f":"AND(CoolerLabelsShelves!S22,\"AAAAAHf98fY=\")","v":{"$error":"#VALUE!"}},{"$f":"AND(CoolerLabelsShelves!T22,\"AAAAAHf98fc=\")","v":{"$error":"#VALUE!"}},{"$f":"AND(CoolerLabelsShelves!U22,\"AAAAAHf98fg=\")","v":{"$error":"#VALUE!"}},{"$f":"AND(CoolerLabelsShelves!V22,\"AAAAAHf98fk=\")","v":{"$error":"#VALUE!"}},{"$f":"AND(CoolerLabelsShelves!W22,\"AAAAAHf98fo=\")","v":{"$error":"#VALUE!"}},{"$f":"AND(CoolerLabelsShelves!X22,\"AAAAAHf98fs=\")","v":{"$error":"#VALUE!"}},{"$f":"AND(CoolerLabelsShelves!Y22,\"AAAAAHf98fw=\")","v":{"$error":"#VALUE!"}},{"$f":"AND(CoolerLabelsShelves!Z22,\"AAAAAHf98f0=\")","v":{"$error":"#VALUE!"}},{"$f":"AND(CoolerLabelsShelves!AA22,\"AAAAAHf98f4=\")","v":{"$error":"#VALUE!"}},{"$f":"IF(CoolerLabelsShelves!23:23,\"AAAAAHf98f8=\",0)","v":0}]
[{"$f":"AND(CoolerLabelsShelves!A23,\"AAAAAC/5/wA=\")","v":{"$error":"#VALUE!"}},{"$f":"AND(CoolerLabelsShelves!B23,\"AAAAAC/5/wE=\")","v":{"$error":"#VALUE!"}},{"$f":"AND(CoolerLabelsShelves!C23,\"AAAAAC/5/wI=\")","v":{"$error":"#VALUE!"}},{"$f":"AND(CoolerLabelsShelves!D23,\"AAAAAC/5/wM=\")","v":{"$error":"#VALUE!"}},{"$f":"AND(CoolerLabelsShelves!E23,\"AAAAAC/5/wQ=\")","v":{"$error":"#VALUE!"}},{"$f":"AND(CoolerLabelsShelves!F23,\"AAAAAC/5/wU=\")","v":{"$error":"#VALUE!"}},{"$f":"AND(CoolerLabelsShelves!G23,\"AAAAAC/5/wY=\")","v":{"$error":"#VALUE!"}},{"$f":"AND(CoolerLabelsShelves!H23,\"AAAAAC/5/wc=\")","v":{"$error":"#VALUE!"}},{"$f":"AND(CoolerLabelsShelves!I23,\"AAAAAC/5/wg=\")","v":{"$error":"#VALUE!"}},{"$f":"AND(CoolerLabelsShelves!J23,\"AAAAAC/5/wk=\")","v":{"$error":"#VALUE!"}},{"$f":"AND(CoolerLabelsShelves!K23,\"AAAAAC/5/wo=\")","v":{"$error":"#VALUE!"}},{"$f":"AND(CoolerLabelsShelves!L23,\"AAAAAC/5/ws=\")","v":{"$error":"#VALUE!"}},{"$f":"AND(CoolerLabelsShelves!M23,\"AAAAAC/5/ww=\")","v":{"$error":"#VALUE!"}},{"$f":"AND(CoolerLabelsShelves!N23,\"AAAAAC/5/w0=\")","v":{"$error":"#VALUE!"}},{"$f":"AND(CoolerLabelsShelves!O23,\"AAAAAC/5/w4=\")","v":{"$error":"#VALUE!"}},{"$f":"AND(CoolerLabelsShelves!P23,\"AAAAAC/5/w8=\")","v":{"$error":"#VALUE!"}},{"$f":"AND(CoolerLabelsShelves!Q23,\"AAAAAC/5/xA=\")","v":{"$error":"#VALUE!"}},{"$f":"AND(CoolerLabelsShelves!R23,\"AAAAAC/5/xE=\")","v":{"$error":"#VALUE!"}},{"$f":"AND(CoolerLabelsShelves!S23,\"AAAAAC/5/xI=\")","v":{"$error":"#VALUE!"}},{"$f":"AND(CoolerLabelsShelves!T23,\"AAAAAC/5/xM=\")","v":{"$error":"#VALUE!"}},{"$f":"AND(CoolerLabelsShelves!U23,\"AAAAAC/5/xQ=\")","v":{"$error":"#VALUE!"}},{"$f":"AND(CoolerLabelsShelves!V23,\"AAAAAC/5/xU=\")","v":{"$error":"#VALUE!"}},{"$f":"AND(CoolerLabelsShelves!W23,\"AAAAAC/5/xY=\")","v":{"$error":"#VALUE!"}},{"$f":"AND(CoolerLabelsShelves!X23,\"AAAAAC/5/xc=\")","v":{"$error":"#VALUE!"}},{"$f":"AND(CoolerLabelsShelves!Y23,\"AAAAAC/5/xg=\")","v":{"$error":"#VALUE!"}},{"$f":"AND(CoolerLabelsShelves!Z23,\"AAAAAC/5/xk=\")","v":{"$error":"#VALUE!"}},{"$f":"AND(CoolerLabelsShelves!AA23,\"AAAAAC/5/xo=\")","v":{"$error":"#VALUE!"}},{"$f":"IF(CoolerLabelsShelves!24:24,\"AAAAAC/5/xs=\",0)","v":0},{"$f":"AND(CoolerLabelsShelves!A24,\"AAAAAC/5/xw=\")","v":{"$error":"#VALUE!"}},{"$f":"AND(CoolerLabelsShelves!B24,\"AAAAAC/5/x0=\")","v":{"$error":"#VALUE!"}},{"$f":"AND(CoolerLabelsShelves!C24,\"AAAAAC/5/x4=\")","v":{"$error":"#VALUE!"}},{"$f":"AND(CoolerLabelsShelves!D24,\"AAAAAC/5/x8=\")","v":{"$error":"#VALUE!"}},{"$f":"AND(CoolerLabelsShelves!E24,\"AAAAAC/5/yA=\")","v":{"$error":"#VALUE!"}},{"$f":"AND(CoolerLabelsShelves!F24,\"AAAAAC/5/yE=\")","v":{"$error":"#VALUE!"}},{"$f":"AND(CoolerLabelsShelves!G24,\"AAAAAC/5/yI=\")","v":{"$error":"#VALUE!"}},{"$f":"AND(CoolerLabelsShelves!H24,\"AAAAAC/5/yM=\")","v":{"$error":"#VALUE!"}},{"$f":"AND(CoolerLabelsShelves!I24,\"AAAAAC/5/yQ=\")","v":{"$error":"#VALUE!"}},{"$f":"AND(CoolerLabelsShelves!J24,\"AAAAAC/5/yU=\")","v":{"$error":"#VALUE!"}},{"$f":"AND(CoolerLabelsShelves!K24,\"AAAAAC/5/yY=\")","v":{"$error":"#VALUE!"}},{"$f":"AND(CoolerLabelsShelves!L24,\"AAAAAC/5/yc=\")","v":{"$error":"#VALUE!"}},{"$f":"AND(CoolerLabelsShelves!M24,\"AAAAAC/5/yg=\")","v":{"$error":"#VALUE!"}},{"$f":"AND(CoolerLabelsShelves!N24,\"AAAAAC/5/yk=\")","v":{"$error":"#VALUE!"}},{"$f":"AND(CoolerLabelsShelves!O24,\"AAAAAC/5/yo=\")","v":{"$error":"#VALUE!"}},{"$f":"AND(CoolerLabelsShelves!P24,\"AAAAAC/5/ys=\")","v":{"$error":"#VALUE!"}},{"$f":"AND(CoolerLabelsShelves!Q24,\"AAAAAC/5/yw=\")","v":{"$error":"#VALUE!"}},{"$f":"AND(CoolerLabelsShelves!R24,\"AAAAAC/5/y0=\")","v":{"$error":"#VALUE!"}},{"$f":"AND(CoolerLabelsShelves!S24,\"AAAAAC/5/y4=\")","v":{"$error":"#VALUE!"}},{"$f":"AND(CoolerLabelsShelves!T24,\"AAAAAC/5/y8=\")","v":{"$error":"#VALUE!"}},{"$f":"AND(CoolerLabelsShelves!U24,\"AAAAAC/5/zA=\")","v":{"$error":"#VALUE!"}},{"$f":"AND(CoolerLabelsShelves!V24,\"AAAAAC/5/zE=\")","v":{"$error":"#VALUE!"}},{"$f":"AND(CoolerLabelsShelves!W24,\"AAAAAC/5/zI=\")","v":{"$error":"#VALUE!"}},{"$f":"AND(CoolerLabelsShelves!X24,\"AAAAAC/5/zM=\")","v":{"$error":"#VALUE!"}},{"$f":"AND(CoolerLabelsShelves!Y24,\"AAAAAC/5/zQ=\")","v":{"$error":"#VALUE!"}},{"$f":"AND(CoolerLabelsShelves!Z24,\"AAAAAC/5/zU=\")","v":{"$error":"#VALUE!"}},{"$f":"AND(CoolerLabelsShelves!AA24,\"AAAAAC/5/zY=\")","v":{"$error":"#VALUE!"}},{"$f":"IF(CoolerLabelsShelves!25:25,\"AAAAAC/5/zc=\",0)","v":0},{"$f":"AND(CoolerLabelsShelves!A25,\"AAAAAC/5/zg=\")","v":{"$error":"#VALUE!"}},{"$f":"AND(CoolerLabelsShelves!B25,\"AAAAAC/5/zk=\")","v":{"$error":"#VALUE!"}},{"$f":"AND(CoolerLabelsShelves!C25,\"AAAAAC/5/zo=\")","v":{"$error":"#VALUE!"}},{"$f":"AND(CoolerLabelsShelves!D25,\"AAAAAC/5/zs=\")","v":{"$error":"#VALUE!"}},{"$f":"AND(CoolerLabelsShelves!E25,\"AAAAAC/5/zw=\")","v":{"$error":"#VALUE!"}},{"$f":"AND(CoolerLabelsShelves!F25,\"AAAAAC/5/z0=\")","v":{"$error":"#VALUE!"}},{"$f":"AND(CoolerLabelsShelves!G25,\"AAAAAC/5/z4=\")","v":{"$error":"#VALUE!"}},{"$f":"AND(CoolerLabelsShelves!H25,\"AAAAAC/5/z8=\")","v":{"$error":"#VALUE!"}},{"$f":"AND(CoolerLabelsShelves!I25,\"AAAAAC/5/0A=\")","v":{"$error":"#VALUE!"}},{"$f":"AND(CoolerLabelsShelves!J25,\"AAAAAC/5/0E=\")","v":{"$error":"#VALUE!"}},{"$f":"AND(CoolerLabelsShelves!K25,\"AAAAAC/5/0I=\")","v":{"$error":"#VALUE!"}},{"$f":"AND(CoolerLabelsShelves!L25,\"AAAAAC/5/0M=\")","v":{"$error":"#VALUE!"}},{"$f":"AND(CoolerLabelsShelves!M25,\"AAAAAC/5/0Q=\")","v":{"$error":"#VALUE!"}},{"$f":"AND(CoolerLabelsShelves!N25,\"AAAAAC/5/0U=\")","v":{"$error":"#VALUE!"}},{"$f":"AND(CoolerLabelsShelves!O25,\"AAAAAC/5/0Y=\")","v":{"$error":"#VALUE!"}},{"$f":"AND(CoolerLabelsShelves!P25,\"AAAAAC/5/0c=\")","v":{"$error":"#VALUE!"}},{"$f":"AND(CoolerLabelsShelves!Q25,\"AAAAAC/5/0g=\")","v":{"$error":"#VALUE!"}},{"$f":"AND(CoolerLabelsShelves!R25,\"AAAAAC/5/0k=\")","v":{"$error":"#VALUE!"}},{"$f":"AND(CoolerLabelsShelves!S25,\"AAAAAC/5/0o=\")","v":{"$error":"#VALUE!"}},{"$f":"AND(CoolerLabelsShelves!T25,\"AAAAAC/5/0s=\")","v":{"$error":"#VALUE!"}},{"$f":"AND(CoolerLabelsShelves!U25,\"AAAAAC/5/0w=\")","v":{"$error":"#VALUE!"}},{"$f":"AND(CoolerLabelsShelves!V25,\"AAAAAC/5/00=\")","v":{"$error":"#VALUE!"}},{"$f":"AND(CoolerLabelsShelves!W25,\"AAAAAC/5/04=\")","v":{"$error":"#VALUE!"}},{"$f":"AND(CoolerLabelsShelves!X25,\"AAAAAC/5/08=\")","v":{"$error":"#VALUE!"}},{"$f":"AND(CoolerLabelsShelves!Y25,\"AAAAAC/5/1A=\")","v":{"$error":"#VALUE!"}},{"$f":"AND(CoolerLabelsShelves!Z25,\"AAAAAC/5/1E=\")","v":{"$error":"#VALUE!"}},{"$f":"AND(CoolerLabelsShelves!AA25,\"AAAAAC/5/1I=\")","v":{"$error":"#VALUE!"}},{"$f":"IF(CoolerLabelsShelves!26:26,\"AAAAAC/5/1M=\",0)","v":0},{"$f":"AND(CoolerLabelsShelves!A26,\"AAAAAC/5/1Q=\")","v":{"$error":"#VALUE!"}},{"$f":"AND(CoolerLabelsShelves!B26,\"AAAAAC/5/1U=\")","v":{"$error":"#VALUE!"}},{"$f":"AND(CoolerLabelsShelves!C26,\"AAAAAC/5/1Y=\")","v":{"$error":"#VALUE!"}},{"$f":"AND(CoolerLabelsShelves!D26,\"AAAAAC/5/1c=\")","v":{"$error":"#VALUE!"}},{"$f":"AND(CoolerLabelsShelves!E26,\"AAAAAC/5/1g=\")","v":{"$error":"#VALUE!"}},{"$f":"AND(CoolerLabelsShelves!F26,\"AAAAAC/5/1k=\")","v":{"$error":"#VALUE!"}},{"$f":"AND(CoolerLabelsShelves!G26,\"AAAAAC/5/1o=\")","v":{"$error":"#VALUE!"}},{"$f":"AND(CoolerLabelsShelves!H26,\"AAAAAC/5/1s=\")","v":{"$error":"#VALUE!"}},{"$f":"AND(CoolerLabelsShelves!I26,\"AAAAAC/5/1w=\")","v":{"$error":"#VALUE!"}},{"$f":"AND(CoolerLabelsShelves!J26,\"AAAAAC/5/10=\")","v":{"$error":"#VALUE!"}},{"$f":"AND(CoolerLabelsShelves!K26,\"AAAAAC/5/14=\")","v":{"$error":"#VALUE!"}},{"$f":"AND(CoolerLabelsShelves!L26,\"AAAAAC/5/18=\")","v":{"$error":"#VALUE!"}},{"$f":"AND(CoolerLabelsShelves!M26,\"AAAAAC/5/2A=\")","v":{"$error":"#VALUE!"}},{"$f":"AND(CoolerLabelsShelves!N26,\"AAAAAC/5/2E=\")","v":{"$error":"#VALUE!"}},{"$f":"AND(CoolerLabelsShelves!O26,\"AAAAAC/5/2I=\")","v":{"$error":"#VALUE!"}},{"$f":"AND(CoolerLabelsShelves!P26,\"AAAAAC/5/2M=\")","v":{"$error":"#VALUE!"}},{"$f":"AND(CoolerLabelsShelves!Q26,\"AAAAAC/5/2Q=\")","v":{"$error":"#VALUE!"}},{"$f":"AND(CoolerLabelsShelves!R26,\"AAAAAC/5/2U=\")","v":{"$error":"#VALUE!"}},{"$f":"AND(CoolerLabelsShelves!S26,\"AAAAAC/5/2Y=\")","v":{"$error":"#VALUE!"}},{"$f":"AND(CoolerLabelsShelves!T26,\"AAAAAC/5/2c=\")","v":{"$error":"#VALUE!"}},{"$f":"AND(CoolerLabelsShelves!U26,\"AAAAAC/5/2g=\")","v":{"$error":"#VALUE!"}},{"$f":"AND(CoolerLabelsShelves!V26,\"AAAAAC/5/2k=\")","v":{"$error":"#VALUE!"}},{"$f":"AND(CoolerLabelsShelves!W26,\"AAAAAC/5/2o=\")","v":{"$error":"#VALUE!"}},{"$f":"AND(CoolerLabelsShelves!X26,\"AAAAAC/5/2s=\")","v":{"$error":"#VALUE!"}},{"$f":"AND(CoolerLabelsShelves!Y26,\"AAAAAC/5/2w=\")","v":{"$error":"#VALUE!"}},{"$f":"AND(CoolerLabelsShelves!Z26,\"AAAAAC/5/20=\")","v":{"$error":"#VALUE!"}},{"$f":"AND(CoolerLabelsShelves!AA26,\"AAAAAC/5/24=\")","v":{"$error":"#VALUE!"}},{"$f":"IF(CoolerLabelsShelves!27:27,\"AAAAAC/5/28=\",0)","v":0},{"$f":"AND(CoolerLabelsShelves!A27,\"AAAAAC/5/3A=\")","v":{"$error":"#VALUE!"}},{"$f":"AND(CoolerLabelsShelves!B27,\"AAAAAC/5/3E=\")","v":{"$error":"#VALUE!"}},{"$f":"AND(CoolerLabelsShelves!C27,\"AAAAAC/5/3I=\")","v":{"$error":"#VALUE!"}},{"$f":"AND(CoolerLabelsShelves!D27,\"AAAAAC/5/3M=\")","v":{"$error":"#VALUE!"}},{"$f":"AND(CoolerLabelsShelves!E27,\"AAAAAC/5/3Q=\")","v":{"$error":"#VALUE!"}},{"$f":"AND(CoolerLabelsShelves!F27,\"AAAAAC/5/3U=\")","v":{"$error":"#VALUE!"}},{"$f":"AND(CoolerLabelsShelves!G27,\"AAAAAC/5/3Y=\")","v":{"$error":"#VALUE!"}},{"$f":"AND(CoolerLabelsShelves!H27,\"AAAAAC/5/3c=\")","v":{"$error":"#VALUE!"}},{"$f":"AND(CoolerLabelsShelves!I27,\"AAAAAC/5/3g=\")","v":{"$error":"#VALUE!"}},{"$f":"AND(CoolerLabelsShelves!J27,\"AAAAAC/5/3k=\")","v":{"$error":"#VALUE!"}},{"$f":"AND(CoolerLabelsShelves!K27,\"AAAAAC/5/3o=\")","v":{"$error":"#VALUE!"}},{"$f":"AND(CoolerLabelsShelves!L27,\"AAAAAC/5/3s=\")","v":{"$error":"#VALUE!"}},{"$f":"AND(CoolerLabelsShelves!M27,\"AAAAAC/5/3w=\")","v":{"$error":"#VALUE!"}},{"$f":"AND(CoolerLabelsShelves!N27,\"AAAAAC/5/30=\")","v":{"$error":"#VALUE!"}},{"$f":"AND(CoolerLabelsShelves!O27,\"AAAAAC/5/34=\")","v":{"$error":"#VALUE!"}},{"$f":"AND(CoolerLabelsShelves!P27,\"AAAAAC/5/38=\")","v":{"$error":"#VALUE!"}},{"$f":"AND(CoolerLabelsShelves!Q27,\"AAAAAC/5/4A=\")","v":{"$error":"#VALUE!"}},{"$f":"AND(CoolerLabelsShelves!R27,\"AAAAAC/5/4E=\")","v":{"$error":"#VALUE!"}},{"$f":"AND(CoolerLabelsShelves!S27,\"AAAAAC/5/4I=\")","v":{"$error":"#VALUE!"}},{"$f":"AND(CoolerLabelsShelves!T27,\"AAAAAC/5/4M=\")","v":{"$error":"#VALUE!"}},{"$f":"AND(CoolerLabelsShelves!U27,\"AAAAAC/5/4Q=\")","v":{"$error":"#VALUE!"}},{"$f":"AND(CoolerLabelsShelves!V27,\"AAAAAC/5/4U=\")","v":{"$error":"#VALUE!"}},{"$f":"AND(CoolerLabelsShelves!W27,\"AAAAAC/5/4Y=\")","v":{"$error":"#VALUE!"}},{"$f":"AND(CoolerLabelsShelves!X27,\"AAAAAC/5/4c=\")","v":{"$error":"#VALUE!"}},{"$f":"AND(CoolerLabelsShelves!Y27,\"AAAAAC/5/4g=\")","v":{"$error":"#VALUE!"}},{"$f":"AND(CoolerLabelsShelves!Z27,\"AAAAAC/5/4k=\")","v":{"$error":"#VALUE!"}},{"$f":"AND(CoolerLabelsShelves!AA27,\"AAAAAC/5/4o=\")","v":{"$error":"#VALUE!"}},{"$f":"IF(CoolerLabelsShelves!28:28,\"AAAAAC/5/4s=\",0)","v":0},{"$f":"AND(CoolerLabelsShelves!A28,\"AAAAAC/5/4w=\")","v":{"$error":"#VALUE!"}},{"$f":"AND(CoolerLabelsShelves!B28,\"AAAAAC/5/40=\")","v":{"$error":"#VALUE!"}},{"$f":"AND(CoolerLabelsShelves!C28,\"AAAAAC/5/44=\")","v":{"$error":"#VALUE!"}},{"$f":"AND(CoolerLabelsShelves!D28,\"AAAAAC/5/48=\")","v":{"$error":"#VALUE!"}},{"$f":"AND(CoolerLabelsShelves!E28,\"AAAAAC/5/5A=\")","v":{"$error":"#VALUE!"}},{"$f":"AND(CoolerLabelsShelves!F28,\"AAAAAC/5/5E=\")","v":{"$error":"#VALUE!"}},{"$f":"AND(CoolerLabelsShelves!G28,\"AAAAAC/5/5I=\")","v":{"$error":"#VALUE!"}},{"$f":"AND(CoolerLabelsShelves!H28,\"AAAAAC/5/5M=\")","v":{"$error":"#VALUE!"}},{"$f":"AND(CoolerLabelsShelves!I28,\"AAAAAC/5/5Q=\")","v":{"$error":"#VALUE!"}},{"$f":"AND(CoolerLabelsShelves!J28,\"AAAAAC/5/5U=\")","v":{"$error":"#VALUE!"}},{"$f":"AND(CoolerLabelsShelves!K28,\"AAAAAC/5/5Y=\")","v":{"$error":"#VALUE!"}},{"$f":"AND(CoolerLabelsShelves!L28,\"AAAAAC/5/5c=\")","v":{"$error":"#VALUE!"}},{"$f":"AND(CoolerLabelsShelves!M28,\"AAAAAC/5/5g=\")","v":{"$error":"#VALUE!"}},{"$f":"AND(CoolerLabelsShelves!N28,\"AAAAAC/5/5k=\")","v":{"$error":"#VALUE!"}},{"$f":"AND(CoolerLabelsShelves!O28,\"AAAAAC/5/5o=\")","v":{"$error":"#VALUE!"}},{"$f":"AND(CoolerLabelsShelves!P28,\"AAAAAC/5/5s=\")","v":{"$error":"#VALUE!"}},{"$f":"AND(CoolerLabelsShelves!Q28,\"AAAAAC/5/5w=\")","v":{"$error":"#VALUE!"}},{"$f":"AND(CoolerLabelsShelves!R28,\"AAAAAC/5/50=\")","v":{"$error":"#VALUE!"}},{"$f":"AND(CoolerLabelsShelves!S28,\"AAAAAC/5/54=\")","v":{"$error":"#VALUE!"}},{"$f":"AND(CoolerLabelsShelves!T28,\"AAAAAC/5/58=\")","v":{"$error":"#VALUE!"}},{"$f":"AND(CoolerLabelsShelves!U28,\"AAAAAC/5/6A=\")","v":{"$error":"#VALUE!"}},{"$f":"AND(CoolerLabelsShelves!V28,\"AAAAAC/5/6E=\")","v":{"$error":"#VALUE!"}},{"$f":"AND(CoolerLabelsShelves!W28,\"AAAAAC/5/6I=\")","v":{"$error":"#VALUE!"}},{"$f":"AND(CoolerLabelsShelves!X28,\"AAAAAC/5/6M=\")","v":{"$error":"#VALUE!"}},{"$f":"AND(CoolerLabelsShelves!Y28,\"AAAAAC/5/6Q=\")","v":{"$error":"#VALUE!"}},{"$f":"AND(CoolerLabelsShelves!Z28,\"AAAAAC/5/6U=\")","v":{"$error":"#VALUE!"}},{"$f":"AND(CoolerLabelsShelves!AA28,\"AAAAAC/5/6Y=\")","v":{"$error":"#VALUE!"}},{"$f":"IF(CoolerLabelsShelves!29:29,\"AAAAAC/5/6c=\",0)","v":0},{"$f":"AND(CoolerLabelsShelves!A29,\"AAAAAC/5/6g=\")","v":{"$error":"#VALUE!"}},{"$f":"AND(CoolerLabelsShelves!B29,\"AAAAAC/5/6k=\")","v":{"$error":"#VALUE!"}},{"$f":"AND(CoolerLabelsShelves!C29,\"AAAAAC/5/6o=\")","v":{"$error":"#VALUE!"}},{"$f":"AND(CoolerLabelsShelves!D29,\"AAAAAC/5/6s=\")","v":{"$error":"#VALUE!"}},{"$f":"AND(CoolerLabelsShelves!E29,\"AAAAAC/5/6w=\")","v":{"$error":"#VALUE!"}},{"$f":"AND(CoolerLabelsShelves!F29,\"AAAAAC/5/60=\")","v":{"$error":"#VALUE!"}},{"$f":"AND(CoolerLabelsShelves!G29,\"AAAAAC/5/64=\")","v":{"$error":"#VALUE!"}},{"$f":"AND(CoolerLabelsShelves!H29,\"AAAAAC/5/68=\")","v":{"$error":"#VALUE!"}},{"$f":"AND(CoolerLabelsShelves!I29,\"AAAAAC/5/7A=\")","v":{"$error":"#VALUE!"}},{"$f":"AND(CoolerLabelsShelves!J29,\"AAAAAC/5/7E=\")","v":{"$error":"#VALUE!"}},{"$f":"AND(CoolerLabelsShelves!K29,\"AAAAAC/5/7I=\")","v":{"$error":"#VALUE!"}},{"$f":"AND(CoolerLabelsShelves!L29,\"AAAAAC/5/7M=\")","v":{"$error":"#VALUE!"}},{"$f":"AND(CoolerLabelsShelves!M29,\"AAAAAC/5/7Q=\")","v":{"$error":"#VALUE!"}},{"$f":"AND(CoolerLabelsShelves!N29,\"AAAAAC/5/7U=\")","v":{"$error":"#VALUE!"}},{"$f":"AND(CoolerLabelsShelves!O29,\"AAAAAC/5/7Y=\")","v":{"$error":"#VALUE!"}},{"$f":"AND(CoolerLabelsShelves!P29,\"AAAAAC/5/7c=\")","v":{"$error":"#VALUE!"}},{"$f":"AND(CoolerLabelsShelves!Q29,\"AAAAAC/5/7g=\")","v":{"$error":"#VALUE!"}},{"$f":"AND(CoolerLabelsShelves!R29,\"AAAAAC/5/7k=\")","v":{"$error":"#VALUE!"}},{"$f":"AND(CoolerLabelsShelves!S29,\"AAAAAC/5/7o=\")","v":{"$error":"#VALUE!"}},{"$f":"AND(CoolerLabelsShelves!T29,\"AAAAAC/5/7s=\")","v":{"$error":"#VALUE!"}},{"$f":"AND(CoolerLabelsShelves!U29,\"AAAAAC/5/7w=\")","v":{"$error":"#VALUE!"}},{"$f":"AND(CoolerLabelsShelves!V29,\"AAAAAC/5/70=\")","v":{"$error":"#VALUE!"}},{"$f":"AND(CoolerLabelsShelves!W29,\"AAAAAC/5/74=\")","v":{"$error":"#VALUE!"}},{"$f":"AND(CoolerLabelsShelves!X29,\"AAAAAC/5/78=\")","v":{"$error":"#VALUE!"}},{"$f":"AND(CoolerLabelsShelves!Y29,\"AAAAAC/5/8A=\")","v":{"$error":"#VALUE!"}},{"$f":"AND(CoolerLabelsShelves!Z29,\"AAAAAC/5/8E=\")","v":{"$error":"#VALUE!"}},{"$f":"AND(CoolerLabelsShelves!AA29,\"AAAAAC/5/8I=\")","v":{"$error":"#VALUE!"}},{"$f":"IF(CoolerLabelsShelves!30:30,\"AAAAAC/5/8M=\",0)","v":0},{"$f":"AND(CoolerLabelsShelves!A30,\"AAAAAC/5/8Q=\")","v":{"$error":"#VALUE!"}},{"$f":"AND(CoolerLabelsShelves!B30,\"AAAAAC/5/8U=\")","v":{"$error":"#VALUE!"}},{"$f":"AND(CoolerLabelsShelves!C30,\"AAAAAC/5/8Y=\")","v":{"$error":"#VALUE!"}},{"$f":"AND(CoolerLabelsShelves!D30,\"AAAAAC/5/8c=\")","v":{"$error":"#VALUE!"}},{"$f":"AND(CoolerLabelsShelves!E30,\"AAAAAC/5/8g=\")","v":{"$error":"#VALUE!"}},{"$f":"AND(CoolerLabelsShelves!F30,\"AAAAAC/5/8k=\")","v":{"$error":"#VALUE!"}},{"$f":"AND(CoolerLabelsShelves!G30,\"AAAAAC/5/8o=\")","v":{"$error":"#VALUE!"}},{"$f":"AND(CoolerLabelsShelves!H30,\"AAAAAC/5/8s=\")","v":{"$error":"#VALUE!"}},{"$f":"AND(CoolerLabelsShelves!I30,\"AAAAAC/5/8w=\")","v":{"$error":"#VALUE!"}},{"$f":"AND(CoolerLabelsShelves!J30,\"AAAAAC/5/80=\")","v":{"$error":"#VALUE!"}},{"$f":"AND(CoolerLabelsShelves!K30,\"AAAAAC/5/84=\")","v":{"$error":"#VALUE!"}},{"$f":"AND(CoolerLabelsShelves!L30,\"AAAAAC/5/88=\")","v":{"$error":"#VALUE!"}},{"$f":"AND(CoolerLabelsShelves!M30,\"AAAAAC/5/9A=\")","v":{"$error":"#VALUE!"}},{"$f":"AND(CoolerLabelsShelves!N30,\"AAAAAC/5/9E=\")","v":{"$error":"#VALUE!"}},{"$f":"AND(CoolerLabelsShelves!O30,\"AAAAAC/5/9I=\")","v":{"$error":"#VALUE!"}},{"$f":"AND(CoolerLabelsShelves!P30,\"AAAAAC/5/9M=\")","v":{"$error":"#VALUE!"}},{"$f":"AND(CoolerLabelsShelves!Q30,\"AAAAAC/5/9Q=\")","v":{"$error":"#VALUE!"}},{"$f":"AND(CoolerLabelsShelves!R30,\"AAAAAC/5/9U=\")","v":{"$error":"#VALUE!"}},{"$f":"AND(CoolerLabelsShelves!S30,\"AAAAAC/5/9Y=\")","v":{"$error":"#VALUE!"}},{"$f":"AND(CoolerLabelsShelves!T30,\"AAAAAC/5/9c=\")","v":{"$error":"#VALUE!"}},{"$f":"AND(CoolerLabelsShelves!U30,\"AAAAAC/5/9g=\")","v":{"$error":"#VALUE!"}},{"$f":"AND(CoolerLabelsShelves!V30,\"AAAAAC/5/9k=\")","v":{"$error":"#VALUE!"}},{"$f":"AND(CoolerLabelsShelves!W30,\"AAAAAC/5/9o=\")","v":{"$error":"#VALUE!"}},{"$f":"AND(CoolerLabelsShelves!X30,\"AAAAAC/5/9s=\")","v":{"$error":"#VALUE!"}},{"$f":"AND(CoolerLabelsShelves!Y30,\"AAAAAC/5/9w=\")","v":{"$error":"#VALUE!"}},{"$f":"AND(CoolerLabelsShelves!Z30,\"AAAAAC/5/90=\")","v":{"$error":"#VALUE!"}},{"$f":"AND(CoolerLabelsShelves!AA30,\"AAAAAC/5/94=\")","v":{"$error":"#VALUE!"}},{"$f":"IF(CoolerLabelsShelves!31:31,\"AAAAAC/5/98=\",0)","v":0},{"$f":"AND(CoolerLabelsShelves!A31,\"AAAAAC/5/+A=\")","v":{"$error":"#VALUE!"}},{"$f":"AND(CoolerLabelsShelves!B31,\"AAAAAC/5/+E=\")","v":{"$error":"#VALUE!"}},{"$f":"AND(CoolerLabelsShelves!C31,\"AAAAAC/5/+I=\")","v":{"$error":"#VALUE!"}},{"$f":"AND(CoolerLabelsShelves!D31,\"AAAAAC/5/+M=\")","v":{"$error":"#VALUE!"}},{"$f":"AND(CoolerLabelsShelves!E31,\"AAAAAC/5/+Q=\")","v":{"$error":"#VALUE!"}},{"$f":"AND(CoolerLabelsShelves!F31,\"AAAAAC/5/+U=\")","v":{"$error":"#VALUE!"}},{"$f":"AND(CoolerLabelsShelves!G31,\"AAAAAC/5/+Y=\")","v":{"$error":"#VALUE!"}},{"$f":"AND(CoolerLabelsShelves!H31,\"AAAAAC/5/+c=\")","v":{"$error":"#VALUE!"}},{"$f":"AND(CoolerLabelsShelves!I31,\"AAAAAC/5/+g=\")","v":{"$error":"#VALUE!"}},{"$f":"AND(CoolerLabelsShelves!J31,\"AAAAAC/5/+k=\")","v":{"$error":"#VALUE!"}},{"$f":"AND(CoolerLabelsShelves!K31,\"AAAAAC/5/+o=\")","v":{"$error":"#VALUE!"}},{"$f":"AND(CoolerLabelsShelves!L31,\"AAAAAC/5/+s=\")","v":{"$error":"#VALUE!"}},{"$f":"AND(CoolerLabelsShelves!M31,\"AAAAAC/5/+w=\")","v":{"$error":"#VALUE!"}},{"$f":"AND(CoolerLabelsShelves!N31,\"AAAAAC/5/+0=\")","v":{"$error":"#VALUE!"}},{"$f":"AND(CoolerLabelsShelves!O31,\"AAAAAC/5/+4=\")","v":{"$error":"#VALUE!"}},{"$f":"AND(CoolerLabelsShelves!P31,\"AAAAAC/5/+8=\")","v":{"$error":"#VALUE!"}},{"$f":"AND(CoolerLabelsShelves!Q31,\"AAAAAC/5//A=\")","v":{"$error":"#VALUE!"}},{"$f":"AND(CoolerLabelsShelves!R31,\"AAAAAC/5//E=\")","v":{"$error":"#VALUE!"}},{"$f":"AND(CoolerLabelsShelves!S31,\"AAAAAC/5//I=\")","v":{"$error":"#VALUE!"}},{"$f":"AND(CoolerLabelsShelves!T31,\"AAAAAC/5//M=\")","v":{"$error":"#VALUE!"}},{"$f":"AND(CoolerLabelsShelves!U31,\"AAAAAC/5//Q=\")","v":{"$error":"#VALUE!"}},{"$f":"AND(CoolerLabelsShelves!V31,\"AAAAAC/5//U=\")","v":{"$error":"#VALUE!"}},{"$f":"AND(CoolerLabelsShelves!W31,\"AAAAAC/5//Y=\")","v":{"$error":"#VALUE!"}},{"$f":"AND(CoolerLabelsShelves!X31,\"AAAAAC/5//c=\")","v":{"$error":"#VALUE!"}},{"$f":"AND(CoolerLabelsShelves!Y31,\"AAAAAC/5//g=\")","v":{"$error":"#VALUE!"}},{"$f":"AND(CoolerLabelsShelves!Z31,\"AAAAAC/5//k=\")","v":{"$error":"#VALUE!"}},{"$f":"AND(CoolerLabelsShelves!AA31,\"AAAAAC/5//o=\")","v":{"$error":"#VALUE!"}},{"$f":"IF(CoolerLabelsShelves!32:32,\"AAAAAC/5//s=\",0)","v":0},{"$f":"AND(CoolerLabelsShelves!A32,\"AAAAAC/5//w=\")","v":{"$error":"#VALUE!"}},{"$f":"AND(CoolerLabelsShelves!B32,\"AAAAAC/5//0=\")","v":{"$error":"#VALUE!"}},{"$f":"AND(CoolerLabelsShelves!C32,\"AAAAAC/5//4=\")","v":{"$error":"#VALUE!"}},{"$f":"AND(CoolerLabelsShelves!D32,\"AAAAAC/5//8=\")","v":{"$error":"#VALUE!"}}]
[{"$f":"AND(CoolerLabelsShelves!E32,\"AAAAAH7PPgA=\")","v":{"$error":"#VALUE!"}},{"$f":"AND(CoolerLabelsShelves!F32,\"AAAAAH7PPgE=\")","v":{"$error":"#VALUE!"}},{"$f":"AND(CoolerLabelsShelves!G32,\"AAAAAH7PPgI=\")","v":{"$error":"#VALUE!"}},{"$f":"AND(CoolerLabelsShelves!H32,\"AAAAAH7PPgM=\")","v":{"$error":"#VALUE!"}},{"$f":"AND(CoolerLabelsShelves!I32,\"AAAAAH7PPgQ=\")","v":{"$error":"#VALUE!"}},{"$f":"AND(CoolerLabelsShelves!J32,\"AAAAAH7PPgU=\")","v":{"$error":"#VALUE!"}},{"$f":"AND(CoolerLabelsShelves!K32,\"AAAAAH7PPgY=\")","v":{"$error":"#VALUE!"}},{"$f":"AND(CoolerLabelsShelves!L32,\"AAAAAH7PPgc=\")","v":{"$error":"#VALUE!"}},{"$f":"AND(CoolerLabelsShelves!M32,\"AAAAAH7PPgg=\")","v":{"$error":"#VALUE!"}},{"$f":"AND(CoolerLabelsShelves!N32,\"AAAAAH7PPgk=\")","v":{"$error":"#VALUE!"}},{"$f":"AND(CoolerLabelsShelves!O32,\"AAAAAH7PPgo=\")","v":{"$error":"#VALUE!"}},{"$f":"AND(CoolerLabelsShelves!P32,\"AAAAAH7PPgs=\")","v":{"$error":"#VALUE!"}},{"$f":"AND(CoolerLabelsShelves!Q32,\"AAAAAH7PPgw=\")","v":{"$error":"#VALUE!"}},{"$f":"AND(CoolerLabelsShelves!R32,\"AAAAAH7PPg0=\")","v":{"$error":"#VALUE!"}},{"$f":"AND(CoolerLabelsShelves!S32,\"AAAAAH7PPg4=\")","v":{"$error":"#VALUE!"}},{"$f":"AND(CoolerLabelsShelves!T32,\"AAAAAH7PPg8=\")","v":{"$error":"#VALUE!"}},{"$f":"AND(CoolerLabelsShelves!U32,\"AAAAAH7PPhA=\")","v":{"$error":"#VALUE!"}},{"$f":"AND(CoolerLabelsShelves!V32,\"AAAAAH7PPhE=\")","v":{"$error":"#VALUE!"}},{"$f":"AND(CoolerLabelsShelves!W32,\"AAAAAH7PPhI=\")","v":{"$error":"#VALUE!"}},{"$f":"AND(CoolerLabelsShelves!X32,\"AAAAAH7PPhM=\")","v":{"$error":"#VALUE!"}},{"$f":"AND(CoolerLabelsShelves!Y32,\"AAAAAH7PPhQ=\")","v":{"$error":"#VALUE!"}},{"$f":"AND(CoolerLabelsShelves!Z32,\"AAAAAH7PPhU=\")","v":{"$error":"#VALUE!"}},{"$f":"AND(CoolerLabelsShelves!AA32,\"AAAAAH7PPhY=\")","v":{"$error":"#VALUE!"}},{"$f":"IF(CoolerLabelsShelves!33:33,\"AAAAAH7PPhc=\",0)","v":0},{"$f":"AND(CoolerLabelsShelves!A33,\"AAAAAH7PPhg=\")","v":{"$error":"#VALUE!"}},{"$f":"AND(CoolerLabelsShelves!B33,\"AAAAAH7PPhk=\")","v":{"$error":"#VALUE!"}},{"$f":"AND(CoolerLabelsShelves!C33,\"AAAAAH7PPho=\")","v":{"$error":"#VALUE!"}},{"$f":"AND(CoolerLabelsShelves!D33,\"AAAAAH7PPhs=\")","v":{"$error":"#VALUE!"}},{"$f":"AND(CoolerLabelsShelves!E33,\"AAAAAH7PPhw=\")","v":{"$error":"#VALUE!"}},{"$f":"AND(CoolerLabelsShelves!F33,\"AAAAAH7PPh0=\")","v":{"$error":"#VALUE!"}},{"$f":"AND(CoolerLabelsShelves!G33,\"AAAAAH7PPh4=\")","v":{"$error":"#VALUE!"}},{"$f":"AND(CoolerLabelsShelves!H33,\"AAAAAH7PPh8=\")","v":{"$error":"#VALUE!"}},{"$f":"AND(CoolerLabelsShelves!I33,\"AAAAAH7PPiA=\")","v":{"$error":"#VALUE!"}},{"$f":"AND(CoolerLabelsShelves!J33,\"AAAAAH7PPiE=\")","v":{"$error":"#VALUE!"}},{"$f":"AND(CoolerLabelsShelves!K33,\"AAAAAH7PPiI=\")","v":{"$error":"#VALUE!"}},{"$f":"AND(CoolerLabelsShelves!L33,\"AAAAAH7PPiM=\")","v":{"$error":"#VALUE!"}},{"$f":"AND(CoolerLabelsShelves!M33,\"AAAAAH7PPiQ=\")","v":{"$error":"#VALUE!"}},{"$f":"AND(CoolerLabelsShelves!N33,\"AAAAAH7PPiU=\")","v":{"$error":"#VALUE!"}},{"$f":"AND(CoolerLabelsShelves!O33,\"AAAAAH7PPiY=\")","v":{"$error":"#VALUE!"}},{"$f":"AND(CoolerLabelsShelves!P33,\"AAAAAH7PPic=\")","v":{"$error":"#VALUE!"}},{"$f":"AND(CoolerLabelsShelves!Q33,\"AAAAAH7PPig=\")","v":{"$error":"#VALUE!"}},{"$f":"AND(CoolerLabelsShelves!R33,\"AAAAAH7PPik=\")","v":{"$error":"#VALUE!"}},{"$f":"AND(CoolerLabelsShelves!S33,\"AAAAAH7PPio=\")","v":{"$error":"#VALUE!"}},{"$f":"AND(CoolerLabelsShelves!T33,\"AAAAAH7PPis=\")","v":{"$error":"#VALUE!"}},{"$f":"AND(CoolerLabelsShelves!U33,\"AAAAAH7PPiw=\")","v":{"$error":"#VALUE!"}},{"$f":"AND(CoolerLabelsShelves!V33,\"AAAAAH7PPi0=\")","v":{"$error":"#VALUE!"}},{"$f":"AND(CoolerLabelsShelves!W33,\"AAAAAH7PPi4=\")","v":{"$error":"#VALUE!"}},{"$f":"AND(CoolerLabelsShelves!X33,\"AAAAAH7PPi8=\")","v":{"$error":"#VALUE!"}},{"$f":"AND(CoolerLabelsShelves!Y33,\"AAAAAH7PPjA=\")","v":{"$error":"#VALUE!"}},{"$f":"AND(CoolerLabelsShelves!Z33,\"AAAAAH7PPjE=\")","v":{"$error":"#VALUE!"}},{"$f":"AND(CoolerLabelsShelves!AA33,\"AAAAAH7PPjI=\")","v":{"$error":"#VALUE!"}},{"$f":"IF(CoolerLabelsShelves!34:34,\"AAAAAH7PPjM=\",0)","v":0},{"$f":"AND(CoolerLabelsShelves!A34,\"AAAAAH7PPjQ=\")","v":{"$error":"#VALUE!"}},{"$f":"AND(CoolerLabelsShelves!B34,\"AAAAAH7PPjU=\")","v":{"$error":"#VALUE!"}},{"$f":"AND(CoolerLabelsShelves!C34,\"AAAAAH7PPjY=\")","v":{"$error":"#VALUE!"}},{"$f":"AND(CoolerLabelsShelves!D34,\"AAAAAH7PPjc=\")","v":{"$error":"#VALUE!"}},{"$f":"AND(CoolerLabelsShelves!E34,\"AAAAAH7PPjg=\")","v":{"$error":"#VALUE!"}},{"$f":"AND(CoolerLabelsShelves!F34,\"AAAAAH7PPjk=\")","v":{"$error":"#VALUE!"}},{"$f":"AND(CoolerLabelsShelves!G34,\"AAAAAH7PPjo=\")","v":{"$error":"#VALUE!"}},{"$f":"AND(CoolerLabelsShelves!H34,\"AAAAAH7PPjs=\")","v":{"$error":"#VALUE!"}},{"$f":"AND(CoolerLabelsShelves!I34,\"AAAAAH7PPjw=\")","v":{"$error":"#VALUE!"}},{"$f":"AND(CoolerLabelsShelves!J34,\"AAAAAH7PPj0=\")","v":{"$error":"#VALUE!"}},{"$f":"AND(CoolerLabelsShelves!K34,\"AAAAAH7PPj4=\")","v":{"$error":"#VALUE!"}},{"$f":"AND(CoolerLabelsShelves!L34,\"AAAAAH7PPj8=\")","v":{"$error":"#VALUE!"}},{"$f":"AND(CoolerLabelsShelves!M34,\"AAAAAH7PPkA=\")","v":{"$error":"#VALUE!"}},{"$f":"AND(CoolerLabelsShelves!N34,\"AAAAAH7PPkE=\")","v":{"$error":"#VALUE!"}},{"$f":"AND(CoolerLabelsShelves!O34,\"AAAAAH7PPkI=\")","v":{"$error":"#VALUE!"}},{"$f":"AND(CoolerLabelsShelves!P34,\"AAAAAH7PPkM=\")","v":{"$error":"#VALUE!"}},{"$f":"AND(CoolerLabelsShelves!Q34,\"AAAAAH7PPkQ=\")","v":{"$error":"#VALUE!"}},{"$f":"AND(CoolerLabelsShelves!R34,\"AAAAAH7PPkU=\")","v":{"$error":"#VALUE!"}},{"$f":"AND(CoolerLabelsShelves!S34,\"AAAAAH7PPkY=\")","v":{"$error":"#VALUE!"}},{"$f":"AND(CoolerLabelsShelves!T34,\"AAAAAH7PPkc=\")","v":{"$error":"#VALUE!"}},{"$f":"AND(CoolerLabelsShelves!U34,\"AAAAAH7PPkg=\")","v":{"$error":"#VALUE!"}},{"$f":"AND(CoolerLabelsShelves!V34,\"AAAAAH7PPkk=\")","v":{"$error":"#VALUE!"}},{"$f":"AND(CoolerLabelsShelves!W34,\"AAAAAH7PPko=\")","v":{"$error":"#VALUE!"}},{"$f":"AND(CoolerLabelsShelves!X34,\"AAAAAH7PPks=\")","v":{"$error":"#VALUE!"}},{"$f":"AND(CoolerLabelsShelves!Y34,\"AAAAAH7PPkw=\")","v":{"$error":"#VALUE!"}},{"$f":"AND(CoolerLabelsShelves!Z34,\"AAAAAH7PPk0=\")","v":{"$error":"#VALUE!"}},{"$f":"AND(CoolerLabelsShelves!AA34,\"AAAAAH7PPk4=\")","v":{"$error":"#VALUE!"}},{"$f":"IF(CoolerLabelsShelves!35:35,\"AAAAAH7PPk8=\",0)","v":0},{"$f":"AND(CoolerLabelsShelves!A35,\"AAAAAH7PPlA=\")","v":{"$error":"#VALUE!"}},{"$f":"AND(CoolerLabelsShelves!B35,\"AAAAAH7PPlE=\")","v":{"$error":"#VALUE!"}},{"$f":"AND(CoolerLabelsShelves!C35,\"AAAAAH7PPlI=\")","v":{"$error":"#VALUE!"}},{"$f":"AND(CoolerLabelsShelves!D35,\"AAAAAH7PPlM=\")","v":{"$error":"#VALUE!"}},{"$f":"AND(CoolerLabelsShelves!E35,\"AAAAAH7PPlQ=\")","v":{"$error":"#VALUE!"}},{"$f":"AND(CoolerLabelsShelves!F35,\"AAAAAH7PPlU=\")","v":{"$error":"#VALUE!"}},{"$f":"AND(CoolerLabelsShelves!G35,\"AAAAAH7PPlY=\")","v":{"$error":"#VALUE!"}},{"$f":"AND(CoolerLabelsShelves!H35,\"AAAAAH7PPlc=\")","v":{"$error":"#VALUE!"}},{"$f":"AND(CoolerLabelsShelves!I35,\"AAAAAH7PPlg=\")","v":{"$error":"#VALUE!"}},{"$f":"AND(CoolerLabelsShelves!J35,\"AAAAAH7PPlk=\")","v":{"$error":"#VALUE!"}},{"$f":"AND(CoolerLabelsShelves!K35,\"AAAAAH7PPlo=\")","v":{"$error":"#VALUE!"}},{"$f":"AND(CoolerLabelsShelves!L35,\"AAAAAH7PPls=\")","v":{"$error":"#VALUE!"}},{"$f":"AND(CoolerLabelsShelves!M35,\"AAAAAH7PPlw=\")","v":{"$error":"#VALUE!"}},{"$f":"AND(CoolerLabelsShelves!N35,\"AAAAAH7PPl0=\")","v":{"$error":"#VALUE!"}},{"$f":"AND(CoolerLabelsShelves!O35,\"AAAAAH7PPl4=\")","v":{"$error":"#VALUE!"}},{"$f":"AND(CoolerLabelsShelves!P35,\"AAAAAH7PPl8=\")","v":{"$error":"#VALUE!"}},{"$f":"AND(CoolerLabelsShelves!Q35,\"AAAAAH7PPmA=\")","v":{"$error":"#VALUE!"}},{"$f":"AND(CoolerLabelsShelves!R35,\"AAAAAH7PPmE=\")","v":{"$error":"#VALUE!"}},{"$f":"AND(CoolerLabelsShelves!S35,\"AAAAAH7PPmI=\")","v":{"$error":"#VALUE!"}},{"$f":"AND(CoolerLabelsShelves!T35,\"AAAAAH7PPmM=\")","v":{"$error":"#VALUE!"}},{"$f":"AND(CoolerLabelsShelves!U35,\"AAAAAH7PPmQ=\")","v":{"$error":"#VALUE!"}},{"$f":"AND(CoolerLabelsShelves!V35,\"AAAAAH7PPmU=\")","v":{"$error":"#VALUE!"}},{"$f":"AND(CoolerLabelsShelves!W35,\"AAAAAH7PPmY=\")","v":{"$error":"#VALUE!"}},{"$f":"AND(CoolerLabelsShelves!X35,\"AAAAAH7PPmc=\")","v":{"$error":"#VALUE!"}},{"$f":"AND(CoolerLabelsShelves!Y35,\"AAAAAH7PPmg=\")","v":{"$error":"#VALUE!"}},{"$f":"AND(CoolerLabelsShelves!Z35,\"AAAAAH7PPmk=\")","v":{"$error":"#VALUE!"}},{"$f":"AND(CoolerLabelsShelves!AA35,\"AAAAAH7PPmo=\")","v":{"$error":"#VALUE!"}},{"$f":"IF(CoolerLabelsShelves!36:36,\"AAAAAH7PPms=\",0)","v":0},{"$f":"AND(CoolerLabelsShelves!A36,\"AAAAAH7PPmw=\")","v":{"$error":"#VALUE!"}},{"$f":"AND(CoolerLabelsShelves!B36,\"AAAAAH7PPm0=\")","v":{"$error":"#VALUE!"}},{"$f":"AND(CoolerLabelsShelves!C36,\"AAAAAH7PPm4=\")","v":{"$error":"#VALUE!"}},{"$f":"AND(CoolerLabelsShelves!D36,\"AAAAAH7PPm8=\")","v":{"$error":"#VALUE!"}},{"$f":"AND(CoolerLabelsShelves!E36,\"AAAAAH7PPnA=\")","v":{"$error":"#VALUE!"}},{"$f":"AND(CoolerLabelsShelves!F36,\"AAAAAH7PPnE=\")","v":{"$error":"#VALUE!"}},{"$f":"AND(CoolerLabelsShelves!G36,\"AAAAAH7PPnI=\")","v":{"$error":"#VALUE!"}},{"$f":"AND(CoolerLabelsShelves!H36,\"AAAAAH7PPnM=\")","v":{"$error":"#VALUE!"}},{"$f":"AND(CoolerLabelsShelves!I36,\"AAAAAH7PPnQ=\")","v":{"$error":"#VALUE!"}},{"$f":"AND(CoolerLabelsShelves!J36,\"AAAAAH7PPnU=\")","v":{"$error":"#VALUE!"}},{"$f":"AND(CoolerLabelsShelves!K36,\"AAAAAH7PPnY=\")","v":{"$error":"#VALUE!"}},{"$f":"AND(CoolerLabelsShelves!L36,\"AAAAAH7PPnc=\")","v":{"$error":"#VALUE!"}},{"$f":"AND(CoolerLabelsShelves!M36,\"AAAAAH7PPng=\")","v":{"$error":"#VALUE!"}},{"$f":"AND(CoolerLabelsShelves!N36,\"AAAAAH7PPnk=\")","v":{"$error":"#VALUE!"}},{"$f":"AND(CoolerLabelsShelves!O36,\"AAAAAH7PPno=\")","v":{"$error":"#VALUE!"}},{"$f":"AND(CoolerLabelsShelves!P36,\"AAAAAH7PPns=\")","v":{"$error":"#VALUE!"}},{"$f":"AND(CoolerLabelsShelves!Q36,\"AAAAAH7PPnw=\")","v":{"$error":"#VALUE!"}},{"$f":"AND(CoolerLabelsShelves!R36,\"AAAAAH7PPn0=\")","v":{"$error":"#VALUE!"}},{"$f":"AND(CoolerLabelsShelves!S36,\"AAAAAH7PPn4=\")","v":{"$error":"#VALUE!"}},{"$f":"AND(CoolerLabelsShelves!T36,\"AAAAAH7PPn8=\")","v":{"$error":"#VALUE!"}},{"$f":"AND(CoolerLabelsShelves!U36,\"AAAAAH7PPoA=\")","v":{"$error":"#VALUE!"}},{"$f":"AND(CoolerLabelsShelves!V36,\"AAAAAH7PPoE=\")","v":{"$error":"#VALUE!"}},{"$f":"AND(CoolerLabelsShelves!W36,\"AAAAAH7PPoI=\")","v":{"$error":"#VALUE!"}},{"$f":"AND(CoolerLabelsShelves!X36,\"AAAAAH7PPoM=\")","v":{"$error":"#VALUE!"}},{"$f":"AND(CoolerLabelsShelves!Y36,\"AAAAAH7PPoQ=\")","v":{"$error":"#VALUE!"}},{"$f":"AND(CoolerLabelsShelves!Z36,\"AAAAAH7PPoU=\")","v":{"$error":"#VALUE!"}},{"$f":"AND(CoolerLabelsShelves!AA36,\"AAAAAH7PPoY=\")","v":{"$error":"#VALUE!"}},{"$f":"IF(CoolerLabelsShelves!37:37,\"AAAAAH7PPoc=\",0)","v":0},{"$f":"AND(CoolerLabelsShelves!A37,\"AAAAAH7PPog=\")","v":{"$error":"#VALUE!"}},{"$f":"AND(CoolerLabelsShelves!B37,\"AAAAAH7PPok=\")","v":{"$error":"#VALUE!"}},{"$f":"AND(CoolerLabelsShelves!C37,\"AAAAAH7PPoo=\")","v":{"$error":"#VALUE!"}},{"$f":"AND(CoolerLabelsShelves!D37,\"AAAAAH7PPos=\")","v":{"$error":"#VALUE!"}},{"$f":"AND(CoolerLabelsShelves!E37,\"AAAAAH7PPow=\")","v":{"$error":"#VALUE!"}},{"$f":"AND(CoolerLabelsShelves!F37,\"AAAAAH7PPo0=\")","v":{"$error":"#VALUE!"}},{"$f":"AND(CoolerLabelsShelves!G37,\"AAAAAH7PPo4=\")","v":{"$error":"#VALUE!"}},{"$f":"AND(CoolerLabelsShelves!H37,\"AAAAAH7PPo8=\")","v":{"$error":"#VALUE!"}},{"$f":"AND(CoolerLabelsShelves!I37,\"AAAAAH7PPpA=\")","v":{"$error":"#VALUE!"}},{"$f":"AND(CoolerLabelsShelves!J37,\"AAAAAH7PPpE=\")","v":{"$error":"#VALUE!"}},{"$f":"AND(CoolerLabelsShelves!K37,\"AAAAAH7PPpI=\")","v":{"$error":"#VALUE!"}},{"$f":"AND(CoolerLabelsShelves!L37,\"AAAAAH7PPpM=\")","v":{"$error":"#VALUE!"}},{"$f":"AND(CoolerLabelsShelves!M37,\"AAAAAH7PPpQ=\")","v":{"$error":"#VALUE!"}},{"$f":"AND(CoolerLabelsShelves!N37,\"AAAAAH7PPpU=\")","v":{"$error":"#VALUE!"}},{"$f":"AND(CoolerLabelsShelves!O37,\"AAAAAH7PPpY=\")","v":{"$error":"#VALUE!"}},{"$f":"AND(CoolerLabelsShelves!P37,\"AAAAAH7PPpc=\")","v":{"$error":"#VALUE!"}},{"$f":"AND(CoolerLabelsShelves!Q37,\"AAAAAH7PPpg=\")","v":{"$error":"#VALUE!"}},{"$f":"AND(CoolerLabelsShelves!R37,\"AAAAAH7PPpk=\")","v":{"$error":"#VALUE!"}},{"$f":"AND(CoolerLabelsShelves!S37,\"AAAAAH7PPpo=\")","v":{"$error":"#VALUE!"}},{"$f":"AND(CoolerLabelsShelves!T37,\"AAAAAH7PPps=\")","v":{"$error":"#VALUE!"}},{"$f":"AND(CoolerLabelsShelves!U37,\"AAAAAH7PPpw=\")","v":{"$error":"#VALUE!"}},{"$f":"AND(CoolerLabelsShelves!V37,\"AAAAAH7PPp0=\")","v":{"$error":"#VALUE!"}},{"$f":"AND(CoolerLabelsShelves!W37,\"AAAAAH7PPp4=\")","v":{"$error":"#VALUE!"}},{"$f":"AND(CoolerLabelsShelves!X37,\"AAAAAH7PPp8=\")","v":{"$error":"#VALUE!"}},{"$f":"AND(CoolerLabelsShelves!Y37,\"AAAAAH7PPqA=\")","v":{"$error":"#VALUE!"}},{"$f":"AND(CoolerLabelsShelves!Z37,\"AAAAAH7PPqE=\")","v":{"$error":"#VALUE!"}},{"$f":"AND(CoolerLabelsShelves!AA37,\"AAAAAH7PPqI=\")","v":{"$error":"#VALUE!"}},{"$f":"IF(CoolerLabelsShelves!38:38,\"AAAAAH7PPqM=\",0)","v":0},{"$f":"AND(CoolerLabelsShelves!A38,\"AAAAAH7PPqQ=\")","v":{"$error":"#VALUE!"}},{"$f":"AND(CoolerLabelsShelves!B38,\"AAAAAH7PPqU=\")","v":{"$error":"#VALUE!"}},{"$f":"AND(CoolerLabelsShelves!C38,\"AAAAAH7PPqY=\")","v":{"$error":"#VALUE!"}},{"$f":"AND(CoolerLabelsShelves!D38,\"AAAAAH7PPqc=\")","v":{"$error":"#VALUE!"}},{"$f":"AND(CoolerLabelsShelves!E38,\"AAAAAH7PPqg=\")","v":{"$error":"#VALUE!"}},{"$f":"AND(CoolerLabelsShelves!F38,\"AAAAAH7PPqk=\")","v":{"$error":"#VALUE!"}},{"$f":"AND(CoolerLabelsShelves!G38,\"AAAAAH7PPqo=\")","v":{"$error":"#VALUE!"}},{"$f":"AND(CoolerLabelsShelves!H38,\"AAAAAH7PPqs=\")","v":{"$error":"#VALUE!"}},{"$f":"AND(CoolerLabelsShelves!I38,\"AAAAAH7PPqw=\")","v":{"$error":"#VALUE!"}},{"$f":"AND(CoolerLabelsShelves!J38,\"AAAAAH7PPq0=\")","v":{"$error":"#VALUE!"}},{"$f":"AND(CoolerLabelsShelves!K38,\"AAAAAH7PPq4=\")","v":{"$error":"#VALUE!"}},{"$f":"AND(CoolerLabelsShelves!L38,\"AAAAAH7PPq8=\")","v":{"$error":"#VALUE!"}},{"$f":"AND(CoolerLabelsShelves!M38,\"AAAAAH7PPrA=\")","v":{"$error":"#VALUE!"}},{"$f":"AND(CoolerLabelsShelves!N38,\"AAAAAH7PPrE=\")","v":{"$error":"#VALUE!"}},{"$f":"AND(CoolerLabelsShelves!O38,\"AAAAAH7PPrI=\")","v":{"$error":"#VALUE!"}},{"$f":"AND(CoolerLabelsShelves!P38,\"AAAAAH7PPrM=\")","v":{"$error":"#VALUE!"}},{"$f":"AND(CoolerLabelsShelves!Q38,\"AAAAAH7PPrQ=\")","v":{"$error":"#VALUE!"}},{"$f":"AND(CoolerLabelsShelves!R38,\"AAAAAH7PPrU=\")","v":{"$error":"#VALUE!"}},{"$f":"AND(CoolerLabelsShelves!S38,\"AAAAAH7PPrY=\")","v":{"$error":"#VALUE!"}},{"$f":"AND(CoolerLabelsShelves!T38,\"AAAAAH7PPrc=\")","v":{"$error":"#VALUE!"}},{"$f":"AND(CoolerLabelsShelves!U38,\"AAAAAH7PPrg=\")","v":{"$error":"#VALUE!"}},{"$f":"AND(CoolerLabelsShelves!V38,\"AAAAAH7PPrk=\")","v":{"$error":"#VALUE!"}},{"$f":"AND(CoolerLabelsShelves!W38,\"AAAAAH7PPro=\")","v":{"$error":"#VALUE!"}},{"$f":"AND(CoolerLabelsShelves!X38,\"AAAAAH7PPrs=\")","v":{"$error":"#VALUE!"}},{"$f":"AND(CoolerLabelsShelves!Y38,\"AAAAAH7PPrw=\")","v":{"$error":"#VALUE!"}},{"$f":"AND(CoolerLabelsShelves!Z38,\"AAAAAH7PPr0=\")","v":{"$error":"#VALUE!"}},{"$f":"AND(CoolerLabelsShelves!AA38,\"AAAAAH7PPr4=\")","v":{"$error":"#VALUE!"}},{"$f":"IF(CoolerLabelsShelves!39:39,\"AAAAAH7PPr8=\",0)","v":0},{"$f":"AND(CoolerLabelsShelves!A39,\"AAAAAH7PPsA=\")","v":{"$error":"#VALUE!"}},{"$f":"AND(CoolerLabelsShelves!B39,\"AAAAAH7PPsE=\")","v":{"$error":"#VALUE!"}},{"$f":"AND(CoolerLabelsShelves!C39,\"AAAAAH7PPsI=\")","v":{"$error":"#VALUE!"}},{"$f":"AND(CoolerLabelsShelves!D39,\"AAAAAH7PPsM=\")","v":{"$error":"#VALUE!"}},{"$f":"AND(CoolerLabelsShelves!E39,\"AAAAAH7PPsQ=\")","v":{"$error":"#VALUE!"}},{"$f":"AND(CoolerLabelsShelves!F39,\"AAAAAH7PPsU=\")","v":{"$error":"#VALUE!"}},{"$f":"AND(CoolerLabelsShelves!G39,\"AAAAAH7PPsY=\")","v":{"$error":"#VALUE!"}},{"$f":"AND(CoolerLabelsShelves!H39,\"AAAAAH7PPsc=\")","v":{"$error":"#VALUE!"}},{"$f":"AND(CoolerLabelsShelves!I39,\"AAAAAH7PPsg=\")","v":{"$error":"#VALUE!"}},{"$f":"AND(CoolerLabelsShelves!J39,\"AAAAAH7PPsk=\")","v":{"$error":"#VALUE!"}},{"$f":"AND(CoolerLabelsShelves!K39,\"AAAAAH7PPso=\")","v":{"$error":"#VALUE!"}},{"$f":"AND(CoolerLabelsShelves!L39,\"AAAAAH7PPss=\")","v":{"$error":"#VALUE!"}},{"$f":"AND(CoolerLabelsShelves!M39,\"AAAAAH7PPsw=\")","v":{"$error":"#VALUE!"}},{"$f":"AND(CoolerLabelsShelves!N39,\"AAAAAH7PPs0=\")","v":{"$error":"#VALUE!"}},{"$f":"AND(CoolerLabelsShelves!O39,\"AAAAAH7PPs4=\")","v":{"$error":"#VALUE!"}},{"$f":"AND(CoolerLabelsShelves!P39,\"AAAAAH7PPs8=\")","v":{"$error":"#VALUE!"}},{"$f":"AND(CoolerLabelsShelves!Q39,\"AAAAAH7PPtA=\")","v":{"$error":"#VALUE!"}},{"$f":"AND(CoolerLabelsShelves!R39,\"AAAAAH7PPtE=\")","v":{"$error":"#VALUE!"}},{"$f":"AND(CoolerLabelsShelves!S39,\"AAAAAH7PPtI=\")","v":{"$error":"#VALUE!"}},{"$f":"AND(CoolerLabelsShelves!T39,\"AAAAAH7PPtM=\")","v":{"$error":"#VALUE!"}},{"$f":"AND(CoolerLabelsShelves!U39,\"AAAAAH7PPtQ=\")","v":{"$error":"#VALUE!"}},{"$f":"AND(CoolerLabelsShelves!V39,\"AAAAAH7PPtU=\")","v":{"$error":"#VALUE!"}},{"$f":"AND(CoolerLabelsShelves!W39,\"AAAAAH7PPtY=\")","v":{"$error":"#VALUE!"}},{"$f":"AND(CoolerLabelsShelves!X39,\"AAAAAH7PPtc=\")","v":{"$error":"#VALUE!"}},{"$f":"AND(CoolerLabelsShelves!Y39,\"AAAAAH7PPtg=\")","v":{"$error":"#VALUE!"}},{"$f":"AND(CoolerLabelsShelves!Z39,\"AAAAAH7PPtk=\")","v":{"$error":"#VALUE!"}},{"$f":"AND(CoolerLabelsShelves!AA39,\"AAAAAH7PPto=\")","v":{"$error":"#VALUE!"}},{"$f":"IF(CoolerLabelsShelves!40:40,\"AAAAAH7PPts=\",0)","v":0},{"$f":"AND(CoolerLabelsShelves!A40,\"AAAAAH7PPtw=\")","v":{"$error":"#VALUE!"}},{"$f":"AND(CoolerLabelsShelves!B40,\"AAAAAH7PPt0=\")","v":{"$error":"#VALUE!"}},{"$f":"AND(CoolerLabelsShelves!C40,\"AAAAAH7PPt4=\")","v":{"$error":"#VALUE!"}},{"$f":"AND(CoolerLabelsShelves!D40,\"AAAAAH7PPt8=\")","v":{"$error":"#VALUE!"}},{"$f":"AND(CoolerLabelsShelves!E40,\"AAAAAH7PPuA=\")","v":{"$error":"#VALUE!"}},{"$f":"AND(CoolerLabelsShelves!F40,\"AAAAAH7PPuE=\")","v":{"$error":"#VALUE!"}},{"$f":"AND(CoolerLabelsShelves!G40,\"AAAAAH7PPuI=\")","v":{"$error":"#VALUE!"}},{"$f":"AND(CoolerLabelsShelves!H40,\"AAAAAH7PPuM=\")","v":{"$error":"#VALUE!"}},{"$f":"AND(CoolerLabelsShelves!I40,\"AAAAAH7PPuQ=\")","v":{"$error":"#VALUE!"}},{"$f":"AND(CoolerLabelsShelves!J40,\"AAAAAH7PPuU=\")","v":{"$error":"#VALUE!"}},{"$f":"AND(CoolerLabelsShelves!K40,\"AAAAAH7PPuY=\")","v":{"$error":"#VALUE!"}},{"$f":"AND(CoolerLabelsShelves!L40,\"AAAAAH7PPuc=\")","v":{"$error":"#VALUE!"}},{"$f":"AND(CoolerLabelsShelves!M40,\"AAAAAH7PPug=\")","v":{"$error":"#VALUE!"}},{"$f":"AND(CoolerLabelsShelves!N40,\"AAAAAH7PPuk=\")","v":{"$error":"#VALUE!"}},{"$f":"AND(CoolerLabelsShelves!O40,\"AAAAAH7PPuo=\")","v":{"$error":"#VALUE!"}},{"$f":"AND(CoolerLabelsShelves!P40,\"AAAAAH7PPus=\")","v":{"$error":"#VALUE!"}},{"$f":"AND(CoolerLabelsShelves!Q40,\"AAAAAH7PPuw=\")","v":{"$error":"#VALUE!"}},{"$f":"AND(CoolerLabelsShelves!R40,\"AAAAAH7PPu0=\")","v":{"$error":"#VALUE!"}},{"$f":"AND(CoolerLabelsShelves!S40,\"AAAAAH7PPu4=\")","v":{"$error":"#VALUE!"}},{"$f":"AND(CoolerLabelsShelves!T40,\"AAAAAH7PPu8=\")","v":{"$error":"#VALUE!"}},{"$f":"AND(CoolerLabelsShelves!U40,\"AAAAAH7PPvA=\")","v":{"$error":"#VALUE!"}},{"$f":"AND(CoolerLabelsShelves!V40,\"AAAAAH7PPvE=\")","v":{"$error":"#VALUE!"}},{"$f":"AND(CoolerLabelsShelves!W40,\"AAAAAH7PPvI=\")","v":{"$error":"#VALUE!"}},{"$f":"AND(CoolerLabelsShelves!X40,\"AAAAAH7PPvM=\")","v":{"$error":"#VALUE!"}},{"$f":"AND(CoolerLabelsShelves!Y40,\"AAAAAH7PPvQ=\")","v":{"$error":"#VALUE!"}},{"$f":"AND(CoolerLabelsShelves!Z40,\"AAAAAH7PPvU=\")","v":{"$error":"#VALUE!"}},{"$f":"AND(CoolerLabelsShelves!AA40,\"AAAAAH7PPvY=\")","v":{"$error":"#VALUE!"}},{"$f":"IF(CoolerLabelsShelves!41:41,\"AAAAAH7PPvc=\",0)","v":0},{"$f":"IF(CoolerLabelsShelves!42:42,\"AAAAAH7PPvg=\",0)","v":0},{"$f":"IF(CoolerLabelsShelves!43:43,\"AAAAAH7PPvk=\",0)","v":0},{"$f":"IF(CoolerLabelsShelves!44:44,\"AAAAAH7PPvo=\",0)","v":0},{"$f":"IF(CoolerLabelsShelves!45:45,\"AAAAAH7PPvs=\",0)","v":0},{"$f":"IF(CoolerLabelsShelves!46:46,\"AAAAAH7PPvw=\",0)","v":0},{"$f":"IF(CoolerLabelsShelves!47:47,\"AAAAAH7PPv0=\",0)","v":0},{"$f":"IF(CoolerLabelsShelves!48:48,\"AAAAAH7PPv4=\",0)","v":0},{"$f":"IF(CoolerLabelsShelves!49:49,\"AAAAAH7PPv8=\",0)","v":0}]
[{"$f":"IF(CoolerLabelsShelves!50:50,\"AAAAAFq6/wA=\",0)","v":0},{"$f":"IF(CoolerLabelsShelves!51:51,\"AAAAAFq6/wE=\",0)","v":0},{"$f":"IF(CoolerLabelsShelves!52:52,\"AAAAAFq6/wI=\",0)","v":0},{"$f":"IF(CoolerLabelsShelves!53:53,\"AAAAAFq6/wM=\",0)","v":0},{"$f":"IF(CoolerLabelsShelves!54:54,\"AAAAAFq6/wQ=\",0)","v":0},{"$f":"IF(CoolerLabelsShelves!55:55,\"AAAAAFq6/wU=\",0)","v":0},{"$f":"IF(CoolerLabelsShelves!56:56,\"AAAAAFq6/wY=\",0)","v":0},{"$f":"IF(CoolerLabelsShelves!57:57,\"AAAAAFq6/wc=\",0)","v":0},{"$f":"IF(CoolerLabelsShelves!58:58,\"AAAAAFq6/wg=\",0)","v":0},{"$f":"IF(CoolerLabelsShelves!59:59,\"AAAAAFq6/wk=\",0)","v":0},{"$f":"IF(CoolerLabelsShelves!60:60,\"AAAAAFq6/wo=\",0)","v":0},{"$f":"IF(CoolerLabelsShelves!61:61,\"AAAAAFq6/ws=\",0)","v":0},{"$f":"IF(CoolerLabelsShelves!62:62,\"AAAAAFq6/ww=\",0)","v":0},{"$f":"IF(CoolerLabelsShelves!63:63,\"AAAAAFq6/w0=\",0)","v":0},{"$f":"IF(CoolerLabelsShelves!64:64,\"AAAAAFq6/w4=\",0)","v":0},{"$f":"IF(CoolerLabelsShelves!65:65,\"AAAAAFq6/w8=\",0)","v":0},{"$f":"IF(CoolerLabelsShelves!66:66,\"AAAAAFq6/xA=\",0)","v":0},{"$f":"IF(CoolerLabelsShelves!67:67,\"AAAAAFq6/xE=\",0)","v":0},{"$f":"IF(CoolerLabelsShelves!68:68,\"AAAAAFq6/xI=\",0)","v":0},{"$f":"IF(CoolerLabelsShelves!69:69,\"AAAAAFq6/xM=\",0)","v":0},{"$f":"IF(CoolerLabelsShelves!70:70,\"AAAAAFq6/xQ=\",0)","v":0},{"$f":"IF(CoolerLabelsShelves!71:71,\"AAAAAFq6/xU=\",0)","v":0},{"$f":"IF(CoolerLabelsShelves!72:72,\"AAAAAFq6/xY=\",0)","v":0},{"$f":"IF(CoolerLabelsShelves!73:73,\"AAAAAFq6/xc=\",0)","v":0},{"$f":"IF(CoolerLabelsShelves!74:74,\"AAAAAFq6/xg=\",0)","v":0},{"$f":"IF(CoolerLabelsShelves!75:75,\"AAAAAFq6/xk=\",0)","v":0},{"$f":"IF(CoolerLabelsShelves!76:76,\"AAAAAFq6/xo=\",0)","v":0},{"$f":"IF(CoolerLabelsShelves!77:77,\"AAAAAFq6/xs=\",0)","v":0},{"$f":"IF(CoolerLabelsShelves!78:78,\"AAAAAFq6/xw=\",0)","v":0},{"$f":"IF(CoolerLabelsShelves!79:79,\"AAAAAFq6/x0=\",0)","v":0},{"$f":"IF(CoolerLabelsShelves!80:80,\"AAAAAFq6/x4=\",0)","v":0},{"$f":"IF(CoolerLabelsShelves!81:81,\"AAAAAFq6/x8=\",0)","v":0},{"$f":"IF(CoolerLabelsShelves!82:82,\"AAAAAFq6/yA=\",0)","v":0},{"$f":"IF(CoolerLabelsShelves!83:83,\"AAAAAFq6/yE=\",0)","v":0},{"$f":"IF(CoolerLabelsShelves!84:84,\"AAAAAFq6/yI=\",0)","v":0},{"$f":"IF(CoolerLabelsShelves!85:85,\"AAAAAFq6/yM=\",0)","v":0},{"$f":"IF(CoolerLabelsShelves!86:86,\"AAAAAFq6/yQ=\",0)","v":0},{"$f":"IF(CoolerLabelsShelves!87:87,\"AAAAAFq6/yU=\",0)","v":0},{"$f":"IF(CoolerLabelsShelves!88:88,\"AAAAAFq6/yY=\",0)","v":0},{"$f":"IF(CoolerLabelsShelves!89:89,\"AAAAAFq6/yc=\",0)","v":0},{"$f":"IF(CoolerLabelsShelves!90:90,\"AAAAAFq6/yg=\",0)","v":0},{"$f":"IF(CoolerLabelsShelves!91:91,\"AAAAAFq6/yk=\",0)","v":0},{"$f":"IF(CoolerLabelsShelves!92:92,\"AAAAAFq6/yo=\",0)","v":0},{"$f":"IF(CoolerLabelsShelves!93:93,\"AAAAAFq6/ys=\",0)","v":0},{"$f":"IF(CoolerLabelsShelves!94:94,\"AAAAAFq6/yw=\",0)","v":0},{"$f":"IF(CoolerLabelsShelves!95:95,\"AAAAAFq6/y0=\",0)","v":0},{"$f":"IF(CoolerLabelsShelves!96:96,\"AAAAAFq6/y4=\",0)","v":0},{"$f":"IF(CoolerLabelsShelves!97:97,\"AAAAAFq6/y8=\",0)","v":0},{"$f":"IF(CoolerLabelsShelves!98:98,\"AAAAAFq6/zA=\",0)","v":0},{"$f":"IF(CoolerLabelsShelves!99:99,\"AAAAAFq6/zE=\",0)","v":0},{"$f":"IF(CoolerLabelsShelves!100:100,\"AAAAAFq6/zI=\",0)","v":0},{"$f":"IF(CoolerLabelsShelves!101:101,\"AAAAAFq6/zM=\",0)","v":0},{"$f":"IF(CoolerLabelsShelves!102:102,\"AAAAAFq6/zQ=\",0)","v":0},{"$f":"IF(CoolerLabelsShelves!103:103,\"AAAAAFq6/zU=\",0)","v":0},{"$f":"IF(CoolerLabelsShelves!104:104,\"AAAAAFq6/zY=\",0)","v":0},{"$f":"IF(CoolerLabelsShelves!105:105,\"AAAAAFq6/zc=\",0)","v":0},{"$f":"IF(CoolerLabelsShelves!106:106,\"AAAAAFq6/zg=\",0)","v":0},{"$f":"IF(CoolerLabelsShelves!107:107,\"AAAAAFq6/zk=\",0)","v":0},{"$f":"IF(CoolerLabelsShelves!108:108,\"AAAAAFq6/zo=\",0)","v":0},{"$f":"IF(CoolerLabelsShelves!109:109,\"AAAAAFq6/zs=\",0)","v":0},{"$f":"IF(CoolerLabelsShelves!110:110,\"AAAAAFq6/zw=\",0)","v":0},{"$f":"IF(CoolerLabelsShelves!111:111,\"AAAAAFq6/z0=\",0)","v":0},{"$f":"IF(CoolerLabelsShelves!A:A,\"AAAAAFq6/z4=\",0)","v":0},{"$f":"IF(CoolerLabelsShelves!B:B,\"AAAAAFq6/z8=\",0)","v":0},{"$f":"IF(CoolerLabelsShelves!C:C,\"AAAAAFq6/0A=\",0)","v":0},{"$f":"IF(CoolerLabelsShelves!D:D,\"AAAAAFq6/0E=\",0)","v":0},{"$f":"IF(CoolerLabelsShelves!E:E,\"AAAAAFq6/0I=\",0)","v":0},{"$f":"IF(CoolerLabelsShelves!F:F,\"AAAAAFq6/0M=\",0)","v":0},{"$f":"IF(CoolerLabelsShelves!G:G,\"AAAAAFq6/0Q=\",0)","v":0},{"$f":"IF(CoolerLabelsShelves!H:H,\"AAAAAFq6/0U=\",0)","v":0},{"$f":"IF(CoolerLabelsShelves!I:I,\"AAAAAFq6/0Y=\",0)","v":0},{"$f":"IF(CoolerLabelsShelves!J:J,\"AAAAAFq6/0c=\",0)","v":0},{"$f":"IF(CoolerLabelsShelves!K:K,\"AAAAAFq6/0g=\",0)","v":0},{"$f":"IF(CoolerLabelsShelves!L:L,\"AAAAAFq6/0k=\",0)","v":0},{"$f":"IF(CoolerLabelsShelves!M:M,\"AAAAAFq6/0o=\",0)","v":0},{"$f":"IF(CoolerLabelsShelves!N:N,\"AAAAAFq6/0s=\",0)","v":0},{"$f":"IF(CoolerLabelsShelves!O:O,\"AAAAAFq6/0w=\",0)","v":0},{"$f":"IF(CoolerLabelsShelves!P:P,\"AAAAAFq6/00=\",0)","v":0},{"$f":"IF(CoolerLabelsShelves!Q:Q,\"AAAAAFq6/04=\",0)","v":0},{"$f":"IF(CoolerLabelsShelves!R:R,\"AAAAAFq6/08=\",0)","v":0},{"$f":"IF(CoolerLabelsShelves!S:S,\"AAAAAFq6/1A=\",0)","v":0},{"$f":"IF(CoolerLabelsShelves!T:T,\"AAAAAFq6/1E=\",0)","v":0},{"$f":"IF(CoolerLabelsShelves!U:U,\"AAAAAFq6/1I=\",0)","v":0},{"$f":"IF(CoolerLabelsShelves!V:V,\"AAAAAFq6/1M=\",0)","v":0},{"$f":"IF(CoolerLabelsShelves!W:W,\"AAAAAFq6/1Q=\",0)","v":0},{"$f":"IF(CoolerLabelsShelves!X:X,\"AAAAAFq6/1U=\",0)","v":0},{"$f":"IF(CoolerLabelsShelves!Y:Y,\"AAAAAFq6/1Y=\",0)","v":0},{"$f":"IF(CoolerLabelsShelves!Z:Z,\"AAAAAFq6/1c=\",0)","v":0},{"$f":"IF(CoolerLabelsShelves!AA:AA,\"AAAAAFq6/1g=\",0)","v":0},{"$f":"IF(CoolerLabelsDairy!1:1,\"AAAAAFq6/1k=\",0)","v":0},{"$f":"AND(CoolerLabelsDairy!A1,\"AAAAAFq6/1o=\")","v":{"$error":"#VALUE!"}},{"$f":"AND(CoolerLabelsDairy!B1,\"AAAAAFq6/1s=\")","v":{"$error":"#VALUE!"}},{"$f":"AND(CoolerLabelsDairy!C1,\"AAAAAFq6/1w=\")","v":{"$error":"#VALUE!"}},{"$f":"AND(CoolerLabelsDairy!D1,\"AAAAAFq6/10=\")","v":{"$error":"#VALUE!"}},{"$f":"AND(CoolerLabelsDairy!E1,\"AAAAAFq6/14=\")","v":{"$error":"#VALUE!"}},{"$f":"AND(CoolerLabelsDairy!F1,\"AAAAAFq6/18=\")","v":{"$error":"#VALUE!"}},{"$f":"AND(CoolerLabelsDairy!G1,\"AAAAAFq6/2A=\")","v":{"$error":"#VALUE!"}},{"$f":"AND(CoolerLabelsDairy!H1,\"AAAAAFq6/2E=\")","v":{"$error":"#VALUE!"}},{"$f":"AND(CoolerLabelsDairy!I1,\"AAAAAFq6/2I=\")","v":{"$error":"#VALUE!"}},{"$f":"AND(CoolerLabelsDairy!J1,\"AAAAAFq6/2M=\")","v":{"$error":"#VALUE!"}},{"$f":"AND(CoolerLabelsDairy!K1,\"AAAAAFq6/2Q=\")","v":{"$error":"#VALUE!"}},{"$f":"AND(CoolerLabelsDairy!L1,\"AAAAAFq6/2U=\")","v":{"$error":"#VALUE!"}},{"$f":"AND(CoolerLabelsDairy!M1,\"AAAAAFq6/2Y=\")","v":{"$error":"#VALUE!"}},{"$f":"AND(CoolerLabelsDairy!N1,\"AAAAAFq6/2c=\")","v":{"$error":"#VALUE!"}},{"$f":"AND(CoolerLabelsDairy!O1,\"AAAAAFq6/2g=\")","v":{"$error":"#VALUE!"}},{"$f":"AND(CoolerLabelsDairy!P1,\"AAAAAFq6/2k=\")","v":{"$error":"#VALUE!"}},{"$f":"AND(CoolerLabelsDairy!Q1,\"AAAAAFq6/2o=\")","v":{"$error":"#VALUE!"}},{"$f":"AND(CoolerLabelsDairy!R1,\"AAAAAFq6/2s=\")","v":{"$error":"#VALUE!"}},{"$f":"AND(CoolerLabelsDairy!S1,\"AAAAAFq6/2w=\")","v":{"$error":"#VALUE!"}},{"$f":"AND(CoolerLabelsDairy!T1,\"AAAAAFq6/20=\")","v":{"$error":"#VALUE!"}},{"$f":"AND(CoolerLabelsDairy!U1,\"AAAAAFq6/24=\")","v":{"$error":"#VALUE!"}},{"$f":"IF(CoolerLabelsDairy!2:2,\"AAAAAFq6/28=\",0)","v":0},{"$f":"AND(CoolerLabelsDairy!A2,\"AAAAAFq6/3A=\")","v":{"$error":"#VALUE!"}},{"$f":"AND(CoolerLabelsDairy!B2,\"AAAAAFq6/3E=\")","v":{"$error":"#VALUE!"}},{"$f":"AND(CoolerLabelsDairy!C2,\"AAAAAFq6/3I=\")","v":{"$error":"#VALUE!"}},{"$f":"AND(CoolerLabelsDairy!D2,\"AAAAAFq6/3M=\")","v":{"$error":"#VALUE!"}},{"$f":"AND(CoolerLabelsDairy!E2,\"AAAAAFq6/3Q=\")","v":{"$error":"#VALUE!"}},{"$f":"AND(CoolerLabelsDairy!F2,\"AAAAAFq6/3U=\")","v":{"$error":"#VALUE!"}},{"$f":"AND(CoolerLabelsDairy!G2,\"AAAAAFq6/3Y=\")","v":{"$error":"#VALUE!"}},{"$f":"AND(CoolerLabelsDairy!H2,\"AAAAAFq6/3c=\")","v":{"$error":"#VALUE!"}},{"$f":"AND(CoolerLabelsDairy!I2,\"AAAAAFq6/3g=\")","v":{"$error":"#VALUE!"}},{"$f":"AND(CoolerLabelsDairy!J2,\"AAAAAFq6/3k=\")","v":{"$error":"#VALUE!"}},{"$f":"AND(CoolerLabelsDairy!K2,\"AAAAAFq6/3o=\")","v":{"$error":"#VALUE!"}},{"$f":"AND(CoolerLabelsDairy!L2,\"AAAAAFq6/3s=\")","v":{"$error":"#VALUE!"}},{"$f":"AND(CoolerLabelsDairy!M2,\"AAAAAFq6/3w=\")","v":{"$error":"#VALUE!"}},{"$f":"AND(CoolerLabelsDairy!N2,\"AAAAAFq6/30=\")","v":{"$error":"#VALUE!"}},{"$f":"AND(CoolerLabelsDairy!O2,\"AAAAAFq6/34=\")","v":{"$error":"#VALUE!"}},{"$f":"AND(CoolerLabelsDairy!P2,\"AAAAAFq6/38=\")","v":{"$error":"#VALUE!"}},{"$f":"AND(CoolerLabelsDairy!Q2,\"AAAAAFq6/4A=\")","v":{"$error":"#VALUE!"}},{"$f":"AND(CoolerLabelsDairy!R2,\"AAAAAFq6/4E=\")","v":{"$error":"#VALUE!"}},{"$f":"AND(CoolerLabelsDairy!S2,\"AAAAAFq6/4I=\")","v":{"$error":"#VALUE!"}},{"$f":"AND(CoolerLabelsDairy!T2,\"AAAAAFq6/4M=\")","v":{"$error":"#VALUE!"}},{"$f":"AND(CoolerLabelsDairy!U2,\"AAAAAFq6/4Q=\")","v":{"$error":"#VALUE!"}},{"$f":"IF(CoolerLabelsDairy!3:3,\"AAAAAFq6/4U=\",0)","v":0},{"$f":"AND(CoolerLabelsDairy!A3,\"AAAAAFq6/4Y=\")","v":{"$error":"#VALUE!"}},{"$f":"AND(CoolerLabelsDairy!B3,\"AAAAAFq6/4c=\")","v":{"$error":"#VALUE!"}},{"$f":"AND(CoolerLabelsDairy!C3,\"AAAAAFq6/4g=\")","v":{"$error":"#VALUE!"}},{"$f":"AND(CoolerLabelsDairy!D3,\"AAAAAFq6/4k=\")","v":{"$error":"#VALUE!"}},{"$f":"AND(CoolerLabelsDairy!E3,\"AAAAAFq6/4o=\")","v":{"$error":"#VALUE!"}},{"$f":"AND(CoolerLabelsDairy!F3,\"AAAAAFq6/4s=\")","v":{"$error":"#VALUE!"}},{"$f":"AND(CoolerLabelsDairy!G3,\"AAAAAFq6/4w=\")","v":{"$error":"#VALUE!"}},{"$f":"AND(CoolerLabelsDairy!H3,\"AAAAAFq6/40=\")","v":{"$error":"#VALUE!"}},{"$f":"AND(CoolerLabelsDairy!I3,\"AAAAAFq6/44=\")","v":{"$error":"#VALUE!"}},{"$f":"AND(CoolerLabelsDairy!J3,\"AAAAAFq6/48=\")","v":{"$error":"#VALUE!"}},{"$f":"AND(CoolerLabelsDairy!K3,\"AAAAAFq6/5A=\")","v":{"$error":"#VALUE!"}},{"$f":"AND(CoolerLabelsDairy!L3,\"AAAAAFq6/5E=\")","v":{"$error":"#VALUE!"}},{"$f":"AND(CoolerLabelsDairy!M3,\"AAAAAFq6/5I=\")","v":{"$error":"#VALUE!"}},{"$f":"AND(CoolerLabelsDairy!N3,\"AAAAAFq6/5M=\")","v":{"$error":"#VALUE!"}},{"$f":"AND(CoolerLabelsDairy!O3,\"AAAAAFq6/5Q=\")","v":{"$error":"#VALUE!"}},{"$f":"AND(CoolerLabelsDairy!P3,\"AAAAAFq6/5U=\")","v":{"$error":"#VALUE!"}},{"$f":"AND(CoolerLabelsDairy!Q3,\"AAAAAFq6/5Y=\")","v":{"$error":"#VALUE!"}},{"$f":"AND(CoolerLabelsDairy!R3,\"AAAAAFq6/5c=\")","v":{"$error":"#VALUE!"}},{"$f":"AND(CoolerLabelsDairy!S3,\"AAAAAFq6/5g=\")","v":{"$error":"#VALUE!"}},{"$f":"AND(CoolerLabelsDairy!T3,\"AAAAAFq6/5k=\")","v":{"$error":"#VALUE!"}},{"$f":"AND(CoolerLabelsDairy!U3,\"AAAAAFq6/5o=\")","v":{"$error":"#VALUE!"}},{"$f":"IF(CoolerLabelsDairy!4:4,\"AAAAAFq6/5s=\",0)","v":0},{"$f":"AND(CoolerLabelsDairy!A4,\"AAAAAFq6/5w=\")","v":{"$error":"#VALUE!"}},{"$f":"AND(CoolerLabelsDairy!B4,\"AAAAAFq6/50=\")","v":{"$error":"#VALUE!"}},{"$f":"AND(CoolerLabelsDairy!C4,\"AAAAAFq6/54=\")","v":{"$error":"#VALUE!"}},{"$f":"AND(CoolerLabelsDairy!D4,\"AAAAAFq6/58=\")","v":{"$error":"#VALUE!"}},{"$f":"AND(CoolerLabelsDairy!E4,\"AAAAAFq6/6A=\")","v":{"$error":"#VALUE!"}},{"$f":"AND(CoolerLabelsDairy!F4,\"AAAAAFq6/6E=\")","v":{"$error":"#VALUE!"}},{"$f":"AND(CoolerLabelsDairy!G4,\"AAAAAFq6/6I=\")","v":{"$error":"#VALUE!"}},{"$f":"AND(CoolerLabelsDairy!H4,\"AAAAAFq6/6M=\")","v":{"$error":"#VALUE!"}},{"$f":"AND(CoolerLabelsDairy!I4,\"AAAAAFq6/6Q=\")","v":{"$error":"#VALUE!"}},{"$f":"AND(CoolerLabelsDairy!J4,\"AAAAAFq6/6U=\")","v":{"$error":"#VALUE!"}},{"$f":"AND(CoolerLabelsDairy!K4,\"AAAAAFq6/6Y=\")","v":{"$error":"#VALUE!"}},{"$f":"AND(CoolerLabelsDairy!L4,\"AAAAAFq6/6c=\")","v":{"$error":"#VALUE!"}},{"$f":"AND(CoolerLabelsDairy!M4,\"AAAAAFq6/6g=\")","v":{"$error":"#VALUE!"}},{"$f":"AND(CoolerLabelsDairy!N4,\"AAAAAFq6/6k=\")","v":{"$error":"#VALUE!"}},{"$f":"AND(CoolerLabelsDairy!O4,\"AAAAAFq6/6o=\")","v":{"$error":"#VALUE!"}},{"$f":"AND(CoolerLabelsDairy!P4,\"AAAAAFq6/6s=\")","v":{"$error":"#VALUE!"}},{"$f":"AND(CoolerLabelsDairy!Q4,\"AAAAAFq6/6w=\")","v":{"$error":"#VALUE!"}},{"$f":"AND(CoolerLabelsDairy!R4,\"AAAAAFq6/60=\")","v":{"$error":"#VALUE!"}},{"$f":"AND(CoolerLabelsDairy!S4,\"AAAAAFq6/64=\")","v":{"$error":"#VALUE!"}},{"$f":"AND(CoolerLabelsDairy!T4,\"AAAAAFq6/68=\")","v":{"$error":"#VALUE!"}},{"$f":"AND(CoolerLabelsDairy!U4,\"AAAAAFq6/7A=\")","v":{"$error":"#VALUE!"}},{"$f":"IF(CoolerLabelsDairy!5:5,\"AAAAAFq6/7E=\",0)","v":0},{"$f":"AND(CoolerLabelsDairy!A5,\"AAAAAFq6/7I=\")","v":{"$error":"#VALUE!"}},{"$f":"AND(CoolerLabelsDairy!B5,\"AAAAAFq6/7M=\")","v":{"$error":"#VALUE!"}},{"$f":"AND(CoolerLabelsDairy!C5,\"AAAAAFq6/7Q=\")","v":{"$error":"#VALUE!"}},{"$f":"AND(CoolerLabelsDairy!D5,\"AAAAAFq6/7U=\")","v":{"$error":"#VALUE!"}},{"$f":"AND(CoolerLabelsDairy!E5,\"AAAAAFq6/7Y=\")","v":{"$error":"#VALUE!"}},{"$f":"AND(CoolerLabelsDairy!F5,\"AAAAAFq6/7c=\")","v":{"$error":"#VALUE!"}},{"$f":"AND(CoolerLabelsDairy!G5,\"AAAAAFq6/7g=\")","v":{"$error":"#VALUE!"}},{"$f":"AND(CoolerLabelsDairy!H5,\"AAAAAFq6/7k=\")","v":{"$error":"#VALUE!"}},{"$f":"AND(CoolerLabelsDairy!I5,\"AAAAAFq6/7o=\")","v":{"$error":"#VALUE!"}},{"$f":"AND(CoolerLabelsDairy!J5,\"AAAAAFq6/7s=\")","v":{"$error":"#VALUE!"}},{"$f":"AND(CoolerLabelsDairy!K5,\"AAAAAFq6/7w=\")","v":{"$error":"#VALUE!"}},{"$f":"AND(CoolerLabelsDairy!L5,\"AAAAAFq6/70=\")","v":{"$error":"#VALUE!"}},{"$f":"AND(CoolerLabelsDairy!M5,\"AAAAAFq6/74=\")","v":{"$error":"#VALUE!"}},{"$f":"AND(CoolerLabelsDairy!N5,\"AAAAAFq6/78=\")","v":{"$error":"#VALUE!"}},{"$f":"AND(CoolerLabelsDairy!O5,\"AAAAAFq6/8A=\")","v":{"$error":"#VALUE!"}},{"$f":"AND(CoolerLabelsDairy!P5,\"AAAAAFq6/8E=\")","v":{"$error":"#VALUE!"}},{"$f":"AND(CoolerLabelsDairy!Q5,\"AAAAAFq6/8I=\")","v":{"$error":"#VALUE!"}},{"$f":"AND(CoolerLabelsDairy!R5,\"AAAAAFq6/8M=\")","v":{"$error":"#VALUE!"}},{"$f":"AND(CoolerLabelsDairy!S5,\"AAAAAFq6/8Q=\")","v":{"$error":"#VALUE!"}},{"$f":"AND(CoolerLabelsDairy!T5,\"AAAAAFq6/8U=\")","v":{"$error":"#VALUE!"}},{"$f":"AND(CoolerLabelsDairy!U5,\"AAAAAFq6/8Y=\")","v":{"$error":"#VALUE!"}},{"$f":"IF(CoolerLabelsDairy!6:6,\"AAAAAFq6/8c=\",0)","v":0},{"$f":"AND(CoolerLabelsDairy!A6,\"AAAAAFq6/8g=\")","v":{"$error":"#VALUE!"}},{"$f":"AND(CoolerLabelsDairy!B6,\"AAAAAFq6/8k=\")","v":{"$error":"#VALUE!"}},{"$f":"AND(CoolerLabelsDairy!C6,\"AAAAAFq6/8o=\")","v":{"$error":"#VALUE!"}},{"$f":"AND(CoolerLabelsDairy!D6,\"AAAAAFq6/8s=\")","v":{"$error":"#VALUE!"}},{"$f":"AND(CoolerLabelsDairy!E6,\"AAAAAFq6/8w=\")","v":{"$error":"#VALUE!"}},{"$f":"AND(CoolerLabelsDairy!F6,\"AAAAAFq6/80=\")","v":{"$error":"#VALUE!"}},{"$f":"AND(CoolerLabelsDairy!G6,\"AAAAAFq6/84=\")","v":{"$error":"#VALUE!"}},{"$f":"AND(CoolerLabelsDairy!H6,\"AAAAAFq6/88=\")","v":{"$error":"#VALUE!"}},{"$f":"AND(CoolerLabelsDairy!I6,\"AAAAAFq6/9A=\")","v":{"$error":"#VALUE!"}},{"$f":"AND(CoolerLabelsDairy!J6,\"AAAAAFq6/9E=\")","v":{"$error":"#VALUE!"}},{"$f":"AND(CoolerLabelsDairy!K6,\"AAAAAFq6/9I=\")","v":{"$error":"#VALUE!"}},{"$f":"AND(CoolerLabelsDairy!L6,\"AAAAAFq6/9M=\")","v":{"$error":"#VALUE!"}},{"$f":"AND(CoolerLabelsDairy!M6,\"AAAAAFq6/9Q=\")","v":{"$error":"#VALUE!"}},{"$f":"AND(CoolerLabelsDairy!N6,\"AAAAAFq6/9U=\")","v":{"$error":"#VALUE!"}},{"$f":"AND(CoolerLabelsDairy!O6,\"AAAAAFq6/9Y=\")","v":{"$error":"#VALUE!"}},{"$f":"AND(CoolerLabelsDairy!P6,\"AAAAAFq6/9c=\")","v":{"$error":"#VALUE!"}},{"$f":"AND(CoolerLabelsDairy!Q6,\"AAAAAFq6/9g=\")","v":{"$error":"#VALUE!"}},{"$f":"AND(CoolerLabelsDairy!R6,\"AAAAAFq6/9k=\")","v":{"$error":"#VALUE!"}},{"$f":"AND(CoolerLabelsDairy!S6,\"AAAAAFq6/9o=\")","v":{"$error":"#VALUE!"}},{"$f":"AND(CoolerLabelsDairy!T6,\"AAAAAFq6/9s=\")","v":{"$error":"#VALUE!"}},{"$f":"AND(CoolerLabelsDairy!U6,\"AAAAAFq6/9w=\")","v":{"$error":"#VALUE!"}},{"$f":"IF(CoolerLabelsDairy!7:7,\"AAAAAFq6/90=\",0)","v":0},{"$f":"AND(CoolerLabelsDairy!A7,\"AAAAAFq6/94=\")","v":{"$error":"#VALUE!"}},{"$f":"AND(CoolerLabelsDairy!B7,\"AAAAAFq6/98=\")","v":{"$error":"#VALUE!"}},{"$f":"AND(CoolerLabelsDairy!C7,\"AAAAAFq6/+A=\")","v":{"$error":"#VALUE!"}},{"$f":"AND(CoolerLabelsDairy!D7,\"AAAAAFq6/+E=\")","v":{"$error":"#VALUE!"}},{"$f":"AND(CoolerLabelsDairy!E7,\"AAAAAFq6/+I=\")","v":{"$error":"#VALUE!"}},{"$f":"AND(CoolerLabelsDairy!F7,\"AAAAAFq6/+M=\")","v":{"$error":"#VALUE!"}},{"$f":"AND(CoolerLabelsDairy!G7,\"AAAAAFq6/+Q=\")","v":{"$error":"#VALUE!"}},{"$f":"AND(CoolerLabelsDairy!H7,\"AAAAAFq6/+U=\")","v":{"$error":"#VALUE!"}},{"$f":"AND(CoolerLabelsDairy!I7,\"AAAAAFq6/+Y=\")","v":{"$error":"#VALUE!"}},{"$f":"AND(CoolerLabelsDairy!J7,\"AAAAAFq6/+c=\")","v":{"$error":"#VALUE!"}},{"$f":"AND(CoolerLabelsDairy!K7,\"AAAAAFq6/+g=\")","v":{"$error":"#VALUE!"}},{"$f":"AND(CoolerLabelsDairy!L7,\"AAAAAFq6/+k=\")","v":{"$error":"#VALUE!"}},{"$f":"AND(CoolerLabelsDairy!M7,\"AAAAAFq6/+o=\")","v":{"$error":"#VALUE!"}},{"$f":"AND(CoolerLabelsDairy!N7,\"AAAAAFq6/+s=\")","v":{"$error":"#VALUE!"}},{"$f":"AND(CoolerLabelsDairy!O7,\"AAAAAFq6/+w=\")","v":{"$error":"#VALUE!"}},{"$f":"AND(CoolerLabelsDairy!P7,\"AAAAAFq6/+0=\")","v":{"$error":"#VALUE!"}},{"$f":"AND(CoolerLabelsDairy!Q7,\"AAAAAFq6/+4=\")","v":{"$error":"#VALUE!"}},{"$f":"AND(CoolerLabelsDairy!R7,\"AAAAAFq6/+8=\")","v":{"$error":"#VALUE!"}},{"$f":"AND(CoolerLabelsDairy!S7,\"AAAAAFq6//A=\")","v":{"$error":"#VALUE!"}},{"$f":"AND(CoolerLabelsDairy!T7,\"AAAAAFq6//E=\")","v":{"$error":"#VALUE!"}},{"$f":"AND(CoolerLabelsDairy!U7,\"AAAAAFq6//I=\")","v":{"$error":"#VALUE!"}},{"$f":"IF(CoolerLabelsDairy!8:8,\"AAAAAFq6//M=\",0)","v":0},{"$f":"AND(CoolerLabelsDairy!A8,\"AAAAAFq6//Q=\")","v":{"$error":"#VALUE!"}},{"$f":"AND(CoolerLabelsDairy!B8,\"AAAAAFq6//U=\")","v":{"$error":"#VALUE!"}},{"$f":"AND(CoolerLabelsDairy!C8,\"AAAAAFq6//Y=\")","v":{"$error":"#VALUE!"}},{"$f":"AND(CoolerLabelsDairy!D8,\"AAAAAFq6//c=\")","v":{"$error":"#VALUE!"}},{"$f":"AND(CoolerLabelsDairy!E8,\"AAAAAFq6//g=\")","v":{"$error":"#VALUE!"}},{"$f":"AND(CoolerLabelsDairy!F8,\"AAAAAFq6//k=\")","v":{"$error":"#VALUE!"}},{"$f":"AND(CoolerLabelsDairy!G8,\"AAAAAFq6//o=\")","v":{"$error":"#VALUE!"}},{"$f":"AND(CoolerLabelsDairy!H8,\"AAAAAFq6//s=\")","v":{"$error":"#VALUE!"}},{"$f":"AND(CoolerLabelsDairy!I8,\"AAAAAFq6//w=\")","v":{"$error":"#VALUE!"}},{"$f":"AND(CoolerLabelsDairy!J8,\"AAAAAFq6//0=\")","v":{"$error":"#VALUE!"}},{"$f":"AND(CoolerLabelsDairy!K8,\"AAAAAFq6//4=\")","v":{"$error":"#VALUE!"}},{"$f":"AND(CoolerLabelsDairy!L8,\"AAAAAFq6//8=\")","v":{"$error":"#VALUE!"}}]
[{"$f":"AND(CoolerLabelsDairy!M8,\"AAAAAH5nHwA=\")","v":{"$error":"#VALUE!"}},{"$f":"AND(CoolerLabelsDairy!N8,\"AAAAAH5nHwE=\")","v":{"$error":"#VALUE!"}},{"$f":"AND(CoolerLabelsDairy!O8,\"AAAAAH5nHwI=\")","v":{"$error":"#VALUE!"}},{"$f":"AND(CoolerLabelsDairy!P8,\"AAAAAH5nHwM=\")","v":{"$error":"#VALUE!"}},{"$f":"AND(CoolerLabelsDairy!Q8,\"AAAAAH5nHwQ=\")","v":{"$error":"#VALUE!"}},{"$f":"AND(CoolerLabelsDairy!R8,\"AAAAAH5nHwU=\")","v":{"$error":"#VALUE!"}},{"$f":"AND(CoolerLabelsDairy!S8,\"AAAAAH5nHwY=\")","v":{"$error":"#VALUE!"}},{"$f":"AND(CoolerLabelsDairy!T8,\"AAAAAH5nHwc=\")","v":{"$error":"#VALUE!"}},{"$f":"AND(CoolerLabelsDairy!U8,\"AAAAAH5nHwg=\")","v":{"$error":"#VALUE!"}},{"$f":"IF(CoolerLabelsDairy!9:9,\"AAAAAH5nHwk=\",0)","v":0},{"$f":"AND(CoolerLabelsDairy!A9,\"AAAAAH5nHwo=\")","v":{"$error":"#VALUE!"}},{"$f":"AND(CoolerLabelsDairy!B9,\"AAAAAH5nHws=\")","v":{"$error":"#VALUE!"}},{"$f":"AND(CoolerLabelsDairy!C9,\"AAAAAH5nHww=\")","v":{"$error":"#VALUE!"}},{"$f":"AND(CoolerLabelsDairy!D9,\"AAAAAH5nHw0=\")","v":{"$error":"#VALUE!"}},{"$f":"AND(CoolerLabelsDairy!E9,\"AAAAAH5nHw4=\")","v":{"$error":"#VALUE!"}},{"$f":"AND(CoolerLabelsDairy!F9,\"AAAAAH5nHw8=\")","v":{"$error":"#VALUE!"}},{"$f":"AND(CoolerLabelsDairy!G9,\"AAAAAH5nHxA=\")","v":{"$error":"#VALUE!"}},{"$f":"AND(CoolerLabelsDairy!H9,\"AAAAAH5nHxE=\")","v":{"$error":"#VALUE!"}},{"$f":"AND(CoolerLabelsDairy!I9,\"AAAAAH5nHxI=\")","v":{"$error":"#VALUE!"}},{"$f":"AND(CoolerLabelsDairy!J9,\"AAAAAH5nHxM=\")","v":{"$error":"#VALUE!"}},{"$f":"AND(CoolerLabelsDairy!K9,\"AAAAAH5nHxQ=\")","v":{"$error":"#VALUE!"}},{"$f":"AND(CoolerLabelsDairy!L9,\"AAAAAH5nHxU=\")","v":{"$error":"#VALUE!"}},{"$f":"AND(CoolerLabelsDairy!M9,\"AAAAAH5nHxY=\")","v":{"$error":"#VALUE!"}},{"$f":"AND(CoolerLabelsDairy!N9,\"AAAAAH5nHxc=\")","v":{"$error":"#VALUE!"}},{"$f":"AND(CoolerLabelsDairy!O9,\"AAAAAH5nHxg=\")","v":{"$error":"#VALUE!"}},{"$f":"AND(CoolerLabelsDairy!P9,\"AAAAAH5nHxk=\")","v":{"$error":"#VALUE!"}},{"$f":"AND(CoolerLabelsDairy!Q9,\"AAAAAH5nHxo=\")","v":{"$error":"#VALUE!"}},{"$f":"AND(CoolerLabelsDairy!R9,\"AAAAAH5nHxs=\")","v":{"$error":"#VALUE!"}},{"$f":"AND(CoolerLabelsDairy!S9,\"AAAAAH5nHxw=\")","v":{"$error":"#VALUE!"}},{"$f":"AND(CoolerLabelsDairy!T9,\"AAAAAH5nHx0=\")","v":{"$error":"#VALUE!"}},{"$f":"AND(CoolerLabelsDairy!U9,\"AAAAAH5nHx4=\")","v":{"$error":"#VALUE!"}},{"$f":"IF(CoolerLabelsDairy!10:10,\"AAAAAH5nHx8=\",0)","v":0},{"$f":"AND(CoolerLabelsDairy!A10,\"AAAAAH5nHyA=\")","v":{"$error":"#VALUE!"}},{"$f":"AND(CoolerLabelsDairy!B10,\"AAAAAH5nHyE=\")","v":{"$error":"#VALUE!"}},{"$f":"AND(CoolerLabelsDairy!C10,\"AAAAAH5nHyI=\")","v":{"$error":"#VALUE!"}},{"$f":"AND(CoolerLabelsDairy!D10,\"AAAAAH5nHyM=\")","v":{"$error":"#VALUE!"}},{"$f":"AND(CoolerLabelsDairy!E10,\"AAAAAH5nHyQ=\")","v":{"$error":"#VALUE!"}},{"$f":"AND(CoolerLabelsDairy!F10,\"AAAAAH5nHyU=\")","v":{"$error":"#VALUE!"}},{"$f":"AND(CoolerLabelsDairy!G10,\"AAAAAH5nHyY=\")","v":{"$error":"#VALUE!"}},{"$f":"AND(CoolerLabelsDairy!H10,\"AAAAAH5nHyc=\")","v":{"$error":"#VALUE!"}},{"$f":"AND(CoolerLabelsDairy!I10,\"AAAAAH5nHyg=\")","v":{"$error":"#VALUE!"}},{"$f":"AND(CoolerLabelsDairy!J10,\"AAAAAH5nHyk=\")","v":{"$error":"#VALUE!"}},{"$f":"AND(CoolerLabelsDairy!K10,\"AAAAAH5nHyo=\")","v":{"$error":"#VALUE!"}},{"$f":"AND(CoolerLabelsDairy!L10,\"AAAAAH5nHys=\")","v":{"$error":"#VALUE!"}},{"$f":"AND(CoolerLabelsDairy!M10,\"AAAAAH5nHyw=\")","v":{"$error":"#VALUE!"}},{"$f":"AND(CoolerLabelsDairy!N10,\"AAAAAH5nHy0=\")","v":{"$error":"#VALUE!"}},{"$f":"AND(CoolerLabelsDairy!O10,\"AAAAAH5nHy4=\")","v":{"$error":"#VALUE!"}},{"$f":"AND(CoolerLabelsDairy!P10,\"AAAAAH5nHy8=\")","v":{"$error":"#VALUE!"}},{"$f":"AND(CoolerLabelsDairy!Q10,\"AAAAAH5nHzA=\")","v":{"$error":"#VALUE!"}},{"$f":"AND(CoolerLabelsDairy!R10,\"AAAAAH5nHzE=\")","v":{"$error":"#VALUE!"}},{"$f":"AND(CoolerLabelsDairy!S10,\"AAAAAH5nHzI=\")","v":{"$error":"#VALUE!"}},{"$f":"AND(CoolerLabelsDairy!T10,\"AAAAAH5nHzM=\")","v":{"$error":"#VALUE!"}},{"$f":"AND(CoolerLabelsDairy!U10,\"AAAAAH5nHzQ=\")","v":{"$error":"#VALUE!"}},{"$f":"IF(CoolerLabelsDairy!11:11,\"AAAAAH5nHzU=\",0)","v":0},{"$f":"AND(CoolerLabelsDairy!A11,\"AAAAAH5nHzY=\")","v":{"$error":"#VALUE!"}},{"$f":"AND(CoolerLabelsDairy!B11,\"AAAAAH5nHzc=\")","v":{"$error":"#VALUE!"}},{"$f":"AND(CoolerLabelsDairy!C11,\"AAAAAH5nHzg=\")","v":{"$error":"#VALUE!"}},{"$f":"AND(CoolerLabelsDairy!D11,\"AAAAAH5nHzk=\")","v":{"$error":"#VALUE!"}},{"$f":"AND(CoolerLabelsDairy!E11,\"AAAAAH5nHzo=\")","v":{"$error":"#VALUE!"}},{"$f":"AND(CoolerLabelsDairy!F11,\"AAAAAH5nHzs=\")","v":{"$error":"#VALUE!"}},{"$f":"AND(CoolerLabelsDairy!G11,\"AAAAAH5nHzw=\")","v":{"$error":"#VALUE!"}},{"$f":"AND(CoolerLabelsDairy!H11,\"AAAAAH5nHz0=\")","v":{"$error":"#VALUE!"}},{"$f":"AND(CoolerLabelsDairy!I11,\"AAAAAH5nHz4=\")","v":{"$error":"#VALUE!"}},{"$f":"AND(CoolerLabelsDairy!J11,\"AAAAAH5nHz8=\")","v":{"$error":"#VALUE!"}},{"$f":"AND(CoolerLabelsDairy!K11,\"AAAAAH5nH0A=\")","v":{"$error":"#VALUE!"}},{"$f":"AND(CoolerLabelsDairy!L11,\"AAAAAH5nH0E=\")","v":{"$error":"#VALUE!"}},{"$f":"AND(CoolerLabelsDairy!M11,\"AAAAAH5nH0I=\")","v":{"$error":"#VALUE!"}},{"$f":"AND(CoolerLabelsDairy!N11,\"AAAAAH5nH0M=\")","v":{"$error":"#VALUE!"}},{"$f":"AND(CoolerLabelsDairy!O11,\"AAAAAH5nH0Q=\")","v":{"$error":"#VALUE!"}},{"$f":"AND(CoolerLabelsDairy!P11,\"AAAAAH5nH0U=\")","v":{"$error":"#VALUE!"}},{"$f":"AND(CoolerLabelsDairy!Q11,\"AAAAAH5nH0Y=\")","v":{"$error":"#VALUE!"}},{"$f":"AND(CoolerLabelsDairy!R11,\"AAAAAH5nH0c=\")","v":{"$error":"#VALUE!"}},{"$f":"AND(CoolerLabelsDairy!S11,\"AAAAAH5nH0g=\")","v":{"$error":"#VALUE!"}},{"$f":"AND(CoolerLabelsDairy!T11,\"AAAAAH5nH0k=\")","v":{"$error":"#VALUE!"}},{"$f":"AND(CoolerLabelsDairy!U11,\"AAAAAH5nH0o=\")","v":{"$error":"#VALUE!"}},{"$f":"IF(CoolerLabelsDairy!12:12,\"AAAAAH5nH0s=\",0)","v":0},{"$f":"AND(CoolerLabelsDairy!A12,\"AAAAAH5nH0w=\")","v":{"$error":"#VALUE!"}},{"$f":"AND(CoolerLabelsDairy!B12,\"AAAAAH5nH00=\")","v":{"$error":"#VALUE!"}},{"$f":"AND(CoolerLabelsDairy!C12,\"AAAAAH5nH04=\")","v":{"$error":"#VALUE!"}},{"$f":"AND(CoolerLabelsDairy!D12,\"AAAAAH5nH08=\")","v":{"$error":"#VALUE!"}},{"$f":"AND(CoolerLabelsDairy!E12,\"AAAAAH5nH1A=\")","v":{"$error":"#VALUE!"}},{"$f":"AND(CoolerLabelsDairy!F12,\"AAAAAH5nH1E=\")","v":{"$error":"#VALUE!"}},{"$f":"AND(CoolerLabelsDairy!G12,\"AAAAAH5nH1I=\")","v":{"$error":"#VALUE!"}},{"$f":"AND(CoolerLabelsDairy!H12,\"AAAAAH5nH1M=\")","v":{"$error":"#VALUE!"}},{"$f":"AND(CoolerLabelsDairy!I12,\"AAAAAH5nH1Q=\")","v":{"$error":"#VALUE!"}},{"$f":"AND(CoolerLabelsDairy!J12,\"AAAAAH5nH1U=\")","v":{"$error":"#VALUE!"}},{"$f":"AND(CoolerLabelsDairy!K12,\"AAAAAH5nH1Y=\")","v":{"$error":"#VALUE!"}},{"$f":"AND(CoolerLabelsDairy!L12,\"AAAAAH5nH1c=\")","v":{"$error":"#VALUE!"}},{"$f":"AND(CoolerLabelsDairy!M12,\"AAAAAH5nH1g=\")","v":{"$error":"#VALUE!"}},{"$f":"AND(CoolerLabelsDairy!N12,\"AAAAAH5nH1k=\")","v":{"$error":"#VALUE!"}},{"$f":"AND(CoolerLabelsDairy!O12,\"AAAAAH5nH1o=\")","v":{"$error":"#VALUE!"}},{"$f":"AND(CoolerLabelsDairy!P12,\"AAAAAH5nH1s=\")","v":{"$error":"#VALUE!"}},{"$f":"AND(CoolerLabelsDairy!Q12,\"AAAAAH5nH1w=\")","v":{"$error":"#VALUE!"}},{"$f":"AND(CoolerLabelsDairy!R12,\"AAAAAH5nH10=\")","v":{"$error":"#VALUE!"}},{"$f":"AND(CoolerLabelsDairy!S12,\"AAAAAH5nH14=\")","v":{"$error":"#VALUE!"}},{"$f":"AND(CoolerLabelsDairy!T12,\"AAAAAH5nH18=\")","v":{"$error":"#VALUE!"}},{"$f":"AND(CoolerLabelsDairy!U12,\"AAAAAH5nH2A=\")","v":{"$error":"#VALUE!"}},{"$f":"IF(CoolerLabelsDairy!13:13,\"AAAAAH5nH2E=\",0)","v":0},{"$f":"AND(CoolerLabelsDairy!A13,\"AAAAAH5nH2I=\")","v":{"$error":"#VALUE!"}},{"$f":"AND(CoolerLabelsDairy!B13,\"AAAAAH5nH2M=\")","v":{"$error":"#VALUE!"}},{"$f":"AND(CoolerLabelsDairy!C13,\"AAAAAH5nH2Q=\")","v":{"$error":"#VALUE!"}},{"$f":"AND(CoolerLabelsDairy!D13,\"AAAAAH5nH2U=\")","v":{"$error":"#VALUE!"}},{"$f":"AND(CoolerLabelsDairy!E13,\"AAAAAH5nH2Y=\")","v":{"$error":"#VALUE!"}},{"$f":"AND(CoolerLabelsDairy!F13,\"AAAAAH5nH2c=\")","v":{"$error":"#VALUE!"}},{"$f":"AND(CoolerLabelsDairy!G13,\"AAAAAH5nH2g=\")","v":{"$error":"#VALUE!"}},{"$f":"AND(CoolerLabelsDairy!H13,\"AAAAAH5nH2k=\")","v":{"$error":"#VALUE!"}},{"$f":"AND(CoolerLabelsDairy!I13,\"AAAAAH5nH2o=\")","v":{"$error":"#VALUE!"}},{"$f":"AND(CoolerLabelsDairy!J13,\"AAAAAH5nH2s=\")","v":{"$error":"#VALUE!"}},{"$f":"AND(CoolerLabelsDairy!K13,\"AAAAAH5nH2w=\")","v":{"$error":"#VALUE!"}},{"$f":"AND(CoolerLabelsDairy!L13,\"AAAAAH5nH20=\")","v":{"$error":"#VALUE!"}},{"$f":"AND(CoolerLabelsDairy!M13,\"AAAAAH5nH24=\")","v":{"$error":"#VALUE!"}},{"$f":"AND(CoolerLabelsDairy!N13,\"AAAAAH5nH28=\")","v":{"$error":"#VALUE!"}},{"$f":"AND(CoolerLabelsDairy!O13,\"AAAAAH5nH3A=\")","v":{"$error":"#VALUE!"}},{"$f":"AND(CoolerLabelsDairy!P13,\"AAAAAH5nH3E=\")","v":{"$error":"#VALUE!"}},{"$f":"AND(CoolerLabelsDairy!Q13,\"AAAAAH5nH3I=\")","v":{"$error":"#VALUE!"}},{"$f":"AND(CoolerLabelsDairy!R13,\"AAAAAH5nH3M=\")","v":{"$error":"#VALUE!"}},{"$f":"AND(CoolerLabelsDairy!S13,\"AAAAAH5nH3Q=\")","v":{"$error":"#VALUE!"}},{"$f":"AND(CoolerLabelsDairy!T13,\"AAAAAH5nH3U=\")","v":{"$error":"#VALUE!"}},{"$f":"AND(CoolerLabelsDairy!U13,\"AAAAAH5nH3Y=\")","v":{"$error":"#VALUE!"}},{"$f":"IF(CoolerLabelsDairy!14:14,\"AAAAAH5nH3c=\",0)","v":0},{"$f":"AND(CoolerLabelsDairy!A14,\"AAAAAH5nH3g=\")","v":{"$error":"#VALUE!"}},{"$f":"AND(CoolerLabelsDairy!B14,\"AAAAAH5nH3k=\")","v":{"$error":"#VALUE!"}},{"$f":"AND(CoolerLabelsDairy!C14,\"AAAAAH5nH3o=\")","v":{"$error":"#VALUE!"}},{"$f":"AND(CoolerLabelsDairy!D14,\"AAAAAH5nH3s=\")","v":{"$error":"#VALUE!"}},{"$f":"AND(CoolerLabelsDairy!E14,\"AAAAAH5nH3w=\")","v":{"$error":"#VALUE!"}},{"$f":"AND(CoolerLabelsDairy!F14,\"AAAAAH5nH30=\")","v":{"$error":"#VALUE!"}},{"$f":"AND(CoolerLabelsDairy!G14,\"AAAAAH5nH34=\")","v":{"$error":"#VALUE!"}},{"$f":"AND(CoolerLabelsDairy!H14,\"AAAAAH5nH38=\")","v":{"$error":"#VALUE!"}},{"$f":"AND(CoolerLabelsDairy!I14,\"AAAAAH5nH4A=\")","v":{"$error":"#VALUE!"}},{"$f":"AND(CoolerLabelsDairy!J14,\"AAAAAH5nH4E=\")","v":{"$error":"#VALUE!"}},{"$f":"AND(CoolerLabelsDairy!K14,\"AAAAAH5nH4I=\")","v":{"$error":"#VALUE!"}},{"$f":"AND(CoolerLabelsDairy!L14,\"AAAAAH5nH4M=\")","v":{"$error":"#VALUE!"}},{"$f":"AND(CoolerLabelsDairy!M14,\"AAAAAH5nH4Q=\")","v":{"$error":"#VALUE!"}},{"$f":"AND(CoolerLabelsDairy!N14,\"AAAAAH5nH4U=\")","v":{"$error":"#VALUE!"}},{"$f":"AND(CoolerLabelsDairy!O14,\"AAAAAH5nH4Y=\")","v":{"$error":"#VALUE!"}},{"$f":"AND(CoolerLabelsDairy!P14,\"AAAAAH5nH4c=\")","v":{"$error":"#VALUE!"}},{"$f":"AND(CoolerLabelsDairy!Q14,\"AAAAAH5nH4g=\")","v":{"$error":"#VALUE!"}},{"$f":"AND(CoolerLabelsDairy!R14,\"AAAAAH5nH4k=\")","v":{"$error":"#VALUE!"}},{"$f":"AND(CoolerLabelsDairy!S14,\"AAAAAH5nH4o=\")","v":{"$error":"#VALUE!"}},{"$f":"AND(CoolerLabelsDairy!T14,\"AAAAAH5nH4s=\")","v":{"$error":"#VALUE!"}},{"$f":"AND(CoolerLabelsDairy!U14,\"AAAAAH5nH4w=\")","v":{"$error":"#VALUE!"}},{"$f":"IF(CoolerLabelsDairy!15:15,\"AAAAAH5nH40=\",0)","v":0},{"$f":"AND(CoolerLabelsDairy!A15,\"AAAAAH5nH44=\")","v":{"$error":"#VALUE!"}},{"$f":"AND(CoolerLabelsDairy!B15,\"AAAAAH5nH48=\")","v":{"$error":"#VALUE!"}},{"$f":"AND(CoolerLabelsDairy!C15,\"AAAAAH5nH5A=\")","v":{"$error":"#VALUE!"}},{"$f":"AND(CoolerLabelsDairy!D15,\"AAAAAH5nH5E=\")","v":{"$error":"#VALUE!"}},{"$f":"AND(CoolerLabelsDairy!E15,\"AAAAAH5nH5I=\")","v":{"$error":"#VALUE!"}},{"$f":"AND(CoolerLabelsDairy!F15,\"AAAAAH5nH5M=\")","v":{"$error":"#VALUE!"}},{"$f":"AND(CoolerLabelsDairy!G15,\"AAAAAH5nH5Q=\")","v":{"$error":"#VALUE!"}},{"$f":"AND(CoolerLabelsDairy!H15,\"AAAAAH5nH5U=\")","v":{"$error":"#VALUE!"}},{"$f":"AND(CoolerLabelsDairy!I15,\"AAAAAH5nH5Y=\")","v":{"$error":"#VALUE!"}},{"$f":"AND(CoolerLabelsDairy!J15,\"AAAAAH5nH5c=\")","v":{"$error":"#VALUE!"}},{"$f":"AND(CoolerLabelsDairy!K15,\"AAAAAH5nH5g=\")","v":{"$error":"#VALUE!"}},{"$f":"AND(CoolerLabelsDairy!L15,\"AAAAAH5nH5k=\")","v":{"$error":"#VALUE!"}},{"$f":"AND(CoolerLabelsDairy!M15,\"AAAAAH5nH5o=\")","v":{"$error":"#VALUE!"}},{"$f":"AND(CoolerLabelsDairy!N15,\"AAAAAH5nH5s=\")","v":{"$error":"#VALUE!"}},{"$f":"AND(CoolerLabelsDairy!O15,\"AAAAAH5nH5w=\")","v":{"$error":"#VALUE!"}},{"$f":"AND(CoolerLabelsDairy!P15,\"AAAAAH5nH50=\")","v":{"$error":"#VALUE!"}},{"$f":"AND(CoolerLabelsDairy!Q15,\"AAAAAH5nH54=\")","v":{"$error":"#VALUE!"}},{"$f":"AND(CoolerLabelsDairy!R15,\"AAAAAH5nH58=\")","v":{"$error":"#VALUE!"}},{"$f":"AND(CoolerLabelsDairy!S15,\"AAAAAH5nH6A=\")","v":{"$error":"#VALUE!"}},{"$f":"AND(CoolerLabelsDairy!T15,\"AAAAAH5nH6E=\")","v":{"$error":"#VALUE!"}},{"$f":"AND(CoolerLabelsDairy!U15,\"AAAAAH5nH6I=\")","v":{"$error":"#VALUE!"}},{"$f":"IF(CoolerLabelsDairy!16:16,\"AAAAAH5nH6M=\",0)","v":0},{"$f":"AND(CoolerLabelsDairy!A16,\"AAAAAH5nH6Q=\")","v":{"$error":"#VALUE!"}},{"$f":"AND(CoolerLabelsDairy!B16,\"AAAAAH5nH6U=\")","v":{"$error":"#VALUE!"}},{"$f":"AND(CoolerLabelsDairy!C16,\"AAAAAH5nH6Y=\")","v":{"$error":"#VALUE!"}},{"$f":"AND(CoolerLabelsDairy!D16,\"AAAAAH5nH6c=\")","v":{"$error":"#VALUE!"}},{"$f":"AND(CoolerLabelsDairy!E16,\"AAAAAH5nH6g=\")","v":{"$error":"#VALUE!"}},{"$f":"AND(CoolerLabelsDairy!F16,\"AAAAAH5nH6k=\")","v":{"$error":"#VALUE!"}},{"$f":"AND(CoolerLabelsDairy!G16,\"AAAAAH5nH6o=\")","v":{"$error":"#VALUE!"}},{"$f":"AND(CoolerLabelsDairy!H16,\"AAAAAH5nH6s=\")","v":{"$error":"#VALUE!"}},{"$f":"AND(CoolerLabelsDairy!I16,\"AAAAAH5nH6w=\")","v":{"$error":"#VALUE!"}},{"$f":"AND(CoolerLabelsDairy!J16,\"AAAAAH5nH60=\")","v":{"$error":"#VALUE!"}},{"$f":"AND(CoolerLabelsDairy!K16,\"AAAAAH5nH64=\")","v":{"$error":"#VALUE!"}},{"$f":"AND(CoolerLabelsDairy!L16,\"AAAAAH5nH68=\")","v":{"$error":"#VALUE!"}},{"$f":"AND(CoolerLabelsDairy!M16,\"AAAAAH5nH7A=\")","v":{"$error":"#VALUE!"}},{"$f":"AND(CoolerLabelsDairy!N16,\"AAAAAH5nH7E=\")","v":{"$error":"#VALUE!"}},{"$f":"AND(CoolerLabelsDairy!O16,\"AAAAAH5nH7I=\")","v":{"$error":"#VALUE!"}},{"$f":"AND(CoolerLabelsDairy!P16,\"AAAAAH5nH7M=\")","v":{"$error":"#VALUE!"}},{"$f":"AND(CoolerLabelsDairy!Q16,\"AAAAAH5nH7Q=\")","v":{"$error":"#VALUE!"}},{"$f":"AND(CoolerLabelsDairy!R16,\"AAAAAH5nH7U=\")","v":{"$error":"#VALUE!"}},{"$f":"AND(CoolerLabelsDairy!S16,\"AAAAAH5nH7Y=\")","v":{"$error":"#VALUE!"}},{"$f":"AND(CoolerLabelsDairy!T16,\"AAAAAH5nH7c=\")","v":{"$error":"#VALUE!"}},{"$f":"AND(CoolerLabelsDairy!U16,\"AAAAAH5nH7g=\")","v":{"$error":"#VALUE!"}},{"$f":"IF(CoolerLabelsDairy!17:17,\"AAAAAH5nH7k=\",0)","v":0},{"$f":"AND(CoolerLabelsDairy!A17,\"AAAAAH5nH7o=\")","v":{"$error":"#VALUE!"}},{"$f":"AND(CoolerLabelsDairy!B17,\"AAAAAH5nH7s=\")","v":{"$error":"#VALUE!"}},{"$f":"AND(CoolerLabelsDairy!C17,\"AAAAAH5nH7w=\")","v":{"$error":"#VALUE!"}},{"$f":"AND(CoolerLabelsDairy!D17,\"AAAAAH5nH70=\")","v":{"$error":"#VALUE!"}},{"$f":"AND(CoolerLabelsDairy!E17,\"AAAAAH5nH74=\")","v":{"$error":"#VALUE!"}},{"$f":"AND(CoolerLabelsDairy!F17,\"AAAAAH5nH78=\")","v":{"$error":"#VALUE!"}},{"$f":"AND(CoolerLabelsDairy!G17,\"AAAAAH5nH8A=\")","v":{"$error":"#VALUE!"}},{"$f":"AND(CoolerLabelsDairy!H17,\"AAAAAH5nH8E=\")","v":{"$error":"#VALUE!"}},{"$f":"AND(CoolerLabelsDairy!I17,\"AAAAAH5nH8I=\")","v":{"$error":"#VALUE!"}},{"$f":"AND(CoolerLabelsDairy!J17,\"AAAAAH5nH8M=\")","v":{"$error":"#VALUE!"}},{"$f":"AND(CoolerLabelsDairy!K17,\"AAAAAH5nH8Q=\")","v":{"$error":"#VALUE!"}},{"$f":"AND(CoolerLabelsDairy!L17,\"AAAAAH5nH8U=\")","v":{"$error":"#VALUE!"}},{"$f":"AND(CoolerLabelsDairy!M17,\"AAAAAH5nH8Y=\")","v":{"$error":"#VALUE!"}},{"$f":"AND(CoolerLabelsDairy!N17,\"AAAAAH5nH8c=\")","v":{"$error":"#VALUE!"}},{"$f":"AND(CoolerLabelsDairy!O17,\"AAAAAH5nH8g=\")","v":{"$error":"#VALUE!"}},{"$f":"AND(CoolerLabelsDairy!P17,\"AAAAAH5nH8k=\")","v":{"$error":"#VALUE!"}},{"$f":"AND(CoolerLabelsDairy!Q17,\"AAAAAH5nH8o=\")","v":{"$error":"#VALUE!"}},{"$f":"AND(CoolerLabelsDairy!R17,\"AAAAAH5nH8s=\")","v":{"$error":"#VALUE!"}},{"$f":"AND(CoolerLabelsDairy!S17,\"AAAAAH5nH8w=\")","v":{"$error":"#VALUE!"}},{"$f":"AND(CoolerLabelsDairy!T17,\"AAAAAH5nH80=\")","v":{"$error":"#VALUE!"}},{"$f":"AND(CoolerLabelsDairy!U17,\"AAAAAH5nH84=\")","v":{"$error":"#VALUE!"}},{"$f":"IF(CoolerLabelsDairy!18:18,\"AAAAAH5nH88=\",0)","v":0},{"$f":"AND(CoolerLabelsDairy!A18,\"AAAAAH5nH9A=\")","v":{"$error":"#VALUE!"}},{"$f":"AND(CoolerLabelsDairy!B18,\"AAAAAH5nH9E=\")","v":{"$error":"#VALUE!"}},{"$f":"AND(CoolerLabelsDairy!C18,\"AAAAAH5nH9I=\")","v":{"$error":"#VALUE!"}},{"$f":"AND(CoolerLabelsDairy!D18,\"AAAAAH5nH9M=\")","v":{"$error":"#VALUE!"}},{"$f":"AND(CoolerLabelsDairy!E18,\"AAAAAH5nH9Q=\")","v":{"$error":"#VALUE!"}},{"$f":"AND(CoolerLabelsDairy!F18,\"AAAAAH5nH9U=\")","v":{"$error":"#VALUE!"}},{"$f":"AND(CoolerLabelsDairy!G18,\"AAAAAH5nH9Y=\")","v":{"$error":"#VALUE!"}},{"$f":"AND(CoolerLabelsDairy!H18,\"AAAAAH5nH9c=\")","v":{"$error":"#VALUE!"}},{"$f":"AND(CoolerLabelsDairy!I18,\"AAAAAH5nH9g=\")","v":{"$error":"#VALUE!"}},{"$f":"AND(CoolerLabelsDairy!J18,\"AAAAAH5nH9k=\")","v":{"$error":"#VALUE!"}},{"$f":"AND(CoolerLabelsDairy!K18,\"AAAAAH5nH9o=\")","v":{"$error":"#VALUE!"}},{"$f":"AND(CoolerLabelsDairy!L18,\"AAAAAH5nH9s=\")","v":{"$error":"#VALUE!"}},{"$f":"AND(CoolerLabelsDairy!M18,\"AAAAAH5nH9w=\")","v":{"$error":"#VALUE!"}},{"$f":"AND(CoolerLabelsDairy!N18,\"AAAAAH5nH90=\")","v":{"$error":"#VALUE!"}},{"$f":"AND(CoolerLabelsDairy!O18,\"AAAAAH5nH94=\")","v":{"$error":"#VALUE!"}},{"$f":"AND(CoolerLabelsDairy!P18,\"AAAAAH5nH98=\")","v":{"$error":"#VALUE!"}},{"$f":"AND(CoolerLabelsDairy!Q18,\"AAAAAH5nH+A=\")","v":{"$error":"#VALUE!"}},{"$f":"AND(CoolerLabelsDairy!R18,\"AAAAAH5nH+E=\")","v":{"$error":"#VALUE!"}},{"$f":"AND(CoolerLabelsDairy!S18,\"AAAAAH5nH+I=\")","v":{"$error":"#VALUE!"}},{"$f":"AND(CoolerLabelsDairy!T18,\"AAAAAH5nH+M=\")","v":{"$error":"#VALUE!"}},{"$f":"AND(CoolerLabelsDairy!U18,\"AAAAAH5nH+Q=\")","v":{"$error":"#VALUE!"}},{"$f":"IF(CoolerLabelsDairy!19:19,\"AAAAAH5nH+U=\",0)","v":0},{"$f":"AND(CoolerLabelsDairy!A19,\"AAAAAH5nH+Y=\")","v":{"$error":"#VALUE!"}},{"$f":"AND(CoolerLabelsDairy!B19,\"AAAAAH5nH+c=\")","v":{"$error":"#VALUE!"}},{"$f":"AND(CoolerLabelsDairy!C19,\"AAAAAH5nH+g=\")","v":{"$error":"#VALUE!"}},{"$f":"AND(CoolerLabelsDairy!D19,\"AAAAAH5nH+k=\")","v":{"$error":"#VALUE!"}},{"$f":"AND(CoolerLabelsDairy!E19,\"AAAAAH5nH+o=\")","v":{"$error":"#VALUE!"}},{"$f":"AND(CoolerLabelsDairy!F19,\"AAAAAH5nH+s=\")","v":{"$error":"#VALUE!"}},{"$f":"AND(CoolerLabelsDairy!G19,\"AAAAAH5nH+w=\")","v":{"$error":"#VALUE!"}},{"$f":"AND(CoolerLabelsDairy!H19,\"AAAAAH5nH+0=\")","v":{"$error":"#VALUE!"}},{"$f":"AND(CoolerLabelsDairy!I19,\"AAAAAH5nH+4=\")","v":{"$error":"#VALUE!"}},{"$f":"AND(CoolerLabelsDairy!J19,\"AAAAAH5nH+8=\")","v":{"$error":"#VALUE!"}},{"$f":"AND(CoolerLabelsDairy!K19,\"AAAAAH5nH/A=\")","v":{"$error":"#VALUE!"}},{"$f":"AND(CoolerLabelsDairy!L19,\"AAAAAH5nH/E=\")","v":{"$error":"#VALUE!"}},{"$f":"AND(CoolerLabelsDairy!M19,\"AAAAAH5nH/I=\")","v":{"$error":"#VALUE!"}},{"$f":"AND(CoolerLabelsDairy!N19,\"AAAAAH5nH/M=\")","v":{"$error":"#VALUE!"}},{"$f":"AND(CoolerLabelsDairy!O19,\"AAAAAH5nH/Q=\")","v":{"$error":"#VALUE!"}},{"$f":"AND(CoolerLabelsDairy!P19,\"AAAAAH5nH/U=\")","v":{"$error":"#VALUE!"}},{"$f":"AND(CoolerLabelsDairy!Q19,\"AAAAAH5nH/Y=\")","v":{"$error":"#VALUE!"}},{"$f":"AND(CoolerLabelsDairy!R19,\"AAAAAH5nH/c=\")","v":{"$error":"#VALUE!"}},{"$f":"AND(CoolerLabelsDairy!S19,\"AAAAAH5nH/g=\")","v":{"$error":"#VALUE!"}},{"$f":"AND(CoolerLabelsDairy!T19,\"AAAAAH5nH/k=\")","v":{"$error":"#VALUE!"}},{"$f":"AND(CoolerLabelsDairy!U19,\"AAAAAH5nH/o=\")","v":{"$error":"#VALUE!"}},{"$f":"IF(CoolerLabelsDairy!20:20,\"AAAAAH5nH/s=\",0)","v":0},{"$f":"AND(CoolerLabelsDairy!A20,\"AAAAAH5nH/w=\")","v":{"$error":"#VALUE!"}},{"$f":"AND(CoolerLabelsDairy!B20,\"AAAAAH5nH/0=\")","v":{"$error":"#VALUE!"}},{"$f":"AND(CoolerLabelsDairy!C20,\"AAAAAH5nH/4=\")","v":{"$error":"#VALUE!"}},{"$f":"AND(CoolerLabelsDairy!D20,\"AAAAAH5nH/8=\")","v":{"$error":"#VALUE!"}}]
[{"$f":"AND(CoolerLabelsDairy!E20,\"AAAAAHL3tAA=\")","v":{"$error":"#VALUE!"}},{"$f":"AND(CoolerLabelsDairy!F20,\"AAAAAHL3tAE=\")","v":{"$error":"#VALUE!"}},{"$f":"AND(CoolerLabelsDairy!G20,\"AAAAAHL3tAI=\")","v":{"$error":"#VALUE!"}},{"$f":"AND(CoolerLabelsDairy!H20,\"AAAAAHL3tAM=\")","v":{"$error":"#VALUE!"}},{"$f":"AND(CoolerLabelsDairy!I20,\"AAAAAHL3tAQ=\")","v":{"$error":"#VALUE!"}},{"$f":"AND(CoolerLabelsDairy!J20,\"AAAAAHL3tAU=\")","v":{"$error":"#VALUE!"}},{"$f":"AND(CoolerLabelsDairy!K20,\"AAAAAHL3tAY=\")","v":{"$error":"#VALUE!"}},{"$f":"AND(CoolerLabelsDairy!L20,\"AAAAAHL3tAc=\")","v":{"$error":"#VALUE!"}},{"$f":"AND(CoolerLabelsDairy!M20,\"AAAAAHL3tAg=\")","v":{"$error":"#VALUE!"}},{"$f":"AND(CoolerLabelsDairy!N20,\"AAAAAHL3tAk=\")","v":{"$error":"#VALUE!"}},{"$f":"AND(CoolerLabelsDairy!O20,\"AAAAAHL3tAo=\")","v":{"$error":"#VALUE!"}},{"$f":"AND(CoolerLabelsDairy!P20,\"AAAAAHL3tAs=\")","v":{"$error":"#VALUE!"}},{"$f":"AND(CoolerLabelsDairy!Q20,\"AAAAAHL3tAw=\")","v":{"$error":"#VALUE!"}},{"$f":"AND(CoolerLabelsDairy!R20,\"AAAAAHL3tA0=\")","v":{"$error":"#VALUE!"}},{"$f":"AND(CoolerLabelsDairy!S20,\"AAAAAHL3tA4=\")","v":{"$error":"#VALUE!"}},{"$f":"AND(CoolerLabelsDairy!T20,\"AAAAAHL3tA8=\")","v":{"$error":"#VALUE!"}},{"$f":"AND(CoolerLabelsDairy!U20,\"AAAAAHL3tBA=\")","v":{"$error":"#VALUE!"}},{"$f":"IF(CoolerLabelsDairy!21:21,\"AAAAAHL3tBE=\",0)","v":0},{"$f":"AND(CoolerLabelsDairy!A21,\"AAAAAHL3tBI=\")","v":{"$error":"#VALUE!"}},{"$f":"AND(CoolerLabelsDairy!B21,\"AAAAAHL3tBM=\")","v":{"$error":"#VALUE!"}},{"$f":"AND(CoolerLabelsDairy!C21,\"AAAAAHL3tBQ=\")","v":{"$error":"#VALUE!"}},{"$f":"AND(CoolerLabelsDairy!D21,\"AAAAAHL3tBU=\")","v":{"$error":"#VALUE!"}},{"$f":"AND(CoolerLabelsDairy!E21,\"AAAAAHL3tBY=\")","v":{"$error":"#VALUE!"}},{"$f":"AND(CoolerLabelsDairy!F21,\"AAAAAHL3tBc=\")","v":{"$error":"#VALUE!"}},{"$f":"AND(CoolerLabelsDairy!G21,\"AAAAAHL3tBg=\")","v":{"$error":"#VALUE!"}},{"$f":"AND(CoolerLabelsDairy!H21,\"AAAAAHL3tBk=\")","v":{"$error":"#VALUE!"}},{"$f":"AND(CoolerLabelsDairy!I21,\"AAAAAHL3tBo=\")","v":{"$error":"#VALUE!"}},{"$f":"AND(CoolerLabelsDairy!J21,\"AAAAAHL3tBs=\")","v":{"$error":"#VALUE!"}},{"$f":"AND(CoolerLabelsDairy!K21,\"AAAAAHL3tBw=\")","v":{"$error":"#VALUE!"}},{"$f":"AND(CoolerLabelsDairy!L21,\"AAAAAHL3tB0=\")","v":{"$error":"#VALUE!"}},{"$f":"AND(CoolerLabelsDairy!M21,\"AAAAAHL3tB4=\")","v":{"$error":"#VALUE!"}},{"$f":"AND(CoolerLabelsDairy!N21,\"AAAAAHL3tB8=\")","v":{"$error":"#VALUE!"}},{"$f":"AND(CoolerLabelsDairy!O21,\"AAAAAHL3tCA=\")","v":{"$error":"#VALUE!"}},{"$f":"AND(CoolerLabelsDairy!P21,\"AAAAAHL3tCE=\")","v":{"$error":"#VALUE!"}},{"$f":"AND(CoolerLabelsDairy!Q21,\"AAAAAHL3tCI=\")","v":{"$error":"#VALUE!"}},{"$f":"AND(CoolerLabelsDairy!R21,\"AAAAAHL3tCM=\")","v":{"$error":"#VALUE!"}},{"$f":"AND(CoolerLabelsDairy!S21,\"AAAAAHL3tCQ=\")","v":{"$error":"#VALUE!"}},{"$f":"AND(CoolerLabelsDairy!T21,\"AAAAAHL3tCU=\")","v":{"$error":"#VALUE!"}},{"$f":"AND(CoolerLabelsDairy!U21,\"AAAAAHL3tCY=\")","v":{"$error":"#VALUE!"}},{"$f":"IF(CoolerLabelsDairy!22:22,\"AAAAAHL3tCc=\",0)","v":0},{"$f":"AND(CoolerLabelsDairy!A22,\"AAAAAHL3tCg=\")","v":{"$error":"#VALUE!"}},{"$f":"AND(CoolerLabelsDairy!B22,\"AAAAAHL3tCk=\")","v":{"$error":"#VALUE!"}},{"$f":"AND(CoolerLabelsDairy!C22,\"AAAAAHL3tCo=\")","v":{"$error":"#VALUE!"}},{"$f":"AND(CoolerLabelsDairy!D22,\"AAAAAHL3tCs=\")","v":{"$error":"#VALUE!"}},{"$f":"AND(CoolerLabelsDairy!E22,\"AAAAAHL3tCw=\")","v":{"$error":"#VALUE!"}},{"$f":"AND(CoolerLabelsDairy!F22,\"AAAAAHL3tC0=\")","v":{"$error":"#VALUE!"}},{"$f":"AND(CoolerLabelsDairy!G22,\"AAAAAHL3tC4=\")","v":{"$error":"#VALUE!"}},{"$f":"AND(CoolerLabelsDairy!H22,\"AAAAAHL3tC8=\")","v":{"$error":"#VALUE!"}},{"$f":"AND(CoolerLabelsDairy!I22,\"AAAAAHL3tDA=\")","v":{"$error":"#VALUE!"}},{"$f":"AND(CoolerLabelsDairy!J22,\"AAAAAHL3tDE=\")","v":{"$error":"#VALUE!"}},{"$f":"AND(CoolerLabelsDairy!K22,\"AAAAAHL3tDI=\")","v":{"$error":"#VALUE!"}},{"$f":"AND(CoolerLabelsDairy!L22,\"AAAAAHL3tDM=\")","v":{"$error":"#VALUE!"}},{"$f":"AND(CoolerLabelsDairy!M22,\"AAAAAHL3tDQ=\")","v":{"$error":"#VALUE!"}},{"$f":"AND(CoolerLabelsDairy!N22,\"AAAAAHL3tDU=\")","v":{"$error":"#VALUE!"}},{"$f":"AND(CoolerLabelsDairy!O22,\"AAAAAHL3tDY=\")","v":{"$error":"#VALUE!"}},{"$f":"AND(CoolerLabelsDairy!P22,\"AAAAAHL3tDc=\")","v":{"$error":"#VALUE!"}},{"$f":"AND(CoolerLabelsDairy!Q22,\"AAAAAHL3tDg=\")","v":{"$error":"#VALUE!"}},{"$f":"AND(CoolerLabelsDairy!R22,\"AAAAAHL3tDk=\")","v":{"$error":"#VALUE!"}},{"$f":"AND(CoolerLabelsDairy!S22,\"AAAAAHL3tDo=\")","v":{"$error":"#VALUE!"}},{"$f":"AND(CoolerLabelsDairy!T22,\"AAAAAHL3tDs=\")","v":{"$error":"#VALUE!"}},{"$f":"AND(CoolerLabelsDairy!U22,\"AAAAAHL3tDw=\")","v":{"$error":"#VALUE!"}},{"$f":"IF(CoolerLabelsDairy!23:23,\"AAAAAHL3tD0=\",0)","v":0},{"$f":"AND(CoolerLabelsDairy!A23,\"AAAAAHL3tD4=\")","v":{"$error":"#VALUE!"}},{"$f":"AND(CoolerLabelsDairy!B23,\"AAAAAHL3tD8=\")","v":{"$error":"#VALUE!"}},{"$f":"AND(CoolerLabelsDairy!C23,\"AAAAAHL3tEA=\")","v":{"$error":"#VALUE!"}},{"$f":"AND(CoolerLabelsDairy!D23,\"AAAAAHL3tEE=\")","v":{"$error":"#VALUE!"}},{"$f":"AND(CoolerLabelsDairy!E23,\"AAAAAHL3tEI=\")","v":{"$error":"#VALUE!"}},{"$f":"AND(CoolerLabelsDairy!F23,\"AAAAAHL3tEM=\")","v":{"$error":"#VALUE!"}},{"$f":"AND(CoolerLabelsDairy!G23,\"AAAAAHL3tEQ=\")","v":{"$error":"#VALUE!"}},{"$f":"AND(CoolerLabelsDairy!H23,\"AAAAAHL3tEU=\")","v":{"$error":"#VALUE!"}},{"$f":"AND(CoolerLabelsDairy!I23,\"AAAAAHL3tEY=\")","v":{"$error":"#VALUE!"}},{"$f":"AND(CoolerLabelsDairy!J23,\"AAAAAHL3tEc=\")","v":{"$error":"#VALUE!"}},{"$f":"AND(CoolerLabelsDairy!K23,\"AAAAAHL3tEg=\")","v":{"$error":"#VALUE!"}},{"$f":"AND(CoolerLabelsDairy!L23,\"AAAAAHL3tEk=\")","v":{"$error":"#VALUE!"}},{"$f":"AND(CoolerLabelsDairy!M23,\"AAAAAHL3tEo=\")","v":{"$error":"#VALUE!"}},{"$f":"AND(CoolerLabelsDairy!N23,\"AAAAAHL3tEs=\")","v":{"$error":"#VALUE!"}},{"$f":"AND(CoolerLabelsDairy!O23,\"AAAAAHL3tEw=\")","v":{"$error":"#VALUE!"}},{"$f":"AND(CoolerLabelsDairy!P23,\"AAAAAHL3tE0=\")","v":{"$error":"#VALUE!"}},{"$f":"AND(CoolerLabelsDairy!Q23,\"AAAAAHL3tE4=\")","v":{"$error":"#VALUE!"}},{"$f":"AND(CoolerLabelsDairy!R23,\"AAAAAHL3tE8=\")","v":{"$error":"#VALUE!"}},{"$f":"AND(CoolerLabelsDairy!S23,\"AAAAAHL3tFA=\")","v":{"$error":"#VALUE!"}},{"$f":"AND(CoolerLabelsDairy!T23,\"AAAAAHL3tFE=\")","v":{"$error":"#VALUE!"}},{"$f":"AND(CoolerLabelsDairy!U23,\"AAAAAHL3tFI=\")","v":{"$error":"#VALUE!"}},{"$f":"IF(CoolerLabelsDairy!24:24,\"AAAAAHL3tFM=\",0)","v":0},{"$f":"AND(CoolerLabelsDairy!A24,\"AAAAAHL3tFQ=\")","v":{"$error":"#VALUE!"}},{"$f":"AND(CoolerLabelsDairy!B24,\"AAAAAHL3tFU=\")","v":{"$error":"#VALUE!"}},{"$f":"AND(CoolerLabelsDairy!C24,\"AAAAAHL3tFY=\")","v":{"$error":"#VALUE!"}},{"$f":"AND(CoolerLabelsDairy!D24,\"AAAAAHL3tFc=\")","v":{"$error":"#VALUE!"}},{"$f":"AND(CoolerLabelsDairy!E24,\"AAAAAHL3tFg=\")","v":{"$error":"#VALUE!"}},{"$f":"AND(CoolerLabelsDairy!F24,\"AAAAAHL3tFk=\")","v":{"$error":"#VALUE!"}},{"$f":"AND(CoolerLabelsDairy!G24,\"AAAAAHL3tFo=\")","v":{"$error":"#VALUE!"}},{"$f":"AND(CoolerLabelsDairy!H24,\"AAAAAHL3tFs=\")","v":{"$error":"#VALUE!"}},{"$f":"AND(CoolerLabelsDairy!I24,\"AAAAAHL3tFw=\")","v":{"$error":"#VALUE!"}},{"$f":"AND(CoolerLabelsDairy!J24,\"AAAAAHL3tF0=\")","v":{"$error":"#VALUE!"}},{"$f":"AND(CoolerLabelsDairy!K24,\"AAAAAHL3tF4=\")","v":{"$error":"#VALUE!"}},{"$f":"AND(CoolerLabelsDairy!L24,\"AAAAAHL3tF8=\")","v":{"$error":"#VALUE!"}},{"$f":"AND(CoolerLabelsDairy!M24,\"AAAAAHL3tGA=\")","v":{"$error":"#VALUE!"}},{"$f":"AND(CoolerLabelsDairy!N24,\"AAAAAHL3tGE=\")","v":{"$error":"#VALUE!"}},{"$f":"AND(CoolerLabelsDairy!O24,\"AAAAAHL3tGI=\")","v":{"$error":"#VALUE!"}},{"$f":"AND(CoolerLabelsDairy!P24,\"AAAAAHL3tGM=\")","v":{"$error":"#VALUE!"}},{"$f":"AND(CoolerLabelsDairy!Q24,\"AAAAAHL3tGQ=\")","v":{"$error":"#VALUE!"}},{"$f":"AND(CoolerLabelsDairy!R24,\"AAAAAHL3tGU=\")","v":{"$error":"#VALUE!"}},{"$f":"AND(CoolerLabelsDairy!S24,\"AAAAAHL3tGY=\")","v":{"$error":"#VALUE!"}},{"$f":"AND(CoolerLabelsDairy!T24,\"AAAAAHL3tGc=\")","v":{"$error":"#VALUE!"}},{"$f":"AND(CoolerLabelsDairy!U24,\"AAAAAHL3tGg=\")","v":{"$error":"#VALUE!"}},{"$f":"IF(CoolerLabelsDairy!25:25,\"AAAAAHL3tGk=\",0)","v":0},{"$f":"AND(CoolerLabelsDairy!A25,\"AAAAAHL3tGo=\")","v":{"$error":"#VALUE!"}},{"$f":"AND(CoolerLabelsDairy!B25,\"AAAAAHL3tGs=\")","v":{"$error":"#VALUE!"}},{"$f":"AND(CoolerLabelsDairy!C25,\"AAAAAHL3tGw=\")","v":{"$error":"#VALUE!"}},{"$f":"AND(CoolerLabelsDairy!D25,\"AAAAAHL3tG0=\")","v":{"$error":"#VALUE!"}},{"$f":"AND(CoolerLabelsDairy!E25,\"AAAAAHL3tG4=\")","v":{"$error":"#VALUE!"}},{"$f":"AND(CoolerLabelsDairy!F25,\"AAAAAHL3tG8=\")","v":{"$error":"#VALUE!"}},{"$f":"AND(CoolerLabelsDairy!G25,\"AAAAAHL3tHA=\")","v":{"$error":"#VALUE!"}},{"$f":"AND(CoolerLabelsDairy!H25,\"AAAAAHL3tHE=\")","v":{"$error":"#VALUE!"}},{"$f":"AND(CoolerLabelsDairy!I25,\"AAAAAHL3tHI=\")","v":{"$error":"#VALUE!"}},{"$f":"AND(CoolerLabelsDairy!J25,\"AAAAAHL3tHM=\")","v":{"$error":"#VALUE!"}},{"$f":"AND(CoolerLabelsDairy!K25,\"AAAAAHL3tHQ=\")","v":{"$error":"#VALUE!"}},{"$f":"AND(CoolerLabelsDairy!L25,\"AAAAAHL3tHU=\")","v":{"$error":"#VALUE!"}},{"$f":"AND(CoolerLabelsDairy!M25,\"AAAAAHL3tHY=\")","v":{"$error":"#VALUE!"}},{"$f":"AND(CoolerLabelsDairy!N25,\"AAAAAHL3tHc=\")","v":{"$error":"#VALUE!"}},{"$f":"AND(CoolerLabelsDairy!O25,\"AAAAAHL3tHg=\")","v":{"$error":"#VALUE!"}},{"$f":"AND(CoolerLabelsDairy!P25,\"AAAAAHL3tHk=\")","v":{"$error":"#VALUE!"}},{"$f":"AND(CoolerLabelsDairy!Q25,\"AAAAAHL3tHo=\")","v":{"$error":"#VALUE!"}},{"$f":"AND(CoolerLabelsDairy!R25,\"AAAAAHL3tHs=\")","v":{"$error":"#VALUE!"}},{"$f":"AND(CoolerLabelsDairy!S25,\"AAAAAHL3tHw=\")","v":{"$error":"#VALUE!"}},{"$f":"AND(CoolerLabelsDairy!T25,\"AAAAAHL3tH0=\")","v":{"$error":"#VALUE!"}},{"$f":"AND(CoolerLabelsDairy!U25,\"AAAAAHL3tH4=\")","v":{"$error":"#VALUE!"}},{"$f":"IF(CoolerLabelsDairy!26:26,\"AAAAAHL3tH8=\",0)","v":0},{"$f":"AND(CoolerLabelsDairy!A26,\"AAAAAHL3tIA=\")","v":{"$error":"#VALUE!"}},{"$f":"AND(CoolerLabelsDairy!B26,\"AAAAAHL3tIE=\")","v":{"$error":"#VALUE!"}},{"$f":"AND(CoolerLabelsDairy!C26,\"AAAAAHL3tII=\")","v":{"$error":"#VALUE!"}},{"$f":"AND(CoolerLabelsDairy!D26,\"AAAAAHL3tIM=\")","v":{"$error":"#VALUE!"}},{"$f":"AND(CoolerLabelsDairy!E26,\"AAAAAHL3tIQ=\")","v":{"$error":"#VALUE!"}},{"$f":"AND(CoolerLabelsDairy!F26,\"AAAAAHL3tIU=\")","v":{"$error":"#VALUE!"}},{"$f":"AND(CoolerLabelsDairy!G26,\"AAAAAHL3tIY=\")","v":{"$error":"#VALUE!"}},{"$f":"AND(CoolerLabelsDairy!H26,\"AAAAAHL3tIc=\")","v":{"$error":"#VALUE!"}},{"$f":"AND(CoolerLabelsDairy!I26,\"AAAAAHL3tIg=\")","v":{"$error":"#VALUE!"}},{"$f":"AND(CoolerLabelsDairy!J26,\"AAAAAHL3tIk=\")","v":{"$error":"#VALUE!"}},{"$f":"AND(CoolerLabelsDairy!K26,\"AAAAAHL3tIo=\")","v":{"$error":"#VALUE!"}},{"$f":"AND(CoolerLabelsDairy!L26,\"AAAAAHL3tIs=\")","v":{"$error":"#VALUE!"}},{"$f":"AND(CoolerLabelsDairy!M26,\"AAAAAHL3tIw=\")","v":{"$error":"#VALUE!"}},{"$f":"AND(CoolerLabelsDairy!N26,\"AAAAAHL3tI0=\")","v":{"$error":"#VALUE!"}},{"$f":"AND(CoolerLabelsDairy!O26,\"AAAAAHL3tI4=\")","v":{"$error":"#VALUE!"}},{"$f":"AND(CoolerLabelsDairy!P26,\"AAAAAHL3tI8=\")","v":{"$error":"#VALUE!"}},{"$f":"AND(CoolerLabelsDairy!Q26,\"AAAAAHL3tJA=\")","v":{"$error":"#VALUE!"}},{"$f":"AND(CoolerLabelsDairy!R26,\"AAAAAHL3tJE=\")","v":{"$error":"#VALUE!"}},{"$f":"AND(CoolerLabelsDairy!S26,\"AAAAAHL3tJI=\")","v":{"$error":"#VALUE!"}},{"$f":"AND(CoolerLabelsDairy!T26,\"AAAAAHL3tJM=\")","v":{"$error":"#VALUE!"}},{"$f":"AND(CoolerLabelsDairy!U26,\"AAAAAHL3tJQ=\")","v":{"$error":"#VALUE!"}},{"$f":"IF(CoolerLabelsDairy!27:27,\"AAAAAHL3tJU=\",0)","v":0},{"$f":"AND(CoolerLabelsDairy!A27,\"AAAAAHL3tJY=\")","v":{"$error":"#VALUE!"}},{"$f":"AND(CoolerLabelsDairy!B27,\"AAAAAHL3tJc=\")","v":{"$error":"#VALUE!"}},{"$f":"AND(CoolerLabelsDairy!C27,\"AAAAAHL3tJg=\")","v":{"$error":"#VALUE!"}},{"$f":"AND(CoolerLabelsDairy!D27,\"AAAAAHL3tJk=\")","v":{"$error":"#VALUE!"}},{"$f":"AND(CoolerLabelsDairy!E27,\"AAAAAHL3tJo=\")","v":{"$error":"#VALUE!"}},{"$f":"AND(CoolerLabelsDairy!F27,\"AAAAAHL3tJs=\")","v":{"$error":"#VALUE!"}},{"$f":"AND(CoolerLabelsDairy!G27,\"AAAAAHL3tJw=\")","v":{"$error":"#VALUE!"}},{"$f":"AND(CoolerLabelsDairy!H27,\"AAAAAHL3tJ0=\")","v":{"$error":"#VALUE!"}},{"$f":"AND(CoolerLabelsDairy!I27,\"AAAAAHL3tJ4=\")","v":{"$error":"#VALUE!"}},{"$f":"AND(CoolerLabelsDairy!J27,\"AAAAAHL3tJ8=\")","v":{"$error":"#VALUE!"}},{"$f":"AND(CoolerLabelsDairy!K27,\"AAAAAHL3tKA=\")","v":{"$error":"#VALUE!"}},{"$f":"AND(CoolerLabelsDairy!L27,\"AAAAAHL3tKE=\")","v":{"$error":"#VALUE!"}},{"$f":"AND(CoolerLabelsDairy!M27,\"AAAAAHL3tKI=\")","v":{"$error":"#VALUE!"}},{"$f":"AND(CoolerLabelsDairy!N27,\"AAAAAHL3tKM=\")","v":{"$error":"#VALUE!"}},{"$f":"AND(CoolerLabelsDairy!O27,\"AAAAAHL3tKQ=\")","v":{"$error":"#VALUE!"}},{"$f":"AND(CoolerLabelsDairy!P27,\"AAAAAHL3tKU=\")","v":{"$error":"#VALUE!"}},{"$f":"AND(CoolerLabelsDairy!Q27,\"AAAAAHL3tKY=\")","v":{"$error":"#VALUE!"}},{"$f":"AND(CoolerLabelsDairy!R27,\"AAAAAHL3tKc=\")","v":{"$error":"#VALUE!"}},{"$f":"AND(CoolerLabelsDairy!S27,\"AAAAAHL3tKg=\")","v":{"$error":"#VALUE!"}},{"$f":"AND(CoolerLabelsDairy!T27,\"AAAAAHL3tKk=\")","v":{"$error":"#VALUE!"}},{"$f":"AND(CoolerLabelsDairy!U27,\"AAAAAHL3tKo=\")","v":{"$error":"#VALUE!"}},{"$f":"IF(CoolerLabelsDairy!28:28,\"AAAAAHL3tKs=\",0)","v":0},{"$f":"AND(CoolerLabelsDairy!A28,\"AAAAAHL3tKw=\")","v":{"$error":"#VALUE!"}},{"$f":"AND(CoolerLabelsDairy!B28,\"AAAAAHL3tK0=\")","v":{"$error":"#VALUE!"}},{"$f":"AND(CoolerLabelsDairy!C28,\"AAAAAHL3tK4=\")","v":{"$error":"#VALUE!"}},{"$f":"AND(CoolerLabelsDairy!D28,\"AAAAAHL3tK8=\")","v":{"$error":"#VALUE!"}},{"$f":"AND(CoolerLabelsDairy!E28,\"AAAAAHL3tLA=\")","v":{"$error":"#VALUE!"}},{"$f":"AND(CoolerLabelsDairy!F28,\"AAAAAHL3tLE=\")","v":{"$error":"#VALUE!"}},{"$f":"AND(CoolerLabelsDairy!G28,\"AAAAAHL3tLI=\")","v":{"$error":"#VALUE!"}},{"$f":"AND(CoolerLabelsDairy!H28,\"AAAAAHL3tLM=\")","v":{"$error":"#VALUE!"}},{"$f":"AND(CoolerLabelsDairy!I28,\"AAAAAHL3tLQ=\")","v":{"$error":"#VALUE!"}},{"$f":"AND(CoolerLabelsDairy!J28,\"AAAAAHL3tLU=\")","v":{"$error":"#VALUE!"}},{"$f":"AND(CoolerLabelsDairy!K28,\"AAAAAHL3tLY=\")","v":{"$error":"#VALUE!"}},{"$f":"AND(CoolerLabelsDairy!L28,\"AAAAAHL3tLc=\")","v":{"$error":"#VALUE!"}},{"$f":"AND(CoolerLabelsDairy!M28,\"AAAAAHL3tLg=\")","v":{"$error":"#VALUE!"}},{"$f":"AND(CoolerLabelsDairy!N28,\"AAAAAHL3tLk=\")","v":{"$error":"#VALUE!"}},{"$f":"AND(CoolerLabelsDairy!O28,\"AAAAAHL3tLo=\")","v":{"$error":"#VALUE!"}},{"$f":"AND(CoolerLabelsDairy!P28,\"AAAAAHL3tLs=\")","v":{"$error":"#VALUE!"}},{"$f":"AND(CoolerLabelsDairy!Q28,\"AAAAAHL3tLw=\")","v":{"$error":"#VALUE!"}},{"$f":"AND(CoolerLabelsDairy!R28,\"AAAAAHL3tL0=\")","v":{"$error":"#VALUE!"}},{"$f":"AND(CoolerLabelsDairy!S28,\"AAAAAHL3tL4=\")","v":{"$error":"#VALUE!"}},{"$f":"AND(CoolerLabelsDairy!T28,\"AAAAAHL3tL8=\")","v":{"$error":"#VALUE!"}},{"$f":"AND(CoolerLabelsDairy!U28,\"AAAAAHL3tMA=\")","v":{"$error":"#VALUE!"}},{"$f":"IF(CoolerLabelsDairy!29:29,\"AAAAAHL3tME=\",0)","v":0},{"$f":"AND(CoolerLabelsDairy!A29,\"AAAAAHL3tMI=\")","v":{"$error":"#VALUE!"}},{"$f":"AND(CoolerLabelsDairy!B29,\"AAAAAHL3tMM=\")","v":{"$error":"#VALUE!"}},{"$f":"AND(CoolerLabelsDairy!C29,\"AAAAAHL3tMQ=\")","v":{"$error":"#VALUE!"}},{"$f":"AND(CoolerLabelsDairy!D29,\"AAAAAHL3tMU=\")","v":{"$error":"#VALUE!"}},{"$f":"AND(CoolerLabelsDairy!E29,\"AAAAAHL3tMY=\")","v":{"$error":"#VALUE!"}},{"$f":"AND(CoolerLabelsDairy!F29,\"AAAAAHL3tMc=\")","v":{"$error":"#VALUE!"}},{"$f":"AND(CoolerLabelsDairy!G29,\"AAAAAHL3tMg=\")","v":{"$error":"#VALUE!"}},{"$f":"AND(CoolerLabelsDairy!H29,\"AAAAAHL3tMk=\")","v":{"$error":"#VALUE!"}},{"$f":"AND(CoolerLabelsDairy!I29,\"AAAAAHL3tMo=\")","v":{"$error":"#VALUE!"}},{"$f":"AND(CoolerLabelsDairy!J29,\"AAAAAHL3tMs=\")","v":{"$error":"#VALUE!"}},{"$f":"AND(CoolerLabelsDairy!K29,\"AAAAAHL3tMw=\")","v":{"$error":"#VALUE!"}},{"$f":"AND(CoolerLabelsDairy!L29,\"AAAAAHL3tM0=\")","v":{"$error":"#VALUE!"}},{"$f":"AND(CoolerLabelsDairy!M29,\"AAAAAHL3tM4=\")","v":{"$error":"#VALUE!"}},{"$f":"AND(CoolerLabelsDairy!N29,\"AAAAAHL3tM8=\")","v":{"$error":"#VALUE!"}},{"$f":"AND(CoolerLabelsDairy!O29,\"AAAAAHL3tNA=\")","v":{"$error":"#VALUE!"}},{"$f":"AND(CoolerLabelsDairy!P29,\"AAAAAHL3tNE=\")","v":{"$error":"#VALUE!"}},{"$f":"AND(CoolerLabelsDairy!Q29,\"AAAAAHL3tNI=\")","v":{"$error":"#VALUE!"}},{"$f":"AND(CoolerLabelsDairy!R29,\"AAAAAHL3tNM=\")","v":{"$error":"#VALUE!"}},{"$f":"AND(CoolerLabelsDairy!S29,\"AAAAAHL3tNQ=\")","v":{"$error":"#VALUE!"}},{"$f":"AND(CoolerLabelsDairy!T29,\"AAAAAHL3tNU=\")","v":{"$error":"#VALUE!"}},{"$f":"AND(CoolerLabelsDairy!U29,\"AAAAAHL3tNY=\")","v":{"$error":"#VALUE!"}},{"$f":"IF(CoolerLabelsDairy!30:30,\"AAAAAHL3tNc=\",0)","v":0},{"$f":"AND(CoolerLabelsDairy!A30,\"AAAAAHL3tNg=\")","v":{"$error":"#VALUE!"}},{"$f":"AND(CoolerLabelsDairy!B30,\"AAAAAHL3tNk=\")","v":{"$error":"#VALUE!"}},{"$f":"AND(CoolerLabelsDairy!C30,\"AAAAAHL3tNo=\")","v":{"$error":"#VALUE!"}},{"$f":"AND(CoolerLabelsDairy!D30,\"AAAAAHL3tNs=\")","v":{"$error":"#VALUE!"}},{"$f":"AND(CoolerLabelsDairy!E30,\"AAAAAHL3tNw=\")","v":{"$error":"#VALUE!"}},{"$f":"AND(CoolerLabelsDairy!F30,\"AAAAAHL3tN0=\")","v":{"$error":"#VALUE!"}},{"$f":"AND(CoolerLabelsDairy!G30,\"AAAAAHL3tN4=\")","v":{"$error":"#VALUE!"}},{"$f":"AND(CoolerLabelsDairy!H30,\"AAAAAHL3tN8=\")","v":{"$error":"#VALUE!"}},{"$f":"AND(CoolerLabelsDairy!I30,\"AAAAAHL3tOA=\")","v":{"$error":"#VALUE!"}},{"$f":"AND(CoolerLabelsDairy!J30,\"AAAAAHL3tOE=\")","v":{"$error":"#VALUE!"}},{"$f":"AND(CoolerLabelsDairy!K30,\"AAAAAHL3tOI=\")","v":{"$error":"#VALUE!"}},{"$f":"AND(CoolerLabelsDairy!L30,\"AAAAAHL3tOM=\")","v":{"$error":"#VALUE!"}},{"$f":"AND(CoolerLabelsDairy!M30,\"AAAAAHL3tOQ=\")","v":{"$error":"#VALUE!"}},{"$f":"AND(CoolerLabelsDairy!N30,\"AAAAAHL3tOU=\")","v":{"$error":"#VALUE!"}},{"$f":"AND(CoolerLabelsDairy!O30,\"AAAAAHL3tOY=\")","v":{"$error":"#VALUE!"}},{"$f":"AND(CoolerLabelsDairy!P30,\"AAAAAHL3tOc=\")","v":{"$error":"#VALUE!"}},{"$f":"AND(CoolerLabelsDairy!Q30,\"AAAAAHL3tOg=\")","v":{"$error":"#VALUE!"}},{"$f":"AND(CoolerLabelsDairy!R30,\"AAAAAHL3tOk=\")","v":{"$error":"#VALUE!"}},{"$f":"AND(CoolerLabelsDairy!S30,\"AAAAAHL3tOo=\")","v":{"$error":"#VALUE!"}},{"$f":"AND(CoolerLabelsDairy!T30,\"AAAAAHL3tOs=\")","v":{"$error":"#VALUE!"}},{"$f":"AND(CoolerLabelsDairy!U30,\"AAAAAHL3tOw=\")","v":{"$error":"#VALUE!"}},{"$f":"IF(CoolerLabelsDairy!31:31,\"AAAAAHL3tO0=\",0)","v":0},{"$f":"AND(CoolerLabelsDairy!A31,\"AAAAAHL3tO4=\")","v":{"$error":"#VALUE!"}},{"$f":"AND(CoolerLabelsDairy!B31,\"AAAAAHL3tO8=\")","v":{"$error":"#VALUE!"}},{"$f":"AND(CoolerLabelsDairy!C31,\"AAAAAHL3tPA=\")","v":{"$error":"#VALUE!"}},{"$f":"AND(CoolerLabelsDairy!D31,\"AAAAAHL3tPE=\")","v":{"$error":"#VALUE!"}},{"$f":"AND(CoolerLabelsDairy!E31,\"AAAAAHL3tPI=\")","v":{"$error":"#VALUE!"}},{"$f":"AND(CoolerLabelsDairy!F31,\"AAAAAHL3tPM=\")","v":{"$error":"#VALUE!"}},{"$f":"AND(CoolerLabelsDairy!G31,\"AAAAAHL3tPQ=\")","v":{"$error":"#VALUE!"}},{"$f":"AND(CoolerLabelsDairy!H31,\"AAAAAHL3tPU=\")","v":{"$error":"#VALUE!"}},{"$f":"AND(CoolerLabelsDairy!I31,\"AAAAAHL3tPY=\")","v":{"$error":"#VALUE!"}},{"$f":"AND(CoolerLabelsDairy!J31,\"AAAAAHL3tPc=\")","v":{"$error":"#VALUE!"}},{"$f":"AND(CoolerLabelsDairy!K31,\"AAAAAHL3tPg=\")","v":{"$error":"#VALUE!"}},{"$f":"AND(CoolerLabelsDairy!L31,\"AAAAAHL3tPk=\")","v":{"$error":"#VALUE!"}},{"$f":"AND(CoolerLabelsDairy!M31,\"AAAAAHL3tPo=\")","v":{"$error":"#VALUE!"}},{"$f":"AND(CoolerLabelsDairy!N31,\"AAAAAHL3tPs=\")","v":{"$error":"#VALUE!"}},{"$f":"AND(CoolerLabelsDairy!O31,\"AAAAAHL3tPw=\")","v":{"$error":"#VALUE!"}},{"$f":"AND(CoolerLabelsDairy!P31,\"AAAAAHL3tP0=\")","v":{"$error":"#VALUE!"}},{"$f":"AND(CoolerLabelsDairy!Q31,\"AAAAAHL3tP4=\")","v":{"$error":"#VALUE!"}},{"$f":"AND(CoolerLabelsDairy!R31,\"AAAAAHL3tP8=\")","v":{"$error":"#VALUE!"}}]
[{"$f":"AND(CoolerLabelsDairy!S31,\"AAAAAHX2fAA=\")","v":{"$error":"#VALUE!"}},{"$f":"AND(CoolerLabelsDairy!T31,\"AAAAAHX2fAE=\")","v":{"$error":"#VALUE!"}},{"$f":"AND(CoolerLabelsDairy!U31,\"AAAAAHX2fAI=\")","v":{"$error":"#VALUE!"}},{"$f":"IF(CoolerLabelsDairy!32:32,\"AAAAAHX2fAM=\",0)","v":0},{"$f":"AND(CoolerLabelsDairy!A32,\"AAAAAHX2fAQ=\")","v":{"$error":"#VALUE!"}},{"$f":"AND(CoolerLabelsDairy!B32,\"AAAAAHX2fAU=\")","v":{"$error":"#VALUE!"}},{"$f":"AND(CoolerLabelsDairy!C32,\"AAAAAHX2fAY=\")","v":{"$error":"#VALUE!"}},{"$f":"AND(CoolerLabelsDairy!D32,\"AAAAAHX2fAc=\")","v":{"$error":"#VALUE!"}},{"$f":"AND(CoolerLabelsDairy!E32,\"AAAAAHX2fAg=\")","v":{"$error":"#VALUE!"}},{"$f":"AND(CoolerLabelsDairy!F32,\"AAAAAHX2fAk=\")","v":{"$error":"#VALUE!"}},{"$f":"AND(CoolerLabelsDairy!G32,\"AAAAAHX2fAo=\")","v":{"$error":"#VALUE!"}},{"$f":"AND(CoolerLabelsDairy!H32,\"AAAAAHX2fAs=\")","v":{"$error":"#VALUE!"}},{"$f":"AND(CoolerLabelsDairy!I32,\"AAAAAHX2fAw=\")","v":{"$error":"#VALUE!"}},{"$f":"AND(CoolerLabelsDairy!J32,\"AAAAAHX2fA0=\")","v":{"$error":"#VALUE!"}},{"$f":"AND(CoolerLabelsDairy!K32,\"AAAAAHX2fA4=\")","v":{"$error":"#VALUE!"}},{"$f":"AND(CoolerLabelsDairy!L32,\"AAAAAHX2fA8=\")","v":{"$error":"#VALUE!"}},{"$f":"AND(CoolerLabelsDairy!M32,\"AAAAAHX2fBA=\")","v":{"$error":"#VALUE!"}},{"$f":"AND(CoolerLabelsDairy!N32,\"AAAAAHX2fBE=\")","v":{"$error":"#VALUE!"}},{"$f":"AND(CoolerLabelsDairy!O32,\"AAAAAHX2fBI=\")","v":{"$error":"#VALUE!"}},{"$f":"AND(CoolerLabelsDairy!P32,\"AAAAAHX2fBM=\")","v":{"$error":"#VALUE!"}},{"$f":"AND(CoolerLabelsDairy!Q32,\"AAAAAHX2fBQ=\")","v":{"$error":"#VALUE!"}},{"$f":"AND(CoolerLabelsDairy!R32,\"AAAAAHX2fBU=\")","v":{"$error":"#VALUE!"}},{"$f":"AND(CoolerLabelsDairy!S32,\"AAAAAHX2fBY=\")","v":{"$error":"#VALUE!"}},{"$f":"AND(CoolerLabelsDairy!T32,\"AAAAAHX2fBc=\")","v":{"$error":"#VALUE!"}},{"$f":"AND(CoolerLabelsDairy!U32,\"AAAAAHX2fBg=\")","v":{"$error":"#VALUE!"}},{"$f":"IF(CoolerLabelsDairy!33:33,\"AAAAAHX2fBk=\",0)","v":0},{"$f":"AND(CoolerLabelsDairy!A33,\"AAAAAHX2fBo=\")","v":{"$error":"#VALUE!"}},{"$f":"AND(CoolerLabelsDairy!B33,\"AAAAAHX2fBs=\")","v":{"$error":"#VALUE!"}},{"$f":"AND(CoolerLabelsDairy!C33,\"AAAAAHX2fBw=\")","v":{"$error":"#VALUE!"}},{"$f":"AND(CoolerLabelsDairy!D33,\"AAAAAHX2fB0=\")","v":{"$error":"#VALUE!"}},{"$f":"AND(CoolerLabelsDairy!E33,\"AAAAAHX2fB4=\")","v":{"$error":"#VALUE!"}},{"$f":"AND(CoolerLabelsDairy!F33,\"AAAAAHX2fB8=\")","v":{"$error":"#VALUE!"}},{"$f":"AND(CoolerLabelsDairy!G33,\"AAAAAHX2fCA=\")","v":{"$error":"#VALUE!"}},{"$f":"AND(CoolerLabelsDairy!H33,\"AAAAAHX2fCE=\")","v":{"$error":"#VALUE!"}},{"$f":"AND(CoolerLabelsDairy!I33,\"AAAAAHX2fCI=\")","v":{"$error":"#VALUE!"}},{"$f":"AND(CoolerLabelsDairy!J33,\"AAAAAHX2fCM=\")","v":{"$error":"#VALUE!"}},{"$f":"AND(CoolerLabelsDairy!K33,\"AAAAAHX2fCQ=\")","v":{"$error":"#VALUE!"}},{"$f":"AND(CoolerLabelsDairy!L33,\"AAAAAHX2fCU=\")","v":{"$error":"#VALUE!"}},{"$f":"AND(CoolerLabelsDairy!M33,\"AAAAAHX2fCY=\")","v":{"$error":"#VALUE!"}},{"$f":"AND(CoolerLabelsDairy!N33,\"AAAAAHX2fCc=\")","v":{"$error":"#VALUE!"}},{"$f":"AND(CoolerLabelsDairy!O33,\"AAAAAHX2fCg=\")","v":{"$error":"#VALUE!"}},{"$f":"AND(CoolerLabelsDairy!P33,\"AAAAAHX2fCk=\")","v":{"$error":"#VALUE!"}},{"$f":"AND(CoolerLabelsDairy!Q33,\"AAAAAHX2fCo=\")","v":{"$error":"#VALUE!"}},{"$f":"AND(CoolerLabelsDairy!R33,\"AAAAAHX2fCs=\")","v":{"$error":"#VALUE!"}},{"$f":"AND(CoolerLabelsDairy!S33,\"AAAAAHX2fCw=\")","v":{"$error":"#VALUE!"}},{"$f":"AND(CoolerLabelsDairy!T33,\"AAAAAHX2fC0=\")","v":{"$error":"#VALUE!"}},{"$f":"AND(CoolerLabelsDairy!U33,\"AAAAAHX2fC4=\")","v":{"$error":"#VALUE!"}},{"$f":"IF(CoolerLabelsDairy!34:34,\"AAAAAHX2fC8=\",0)","v":0},{"$f":"AND(CoolerLabelsDairy!A34,\"AAAAAHX2fDA=\")","v":{"$error":"#VALUE!"}},{"$f":"AND(CoolerLabelsDairy!B34,\"AAAAAHX2fDE=\")","v":{"$error":"#VALUE!"}},{"$f":"AND(CoolerLabelsDairy!C34,\"AAAAAHX2fDI=\")","v":{"$error":"#VALUE!"}},{"$f":"AND(CoolerLabelsDairy!D34,\"AAAAAHX2fDM=\")","v":{"$error":"#VALUE!"}},{"$f":"AND(CoolerLabelsDairy!E34,\"AAAAAHX2fDQ=\")","v":{"$error":"#VALUE!"}},{"$f":"AND(CoolerLabelsDairy!F34,\"AAAAAHX2fDU=\")","v":{"$error":"#VALUE!"}},{"$f":"AND(CoolerLabelsDairy!G34,\"AAAAAHX2fDY=\")","v":{"$error":"#VALUE!"}},{"$f":"AND(CoolerLabelsDairy!H34,\"AAAAAHX2fDc=\")","v":{"$error":"#VALUE!"}},{"$f":"AND(CoolerLabelsDairy!I34,\"AAAAAHX2fDg=\")","v":{"$error":"#VALUE!"}},{"$f":"AND(CoolerLabelsDairy!J34,\"AAAAAHX2fDk=\")","v":{"$error":"#VALUE!"}},{"$f":"AND(CoolerLabelsDairy!K34,\"AAAAAHX2fDo=\")","v":{"$error":"#VALUE!"}},{"$f":"AND(CoolerLabelsDairy!L34,\"AAAAAHX2fDs=\")","v":{"$error":"#VALUE!"}},{"$f":"AND(CoolerLabelsDairy!M34,\"AAAAAHX2fDw=\")","v":{"$error":"#VALUE!"}},{"$f":"AND(CoolerLabelsDairy!N34,\"AAAAAHX2fD0=\")","v":{"$error":"#VALUE!"}},{"$f":"AND(CoolerLabelsDairy!O34,\"AAAAAHX2fD4=\")","v":{"$error":"#VALUE!"}},{"$f":"AND(CoolerLabelsDairy!P34,\"AAAAAHX2fD8=\")","v":{"$error":"#VALUE!"}},{"$f":"AND(CoolerLabelsDairy!Q34,\"AAAAAHX2fEA=\")","v":{"$error":"#VALUE!"}},{"$f":"AND(CoolerLabelsDairy!R34,\"AAAAAHX2fEE=\")","v":{"$error":"#VALUE!"}},{"$f":"AND(CoolerLabelsDairy!S34,\"AAAAAHX2fEI=\")","v":{"$error":"#VALUE!"}},{"$f":"AND(CoolerLabelsDairy!T34,\"AAAAAHX2fEM=\")","v":{"$error":"#VALUE!"}},{"$f":"AND(CoolerLabelsDairy!U34,\"AAAAAHX2fEQ=\")","v":{"$error":"#VALUE!"}},{"$f":"IF(CoolerLabelsDairy!35:35,\"AAAAAHX2fEU=\",0)","v":0},{"$f":"AND(CoolerLabelsDairy!A35,\"AAAAAHX2fEY=\")","v":{"$error":"#VALUE!"}},{"$f":"AND(CoolerLabelsDairy!B35,\"AAAAAHX2fEc=\")","v":{"$error":"#VALUE!"}},{"$f":"AND(CoolerLabelsDairy!C35,\"AAAAAHX2fEg=\")","v":{"$error":"#VALUE!"}},{"$f":"AND(CoolerLabelsDairy!D35,\"AAAAAHX2fEk=\")","v":{"$error":"#VALUE!"}},{"$f":"AND(CoolerLabelsDairy!E35,\"AAAAAHX2fEo=\")","v":{"$error":"#VALUE!"}},{"$f":"AND(CoolerLabelsDairy!F35,\"AAAAAHX2fEs=\")","v":{"$error":"#VALUE!"}},{"$f":"AND(CoolerLabelsDairy!G35,\"AAAAAHX2fEw=\")","v":{"$error":"#VALUE!"}},{"$f":"AND(CoolerLabelsDairy!H35,\"AAAAAHX2fE0=\")","v":{"$error":"#VALUE!"}},{"$f":"AND(CoolerLabelsDairy!I35,\"AAAAAHX2fE4=\")","v":{"$error":"#VALUE!"}},{"$f":"AND(CoolerLabelsDairy!J35,\"AAAAAHX2fE8=\")","v":{"$error":"#VALUE!"}},{"$f":"AND(CoolerLabelsDairy!K35,\"AAAAAHX2fFA=\")","v":{"$error":"#VALUE!"}},{"$f":"AND(CoolerLabelsDairy!L35,\"AAAAAHX2fFE=\")","v":{"$error":"#VALUE!"}},{"$f":"AND(CoolerLabelsDairy!M35,\"AAAAAHX2fFI=\")","v":{"$error":"#VALUE!"}},{"$f":"AND(CoolerLabelsDairy!N35,\"AAAAAHX2fFM=\")","v":{"$error":"#VALUE!"}},{"$f":"AND(CoolerLabelsDairy!O35,\"AAAAAHX2fFQ=\")","v":{"$error":"#VALUE!"}},{"$f":"AND(CoolerLabelsDairy!P35,\"AAAAAHX2fFU=\")","v":{"$error":"#VALUE!"}},{"$f":"AND(CoolerLabelsDairy!Q35,\"AAAAAHX2fFY=\")","v":{"$error":"#VALUE!"}},{"$f":"AND(CoolerLabelsDairy!R35,\"AAAAAHX2fFc=\")","v":{"$error":"#VALUE!"}},{"$f":"AND(CoolerLabelsDairy!S35,\"AAAAAHX2fFg=\")","v":{"$error":"#VALUE!"}},{"$f":"AND(CoolerLabelsDairy!T35,\"AAAAAHX2fFk=\")","v":{"$error":"#VALUE!"}},{"$f":"AND(CoolerLabelsDairy!U35,\"AAAAAHX2fFo=\")","v":{"$error":"#VALUE!"}},{"$f":"IF(CoolerLabelsDairy!36:36,\"AAAAAHX2fFs=\",0)","v":0},{"$f":"AND(CoolerLabelsDairy!A36,\"AAAAAHX2fFw=\")","v":{"$error":"#VALUE!"}},{"$f":"AND(CoolerLabelsDairy!B36,\"AAAAAHX2fF0=\")","v":{"$error":"#VALUE!"}},{"$f":"AND(CoolerLabelsDairy!C36,\"AAAAAHX2fF4=\")","v":{"$error":"#VALUE!"}},{"$f":"AND(CoolerLabelsDairy!D36,\"AAAAAHX2fF8=\")","v":{"$error":"#VALUE!"}},{"$f":"AND(CoolerLabelsDairy!E36,\"AAAAAHX2fGA=\")","v":{"$error":"#VALUE!"}},{"$f":"AND(CoolerLabelsDairy!F36,\"AAAAAHX2fGE=\")","v":{"$error":"#VALUE!"}},{"$f":"AND(CoolerLabelsDairy!G36,\"AAAAAHX2fGI=\")","v":{"$error":"#VALUE!"}},{"$f":"AND(CoolerLabelsDairy!H36,\"AAAAAHX2fGM=\")","v":{"$error":"#VALUE!"}},{"$f":"AND(CoolerLabelsDairy!I36,\"AAAAAHX2fGQ=\")","v":{"$error":"#VALUE!"}},{"$f":"AND(CoolerLabelsDairy!J36,\"AAAAAHX2fGU=\")","v":{"$error":"#VALUE!"}},{"$f":"AND(CoolerLabelsDairy!K36,\"AAAAAHX2fGY=\")","v":{"$error":"#VALUE!"}},{"$f":"AND(CoolerLabelsDairy!L36,\"AAAAAHX2fGc=\")","v":{"$error":"#VALUE!"}},{"$f":"AND(CoolerLabelsDairy!M36,\"AAAAAHX2fGg=\")","v":{"$error":"#VALUE!"}},{"$f":"AND(CoolerLabelsDairy!N36,\"AAAAAHX2fGk=\")","v":{"$error":"#VALUE!"}},{"$f":"AND(CoolerLabelsDairy!O36,\"AAAAAHX2fGo=\")","v":{"$error":"#VALUE!"}},{"$f":"AND(CoolerLabelsDairy!P36,\"AAAAAHX2fGs=\")","v":{"$error":"#VALUE!"}},{"$f":"AND(CoolerLabelsDairy!Q36,\"AAAAAHX2fGw=\")","v":{"$error":"#VALUE!"}},{"$f":"AND(CoolerLabelsDairy!R36,\"AAAAAHX2fG0=\")","v":{"$error":"#VALUE!"}},{"$f":"AND(CoolerLabelsDairy!S36,\"AAAAAHX2fG4=\")","v":{"$error":"#VALUE!"}},{"$f":"AND(CoolerLabelsDairy!T36,\"AAAAAHX2fG8=\")","v":{"$error":"#VALUE!"}},{"$f":"AND(CoolerLabelsDairy!U36,\"AAAAAHX2fHA=\")","v":{"$error":"#VALUE!"}},{"$f":"IF(CoolerLabelsDairy!37:37,\"AAAAAHX2fHE=\",0)","v":0},{"$f":"AND(CoolerLabelsDairy!A37,\"AAAAAHX2fHI=\")","v":{"$error":"#VALUE!"}},{"$f":"AND(CoolerLabelsDairy!B37,\"AAAAAHX2fHM=\")","v":{"$error":"#VALUE!"}},{"$f":"AND(CoolerLabelsDairy!C37,\"AAAAAHX2fHQ=\")","v":{"$error":"#VALUE!"}},{"$f":"AND(CoolerLabelsDairy!D37,\"AAAAAHX2fHU=\")","v":{"$error":"#VALUE!"}},{"$f":"AND(CoolerLabelsDairy!E37,\"AAAAAHX2fHY=\")","v":{"$error":"#VALUE!"}},{"$f":"AND(CoolerLabelsDairy!F37,\"AAAAAHX2fHc=\")","v":{"$error":"#VALUE!"}},{"$f":"AND(CoolerLabelsDairy!G37,\"AAAAAHX2fHg=\")","v":{"$error":"#VALUE!"}},{"$f":"AND(CoolerLabelsDairy!H37,\"AAAAAHX2fHk=\")","v":{"$error":"#VALUE!"}},{"$f":"AND(CoolerLabelsDairy!I37,\"AAAAAHX2fHo=\")","v":{"$error":"#VALUE!"}},{"$f":"AND(CoolerLabelsDairy!J37,\"AAAAAHX2fHs=\")","v":{"$error":"#VALUE!"}},{"$f":"AND(CoolerLabelsDairy!K37,\"AAAAAHX2fHw=\")","v":{"$error":"#VALUE!"}},{"$f":"AND(CoolerLabelsDairy!L37,\"AAAAAHX2fH0=\")","v":{"$error":"#VALUE!"}},{"$f":"AND(CoolerLabelsDairy!M37,\"AAAAAHX2fH4=\")","v":{"$error":"#VALUE!"}},{"$f":"AND(CoolerLabelsDairy!N37,\"AAAAAHX2fH8=\")","v":{"$error":"#VALUE!"}},{"$f":"AND(CoolerLabelsDairy!O37,\"AAAAAHX2fIA=\")","v":{"$error":"#VALUE!"}},{"$f":"AND(CoolerLabelsDairy!P37,\"AAAAAHX2fIE=\")","v":{"$error":"#VALUE!"}},{"$f":"AND(CoolerLabelsDairy!Q37,\"AAAAAHX2fII=\")","v":{"$error":"#VALUE!"}},{"$f":"AND(CoolerLabelsDairy!R37,\"AAAAAHX2fIM=\")","v":{"$error":"#VALUE!"}},{"$f":"AND(CoolerLabelsDairy!S37,\"AAAAAHX2fIQ=\")","v":{"$error":"#VALUE!"}},{"$f":"AND(CoolerLabelsDairy!T37,\"AAAAAHX2fIU=\")","v":{"$error":"#VALUE!"}},{"$f":"AND(CoolerLabelsDairy!U37,\"AAAAAHX2fIY=\")","v":{"$error":"#VALUE!"}},{"$f":"IF(CoolerLabelsDairy!38:38,\"AAAAAHX2fIc=\",0)","v":0},{"$f":"AND(CoolerLabelsDairy!A38,\"AAAAAHX2fIg=\")","v":{"$error":"#VALUE!"}},{"$f":"AND(CoolerLabelsDairy!B38,\"AAAAAHX2fIk=\")","v":{"$error":"#VALUE!"}},{"$f":"AND(CoolerLabelsDairy!C38,\"AAAAAHX2fIo=\")","v":{"$error":"#VALUE!"}},{"$f":"AND(CoolerLabelsDairy!D38,\"AAAAAHX2fIs=\")","v":{"$error":"#VALUE!"}},{"$f":"AND(CoolerLabelsDairy!E38,\"AAAAAHX2fIw=\")","v":{"$error":"#VALUE!"}},{"$f":"AND(CoolerLabelsDairy!F38,\"AAAAAHX2fI0=\")","v":{"$error":"#VALUE!"}},{"$f":"AND(CoolerLabelsDairy!G38,\"AAAAAHX2fI4=\")","v":{"$error":"#VALUE!"}},{"$f":"AND(CoolerLabelsDairy!H38,\"AAAAAHX2fI8=\")","v":{"$error":"#VALUE!"}},{"$f":"AND(CoolerLabelsDairy!I38,\"AAAAAHX2fJA=\")","v":{"$error":"#VALUE!"}},{"$f":"AND(CoolerLabelsDairy!J38,\"AAAAAHX2fJE=\")","v":{"$error":"#VALUE!"}},{"$f":"AND(CoolerLabelsDairy!K38,\"AAAAAHX2fJI=\")","v":{"$error":"#VALUE!"}},{"$f":"AND(CoolerLabelsDairy!L38,\"AAAAAHX2fJM=\")","v":{"$error":"#VALUE!"}},{"$f":"AND(CoolerLabelsDairy!M38,\"AAAAAHX2fJQ=\")","v":{"$error":"#VALUE!"}},{"$f":"AND(CoolerLabelsDairy!N38,\"AAAAAHX2fJU=\")","v":{"$error":"#VALUE!"}},{"$f":"AND(CoolerLabelsDairy!O38,\"AAAAAHX2fJY=\")","v":{"$error":"#VALUE!"}},{"$f":"AND(CoolerLabelsDairy!P38,\"AAAAAHX2fJc=\")","v":{"$error":"#VALUE!"}},{"$f":"AND(CoolerLabelsDairy!Q38,\"AAAAAHX2fJg=\")","v":{"$error":"#VALUE!"}},{"$f":"AND(CoolerLabelsDairy!R38,\"AAAAAHX2fJk=\")","v":{"$error":"#VALUE!"}},{"$f":"AND(CoolerLabelsDairy!S38,\"AAAAAHX2fJo=\")","v":{"$error":"#VALUE!"}},{"$f":"AND(CoolerLabelsDairy!T38,\"AAAAAHX2fJs=\")","v":{"$error":"#VALUE!"}},{"$f":"AND(CoolerLabelsDairy!U38,\"AAAAAHX2fJw=\")","v":{"$error":"#VALUE!"}},{"$f":"IF(CoolerLabelsDairy!39:39,\"AAAAAHX2fJ0=\",0)","v":0},{"$f":"AND(CoolerLabelsDairy!A39,\"AAAAAHX2fJ4=\")","v":{"$error":"#VALUE!"}},{"$f":"AND(CoolerLabelsDairy!B39,\"AAAAAHX2fJ8=\")","v":{"$error":"#VALUE!"}},{"$f":"AND(CoolerLabelsDairy!C39,\"AAAAAHX2fKA=\")","v":{"$error":"#VALUE!"}},{"$f":"AND(CoolerLabelsDairy!D39,\"AAAAAHX2fKE=\")","v":{"$error":"#VALUE!"}},{"$f":"AND(CoolerLabelsDairy!E39,\"AAAAAHX2fKI=\")","v":{"$error":"#VALUE!"}},{"$f":"AND(CoolerLabelsDairy!F39,\"AAAAAHX2fKM=\")","v":{"$error":"#VALUE!"}},{"$f":"AND(CoolerLabelsDairy!G39,\"AAAAAHX2fKQ=\")","v":{"$error":"#VALUE!"}},{"$f":"AND(CoolerLabelsDairy!H39,\"AAAAAHX2fKU=\")","v":{"$error":"#VALUE!"}},{"$f":"AND(CoolerLabelsDairy!I39,\"AAAAAHX2fKY=\")","v":{"$error":"#VALUE!"}},{"$f":"AND(CoolerLabelsDairy!J39,\"AAAAAHX2fKc=\")","v":{"$error":"#VALUE!"}},{"$f":"AND(CoolerLabelsDairy!K39,\"AAAAAHX2fKg=\")","v":{"$error":"#VALUE!"}},{"$f":"AND(CoolerLabelsDairy!L39,\"AAAAAHX2fKk=\")","v":{"$error":"#VALUE!"}},{"$f":"AND(CoolerLabelsDairy!M39,\"AAAAAHX2fKo=\")","v":{"$error":"#VALUE!"}},{"$f":"AND(CoolerLabelsDairy!N39,\"AAAAAHX2fKs=\")","v":{"$error":"#VALUE!"}},{"$f":"AND(CoolerLabelsDairy!O39,\"AAAAAHX2fKw=\")","v":{"$error":"#VALUE!"}},{"$f":"AND(CoolerLabelsDairy!P39,\"AAAAAHX2fK0=\")","v":{"$error":"#VALUE!"}},{"$f":"AND(CoolerLabelsDairy!Q39,\"AAAAAHX2fK4=\")","v":{"$error":"#VALUE!"}},{"$f":"AND(CoolerLabelsDairy!R39,\"AAAAAHX2fK8=\")","v":{"$error":"#VALUE!"}},{"$f":"AND(CoolerLabelsDairy!S39,\"AAAAAHX2fLA=\")","v":{"$error":"#VALUE!"}},{"$f":"AND(CoolerLabelsDairy!T39,\"AAAAAHX2fLE=\")","v":{"$error":"#VALUE!"}},{"$f":"AND(CoolerLabelsDairy!U39,\"AAAAAHX2fLI=\")","v":{"$error":"#VALUE!"}},{"$f":"IF(CoolerLabelsDairy!40:40,\"AAAAAHX2fLM=\",0)","v":0},{"$f":"AND(CoolerLabelsDairy!A40,\"AAAAAHX2fLQ=\")","v":{"$error":"#VALUE!"}},{"$f":"AND(CoolerLabelsDairy!B40,\"AAAAAHX2fLU=\")","v":{"$error":"#VALUE!"}},{"$f":"AND(CoolerLabelsDairy!C40,\"AAAAAHX2fLY=\")","v":{"$error":"#VALUE!"}},{"$f":"AND(CoolerLabelsDairy!D40,\"AAAAAHX2fLc=\")","v":{"$error":"#VALUE!"}},{"$f":"AND(CoolerLabelsDairy!E40,\"AAAAAHX2fLg=\")","v":{"$error":"#VALUE!"}},{"$f":"AND(CoolerLabelsDairy!F40,\"AAAAAHX2fLk=\")","v":{"$error":"#VALUE!"}},{"$f":"AND(CoolerLabelsDairy!G40,\"AAAAAHX2fLo=\")","v":{"$error":"#VALUE!"}},{"$f":"AND(CoolerLabelsDairy!H40,\"AAAAAHX2fLs=\")","v":{"$error":"#VALUE!"}},{"$f":"AND(CoolerLabelsDairy!I40,\"AAAAAHX2fLw=\")","v":{"$error":"#VALUE!"}},{"$f":"AND(CoolerLabelsDairy!J40,\"AAAAAHX2fL0=\")","v":{"$error":"#VALUE!"}},{"$f":"AND(CoolerLabelsDairy!K40,\"AAAAAHX2fL4=\")","v":{"$error":"#VALUE!"}},{"$f":"AND(CoolerLabelsDairy!L40,\"AAAAAHX2fL8=\")","v":{"$error":"#VALUE!"}},{"$f":"AND(CoolerLabelsDairy!M40,\"AAAAAHX2fMA=\")","v":{"$error":"#VALUE!"}},{"$f":"AND(CoolerLabelsDairy!N40,\"AAAAAHX2fME=\")","v":{"$error":"#VALUE!"}},{"$f":"AND(CoolerLabelsDairy!O40,\"AAAAAHX2fMI=\")","v":{"$error":"#VALUE!"}},{"$f":"AND(CoolerLabelsDairy!P40,\"AAAAAHX2fMM=\")","v":{"$error":"#VALUE!"}},{"$f":"AND(CoolerLabelsDairy!Q40,\"AAAAAHX2fMQ=\")","v":{"$error":"#VALUE!"}},{"$f":"AND(CoolerLabelsDairy!R40,\"AAAAAHX2fMU=\")","v":{"$error":"#VALUE!"}},{"$f":"AND(CoolerLabelsDairy!S40,\"AAAAAHX2fMY=\")","v":{"$error":"#VALUE!"}},{"$f":"AND(CoolerLabelsDairy!T40,\"AAAAAHX2fMc=\")","v":{"$error":"#VALUE!"}},{"$f":"AND(CoolerLabelsDairy!U40,\"AAAAAHX2fMg=\")","v":{"$error":"#VALUE!"}},{"$f":"IF(CoolerLabelsDairy!41:41,\"AAAAAHX2fMk=\",0)","v":0},{"$f":"AND(CoolerLabelsDairy!A41,\"AAAAAHX2fMo=\")","v":{"$error":"#VALUE!"}},{"$f":"AND(CoolerLabelsDairy!B41,\"AAAAAHX2fMs=\")","v":{"$error":"#VALUE!"}},{"$f":"AND(CoolerLabelsDairy!C41,\"AAAAAHX2fMw=\")","v":{"$error":"#VALUE!"}},{"$f":"AND(CoolerLabelsDairy!D41,\"AAAAAHX2fM0=\")","v":{"$error":"#VALUE!"}},{"$f":"AND(CoolerLabelsDairy!E41,\"AAAAAHX2fM4=\")","v":{"$error":"#VALUE!"}},{"$f":"AND(CoolerLabelsDairy!F41,\"AAAAAHX2fM8=\")","v":{"$error":"#VALUE!"}},{"$f":"AND(CoolerLabelsDairy!G41,\"AAAAAHX2fNA=\")","v":{"$error":"#VALUE!"}},{"$f":"AND(CoolerLabelsDairy!H41,\"AAAAAHX2fNE=\")","v":{"$error":"#VALUE!"}},{"$f":"AND(CoolerLabelsDairy!I41,\"AAAAAHX2fNI=\")","v":{"$error":"#VALUE!"}},{"$f":"AND(CoolerLabelsDairy!J41,\"AAAAAHX2fNM=\")","v":{"$error":"#VALUE!"}},{"$f":"AND(CoolerLabelsDairy!K41,\"AAAAAHX2fNQ=\")","v":{"$error":"#VALUE!"}},{"$f":"AND(CoolerLabelsDairy!L41,\"AAAAAHX2fNU=\")","v":{"$error":"#VALUE!"}},{"$f":"AND(CoolerLabelsDairy!M41,\"AAAAAHX2fNY=\")","v":{"$error":"#VALUE!"}},{"$f":"AND(CoolerLabelsDairy!N41,\"AAAAAHX2fNc=\")","v":{"$error":"#VALUE!"}},{"$f":"AND(CoolerLabelsDairy!O41,\"AAAAAHX2fNg=\")","v":{"$error":"#VALUE!"}},{"$f":"AND(CoolerLabelsDairy!P41,\"AAAAAHX2fNk=\")","v":{"$error":"#VALUE!"}},{"$f":"AND(CoolerLabelsDairy!Q41,\"AAAAAHX2fNo=\")","v":{"$error":"#VALUE!"}},{"$f":"AND(CoolerLabelsDairy!R41,\"AAAAAHX2fNs=\")","v":{"$error":"#VALUE!"}},{"$f":"AND(CoolerLabelsDairy!S41,\"AAAAAHX2fNw=\")","v":{"$error":"#VALUE!"}},{"$f":"AND(CoolerLabelsDairy!T41,\"AAAAAHX2fN0=\")","v":{"$error":"#VALUE!"}},{"$f":"AND(CoolerLabelsDairy!U41,\"AAAAAHX2fN4=\")","v":{"$error":"#VALUE!"}},{"$f":"IF(CoolerLabelsDairy!42:42,\"AAAAAHX2fN8=\",0)","v":0},{"$f":"AND(CoolerLabelsDairy!A42,\"AAAAAHX2fOA=\")","v":{"$error":"#VALUE!"}},{"$f":"AND(CoolerLabelsDairy!B42,\"AAAAAHX2fOE=\")","v":{"$error":"#VALUE!"}},{"$f":"AND(CoolerLabelsDairy!C42,\"AAAAAHX2fOI=\")","v":{"$error":"#VALUE!"}},{"$f":"AND(CoolerLabelsDairy!D42,\"AAAAAHX2fOM=\")","v":{"$error":"#VALUE!"}},{"$f":"AND(CoolerLabelsDairy!E42,\"AAAAAHX2fOQ=\")","v":{"$error":"#VALUE!"}},{"$f":"AND(CoolerLabelsDairy!F42,\"AAAAAHX2fOU=\")","v":{"$error":"#VALUE!"}},{"$f":"AND(CoolerLabelsDairy!G42,\"AAAAAHX2fOY=\")","v":{"$error":"#VALUE!"}},{"$f":"AND(CoolerLabelsDairy!H42,\"AAAAAHX2fOc=\")","v":{"$error":"#VALUE!"}},{"$f":"AND(CoolerLabelsDairy!I42,\"AAAAAHX2fOg=\")","v":{"$error":"#VALUE!"}},{"$f":"AND(CoolerLabelsDairy!J42,\"AAAAAHX2fOk=\")","v":{"$error":"#VALUE!"}},{"$f":"AND(CoolerLabelsDairy!K42,\"AAAAAHX2fOo=\")","v":{"$error":"#VALUE!"}},{"$f":"AND(CoolerLabelsDairy!L42,\"AAAAAHX2fOs=\")","v":{"$error":"#VALUE!"}},{"$f":"AND(CoolerLabelsDairy!M42,\"AAAAAHX2fOw=\")","v":{"$error":"#VALUE!"}},{"$f":"AND(CoolerLabelsDairy!N42,\"AAAAAHX2fO0=\")","v":{"$error":"#VALUE!"}},{"$f":"AND(CoolerLabelsDairy!O42,\"AAAAAHX2fO4=\")","v":{"$error":"#VALUE!"}},{"$f":"AND(CoolerLabelsDairy!P42,\"AAAAAHX2fO8=\")","v":{"$error":"#VALUE!"}},{"$f":"AND(CoolerLabelsDairy!Q42,\"AAAAAHX2fPA=\")","v":{"$error":"#VALUE!"}},{"$f":"AND(CoolerLabelsDairy!R42,\"AAAAAHX2fPE=\")","v":{"$error":"#VALUE!"}},{"$f":"AND(CoolerLabelsDairy!S42,\"AAAAAHX2fPI=\")","v":{"$error":"#VALUE!"}},{"$f":"AND(CoolerLabelsDairy!T42,\"AAAAAHX2fPM=\")","v":{"$error":"#VALUE!"}},{"$f":"AND(CoolerLabelsDairy!U42,\"AAAAAHX2fPQ=\")","v":{"$error":"#VALUE!"}},{"$f":"IF(CoolerLabelsDairy!A:A,\"AAAAAHX2fPU=\",0)","v":0},{"$f":"IF(CoolerLabelsDairy!B:B,\"AAAAAHX2fPY=\",0)","v":0},{"$f":"IF(CoolerLabelsDairy!C:C,\"AAAAAHX2fPc=\",0)","v":0},{"$f":"IF(CoolerLabelsDairy!D:D,\"AAAAAHX2fPg=\",0)","v":0},{"$f":"IF(CoolerLabelsDairy!E:E,\"AAAAAHX2fPk=\",0)","v":0},{"$f":"IF(CoolerLabelsDairy!F:F,\"AAAAAHX2fPo=\",0)","v":0},{"$f":"IF(CoolerLabelsDairy!G:G,\"AAAAAHX2fPs=\",0)","v":0},{"$f":"IF(CoolerLabelsDairy!H:H,\"AAAAAHX2fPw=\",0)","v":0},{"$f":"IF(CoolerLabelsDairy!I:I,\"AAAAAHX2fP0=\",0)","v":0},{"$f":"IF(CoolerLabelsDairy!J:J,\"AAAAAHX2fP4=\",0)","v":0},{"$f":"IF(CoolerLabelsDairy!K:K,\"AAAAAHX2fP8=\",0)","v":0}]
[{"$f":"IF(CoolerLabelsDairy!L:L,\"AAAAAHf3nwA=\",0)","v":0},{"$f":"IF(CoolerLabelsDairy!M:M,\"AAAAAHf3nwE=\",0)","v":0},{"$f":"IF(CoolerLabelsDairy!N:N,\"AAAAAHf3nwI=\",0)","v":0},{"$f":"IF(CoolerLabelsDairy!O:O,\"AAAAAHf3nwM=\",0)","v":0},{"$f":"IF(CoolerLabelsDairy!P:P,\"AAAAAHf3nwQ=\",0)","v":0},{"$f":"IF(CoolerLabelsDairy!Q:Q,\"AAAAAHf3nwU=\",0)","v":0},{"$f":"IF(CoolerLabelsDairy!R:R,\"AAAAAHf3nwY=\",0)","v":0},{"$f":"IF(CoolerLabelsDairy!S:S,\"AAAAAHf3nwc=\",0)","v":0},{"$f":"IF(CoolerLabelsDairy!T:T,\"AAAAAHf3nwg=\",0)","v":0},{"$f":"IF(CoolerLabelsDairy!U:U,\"AAAAAHf3nwk=\",0)","v":0},{"$f":"IF(EventData!1:1,\"AAAAAHf3nwo=\",0)","v":0},{"$f":"AND(EventData!A1,\"AAAAAHf3nws=\")","v":{"$error":"#VALUE!"}},{"$f":"AND(EventData!B1,\"AAAAAHf3nww=\")","v":{"$error":"#VALUE!"}},{"$f":"AND(EventData!C1,\"AAAAAHf3nw0=\")","v":{"$error":"#VALUE!"}},{"$f":"AND(EventData!D1,\"AAAAAHf3nw4=\")","v":{"$error":"#VALUE!"}},{"$f":"AND(EventData!E1,\"AAAAAHf3nw8=\")","v":{"$error":"#VALUE!"}},{"$f":"IF(EventData!2:2,\"AAAAAHf3nxA=\",0)","v":0},{"$f":"AND(EventData!A2,\"AAAAAHf3nxE=\")","v":{"$error":"#VALUE!"}},{"$f":"AND(EventData!B2,\"AAAAAHf3nxI=\")","v":{"$error":"#VALUE!"}},{"$f":"AND(EventData!C2,\"AAAAAHf3nxM=\")","v":{"$error":"#VALUE!"}},{"$f":"AND(EventData!D2,\"AAAAAHf3nxQ=\")","v":{"$error":"#VALUE!"}},{"$f":"AND(EventData!E2,\"AAAAAHf3nxU=\")","v":{"$error":"#VALUE!"}},{"$f":"IF(EventData!3:3,\"AAAAAHf3nxY=\",0)","v":0},{"$f":"AND(EventData!A3,\"AAAAAHf3nxc=\")","v":{"$error":"#VALUE!"}},{"$f":"AND(EventData!B3,\"AAAAAHf3nxg=\")","v":{"$error":"#VALUE!"}},{"$f":"AND(EventData!C3,\"AAAAAHf3nxk=\")","v":{"$error":"#VALUE!"}},{"$f":"AND(EventData!D3,\"AAAAAHf3nxo=\")","v":{"$error":"#VALUE!"}},{"$f":"AND(EventData!E3,\"AAAAAHf3nxs=\")","v":{"$error":"#VALUE!"}},{"$f":"IF(EventData!4:4,\"AAAAAHf3nxw=\",0)","v":0},{"$f":"AND(EventData!A4,\"AAAAAHf3nx0=\")","v":{"$error":"#VALUE!"}},{"$f":"AND(EventData!B4,\"AAAAAHf3nx4=\")","v":{"$error":"#VALUE!"}},{"$f":"AND(EventData!C4,\"AAAAAHf3nx8=\")","v":{"$error":"#VALUE!"}},{"$f":"AND(EventData!D4,\"AAAAAHf3nyA=\")","v":{"$error":"#VALUE!"}},{"$f":"AND(EventData!E4,\"AAAAAHf3nyE=\")","v":{"$error":"#VALUE!"}},{"$f":"IF(EventData!5:5,\"AAAAAHf3nyI=\",0)","v":0},{"$f":"AND(EventData!A5,\"AAAAAHf3nyM=\")","v":{"$error":"#VALUE!"}},{"$f":"AND(EventData!B5,\"AAAAAHf3nyQ=\")","v":{"$error":"#VALUE!"}},{"$f":"AND(EventData!C5,\"AAAAAHf3nyU=\")","v":{"$error":"#VALUE!"}},{"$f":"AND(EventData!D5,\"AAAAAHf3nyY=\")","v":{"$error":"#VALUE!"}},{"$f":"AND(EventData!E5,\"AAAAAHf3nyc=\")","v":{"$error":"#VALUE!"}},{"$f":"IF(EventData!6:6,\"AAAAAHf3nyg=\",0)","v":0},{"$f":"AND(EventData!A6,\"AAAAAHf3nyk=\")","v":{"$error":"#VALUE!"}},{"$f":"AND(EventData!B6,\"AAAAAHf3nyo=\")","v":{"$error":"#VALUE!"}},{"$f":"AND(EventData!C6,\"AAAAAHf3nys=\")","v":{"$error":"#VALUE!"}},{"$f":"AND(EventData!D6,\"AAAAAHf3nyw=\")","v":{"$error":"#VALUE!"}},{"$f":"AND(EventData!E6,\"AAAAAHf3ny0=\")","v":{"$error":"#VALUE!"}},{"$f":"IF(EventData!7:7,\"AAAAAHf3ny4=\",0)","v":0},{"$f":"AND(EventData!A7,\"AAAAAHf3ny8=\")","v":{"$error":"#VALUE!"}},{"$f":"AND(EventData!B7,\"AAAAAHf3nzA=\")","v":{"$error":"#VALUE!"}},{"$f":"AND(EventData!C7,\"AAAAAHf3nzE=\")","v":{"$error":"#VALUE!"}},{"$f":"AND(EventData!D7,\"AAAAAHf3nzI=\")","v":{"$error":"#VALUE!"}},{"$f":"AND(EventData!E7,\"AAAAAHf3nzM=\")","v":{"$error":"#VALUE!"}},{"$f":"IF(EventData!8:8,\"AAAAAHf3nzQ=\",0)","v":0},{"$f":"AND(EventData!A8,\"AAAAAHf3nzU=\")","v":{"$error":"#VALUE!"}},{"$f":"AND(EventData!B8,\"AAAAAHf3nzY=\")","v":{"$error":"#VALUE!"}},{"$f":"AND(EventData!C8,\"AAAAAHf3nzc=\")","v":{"$error":"#VALUE!"}},{"$f":"AND(EventData!D8,\"AAAAAHf3nzg=\")","v":{"$error":"#VALUE!"}},{"$f":"AND(EventData!E8,\"AAAAAHf3nzk=\")","v":{"$error":"#VALUE!"}},{"$f":"IF(EventData!9:9,\"AAAAAHf3nzo=\",0)","v":0},{"$f":"AND(EventData!A9,\"AAAAAHf3nzs=\")","v":{"$error":"#VALUE!"}},{"$f":"AND(EventData!B9,\"AAAAAHf3nzw=\")","v":{"$error":"#VALUE!"}},{"$f":"AND(EventData!C9,\"AAAAAHf3nz0=\")","v":{"$error":"#VALUE!"}},{"$f":"AND(EventData!D9,\"AAAAAHf3nz4=\")","v":{"$error":"#VALUE!"}},{"$f":"AND(EventData!E9,\"AAAAAHf3nz8=\")","v":{"$error":"#VALUE!"}},{"$f":"IF(EventData!10:10,\"AAAAAHf3n0A=\",0)","v":0},{"$f":"AND(EventData!A10,\"AAAAAHf3n0E=\")","v":{"$error":"#VALUE!"}},{"$f":"AND(EventData!B10,\"AAAAAHf3n0I=\")","v":{"$error":"#VALUE!"}},{"$f":"AND(EventData!C10,\"AAAAAHf3n0M=\")","v":{"$error":"#VALUE!"}},{"$f":"AND(EventData!D10,\"AAAAAHf3n0Q=\")","v":{"$error":"#VALUE!"}},{"$f":"AND(EventData!E10,\"AAAAAHf3n0U=\")","v":{"$error":"#VALUE!"}},{"$f":"IF(EventData!11:11,\"AAAAAHf3n0Y=\",0)","v":0},{"$f":"AND(EventData!A11,\"AAAAAHf3n0c=\")","v":{"$error":"#VALUE!"}},{"$f":"AND(EventData!B11,\"AAAAAHf3n0g=\")","v":{"$error":"#VALUE!"}},{"$f":"AND(EventData!C11,\"AAAAAHf3n0k=\")","v":{"$error":"#VALUE!"}},{"$f":"AND(EventData!D11,\"AAAAAHf3n0o=\")","v":{"$error":"#VALUE!"}},{"$f":"AND(EventData!E11,\"AAAAAHf3n0s=\")","v":{"$error":"#VALUE!"}},{"$f":"IF(EventData!12:12,\"AAAAAHf3n0w=\",0)","v":0},{"$f":"AND(EventData!A12,\"AAAAAHf3n00=\")","v":{"$error":"#VALUE!"}},{"$f":"AND(EventData!B12,\"AAAAAHf3n04=\")","v":{"$error":"#VALUE!"}},{"$f":"AND(EventData!C12,\"AAAAAHf3n08=\")","v":{"$error":"#VALUE!"}},{"$f":"AND(EventData!D12,\"AAAAAHf3n1A=\")","v":{"$error":"#VALUE!"}},{"$f":"AND(EventData!E12,\"AAAAAHf3n1E=\")","v":{"$error":"#VALUE!"}},{"$f":"IF(EventData!13:13,\"AAAAAHf3n1I=\",0)","v":0},{"$f":"AND(EventData!A13,\"AAAAAHf3n1M=\")","v":{"$error":"#VALUE!"}},{"$f":"AND(EventData!B13,\"AAAAAHf3n1Q=\")","v":{"$error":"#VALUE!"}},{"$f":"AND(EventData!C13,\"AAAAAHf3n1U=\")","v":{"$error":"#VALUE!"}},{"$f":"AND(EventData!D13,\"AAAAAHf3n1Y=\")","v":{"$error":"#VALUE!"}},{"$f":"AND(EventData!E13,\"AAAAAHf3n1c=\")","v":{"$error":"#VALUE!"}},{"$f":"IF(EventData!14:14,\"AAAAAHf3n1g=\",0)","v":0},{"$f":"AND(EventData!A14,\"AAAAAHf3n1k=\")","v":{"$error":"#VALUE!"}},{"$f":"AND(EventData!B14,\"AAAAAHf3n1o=\")","v":{"$error":"#VALUE!"}},{"$f":"AND(EventData!C14,\"AAAAAHf3n1s=\")","v":{"$error":"#VALUE!"}},{"$f":"AND(EventData!D14,\"AAAAAHf3n1w=\")","v":{"$error":"#VALUE!"}},{"$f":"AND(EventData!E14,\"AAAAAHf3n10=\")","v":{"$error":"#VALUE!"}},{"$f":"IF(EventData!15:15,\"AAAAAHf3n14=\",0)","v":0},{"$f":"AND(EventData!A15,\"AAAAAHf3n18=\")","v":{"$error":"#VALUE!"}},{"$f":"AND(EventData!B15,\"AAAAAHf3n2A=\")","v":{"$error":"#VALUE!"}},{"$f":"AND(EventData!C15,\"AAAAAHf3n2E=\")","v":{"$error":"#VALUE!"}},{"$f":"AND(EventData!D15,\"AAAAAHf3n2I=\")","v":{"$error":"#VALUE!"}},{"$f":"AND(EventData!E15,\"AAAAAHf3n2M=\")","v":{"$error":"#VALUE!"}},{"$f":"IF(EventData!16:16,\"AAAAAHf3n2Q=\",0)","v":0},{"$f":"AND(EventData!A16,\"AAAAAHf3n2U=\")","v":{"$error":"#VALUE!"}},{"$f":"AND(EventData!B16,\"AAAAAHf3n2Y=\")","v":{"$error":"#VALUE!"}},{"$f":"AND(EventData!C16,\"AAAAAHf3n2c=\")","v":{"$error":"#VALUE!"}},{"$f":"AND(EventData!D16,\"AAAAAHf3n2g=\")","v":{"$error":"#VALUE!"}},{"$f":"AND(EventData!E16,\"AAAAAHf3n2k=\")","v":{"$error":"#VALUE!"}},{"$f":"IF(EventData!17:17,\"AAAAAHf3n2o=\",0)","v":0},{"$f":"AND(EventData!A17,\"AAAAAHf3n2s=\")","v":{"$error":"#VALUE!"}},{"$f":"AND(EventData!B17,\"AAAAAHf3n2w=\")","v":{"$error":"#VALUE!"}},{"$f":"AND(EventData!C17,\"AAAAAHf3n20=\")","v":{"$error":"#VALUE!"}},{"$f":"AND(EventData!D17,\"AAAAAHf3n24=\")","v":{"$error":"#VALUE!"}},{"$f":"AND(EventData!E17,\"AAAAAHf3n28=\")","v":{"$error":"#VALUE!"}},{"$f":"IF(EventData!18:18,\"AAAAAHf3n3A=\",0)","v":0},{"$f":"AND(EventData!A18,\"AAAAAHf3n3E=\")","v":{"$error":"#VALUE!"}},{"$f":"AND(EventData!B18,\"AAAAAHf3n3I=\")","v":{"$error":"#VALUE!"}},{"$f":"AND(EventData!C18,\"AAAAAHf3n3M=\")","v":{"$error":"#VALUE!"}},{"$f":"AND(EventData!D18,\"AAAAAHf3n3Q=\")","v":{"$error":"#VALUE!"}},{"$f":"AND(EventData!E18,\"AAAAAHf3n3U=\")","v":{"$error":"#VALUE!"}},{"$f":"IF(EventData!19:19,\"AAAAAHf3n3Y=\",0)","v":0},{"$f":"AND(EventData!A19,\"AAAAAHf3n3c=\")","v":{"$error":"#VALUE!"}},{"$f":"AND(EventData!B19,\"AAAAAHf3n3g=\")","v":{"$error":"#VALUE!"}},{"$f":"AND(EventData!C19,\"AAAAAHf3n3k=\")","v":{"$error":"#VALUE!"}},{"$f":"AND(EventData!D19,\"AAAAAHf3n3o=\")","v":{"$error":"#VALUE!"}},{"$f":"AND(EventData!E19,\"AAAAAHf3n3s=\")","v":{"$error":"#VALUE!"}},{"$f":"IF(EventData!20:20,\"AAAAAHf3n3w=\",0)","v":0},{"$f":"AND(EventData!A20,\"AAAAAHf3n30=\")","v":{"$error":"#VALUE!"}},{"$f":"AND(EventData!B20,\"AAAAAHf3n34=\")","v":{"$error":"#VALUE!"}},{"$f":"AND(EventData!C20,\"AAAAAHf3n38=\")","v":{"$error":"#VALUE!"}},{"$f":"AND(EventData!D20,\"AAAAAHf3n4A=\")","v":{"$error":"#VALUE!"}},{"$f":"AND(EventData!E20,\"AAAAAHf3n4E=\")","v":{"$error":"#VALUE!"}},{"$f":"IF(EventData!21:21,\"AAAAAHf3n4I=\",0)","v":0},{"$f":"AND(EventData!A21,\"AAAAAHf3n4M=\")","v":{"$error":"#VALUE!"}},{"$f":"AND(EventData!B21,\"AAAAAHf3n4Q=\")","v":{"$error":"#VALUE!"}},{"$f":"AND(EventData!C21,\"AAAAAHf3n4U=\")","v":{"$error":"#VALUE!"}},{"$f":"AND(EventData!D21,\"AAAAAHf3n4Y=\")","v":{"$error":"#VALUE!"}},{"$f":"AND(EventData!E21,\"AAAAAHf3n4c=\")","v":{"$error":"#VALUE!"}},{"$f":"IF(EventData!22:22,\"AAAAAHf3n4g=\",0)","v":0},{"$f":"AND(EventData!A22,\"AAAAAHf3n4k=\")","v":{"$error":"#VALUE!"}},{"$f":"AND(EventData!B22,\"AAAAAHf3n4o=\")","v":{"$error":"#VALUE!"}},{"$f":"AND(EventData!C22,\"AAAAAHf3n4s=\")","v":{"$error":"#VALUE!"}},{"$f":"AND(EventData!D22,\"AAAAAHf3n4w=\")","v":{"$error":"#VALUE!"}},{"$f":"AND(EventData!E22,\"AAAAAHf3n40=\")","v":{"$error":"#VALUE!"}},{"$f":"IF(EventData!23:23,\"AAAAAHf3n44=\",0)","v":0},{"$f":"AND(EventData!A23,\"AAAAAHf3n48=\")","v":{"$error":"#VALUE!"}},{"$f":"AND(EventData!B23,\"AAAAAHf3n5A=\")","v":{"$error":"#VALUE!"}},{"$f":"AND(EventData!C23,\"AAAAAHf3n5E=\")","v":{"$error":"#VALUE!"}},{"$f":"AND(EventData!D23,\"AAAAAHf3n5I=\")","v":{"$error":"#VALUE!"}},{"$f":"AND(EventData!E23,\"AAAAAHf3n5M=\")","v":{"$error":"#VALUE!"}},{"$f":"IF(EventData!24:24,\"AAAAAHf3n5Q=\",0)","v":0},{"$f":"AND(EventData!A24,\"AAAAAHf3n5U=\")","v":{"$error":"#VALUE!"}},{"$f":"AND(EventData!B24,\"AAAAAHf3n5Y=\")","v":{"$error":"#VALUE!"}},{"$f":"AND(EventData!C24,\"AAAAAHf3n5c=\")","v":{"$error":"#VALUE!"}},{"$f":"AND(EventData!D24,\"AAAAAHf3n5g=\")","v":{"$error":"#VALUE!"}},{"$f":"AND(EventData!E24,\"AAAAAHf3n5k=\")","v":{"$error":"#VALUE!"}},{"$f":"IF(EventData!25:25,\"AAAAAHf3n5o=\",0)","v":0},{"$f":"AND(EventData!A25,\"AAAAAHf3n5s=\")","v":{"$error":"#VALUE!"}},{"$f":"AND(EventData!B25,\"AAAAAHf3n5w=\")","v":{"$error":"#VALUE!"}},{"$f":"AND(EventData!C25,\"AAAAAHf3n50=\")","v":{"$error":"#VALUE!"}},{"$f":"AND(EventData!D25,\"AAAAAHf3n54=\")","v":{"$error":"#VALUE!"}},{"$f":"AND(EventData!E25,\"AAAAAHf3n58=\")","v":{"$error":"#VALUE!"}},{"$f":"IF(EventData!26:26,\"AAAAAHf3n6A=\",0)","v":0},{"$f":"AND(EventData!A26,\"AAAAAHf3n6E=\")","v":{"$error":"#VALUE!"}},{"$f":"AND(EventData!B26,\"AAAAAHf3n6I=\")","v":{"$error":"#VALUE!"}},{"$f":"AND(EventData!C26,\"AAAAAHf3n6M=\")","v":{"$error":"#VALUE!"}},{"$f":"AND(EventData!D26,\"AAAAAHf3n6Q=\")","v":{"$error":"#VALUE!"}},{"$f":"AND(EventData!E26,\"AAAAAHf3n6U=\")","v":{"$error":"#VALUE!"}},{"$f":"IF(EventData!27:27,\"AAAAAHf3n6Y=\",0)","v":0},{"$f":"AND(EventData!A27,\"AAAAAHf3n6c=\")","v":{"$error":"#VALUE!"}},{"$f":"AND(EventData!B27,\"AAAAAHf3n6g=\")","v":{"$error":"#VALUE!"}},{"$f":"AND(EventData!C27,\"AAAAAHf3n6k=\")","v":{"$error":"#VALUE!"}},{"$f":"AND(EventData!D27,\"AAAAAHf3n6o=\")","v":{"$error":"#VALUE!"}},{"$f":"AND(EventData!E27,\"AAAAAHf3n6s=\")","v":{"$error":"#VALUE!"}},{"$f":"IF(EventData!28:28,\"AAAAAHf3n6w=\",0)","v":0},{"$f":"AND(EventData!A28,\"AAAAAHf3n60=\")","v":{"$error":"#VALUE!"}},{"$f":"AND(EventData!B28,\"AAAAAHf3n64=\")","v":{"$error":"#VALUE!"}},{"$f":"AND(EventData!C28,\"AAAAAHf3n68=\")","v":{"$error":"#VALUE!"}},{"$f":"AND(EventData!D28,\"AAAAAHf3n7A=\")","v":{"$error":"#VALUE!"}},{"$f":"AND(EventData!E28,\"AAAAAHf3n7E=\")","v":{"$error":"#VALUE!"}},{"$f":"IF(EventData!29:29,\"AAAAAHf3n7I=\",0)","v":0},{"$f":"AND(EventData!A29,\"AAAAAHf3n7M=\")","v":{"$error":"#VALUE!"}},{"$f":"AND(EventData!B29,\"AAAAAHf3n7Q=\")","v":{"$error":"#VALUE!"}},{"$f":"AND(EventData!C29,\"AAAAAHf3n7U=\")","v":{"$error":"#VALUE!"}},{"$f":"AND(EventData!D29,\"AAAAAHf3n7Y=\")","v":{"$error":"#VALUE!"}},{"$f":"AND(EventData!E29,\"AAAAAHf3n7c=\")","v":{"$error":"#VALUE!"}},{"$f":"IF(EventData!30:30,\"AAAAAHf3n7g=\",0)","v":0},{"$f":"AND(EventData!A30,\"AAAAAHf3n7k=\")","v":{"$error":"#VALUE!"}},{"$f":"AND(EventData!B30,\"AAAAAHf3n7o=\")","v":{"$error":"#VALUE!"}},{"$f":"AND(EventData!C30,\"AAAAAHf3n7s=\")","v":{"$error":"#VALUE!"}},{"$f":"AND(EventData!D30,\"AAAAAHf3n7w=\")","v":{"$error":"#VALUE!"}},{"$f":"AND(EventData!E30,\"AAAAAHf3n70=\")","v":{"$error":"#VALUE!"}},{"$f":"IF(EventData!31:31,\"AAAAAHf3n74=\",0)","v":0},{"$f":"AND(EventData!A31,\"AAAAAHf3n78=\")","v":{"$error":"#VALUE!"}},{"$f":"AND(EventData!B31,\"AAAAAHf3n8A=\")","v":{"$error":"#VALUE!"}},{"$f":"AND(EventData!C31,\"AAAAAHf3n8E=\")","v":{"$error":"#VALUE!"}},{"$f":"AND(EventData!D31,\"AAAAAHf3n8I=\")","v":{"$error":"#VALUE!"}},{"$f":"AND(EventData!E31,\"AAAAAHf3n8M=\")","v":{"$error":"#VALUE!"}},{"$f":"IF(EventData!32:32,\"AAAAAHf3n8Q=\",0)","v":0},{"$f":"AND(EventData!A32,\"AAAAAHf3n8U=\")","v":{"$error":"#VALUE!"}},{"$f":"AND(EventData!B32,\"AAAAAHf3n8Y=\")","v":{"$error":"#VALUE!"}},{"$f":"AND(EventData!C32,\"AAAAAHf3n8c=\")","v":{"$error":"#VALUE!"}},{"$f":"AND(EventData!D32,\"AAAAAHf3n8g=\")","v":{"$error":"#VALUE!"}},{"$f":"AND(EventData!E32,\"AAAAAHf3n8k=\")","v":{"$error":"#VALUE!"}},{"$f":"IF(EventData!33:33,\"AAAAAHf3n8o=\",0)","v":0},{"$f":"AND(EventData!A33,\"AAAAAHf3n8s=\")","v":{"$error":"#VALUE!"}},{"$f":"AND(EventData!B33,\"AAAAAHf3n8w=\")","v":{"$error":"#VALUE!"}},{"$f":"AND(EventData!C33,\"AAAAAHf3n80=\")","v":{"$error":"#VALUE!"}},{"$f":"AND(EventData!D33,\"AAAAAHf3n84=\")","v":{"$error":"#VALUE!"}},{"$f":"AND(EventData!E33,\"AAAAAHf3n88=\")","v":{"$error":"#VALUE!"}},{"$f":"IF(EventData!34:34,\"AAAAAHf3n9A=\",0)","v":0},{"$f":"AND(EventData!A34,\"AAAAAHf3n9E=\")","v":{"$error":"#VALUE!"}},{"$f":"AND(EventData!B34,\"AAAAAHf3n9I=\")","v":{"$error":"#VALUE!"}},{"$f":"AND(EventData!C34,\"AAAAAHf3n9M=\")","v":{"$error":"#VALUE!"}},{"$f":"AND(EventData!D34,\"AAAAAHf3n9Q=\")","v":{"$error":"#VALUE!"}},{"$f":"AND(EventData!E34,\"AAAAAHf3n9U=\")","v":{"$error":"#VALUE!"}},{"$f":"IF(EventData!35:35,\"AAAAAHf3n9Y=\",0)","v":0},{"$f":"AND(EventData!A35,\"AAAAAHf3n9c=\")","v":{"$error":"#VALUE!"}},{"$f":"AND(EventData!B35,\"AAAAAHf3n9g=\")","v":{"$error":"#VALUE!"}},{"$f":"AND(EventData!C35,\"AAAAAHf3n9k=\")","v":{"$error":"#VALUE!"}},{"$f":"AND(EventData!D35,\"AAAAAHf3n9o=\")","v":{"$error":"#VALUE!"}},{"$f":"AND(EventData!E35,\"AAAAAHf3n9s=\")","v":{"$error":"#VALUE!"}},{"$f":"IF(EventData!36:36,\"AAAAAHf3n9w=\",0)","v":0},{"$f":"AND(EventData!A36,\"AAAAAHf3n90=\")","v":{"$error":"#VALUE!"}},{"$f":"AND(EventData!B36,\"AAAAAHf3n94=\")","v":{"$error":"#VALUE!"}},{"$f":"AND(EventData!C36,\"AAAAAHf3n98=\")","v":{"$error":"#VALUE!"}},{"$f":"AND(EventData!D36,\"AAAAAHf3n+A=\")","v":{"$error":"#VALUE!"}},{"$f":"AND(EventData!E36,\"AAAAAHf3n+E=\")","v":{"$error":"#VALUE!"}},{"$f":"IF(EventData!37:37,\"AAAAAHf3n+I=\",0)","v":0},{"$f":"AND(EventData!A37,\"AAAAAHf3n+M=\")","v":{"$error":"#VALUE!"}},{"$f":"AND(EventData!B37,\"AAAAAHf3n+Q=\")","v":{"$error":"#VALUE!"}},{"$f":"AND(EventData!C37,\"AAAAAHf3n+U=\")","v":{"$error":"#VALUE!"}},{"$f":"AND(EventData!D37,\"AAAAAHf3n+Y=\")","v":{"$error":"#VALUE!"}},{"$f":"AND(EventData!E37,\"AAAAAHf3n+c=\")","v":{"$error":"#VALUE!"}},{"$f":"IF(EventData!38:38,\"AAAAAHf3n+g=\",0)","v":0},{"$f":"AND(EventData!A38,\"AAAAAHf3n+k=\")","v":{"$error":"#VALUE!"}},{"$f":"AND(EventData!B38,\"AAAAAHf3n+o=\")","v":{"$error":"#VALUE!"}},{"$f":"AND(EventData!C38,\"AAAAAHf3n+s=\")","v":{"$error":"#VALUE!"}},{"$f":"AND(EventData!D38,\"AAAAAHf3n+w=\")","v":{"$error":"#VALUE!"}},{"$f":"AND(EventData!E38,\"AAAAAHf3n+0=\")","v":{"$error":"#VALUE!"}},{"$f":"IF(EventData!A:A,\"AAAAAHf3n+4=\",0)","v":{"$error":"#VALUE!"}},{"$f":"IF(EventData!B:B,\"AAAAAHf3n+8=\",0)","v":{"$error":"#VALUE!"}},{"$f":"IF(EventData!C:C,\"AAAAAHf3n/A=\",0)","v":{"$error":"#VALUE!"}},{"$f":"IF(EventData!D:D,\"AAAAAHf3n/E=\",0)","v":{"$error":"#VALUE!"}},{"$f":"IF(EventData!E:E,\"AAAAAHf3n/I=\",0)","v":{"$error":"#VALUE!"}},{"$f":"IF(EventData!F:F,\"AAAAAHf3n/M=\",0)","v":0},{"$f":"IF(EventData!G:G,\"AAAAAHf3n/Q=\",0)","v":0},{"$f":"IF(EventData!H:H,\"AAAAAHf3n/U=\",0)","v":0},{"$f":"IF(EventData!I:I,\"AAAAAHf3n/Y=\",0)","v":0},{"$f":"IF(EventData!J:J,\"AAAAAHf3n/c=\",0)","v":0},{"$f":"IF(EventData!K:K,\"AAAAAHf3n/g=\",0)","v":0},{"$f":"IF(EventData!L:L,\"AAAAAHf3n/k=\",0)","v":0},{"$f":"IF(EventData!M:M,\"AAAAAHf3n/o=\",0)","v":0},{"$f":"IF(EventData!N:N,\"AAAAAHf3n/s=\",0)","v":0},{"$f":"IF(EventData!O:O,\"AAAAAHf3n/w=\",0)","v":0},{"$f":"IF(EventData!P:P,\"AAAAAHf3n/0=\",0)","v":0},{"$f":"IF(EventData!Q:Q,\"AAAAAHf3n/4=\",0)","v":0},{"$f":"IF(EventData!R:R,\"AAAAAHf3n/8=\",0)","v":0}]
[{"$f":"IF(EventData!S:S,\"AAAAAH+f2wA=\",0)","v":0},{"$f":"IF(EventData!T:T,\"AAAAAH+f2wE=\",0)","v":0},{"$f":"IF(EventData!U:U,\"AAAAAH+f2wI=\",0)","v":0},{"$f":"IF(EventData!V:V,\"AAAAAH+f2wM=\",0)","v":0},{"$f":"IF(EventData!W:W,\"AAAAAH+f2wQ=\",0)","v":0},{"$f":"IF(EventData!X:X,\"AAAAAH+f2wU=\",0)","v":0},{"$f":"IF(EventData!Y:Y,\"AAAAAH+f2wY=\",0)","v":0},{"$f":"IF(EventData!Z:Z,\"AAAAAH+f2wc=\",0)","v":0},{"$f":"IF(EventData!AA:AA,\"AAAAAH+f2wg=\",0)","v":0},{"$f":"IF(EventData!AB:AB,\"AAAAAH+f2wk=\",0)","v":0},{"$f":"IF(EventData!AC:AC,\"AAAAAH+f2wo=\",0)","v":0},{"$f":"IF(EventData!AD:AD,\"AAAAAH+f2ws=\",0)","v":0},{"$f":"IF(EventData!AE:AE,\"AAAAAH+f2ww=\",0)","v":0},{"$f":"IF(EventData!AF:AF,\"AAAAAH+f2w0=\",0)","v":0},{"$f":"IF(EventData!AG:AG,\"AAAAAH+f2w4=\",0)","v":0},{"$f":"IF(EventData!AH:AH,\"AAAAAH+f2w8=\",0)","v":0},{"$f":"IF(EventData!AI:AI,\"AAAAAH+f2xA=\",0)","v":0},{"$f":"IF(EventData!AJ:AJ,\"AAAAAH+f2xE=\",0)","v":0},{"$f":"IF(EventData!AK:AK,\"AAAAAH+f2xI=\",0)","v":0},{"$f":"IF(EventData!AL:AL,\"AAAAAH+f2xM=\",0)","v":0},{"$f":"IF(EventData!AM:AM,\"AAAAAH+f2xQ=\",0)","v":0},{"$f":"IF(EventData!AN:AN,\"AAAAAH+f2xU=\",0)","v":0},{"$f":"IF(EventData!AO:AO,\"AAAAAH+f2xY=\",0)","v":0},{"$f":"IF(EventData!AP:AP,\"AAAAAH+f2xc=\",0)","v":0},{"$f":"IF(EventData!AQ:AQ,\"AAAAAH+f2xg=\",0)","v":0},{"$f":"IF(EventData!AR:AR,\"AAAAAH+f2xk=\",0)","v":0},{"$f":"IF(EventData!AS:AS,\"AAAAAH+f2xo=\",0)","v":0},{"$f":"IF(DataSheet!1:1,\"AAAAAH+f2xs=\",0)","v":0},{"$f":"AND(DataSheet!A1,\"AAAAAH+f2xw=\")","v":{"$error":"#VALUE!"}},{"$f":"AND(DataSheet!B1,\"AAAAAH+f2x0=\")","v":{"$error":"#VALUE!"}},{"$f":"AND(DataSheet!C1,\"AAAAAH+f2x4=\")","v":{"$error":"#VALUE!"}},{"$f":"AND(DataSheet!D1,\"AAAAAH+f2x8=\")","v":{"$error":"#VALUE!"}},{"$f":"AND(DataSheet!E1,\"AAAAAH+f2yA=\")","v":{"$error":"#VALUE!"}},{"$f":"AND(DataSheet!F1,\"AAAAAH+f2yE=\")","v":{"$error":"#VALUE!"}},{"$f":"AND(DataSheet!G1,\"AAAAAH+f2yI=\")","v":{"$error":"#VALUE!"}},{"$f":"AND(DataSheet!H1,\"AAAAAH+f2yM=\")","v":{"$error":"#VALUE!"}},{"$f":"IF(DataSheet!2:2,\"AAAAAH+f2yQ=\",0)","v":0},{"$f":"AND(DataSheet!A2,\"AAAAAH+f2yU=\")","v":{"$error":"#VALUE!"}},{"$f":"AND(DataSheet!B2,\"AAAAAH+f2yY=\")","v":{"$error":"#VALUE!"}},{"$f":"AND(DataSheet!C2,\"AAAAAH+f2yc=\")","v":{"$error":"#VALUE!"}},{"$f":"AND(DataSheet!D2,\"AAAAAH+f2yg=\")","v":{"$error":"#VALUE!"}},{"$f":"AND(DataSheet!E2,\"AAAAAH+f2yk=\")","v":{"$error":"#VALUE!"}},{"$f":"AND(DataSheet!F2,\"AAAAAH+f2yo=\")","v":{"$error":"#VALUE!"}},{"$f":"AND(DataSheet!G2,\"AAAAAH+f2ys=\")","v":{"$error":"#VALUE!"}},{"$f":"AND(DataSheet!H2,\"AAAAAH+f2yw=\")","v":{"$error":"#VALUE!"}},{"$f":"IF(DataSheet!3:3,\"AAAAAH+f2y0=\",0)","v":0},{"$f":"AND(DataSheet!A3,\"AAAAAH+f2y4=\")","v":{"$error":"#VALUE!"}},{"$f":"AND(DataSheet!B3,\"AAAAAH+f2y8=\")","v":{"$error":"#VALUE!"}},{"$f":"AND(DataSheet!C3,\"AAAAAH+f2zA=\")","v":{"$error":"#VALUE!"}},{"$f":"AND(DataSheet!D3,\"AAAAAH+f2zE=\")","v":{"$error":"#VALUE!"}},{"$f":"AND(DataSheet!E3,\"AAAAAH+f2zI=\")","v":{"$error":"#VALUE!"}},{"$f":"AND(DataSheet!F3,\"AAAAAH+f2zM=\")","v":{"$error":"#VALUE!"}},{"$f":"AND(DataSheet!G3,\"AAAAAH+f2zQ=\")","v":{"$error":"#VALUE!"}},{"$f":"AND(DataSheet!H3,\"AAAAAH+f2zU=\")","v":{"$error":"#VALUE!"}},{"$f":"IF(DataSheet!4:4,\"AAAAAH+f2zY=\",0)","v":0},{"$f":"AND(DataSheet!A4,\"AAAAAH+f2zc=\")","v":{"$error":"#VALUE!"}},{"$f":"AND(DataSheet!B4,\"AAAAAH+f2zg=\")","v":{"$error":"#VALUE!"}},{"$f":"AND(DataSheet!C4,\"AAAAAH+f2zk=\")","v":{"$error":"#VALUE!"}},{"$f":"AND(DataSheet!D4,\"AAAAAH+f2zo=\")","v":{"$error":"#VALUE!"}},{"$f":"AND(DataSheet!E4,\"AAAAAH+f2zs=\")","v":{"$error":"#VALUE!"}},{"$f":"AND(DataSheet!F4,\"AAAAAH+f2zw=\")","v":{"$error":"#VALUE!"}},{"$f":"AND(DataSheet!G4,\"AAAAAH+f2z0=\")","v":{"$error":"#VALUE!"}},{"$f":"AND(DataSheet!H4,\"AAAAAH+f2z4=\")","v":{"$error":"#VALUE!"}},{"$f":"IF(DataSheet!5:5,\"AAAAAH+f2z8=\",0)","v":0},{"$f":"AND(DataSheet!A5,\"AAAAAH+f20A=\")","v":{"$error":"#VALUE!"}},{"$f":"AND(DataSheet!B5,\"AAAAAH+f20E=\")","v":{"$error":"#VALUE!"}},{"$f":"AND(DataSheet!C5,\"AAAAAH+f20I=\")","v":{"$error":"#VALUE!"}},{"$f":"AND(DataSheet!D5,\"AAAAAH+f20M=\")","v":{"$error":"#VALUE!"}},{"$f":"AND(DataSheet!E5,\"AAAAAH+f20Q=\")","v":{"$error":"#VALUE!"}},{"$f":"AND(DataSheet!F5,\"AAAAAH+f20U=\")","v":{"$error":"#VALUE!"}},{"$f":"AND(DataSheet!G5,\"AAAAAH+f20Y=\")","v":{"$error":"#VALUE!"}},{"$f":"AND(DataSheet!H5,\"AAAAAH+f20c=\")","v":{"$error":"#VALUE!"}},{"$f":"IF(DataSheet!6:6,\"AAAAAH+f20g=\",0)","v":0},{"$f":"AND(DataSheet!A6,\"AAAAAH+f20k=\")","v":{"$error":"#VALUE!"}},{"$f":"AND(DataSheet!B6,\"AAAAAH+f20o=\")","v":{"$error":"#VALUE!"}},{"$f":"AND(DataSheet!C6,\"AAAAAH+f20s=\")","v":{"$error":"#VALUE!"}},{"$f":"AND(DataSheet!D6,\"AAAAAH+f20w=\")","v":{"$error":"#VALUE!"}},{"$f":"AND(DataSheet!E6,\"AAAAAH+f200=\")","v":{"$error":"#VALUE!"}},{"$f":"AND(DataSheet!F6,\"AAAAAH+f204=\")","v":{"$error":"#VALUE!"}},{"$f":"AND(DataSheet!G6,\"AAAAAH+f208=\")","v":{"$error":"#VALUE!"}},{"$f":"AND(DataSheet!H6,\"AAAAAH+f21A=\")","v":{"$error":"#VALUE!"}},{"$f":"IF(DataSheet!7:7,\"AAAAAH+f21E=\",0)","v":0},{"$f":"AND(DataSheet!A7,\"AAAAAH+f21I=\")","v":{"$error":"#VALUE!"}},{"$f":"AND(DataSheet!B7,\"AAAAAH+f21M=\")","v":{"$error":"#VALUE!"}},{"$f":"AND(DataSheet!C7,\"AAAAAH+f21Q=\")","v":{"$error":"#VALUE!"}},{"$f":"AND(DataSheet!D7,\"AAAAAH+f21U=\")","v":{"$error":"#VALUE!"}},{"$f":"AND(DataSheet!E7,\"AAAAAH+f21Y=\")","v":{"$error":"#VALUE!"}},{"$f":"AND(DataSheet!F7,\"AAAAAH+f21c=\")","v":{"$error":"#VALUE!"}},{"$f":"AND(DataSheet!G7,\"AAAAAH+f21g=\")","v":{"$error":"#VALUE!"}},{"$f":"AND(DataSheet!H7,\"AAAAAH+f21k=\")","v":{"$error":"#VALUE!"}},{"$f":"IF(DataSheet!8:8,\"AAAAAH+f21o=\",0)","v":0},{"$f":"AND(DataSheet!A8,\"AAAAAH+f21s=\")","v":{"$error":"#VALUE!"}},{"$f":"AND(DataSheet!B8,\"AAAAAH+f21w=\")","v":{"$error":"#VALUE!"}},{"$f":"AND(DataSheet!C8,\"AAAAAH+f210=\")","v":{"$error":"#VALUE!"}},{"$f":"AND(DataSheet!D8,\"AAAAAH+f214=\")","v":{"$error":"#VALUE!"}},{"$f":"AND(DataSheet!E8,\"AAAAAH+f218=\")","v":{"$error":"#VALUE!"}},{"$f":"AND(DataSheet!F8,\"AAAAAH+f22A=\")","v":{"$error":"#VALUE!"}},{"$f":"AND(DataSheet!G8,\"AAAAAH+f22E=\")","v":{"$error":"#VALUE!"}},{"$f":"AND(DataSheet!H8,\"AAAAAH+f22I=\")","v":{"$error":"#VALUE!"}},{"$f":"IF(DataSheet!9:9,\"AAAAAH+f22M=\",0)","v":0},{"$f":"AND(DataSheet!A9,\"AAAAAH+f22Q=\")","v":{"$error":"#VALUE!"}},{"$f":"AND(DataSheet!B9,\"AAAAAH+f22U=\")","v":{"$error":"#VALUE!"}},{"$f":"AND(DataSheet!C9,\"AAAAAH+f22Y=\")","v":{"$error":"#VALUE!"}},{"$f":"AND(DataSheet!D9,\"AAAAAH+f22c=\")","v":{"$error":"#VALUE!"}},{"$f":"AND(DataSheet!E9,\"AAAAAH+f22g=\")","v":{"$error":"#VALUE!"}},{"$f":"AND(DataSheet!F9,\"AAAAAH+f22k=\")","v":{"$error":"#VALUE!"}},{"$f":"AND(DataSheet!G9,\"AAAAAH+f22o=\")","v":{"$error":"#VALUE!"}},{"$f":"AND(DataSheet!H9,\"AAAAAH+f22s=\")","v":{"$error":"#VALUE!"}},{"$f":"IF(DataSheet!10:10,\"AAAAAH+f22w=\",0)","v":0},{"$f":"AND(DataSheet!A10,\"AAAAAH+f220=\")","v":{"$error":"#VALUE!"}},{"$f":"AND(DataSheet!B10,\"AAAAAH+f224=\")","v":{"$error":"#VALUE!"}},{"$f":"AND(DataSheet!C10,\"AAAAAH+f228=\")","v":{"$error":"#VALUE!"}},{"$f":"AND(DataSheet!D10,\"AAAAAH+f23A=\")","v":{"$error":"#VALUE!"}},{"$f":"AND(DataSheet!E10,\"AAAAAH+f23E=\")","v":{"$error":"#VALUE!"}},{"$f":"AND(DataSheet!F10,\"AAAAAH+f23I=\")","v":{"$error":"#VALUE!"}},{"$f":"AND(DataSheet!G10,\"AAAAAH+f23M=\")","v":{"$error":"#VALUE!"}},{"$f":"AND(DataSheet!H10,\"AAAAAH+f23Q=\")","v":{"$error":"#VALUE!"}},{"$f":"IF(DataSheet!11:11,\"AAAAAH+f23U=\",0)","v":0},{"$f":"AND(DataSheet!A11,\"AAAAAH+f23Y=\")","v":{"$error":"#VALUE!"}},{"$f":"AND(DataSheet!B11,\"AAAAAH+f23c=\")","v":{"$error":"#VALUE!"}},{"$f":"AND(DataSheet!C11,\"AAAAAH+f23g=\")","v":{"$error":"#VALUE!"}},{"$f":"AND(DataSheet!D11,\"AAAAAH+f23k=\")","v":{"$error":"#VALUE!"}},{"$f":"AND(DataSheet!E11,\"AAAAAH+f23o=\")","v":{"$error":"#VALUE!"}},{"$f":"AND(DataSheet!F11,\"AAAAAH+f23s=\")","v":{"$error":"#VALUE!"}},{"$f":"AND(DataSheet!G11,\"AAAAAH+f23w=\")","v":{"$error":"#VALUE!"}},{"$f":"AND(DataSheet!H11,\"AAAAAH+f230=\")","v":{"$error":"#VALUE!"}},{"$f":"IF(DataSheet!12:12,\"AAAAAH+f234=\",0)","v":0},{"$f":"AND(DataSheet!A12,\"AAAAAH+f238=\")","v":{"$error":"#VALUE!"}},{"$f":"AND(DataSheet!B12,\"AAAAAH+f24A=\")","v":{"$error":"#VALUE!"}},{"$f":"AND(DataSheet!C12,\"AAAAAH+f24E=\")","v":{"$error":"#VALUE!"}},{"$f":"AND(DataSheet!D12,\"AAAAAH+f24I=\")","v":{"$error":"#VALUE!"}},{"$f":"AND(DataSheet!E12,\"AAAAAH+f24M=\")","v":{"$error":"#VALUE!"}},{"$f":"AND(DataSheet!F12,\"AAAAAH+f24Q=\")","v":{"$error":"#VALUE!"}},{"$f":"AND(DataSheet!G12,\"AAAAAH+f24U=\")","v":{"$error":"#VALUE!"}},{"$f":"AND(DataSheet!H12,\"AAAAAH+f24Y=\")","v":{"$error":"#VALUE!"}},{"$f":"IF(DataSheet!13:13,\"AAAAAH+f24c=\",0)","v":0},{"$f":"AND(DataSheet!A13,\"AAAAAH+f24g=\")","v":{"$error":"#VALUE!"}},{"$f":"AND(DataSheet!B13,\"AAAAAH+f24k=\")","v":{"$error":"#VALUE!"}},{"$f":"AND(DataSheet!C13,\"AAAAAH+f24o=\")","v":{"$error":"#VALUE!"}},{"$f":"AND(DataSheet!D13,\"AAAAAH+f24s=\")","v":{"$error":"#VALUE!"}},{"$f":"AND(DataSheet!E13,\"AAAAAH+f24w=\")","v":{"$error":"#VALUE!"}},{"$f":"AND(DataSheet!F13,\"AAAAAH+f240=\")","v":{"$error":"#VALUE!"}},{"$f":"AND(DataSheet!G13,\"AAAAAH+f244=\")","v":{"$error":"#VALUE!"}},{"$f":"AND(DataSheet!H13,\"AAAAAH+f248=\")","v":{"$error":"#VALUE!"}},{"$f":"IF(DataSheet!14:14,\"AAAAAH+f25A=\",0)","v":0},{"$f":"AND(DataSheet!A14,\"AAAAAH+f25E=\")","v":{"$error":"#VALUE!"}},{"$f":"AND(DataSheet!B14,\"AAAAAH+f25I=\")","v":{"$error":"#VALUE!"}},{"$f":"AND(DataSheet!C14,\"AAAAAH+f25M=\")","v":{"$error":"#VALUE!"}},{"$f":"AND(DataSheet!D14,\"AAAAAH+f25Q=\")","v":{"$error":"#VALUE!"}},{"$f":"AND(DataSheet!E14,\"AAAAAH+f25U=\")","v":{"$error":"#VALUE!"}},{"$f":"AND(DataSheet!F14,\"AAAAAH+f25Y=\")","v":{"$error":"#VALUE!"}},{"$f":"AND(DataSheet!G14,\"AAAAAH+f25c=\")","v":{"$error":"#VALUE!"}},{"$f":"AND(DataSheet!H14,\"AAAAAH+f25g=\")","v":{"$error":"#VALUE!"}},{"$f":"IF(DataSheet!15:15,\"AAAAAH+f25k=\",0)","v":0},{"$f":"AND(DataSheet!A15,\"AAAAAH+f25o=\")","v":{"$error":"#VALUE!"}},{"$f":"AND(DataSheet!B15,\"AAAAAH+f25s=\")","v":{"$error":"#VALUE!"}},{"$f":"AND(DataSheet!C15,\"AAAAAH+f25w=\")","v":{"$error":"#VALUE!"}},{"$f":"AND(DataSheet!D15,\"AAAAAH+f250=\")","v":{"$error":"#VALUE!"}},{"$f":"AND(DataSheet!E15,\"AAAAAH+f254=\")","v":{"$error":"#VALUE!"}},{"$f":"AND(DataSheet!F15,\"AAAAAH+f258=\")","v":{"$error":"#VALUE!"}},{"$f":"AND(DataSheet!G15,\"AAAAAH+f26A=\")","v":{"$error":"#VALUE!"}},{"$f":"AND(DataSheet!H15,\"AAAAAH+f26E=\")","v":{"$error":"#VALUE!"}},{"$f":"IF(DataSheet!16:16,\"AAAAAH+f26I=\",0)","v":0},{"$f":"AND(DataSheet!A16,\"AAAAAH+f26M=\")","v":{"$error":"#VALUE!"}},{"$f":"AND(DataSheet!B16,\"AAAAAH+f26Q=\")","v":{"$error":"#VALUE!"}},{"$f":"AND(DataSheet!C16,\"AAAAAH+f26U=\")","v":{"$error":"#VALUE!"}},{"$f":"AND(DataSheet!D16,\"AAAAAH+f26Y=\")","v":{"$error":"#VALUE!"}},{"$f":"AND(DataSheet!E16,\"AAAAAH+f26c=\")","v":{"$error":"#VALUE!"}},{"$f":"AND(DataSheet!F16,\"AAAAAH+f26g=\")","v":{"$error":"#VALUE!"}},{"$f":"AND(DataSheet!G16,\"AAAAAH+f26k=\")","v":{"$error":"#VALUE!"}},{"$f":"AND(DataSheet!H16,\"AAAAAH+f26o=\")","v":{"$error":"#VALUE!"}},{"$f":"IF(DataSheet!17:17,\"AAAAAH+f26s=\",0)","v":0},{"$f":"AND(DataSheet!A17,\"AAAAAH+f26w=\")","v":{"$error":"#VALUE!"}},{"$f":"AND(DataSheet!B17,\"AAAAAH+f260=\")","v":{"$error":"#VALUE!"}},{"$f":"AND(DataSheet!C17,\"AAAAAH+f264=\")","v":{"$error":"#VALUE!"}},{"$f":"AND(DataSheet!D17,\"AAAAAH+f268=\")","v":{"$error":"#VALUE!"}},{"$f":"AND(DataSheet!E17,\"AAAAAH+f27A=\")","v":{"$error":"#VALUE!"}},{"$f":"AND(DataSheet!F17,\"AAAAAH+f27E=\")","v":{"$error":"#VALUE!"}},{"$f":"AND(DataSheet!G17,\"AAAAAH+f27I=\")","v":{"$error":"#VALUE!"}},{"$f":"AND(DataSheet!H17,\"AAAAAH+f27M=\")","v":{"$error":"#VALUE!"}},{"$f":"IF(DataSheet!18:18,\"AAAAAH+f27Q=\",0)","v":0},{"$f":"AND(DataSheet!A18,\"AAAAAH+f27U=\")","v":{"$error":"#VALUE!"}},{"$f":"AND(DataSheet!B18,\"AAAAAH+f27Y=\")","v":{"$error":"#VALUE!"}},{"$f":"AND(DataSheet!C18,\"AAAAAH+f27c=\")","v":{"$error":"#VALUE!"}},{"$f":"AND(DataSheet!D18,\"AAAAAH+f27g=\")","v":{"$error":"#VALUE!"}},{"$f":"AND(DataSheet!E18,\"AAAAAH+f27k=\")","v":{"$error":"#VALUE!"}},{"$f":"AND(DataSheet!F18,\"AAAAAH+f27o=\")","v":{"$error":"#VALUE!"}},{"$f":"AND(DataSheet!G18,\"AAAAAH+f27s=\")","v":{"$error":"#VALUE!"}},{"$f":"AND(DataSheet!H18,\"AAAAAH+f27w=\")","v":{"$error":"#VALUE!"}},{"$f":"IF(DataSheet!19:19,\"AAAAAH+f270=\",0)","v":0},{"$f":"AND(DataSheet!A19,\"AAAAAH+f274=\")","v":{"$error":"#VALUE!"}},{"$f":"AND(DataSheet!B19,\"AAAAAH+f278=\")","v":{"$error":"#VALUE!"}},{"$f":"AND(DataSheet!C19,\"AAAAAH+f28A=\")","v":{"$error":"#VALUE!"}},{"$f":"AND(DataSheet!D19,\"AAAAAH+f28E=\")","v":{"$error":"#VALUE!"}},{"$f":"AND(DataSheet!E19,\"AAAAAH+f28I=\")","v":{"$error":"#VALUE!"}},{"$f":"AND(DataSheet!F19,\"AAAAAH+f28M=\")","v":{"$error":"#VALUE!"}},{"$f":"AND(DataSheet!G19,\"AAAAAH+f28Q=\")","v":{"$error":"#VALUE!"}},{"$f":"AND(DataSheet!H19,\"AAAAAH+f28U=\")","v":{"$error":"#VALUE!"}},{"$f":"IF(DataSheet!20:20,\"AAAAAH+f28Y=\",0)","v":0},{"$f":"AND(DataSheet!A20,\"AAAAAH+f28c=\")","v":{"$error":"#VALUE!"}},{"$f":"AND(DataSheet!B20,\"AAAAAH+f28g=\")","v":{"$error":"#VALUE!"}},{"$f":"AND(DataSheet!C20,\"AAAAAH+f28k=\")","v":{"$error":"#VALUE!"}},{"$f":"AND(DataSheet!D20,\"AAAAAH+f28o=\")","v":{"$error":"#VALUE!"}},{"$f":"AND(DataSheet!E20,\"AAAAAH+f28s=\")","v":{"$error":"#VALUE!"}},{"$f":"AND(DataSheet!F20,\"AAAAAH+f28w=\")","v":{"$error":"#VALUE!"}},{"$f":"AND(DataSheet!G20,\"AAAAAH+f280=\")","v":{"$error":"#VALUE!"}},{"$f":"AND(DataSheet!H20,\"AAAAAH+f284=\")","v":{"$error":"#VALUE!"}},{"$f":"IF(DataSheet!21:21,\"AAAAAH+f288=\",0)","v":0},{"$f":"AND(DataSheet!A21,\"AAAAAH+f29A=\")","v":{"$error":"#VALUE!"}},{"$f":"AND(DataSheet!B21,\"AAAAAH+f29E=\")","v":{"$error":"#VALUE!"}},{"$f":"AND(DataSheet!C21,\"AAAAAH+f29I=\")","v":{"$error":"#VALUE!"}},{"$f":"AND(DataSheet!D21,\"AAAAAH+f29M=\")","v":{"$error":"#VALUE!"}},{"$f":"AND(DataSheet!E21,\"AAAAAH+f29Q=\")","v":{"$error":"#VALUE!"}},{"$f":"AND(DataSheet!F21,\"AAAAAH+f29U=\")","v":{"$error":"#VALUE!"}},{"$f":"AND(DataSheet!G21,\"AAAAAH+f29Y=\")","v":{"$error":"#VALUE!"}},{"$f":"AND(DataSheet!H21,\"AAAAAH+f29c=\")","v":{"$error":"#VALUE!"}},{"$f":"IF(DataSheet!22:22,\"AAAAAH+f29g=\",0)","v":0},{"$f":"AND(DataSheet!A22,\"AAAAAH+f29k=\")","v":{"$error":"#VALUE!"}},{"$f":"AND(DataSheet!B22,\"AAAAAH+f29o=\")","v":{"$error":"#VALUE!"}},{"$f":"AND(DataSheet!C22,\"AAAAAH+f29s=\")","v":{"$error":"#VALUE!"}},{"$f":"AND(DataSheet!D22,\"AAAAAH+f29w=\")","v":{"$error":"#VALUE!"}},{"$f":"AND(DataSheet!E22,\"AAAAAH+f290=\")","v":{"$error":"#VALUE!"}},{"$f":"AND(DataSheet!F22,\"AAAAAH+f294=\")","v":{"$error":"#VALUE!"}},{"$f":"AND(DataSheet!G22,\"AAAAAH+f298=\")","v":{"$error":"#VALUE!"}},{"$f":"AND(DataSheet!H22,\"AAAAAH+f2+A=\")","v":{"$error":"#VALUE!"}},{"$f":"IF(DataSheet!23:23,\"AAAAAH+f2+E=\",0)","v":0},{"$f":"AND(DataSheet!A23,\"AAAAAH+f2+I=\")","v":{"$error":"#VALUE!"}},{"$f":"AND(DataSheet!B23,\"AAAAAH+f2+M=\")","v":{"$error":"#VALUE!"}},{"$f":"AND(DataSheet!C23,\"AAAAAH+f2+Q=\")","v":{"$error":"#VALUE!"}},{"$f":"AND(DataSheet!D23,\"AAAAAH+f2+U=\")","v":{"$error":"#VALUE!"}},{"$f":"AND(DataSheet!E23,\"AAAAAH+f2+Y=\")","v":{"$error":"#VALUE!"}},{"$f":"AND(DataSheet!F23,\"AAAAAH+f2+c=\")","v":{"$error":"#VALUE!"}},{"$f":"AND(DataSheet!G23,\"AAAAAH+f2+g=\")","v":{"$error":"#VALUE!"}},{"$f":"AND(DataSheet!H23,\"AAAAAH+f2+k=\")","v":{"$error":"#VALUE!"}},{"$f":"IF(DataSheet!24:24,\"AAAAAH+f2+o=\",0)","v":0},{"$f":"AND(DataSheet!A24,\"AAAAAH+f2+s=\")","v":{"$error":"#VALUE!"}},{"$f":"AND(DataSheet!B24,\"AAAAAH+f2+w=\")","v":{"$error":"#VALUE!"}},{"$f":"AND(DataSheet!C24,\"AAAAAH+f2+0=\")","v":{"$error":"#VALUE!"}},{"$f":"AND(DataSheet!D24,\"AAAAAH+f2+4=\")","v":{"$error":"#VALUE!"}},{"$f":"AND(DataSheet!E24,\"AAAAAH+f2+8=\")","v":{"$error":"#VALUE!"}},{"$f":"AND(DataSheet!F24,\"AAAAAH+f2/A=\")","v":{"$error":"#VALUE!"}},{"$f":"AND(DataSheet!G24,\"AAAAAH+f2/E=\")","v":{"$error":"#VALUE!"}},{"$f":"AND(DataSheet!H24,\"AAAAAH+f2/I=\")","v":{"$error":"#VALUE!"}},{"$f":"IF(DataSheet!25:25,\"AAAAAH+f2/M=\",0)","v":0},{"$f":"AND(DataSheet!A25,\"AAAAAH+f2/Q=\")","v":{"$error":"#VALUE!"}},{"$f":"AND(DataSheet!B25,\"AAAAAH+f2/U=\")","v":{"$error":"#VALUE!"}},{"$f":"AND(DataSheet!C25,\"AAAAAH+f2/Y=\")","v":{"$error":"#VALUE!"}},{"$f":"AND(DataSheet!D25,\"AAAAAH+f2/c=\")","v":{"$error":"#VALUE!"}},{"$f":"AND(DataSheet!E25,\"AAAAAH+f2/g=\")","v":{"$error":"#VALUE!"}},{"$f":"AND(DataSheet!F25,\"AAAAAH+f2/k=\")","v":{"$error":"#VALUE!"}},{"$f":"AND(DataSheet!G25,\"AAAAAH+f2/o=\")","v":{"$error":"#VALUE!"}},{"$f":"AND(DataSheet!H25,\"AAAAAH+f2/s=\")","v":{"$error":"#VALUE!"}},{"$f":"IF(DataSheet!26:26,\"AAAAAH+f2/w=\",0)","v":0},{"$f":"AND(DataSheet!A26,\"AAAAAH+f2/0=\")","v":{"$error":"#VALUE!"}},{"$f":"AND(DataSheet!B26,\"AAAAAH+f2/4=\")","v":{"$error":"#VALUE!"}},{"$f":"AND(DataSheet!C26,\"AAAAAH+f2/8=\")","v":{"$error":"#VALUE!"}}]
[{"$f":"AND(DataSheet!D26,\"AAAAAHf71wA=\")","v":{"$error":"#VALUE!"}},{"$f":"AND(DataSheet!E26,\"AAAAAHf71wE=\")","v":{"$error":"#VALUE!"}},{"$f":"AND(DataSheet!F26,\"AAAAAHf71wI=\")","v":{"$error":"#VALUE!"}},{"$f":"AND(DataSheet!G26,\"AAAAAHf71wM=\")","v":{"$error":"#VALUE!"}},{"$f":"AND(DataSheet!H26,\"AAAAAHf71wQ=\")","v":{"$error":"#VALUE!"}},{"$f":"IF(DataSheet!27:27,\"AAAAAHf71wU=\",0)","v":{"$error":"#VALUE!"}},{"$f":"AND(DataSheet!A27,\"AAAAAHf71wY=\")","v":{"$error":"#VALUE!"}},{"$f":"AND(DataSheet!B27,\"AAAAAHf71wc=\")","v":{"$error":"#VALUE!"}},{"$f":"AND(DataSheet!C27,\"AAAAAHf71wg=\")","v":{"$error":"#VALUE!"}},{"$f":"AND(DataSheet!D27,\"AAAAAHf71wk=\")","v":{"$error":"#VALUE!"}},{"$f":"AND(DataSheet!E27,\"AAAAAHf71wo=\")","v":{"$error":"#VALUE!"}},{"$f":"AND(DataSheet!F27,\"AAAAAHf71ws=\")","v":{"$error":"#VALUE!"}},{"$f":"AND(DataSheet!G27,\"AAAAAHf71ww=\")","v":{"$error":"#VALUE!"}},{"$f":"AND(DataSheet!H27,\"AAAAAHf71w0=\")","v":{"$error":"#VALUE!"}},{"$f":"IF(DataSheet!28:28,\"AAAAAHf71w4=\",0)","v":0},{"$f":"AND(DataSheet!A28,\"AAAAAHf71w8=\")","v":{"$error":"#VALUE!"}},{"$f":"AND(DataSheet!B28,\"AAAAAHf71xA=\")","v":{"$error":"#VALUE!"}},{"$f":"AND(DataSheet!C28,\"AAAAAHf71xE=\")","v":{"$error":"#VALUE!"}},{"$f":"AND(DataSheet!D28,\"AAAAAHf71xI=\")","v":{"$error":"#VALUE!"}},{"$f":"AND(DataSheet!E28,\"AAAAAHf71xM=\")","v":{"$error":"#VALUE!"}},{"$f":"AND(DataSheet!F28,\"AAAAAHf71xQ=\")","v":{"$error":"#VALUE!"}},{"$f":"AND(DataSheet!G28,\"AAAAAHf71xU=\")","v":{"$error":"#VALUE!"}},{"$f":"AND(DataSheet!H28,\"AAAAAHf71xY=\")","v":{"$error":"#VALUE!"}},{"$f":"IF(DataSheet!29:29,\"AAAAAHf71xc=\",0)","v":0},{"$f":"AND(DataSheet!A29,\"AAAAAHf71xg=\")","v":{"$error":"#VALUE!"}},{"$f":"AND(DataSheet!B29,\"AAAAAHf71xk=\")","v":{"$error":"#VALUE!"}},{"$f":"AND(DataSheet!C29,\"AAAAAHf71xo=\")","v":{"$error":"#VALUE!"}},{"$f":"AND(DataSheet!D29,\"AAAAAHf71xs=\")","v":{"$error":"#VALUE!"}},{"$f":"AND(DataSheet!E29,\"AAAAAHf71xw=\")","v":{"$error":"#VALUE!"}},{"$f":"AND(DataSheet!F29,\"AAAAAHf71x0=\")","v":{"$error":"#VALUE!"}},{"$f":"AND(DataSheet!G29,\"AAAAAHf71x4=\")","v":{"$error":"#VALUE!"}},{"$f":"AND(DataSheet!H29,\"AAAAAHf71x8=\")","v":{"$error":"#VALUE!"}},{"$f":"IF(DataSheet!30:30,\"AAAAAHf71yA=\",0)","v":0},{"$f":"AND(DataSheet!A30,\"AAAAAHf71yE=\")","v":{"$error":"#VALUE!"}},{"$f":"AND(DataSheet!B30,\"AAAAAHf71yI=\")","v":{"$error":"#VALUE!"}},{"$f":"AND(DataSheet!C30,\"AAAAAHf71yM=\")","v":{"$error":"#VALUE!"}},{"$f":"AND(DataSheet!D30,\"AAAAAHf71yQ=\")","v":{"$error":"#VALUE!"}},{"$f":"AND(DataSheet!E30,\"AAAAAHf71yU=\")","v":{"$error":"#VALUE!"}},{"$f":"AND(DataSheet!F30,\"AAAAAHf71yY=\")","v":{"$error":"#VALUE!"}},{"$f":"AND(DataSheet!G30,\"AAAAAHf71yc=\")","v":{"$error":"#VALUE!"}},{"$f":"AND(DataSheet!H30,\"AAAAAHf71yg=\")","v":{"$error":"#VALUE!"}},{"$f":"IF(DataSheet!31:31,\"AAAAAHf71yk=\",0)","v":0},{"$f":"AND(DataSheet!A31,\"AAAAAHf71yo=\")","v":{"$error":"#VALUE!"}},{"$f":"AND(DataSheet!B31,\"AAAAAHf71ys=\")","v":{"$error":"#VALUE!"}},{"$f":"AND(DataSheet!C31,\"AAAAAHf71yw=\")","v":{"$error":"#VALUE!"}},{"$f":"AND(DataSheet!D31,\"AAAAAHf71y0=\")","v":{"$error":"#VALUE!"}},{"$f":"AND(DataSheet!E31,\"AAAAAHf71y4=\")","v":{"$error":"#VALUE!"}},{"$f":"AND(DataSheet!F31,\"AAAAAHf71y8=\")","v":{"$error":"#VALUE!"}},{"$f":"AND(DataSheet!G31,\"AAAAAHf71zA=\")","v":{"$error":"#VALUE!"}},{"$f":"AND(DataSheet!H31,\"AAAAAHf71zE=\")","v":{"$error":"#VALUE!"}},{"$f":"IF(DataSheet!32:32,\"AAAAAHf71zI=\",0)","v":0},{"$f":"AND(DataSheet!A32,\"AAAAAHf71zM=\")","v":{"$error":"#VALUE!"}},{"$f":"AND(DataSheet!B32,\"AAAAAHf71zQ=\")","v":{"$error":"#VALUE!"}},{"$f":"AND(DataSheet!C32,\"AAAAAHf71zU=\")","v":{"$error":"#VALUE!"}},{"$f":"AND(DataSheet!D32,\"AAAAAHf71zY=\")","v":{"$error":"#VALUE!"}},{"$f":"AND(DataSheet!E32,\"AAAAAHf71zc=\")","v":{"$error":"#VALUE!"}},{"$f":"AND(DataSheet!F32,\"AAAAAHf71zg=\")","v":{"$error":"#VALUE!"}},{"$f":"AND(DataSheet!G32,\"AAAAAHf71zk=\")","v":{"$error":"#VALUE!"}},{"$f":"AND(DataSheet!H32,\"AAAAAHf71zo=\")","v":{"$error":"#VALUE!"}},{"$f":"IF(DataSheet!33:33,\"AAAAAHf71zs=\",0)","v":0},{"$f":"AND(DataSheet!A33,\"AAAAAHf71zw=\")","v":{"$error":"#VALUE!"}},{"$f":"AND(DataSheet!B33,\"AAAAAHf71z0=\")","v":{"$error":"#VALUE!"}},{"$f":"AND(DataSheet!C33,\"AAAAAHf71z4=\")","v":{"$error":"#VALUE!"}},{"$f":"AND(DataSheet!D33,\"AAAAAHf71z8=\")","v":{"$error":"#VALUE!"}},{"$f":"AND(DataSheet!E33,\"AAAAAHf710A=\")","v":{"$error":"#VALUE!"}},{"$f":"AND(DataSheet!F33,\"AAAAAHf710E=\")","v":{"$error":"#VALUE!"}},{"$f":"AND(DataSheet!G33,\"AAAAAHf710I=\")","v":{"$error":"#VALUE!"}},{"$f":"AND(DataSheet!H33,\"AAAAAHf710M=\")","v":{"$error":"#VALUE!"}},{"$f":"IF(DataSheet!34:34,\"AAAAAHf710Q=\",0)","v":0},{"$f":"AND(DataSheet!A34,\"AAAAAHf710U=\")","v":{"$error":"#VALUE!"}},{"$f":"AND(DataSheet!B34,\"AAAAAHf710Y=\")","v":{"$error":"#VALUE!"}},{"$f":"AND(DataSheet!C34,\"AAAAAHf710c=\")","v":{"$error":"#VALUE!"}},{"$f":"AND(DataSheet!D34,\"AAAAAHf710g=\")","v":{"$error":"#VALUE!"}},{"$f":"AND(DataSheet!E34,\"AAAAAHf710k=\")","v":{"$error":"#VALUE!"}},{"$f":"AND(DataSheet!F34,\"AAAAAHf710o=\")","v":{"$error":"#VALUE!"}},{"$f":"AND(DataSheet!G34,\"AAAAAHf710s=\")","v":{"$error":"#VALUE!"}},{"$f":"AND(DataSheet!H34,\"AAAAAHf710w=\")","v":{"$error":"#VALUE!"}},{"$f":"IF(DataSheet!35:35,\"AAAAAHf7100=\",0)","v":0},{"$f":"AND(DataSheet!A35,\"AAAAAHf7104=\")","v":{"$error":"#VALUE!"}},{"$f":"AND(DataSheet!B35,\"AAAAAHf7108=\")","v":{"$error":"#VALUE!"}},{"$f":"AND(DataSheet!C35,\"AAAAAHf711A=\")","v":{"$error":"#VALUE!"}},{"$f":"AND(DataSheet!D35,\"AAAAAHf711E=\")","v":{"$error":"#VALUE!"}},{"$f":"AND(DataSheet!E35,\"AAAAAHf711I=\")","v":{"$error":"#VALUE!"}},{"$f":"AND(DataSheet!F35,\"AAAAAHf711M=\")","v":{"$error":"#VALUE!"}},{"$f":"AND(DataSheet!G35,\"AAAAAHf711Q=\")","v":{"$error":"#VALUE!"}},{"$f":"AND(DataSheet!H35,\"AAAAAHf711U=\")","v":{"$error":"#VALUE!"}},{"$f":"IF(DataSheet!36:36,\"AAAAAHf711Y=\",0)","v":0},{"$f":"AND(DataSheet!A36,\"AAAAAHf711c=\")","v":{"$error":"#VALUE!"}},{"$f":"AND(DataSheet!B36,\"AAAAAHf711g=\")","v":{"$error":"#VALUE!"}},{"$f":"AND(DataSheet!C36,\"AAAAAHf711k=\")","v":{"$error":"#VALUE!"}},{"$f":"AND(DataSheet!D36,\"AAAAAHf711o=\")","v":{"$error":"#VALUE!"}},{"$f":"AND(DataSheet!E36,\"AAAAAHf711s=\")","v":{"$error":"#VALUE!"}},{"$f":"AND(DataSheet!F36,\"AAAAAHf711w=\")","v":{"$error":"#VALUE!"}},{"$f":"AND(DataSheet!G36,\"AAAAAHf7110=\")","v":{"$error":"#VALUE!"}},{"$f":"AND(DataSheet!H36,\"AAAAAHf7114=\")","v":{"$error":"#VALUE!"}},{"$f":"IF(DataSheet!37:37,\"AAAAAHf7118=\",0)","v":0},{"$f":"AND(DataSheet!A37,\"AAAAAHf712A=\")","v":{"$error":"#VALUE!"}},{"$f":"AND(DataSheet!B37,\"AAAAAHf712E=\")","v":{"$error":"#VALUE!"}},{"$f":"AND(DataSheet!C37,\"AAAAAHf712I=\")","v":{"$error":"#VALUE!"}},{"$f":"AND(DataSheet!D37,\"AAAAAHf712M=\")","v":{"$error":"#VALUE!"}},{"$f":"AND(DataSheet!E37,\"AAAAAHf712Q=\")","v":{"$error":"#VALUE!"}},{"$f":"AND(DataSheet!F37,\"AAAAAHf712U=\")","v":{"$error":"#VALUE!"}},{"$f":"AND(DataSheet!G37,\"AAAAAHf712Y=\")","v":{"$error":"#VALUE!"}},{"$f":"AND(DataSheet!H37,\"AAAAAHf712c=\")","v":{"$error":"#VALUE!"}},{"$f":"IF(DataSheet!38:38,\"AAAAAHf712g=\",0)","v":0},{"$f":"AND(DataSheet!A38,\"AAAAAHf712k=\")","v":{"$error":"#VALUE!"}},{"$f":"AND(DataSheet!B38,\"AAAAAHf712o=\")","v":{"$error":"#VALUE!"}},{"$f":"AND(DataSheet!C38,\"AAAAAHf712s=\")","v":{"$error":"#VALUE!"}},{"$f":"AND(DataSheet!D38,\"AAAAAHf712w=\")","v":{"$error":"#VALUE!"}},{"$f":"AND(DataSheet!E38,\"AAAAAHf7120=\")","v":{"$error":"#VALUE!"}},{"$f":"AND(DataSheet!F38,\"AAAAAHf7124=\")","v":{"$error":"#VALUE!"}},{"$f":"AND(DataSheet!G38,\"AAAAAHf7128=\")","v":{"$error":"#VALUE!"}},{"$f":"AND(DataSheet!H38,\"AAAAAHf713A=\")","v":{"$error":"#VALUE!"}},{"$f":"IF(DataSheet!39:39,\"AAAAAHf713E=\",0)","v":0},{"$f":"AND(DataSheet!A39,\"AAAAAHf713I=\")","v":{"$error":"#VALUE!"}},{"$f":"AND(DataSheet!B39,\"AAAAAHf713M=\")","v":{"$error":"#VALUE!"}},{"$f":"AND(DataSheet!C39,\"AAAAAHf713Q=\")","v":{"$error":"#VALUE!"}},{"$f":"AND(DataSheet!D39,\"AAAAAHf713U=\")","v":{"$error":"#VALUE!"}},{"$f":"AND(DataSheet!E39,\"AAAAAHf713Y=\")","v":{"$error":"#VALUE!"}},{"$f":"AND(DataSheet!F39,\"AAAAAHf713c=\")","v":{"$error":"#VALUE!"}},{"$f":"AND(DataSheet!G39,\"AAAAAHf713g=\")","v":{"$error":"#VALUE!"}},{"$f":"AND(DataSheet!H39,\"AAAAAHf713k=\")","v":{"$error":"#VALUE!"}},{"$f":"IF(DataSheet!40:40,\"AAAAAHf713o=\",0)","v":0},{"$f":"AND(DataSheet!A40,\"AAAAAHf713s=\")","v":{"$error":"#VALUE!"}},{"$f":"AND(DataSheet!B40,\"AAAAAHf713w=\")","v":{"$error":"#VALUE!"}},{"$f":"AND(DataSheet!C40,\"AAAAAHf7130=\")","v":{"$error":"#VALUE!"}},{"$f":"AND(DataSheet!D40,\"AAAAAHf7134=\")","v":{"$error":"#VALUE!"}},{"$f":"AND(DataSheet!E40,\"AAAAAHf7138=\")","v":{"$error":"#VALUE!"}},{"$f":"AND(DataSheet!F40,\"AAAAAHf714A=\")","v":{"$error":"#VALUE!"}},{"$f":"AND(DataSheet!G40,\"AAAAAHf714E=\")","v":{"$error":"#VALUE!"}},{"$f":"AND(DataSheet!H40,\"AAAAAHf714I=\")","v":{"$error":"#VALUE!"}},{"$f":"IF(DataSheet!41:41,\"AAAAAHf714M=\",0)","v":0},{"$f":"AND(DataSheet!A41,\"AAAAAHf714Q=\")","v":{"$error":"#VALUE!"}},{"$f":"AND(DataSheet!B41,\"AAAAAHf714U=\")","v":{"$error":"#VALUE!"}},{"$f":"AND(DataSheet!C41,\"AAAAAHf714Y=\")","v":{"$error":"#VALUE!"}},{"$f":"AND(DataSheet!D41,\"AAAAAHf714c=\")","v":{"$error":"#VALUE!"}},{"$f":"AND(DataSheet!E41,\"AAAAAHf714g=\")","v":{"$error":"#VALUE!"}},{"$f":"AND(DataSheet!F41,\"AAAAAHf714k=\")","v":{"$error":"#VALUE!"}},{"$f":"AND(DataSheet!G41,\"AAAAAHf714o=\")","v":{"$error":"#VALUE!"}},{"$f":"AND(DataSheet!H41,\"AAAAAHf714s=\")","v":{"$error":"#VALUE!"}},{"$f":"IF(DataSheet!42:42,\"AAAAAHf714w=\",0)","v":0},{"$f":"AND(DataSheet!A42,\"AAAAAHf7140=\")","v":{"$error":"#VALUE!"}},{"$f":"AND(DataSheet!B42,\"AAAAAHf7144=\")","v":{"$error":"#VALUE!"}},{"$f":"AND(DataSheet!C42,\"AAAAAHf7148=\")","v":{"$error":"#VALUE!"}},{"$f":"AND(DataSheet!D42,\"AAAAAHf715A=\")","v":{"$error":"#VALUE!"}},{"$f":"AND(DataSheet!E42,\"AAAAAHf715E=\")","v":{"$error":"#VALUE!"}},{"$f":"AND(DataSheet!F42,\"AAAAAHf715I=\")","v":{"$error":"#VALUE!"}},{"$f":"AND(DataSheet!G42,\"AAAAAHf715M=\")","v":{"$error":"#VALUE!"}},{"$f":"AND(DataSheet!H42,\"AAAAAHf715Q=\")","v":{"$error":"#VALUE!"}},{"$f":"IF(DataSheet!43:43,\"AAAAAHf715U=\",0)","v":0},{"$f":"AND(DataSheet!A43,\"AAAAAHf715Y=\")","v":{"$error":"#VALUE!"}},{"$f":"AND(DataSheet!B43,\"AAAAAHf715c=\")","v":{"$error":"#VALUE!"}},{"$f":"AND(DataSheet!C43,\"AAAAAHf715g=\")","v":{"$error":"#VALUE!"}},{"$f":"AND(DataSheet!D43,\"AAAAAHf715k=\")","v":{"$error":"#VALUE!"}},{"$f":"AND(DataSheet!E43,\"AAAAAHf715o=\")","v":{"$error":"#VALUE!"}},{"$f":"AND(DataSheet!F43,\"AAAAAHf715s=\")","v":{"$error":"#VALUE!"}},{"$f":"AND(DataSheet!G43,\"AAAAAHf715w=\")","v":{"$error":"#VALUE!"}},{"$f":"AND(DataSheet!H43,\"AAAAAHf7150=\")","v":{"$error":"#VALUE!"}},{"$f":"IF(DataSheet!44:44,\"AAAAAHf7154=\",0)","v":0},{"$f":"AND(DataSheet!A44,\"AAAAAHf7158=\")","v":{"$error":"#VALUE!"}},{"$f":"AND(DataSheet!B44,\"AAAAAHf716A=\")","v":{"$error":"#VALUE!"}},{"$f":"AND(DataSheet!C44,\"AAAAAHf716E=\")","v":{"$error":"#VALUE!"}},{"$f":"AND(DataSheet!D44,\"AAAAAHf716I=\")","v":{"$error":"#VALUE!"}},{"$f":"AND(DataSheet!E44,\"AAAAAHf716M=\")","v":{"$error":"#VALUE!"}},{"$f":"AND(DataSheet!F44,\"AAAAAHf716Q=\")","v":{"$error":"#VALUE!"}},{"$f":"AND(DataSheet!G44,\"AAAAAHf716U=\")","v":{"$error":"#VALUE!"}},{"$f":"AND(DataSheet!H44,\"AAAAAHf716Y=\")","v":{"$error":"#VALUE!"}},{"$f":"IF(DataSheet!45:45,\"AAAAAHf716c=\",0)","v":0},{"$f":"AND(DataSheet!A45,\"AAAAAHf716g=\")","v":{"$error":"#VALUE!"}},{"$f":"AND(DataSheet!B45,\"AAAAAHf716k=\")","v":{"$error":"#VALUE!"}},{"$f":"AND(DataSheet!C45,\"AAAAAHf716o=\")","v":{"$error":"#VALUE!"}},{"$f":"AND(DataSheet!D45,\"AAAAAHf716s=\")","v":{"$error":"#VALUE!"}},{"$f":"AND(DataSheet!E45,\"AAAAAHf716w=\")","v":{"$error":"#VALUE!"}},{"$f":"AND(DataSheet!F45,\"AAAAAHf7160=\")","v":{"$error":"#VALUE!"}},{"$f":"AND(DataSheet!G45,\"AAAAAHf7164=\")","v":{"$error":"#VALUE!"}},{"$f":"AND(DataSheet!H45,\"AAAAAHf7168=\")","v":{"$error":"#VALUE!"}},{"$f":"IF(DataSheet!46:46,\"AAAAAHf717A=\",0)","v":0},{"$f":"AND(DataSheet!A46,\"AAAAAHf717E=\")","v":{"$error":"#VALUE!"}},{"$f":"AND(DataSheet!B46,\"AAAAAHf717I=\")","v":{"$error":"#VALUE!"}},{"$f":"AND(DataSheet!C46,\"AAAAAHf717M=\")","v":{"$error":"#VALUE!"}},{"$f":"AND(DataSheet!D46,\"AAAAAHf717Q=\")","v":{"$error":"#VALUE!"}},{"$f":"AND(DataSheet!E46,\"AAAAAHf717U=\")","v":{"$error":"#VALUE!"}},{"$f":"AND(DataSheet!F46,\"AAAAAHf717Y=\")","v":{"$error":"#VALUE!"}},{"$f":"AND(DataSheet!G46,\"AAAAAHf717c=\")","v":{"$error":"#VALUE!"}},{"$f":"AND(DataSheet!H46,\"AAAAAHf717g=\")","v":{"$error":"#VALUE!"}},{"$f":"IF(DataSheet!47:47,\"AAAAAHf717k=\",0)","v":0},{"$f":"AND(DataSheet!A47,\"AAAAAHf717o=\")","v":{"$error":"#VALUE!"}},{"$f":"AND(DataSheet!B47,\"AAAAAHf717s=\")","v":{"$error":"#VALUE!"}},{"$f":"AND(DataSheet!C47,\"AAAAAHf717w=\")","v":{"$error":"#VALUE!"}},{"$f":"AND(DataSheet!D47,\"AAAAAHf7170=\")","v":{"$error":"#VALUE!"}},{"$f":"AND(DataSheet!E47,\"AAAAAHf7174=\")","v":{"$error":"#VALUE!"}},{"$f":"AND(DataSheet!F47,\"AAAAAHf7178=\")","v":{"$error":"#VALUE!"}},{"$f":"AND(DataSheet!G47,\"AAAAAHf718A=\")","v":{"$error":"#VALUE!"}},{"$f":"AND(DataSheet!H47,\"AAAAAHf718E=\")","v":{"$error":"#VALUE!"}},{"$f":"IF(DataSheet!48:48,\"AAAAAHf718I=\",0)","v":0},{"$f":"AND(DataSheet!A48,\"AAAAAHf718M=\")","v":{"$error":"#VALUE!"}},{"$f":"AND(DataSheet!B48,\"AAAAAHf718Q=\")","v":{"$error":"#VALUE!"}},{"$f":"AND(DataSheet!C48,\"AAAAAHf718U=\")","v":{"$error":"#VALUE!"}},{"$f":"AND(DataSheet!D48,\"AAAAAHf718Y=\")","v":{"$error":"#VALUE!"}},{"$f":"AND(DataSheet!E48,\"AAAAAHf718c=\")","v":{"$error":"#VALUE!"}},{"$f":"AND(DataSheet!F48,\"AAAAAHf718g=\")","v":{"$error":"#VALUE!"}},{"$f":"AND(DataSheet!G48,\"AAAAAHf718k=\")","v":{"$error":"#VALUE!"}},{"$f":"AND(DataSheet!H48,\"AAAAAHf718o=\")","v":{"$error":"#VALUE!"}},{"$f":"IF(DataSheet!49:49,\"AAAAAHf718s=\",0)","v":0},{"$f":"AND(DataSheet!A49,\"AAAAAHf718w=\")","v":{"$error":"#VALUE!"}},{"$f":"AND(DataSheet!B49,\"AAAAAHf7180=\")","v":{"$error":"#VALUE!"}},{"$f":"AND(DataSheet!C49,\"AAAAAHf7184=\")","v":{"$error":"#VALUE!"}},{"$f":"AND(DataSheet!D49,\"AAAAAHf7188=\")","v":{"$error":"#VALUE!"}},{"$f":"AND(DataSheet!E49,\"AAAAAHf719A=\")","v":{"$error":"#VALUE!"}},{"$f":"AND(DataSheet!F49,\"AAAAAHf719E=\")","v":{"$error":"#VALUE!"}},{"$f":"AND(DataSheet!G49,\"AAAAAHf719I=\")","v":{"$error":"#VALUE!"}},{"$f":"AND(DataSheet!H49,\"AAAAAHf719M=\")","v":{"$error":"#VALUE!"}},{"$f":"IF(DataSheet!50:50,\"AAAAAHf719Q=\",0)","v":0},{"$f":"AND(DataSheet!A50,\"AAAAAHf719U=\")","v":{"$error":"#VALUE!"}},{"$f":"AND(DataSheet!B50,\"AAAAAHf719Y=\")","v":{"$error":"#VALUE!"}},{"$f":"AND(DataSheet!C50,\"AAAAAHf719c=\")","v":{"$error":"#VALUE!"}},{"$f":"AND(DataSheet!D50,\"AAAAAHf719g=\")","v":{"$error":"#VALUE!"}},{"$f":"AND(DataSheet!E50,\"AAAAAHf719k=\")","v":{"$error":"#VALUE!"}},{"$f":"AND(DataSheet!F50,\"AAAAAHf719o=\")","v":{"$error":"#VALUE!"}},{"$f":"AND(DataSheet!G50,\"AAAAAHf719s=\")","v":{"$error":"#VALUE!"}},{"$f":"AND(DataSheet!H50,\"AAAAAHf719w=\")","v":{"$error":"#VALUE!"}},{"$f":"IF(DataSheet!51:51,\"AAAAAHf7190=\",0)","v":0},{"$f":"AND(DataSheet!A51,\"AAAAAHf7194=\")","v":{"$error":"#VALUE!"}},{"$f":"AND(DataSheet!B51,\"AAAAAHf7198=\")","v":{"$error":"#VALUE!"}},{"$f":"AND(DataSheet!C51,\"AAAAAHf71+A=\")","v":{"$error":"#VALUE!"}},{"$f":"AND(DataSheet!D51,\"AAAAAHf71+E=\")","v":{"$error":"#VALUE!"}},{"$f":"AND(DataSheet!E51,\"AAAAAHf71+I=\")","v":{"$error":"#VALUE!"}},{"$f":"AND(DataSheet!F51,\"AAAAAHf71+M=\")","v":{"$error":"#VALUE!"}},{"$f":"AND(DataSheet!G51,\"AAAAAHf71+Q=\")","v":{"$error":"#VALUE!"}},{"$f":"AND(DataSheet!H51,\"AAAAAHf71+U=\")","v":{"$error":"#VALUE!"}},{"$f":"IF(DataSheet!52:52,\"AAAAAHf71+Y=\",0)","v":0},{"$f":"AND(DataSheet!A52,\"AAAAAHf71+c=\")","v":{"$error":"#VALUE!"}},{"$f":"AND(DataSheet!B52,\"AAAAAHf71+g=\")","v":{"$error":"#VALUE!"}},{"$f":"AND(DataSheet!C52,\"AAAAAHf71+k=\")","v":{"$error":"#VALUE!"}},{"$f":"AND(DataSheet!D52,\"AAAAAHf71+o=\")","v":{"$error":"#VALUE!"}},{"$f":"AND(DataSheet!E52,\"AAAAAHf71+s=\")","v":{"$error":"#VALUE!"}},{"$f":"AND(DataSheet!F52,\"AAAAAHf71+w=\")","v":{"$error":"#VALUE!"}},{"$f":"AND(DataSheet!G52,\"AAAAAHf71+0=\")","v":{"$error":"#VALUE!"}},{"$f":"AND(DataSheet!H52,\"AAAAAHf71+4=\")","v":{"$error":"#VALUE!"}},{"$f":"IF(DataSheet!53:53,\"AAAAAHf71+8=\",0)","v":0},{"$f":"AND(DataSheet!A53,\"AAAAAHf71/A=\")","v":{"$error":"#VALUE!"}},{"$f":"AND(DataSheet!B53,\"AAAAAHf71/E=\")","v":{"$error":"#VALUE!"}},{"$f":"AND(DataSheet!C53,\"AAAAAHf71/I=\")","v":{"$error":"#VALUE!"}},{"$f":"AND(DataSheet!D53,\"AAAAAHf71/M=\")","v":{"$error":"#VALUE!"}},{"$f":"AND(DataSheet!E53,\"AAAAAHf71/Q=\")","v":{"$error":"#VALUE!"}},{"$f":"AND(DataSheet!F53,\"AAAAAHf71/U=\")","v":{"$error":"#VALUE!"}},{"$f":"AND(DataSheet!G53,\"AAAAAHf71/Y=\")","v":{"$error":"#VALUE!"}},{"$f":"AND(DataSheet!H53,\"AAAAAHf71/c=\")","v":{"$error":"#VALUE!"}},{"$f":"IF(DataSheet!54:54,\"AAAAAHf71/g=\",0)","v":0},{"$f":"AND(DataSheet!A54,\"AAAAAHf71/k=\")","v":{"$error":"#VALUE!"}},{"$f":"AND(DataSheet!B54,\"AAAAAHf71/o=\")","v":{"$error":"#VALUE!"}},{"$f":"AND(DataSheet!C54,\"AAAAAHf71/s=\")","v":{"$error":"#VALUE!"}},{"$f":"AND(DataSheet!D54,\"AAAAAHf71/w=\")","v":{"$error":"#VALUE!"}},{"$f":"AND(DataSheet!E54,\"AAAAAHf71/0=\")","v":{"$error":"#VALUE!"}},{"$f":"AND(DataSheet!F54,\"AAAAAHf71/4=\")","v":{"$error":"#VALUE!"}},{"$f":"AND(DataSheet!G54,\"AAAAAHf71/8=\")","v":{"$error":"#VALUE!"}}]
[{"$f":"AND(DataSheet!H54,\"AAAAAE8/uwA=\")","v":{"$error":"#VALUE!"}},{"$f":"IF(DataSheet!55:55,\"AAAAAE8/uwE=\",0)","v":"AAAAAE8/uwE="},{"$f":"AND(DataSheet!A55,\"AAAAAE8/uwI=\")","v":{"$error":"#VALUE!"}},{"$f":"AND(DataSheet!B55,\"AAAAAE8/uwM=\")","v":{"$error":"#VALUE!"}},{"$f":"AND(DataSheet!C55,\"AAAAAE8/uwQ=\")","v":{"$error":"#VALUE!"}},{"$f":"AND(DataSheet!D55,\"AAAAAE8/uwU=\")","v":{"$error":"#VALUE!"}},{"$f":"AND(DataSheet!E55,\"AAAAAE8/uwY=\")","v":{"$error":"#VALUE!"}},{"$f":"AND(DataSheet!F55,\"AAAAAE8/uwc=\")","v":{"$error":"#VALUE!"}},{"$f":"AND(DataSheet!G55,\"AAAAAE8/uwg=\")","v":{"$error":"#VALUE!"}},{"$f":"AND(DataSheet!H55,\"AAAAAE8/uwk=\")","v":{"$error":"#VALUE!"}},{"$f":"IF(DataSheet!56:56,\"AAAAAE8/uwo=\",0)","v":0},{"$f":"AND(DataSheet!A56,\"AAAAAE8/uws=\")","v":{"$error":"#VALUE!"}},{"$f":"AND(DataSheet!B56,\"AAAAAE8/uww=\")","v":{"$error":"#VALUE!"}},{"$f":"AND(DataSheet!C56,\"AAAAAE8/uw0=\")","v":{"$error":"#VALUE!"}},{"$f":"AND(DataSheet!D56,\"AAAAAE8/uw4=\")","v":{"$error":"#VALUE!"}},{"$f":"AND(DataSheet!E56,\"AAAAAE8/uw8=\")","v":{"$error":"#VALUE!"}},{"$f":"AND(DataSheet!F56,\"AAAAAE8/uxA=\")","v":{"$error":"#VALUE!"}},{"$f":"AND(DataSheet!G56,\"AAAAAE8/uxE=\")","v":{"$error":"#VALUE!"}},{"$f":"AND(DataSheet!H56,\"AAAAAE8/uxI=\")","v":{"$error":"#VALUE!"}},{"$f":"IF(DataSheet!57:57,\"AAAAAE8/uxM=\",0)","v":0},{"$f":"AND(DataSheet!A57,\"AAAAAE8/uxQ=\")","v":{"$error":"#VALUE!"}},{"$f":"AND(DataSheet!B57,\"AAAAAE8/uxU=\")","v":{"$error":"#VALUE!"}},{"$f":"AND(DataSheet!C57,\"AAAAAE8/uxY=\")","v":{"$error":"#VALUE!"}},{"$f":"AND(DataSheet!D57,\"AAAAAE8/uxc=\")","v":{"$error":"#VALUE!"}},{"$f":"AND(DataSheet!E57,\"AAAAAE8/uxg=\")","v":{"$error":"#VALUE!"}},{"$f":"AND(DataSheet!F57,\"AAAAAE8/uxk=\")","v":{"$error":"#VALUE!"}},{"$f":"AND(DataSheet!G57,\"AAAAAE8/uxo=\")","v":{"$error":"#VALUE!"}},{"$f":"AND(DataSheet!H57,\"AAAAAE8/uxs=\")","v":{"$error":"#VALUE!"}},{"$f":"IF(DataSheet!58:58,\"AAAAAE8/uxw=\",0)","v":0},{"$f":"AND(DataSheet!A58,\"AAAAAE8/ux0=\")","v":{"$error":"#VALUE!"}},{"$f":"AND(DataSheet!B58,\"AAAAAE8/ux4=\")","v":{"$error":"#VALUE!"}},{"$f":"AND(DataSheet!C58,\"AAAAAE8/ux8=\")","v":{"$error":"#VALUE!"}},{"$f":"AND(DataSheet!D58,\"AAAAAE8/uyA=\")","v":{"$error":"#VALUE!"}},{"$f":"AND(DataSheet!E58,\"AAAAAE8/uyE=\")","v":{"$error":"#VALUE!"}},{"$f":"AND(DataSheet!F58,\"AAAAAE8/uyI=\")","v":{"$error":"#VALUE!"}},{"$f":"AND(DataSheet!G58,\"AAAAAE8/uyM=\")","v":{"$error":"#VALUE!"}},{"$f":"AND(DataSheet!H58,\"AAAAAE8/uyQ=\")","v":{"$error":"#VALUE!"}},{"$f":"IF(DataSheet!59:59,\"AAAAAE8/uyU=\",0)","v":0},{"$f":"AND(DataSheet!A59,\"AAAAAE8/uyY=\")","v":{"$error":"#VALUE!"}},{"$f":"AND(DataSheet!B59,\"AAAAAE8/uyc=\")","v":{"$error":"#VALUE!"}},{"$f":"AND(DataSheet!C59,\"AAAAAE8/uyg=\")","v":{"$error":"#VALUE!"}},{"$f":"AND(DataSheet!D59,\"AAAAAE8/uyk=\")","v":{"$error":"#VALUE!"}},{"$f":"AND(DataSheet!E59,\"AAAAAE8/uyo=\")","v":{"$error":"#VALUE!"}},{"$f":"AND(DataSheet!F59,\"AAAAAE8/uys=\")","v":{"$error":"#VALUE!"}},{"$f":"AND(DataSheet!G59,\"AAAAAE8/uyw=\")","v":{"$error":"#VALUE!"}},{"$f":"AND(DataSheet!H59,\"AAAAAE8/uy0=\")","v":{"$error":"#VALUE!"}},{"$f":"IF(DataSheet!60:60,\"AAAAAE8/uy4=\",0)","v":0},{"$f":"AND(DataSheet!A60,\"AAAAAE8/uy8=\")","v":{"$error":"#VALUE!"}},{"$f":"AND(DataSheet!B60,\"AAAAAE8/uzA=\")","v":{"$error":"#VALUE!"}},{"$f":"AND(DataSheet!C60,\"AAAAAE8/uzE=\")","v":{"$error":"#VALUE!"}},{"$f":"AND(DataSheet!D60,\"AAAAAE8/uzI=\")","v":{"$error":"#VALUE!"}},{"$f":"AND(DataSheet!E60,\"AAAAAE8/uzM=\")","v":{"$error":"#VALUE!"}},{"$f":"AND(DataSheet!F60,\"AAAAAE8/uzQ=\")","v":{"$error":"#VALUE!"}},{"$f":"AND(DataSheet!G60,\"AAAAAE8/uzU=\")","v":{"$error":"#VALUE!"}},{"$f":"AND(DataSheet!H60,\"AAAAAE8/uzY=\")","v":{"$error":"#VALUE!"}},{"$f":"IF(DataSheet!61:61,\"AAAAAE8/uzc=\",0)","v":0},{"$f":"AND(DataSheet!A61,\"AAAAAE8/uzg=\")","v":{"$error":"#VALUE!"}},{"$f":"AND(DataSheet!B61,\"AAAAAE8/uzk=\")","v":{"$error":"#VALUE!"}},{"$f":"AND(DataSheet!C61,\"AAAAAE8/uzo=\")","v":{"$error":"#VALUE!"}},{"$f":"AND(DataSheet!D61,\"AAAAAE8/uzs=\")","v":{"$error":"#VALUE!"}},{"$f":"AND(DataSheet!E61,\"AAAAAE8/uzw=\")","v":{"$error":"#VALUE!"}},{"$f":"AND(DataSheet!F61,\"AAAAAE8/uz0=\")","v":{"$error":"#VALUE!"}},{"$f":"AND(DataSheet!G61,\"AAAAAE8/uz4=\")","v":{"$error":"#VALUE!"}},{"$f":"AND(DataSheet!H61,\"AAAAAE8/uz8=\")","v":{"$error":"#VALUE!"}},{"$f":"IF(DataSheet!62:62,\"AAAAAE8/u0A=\",0)","v":0},{"$f":"AND(DataSheet!A62,\"AAAAAE8/u0E=\")","v":{"$error":"#VALUE!"}},{"$f":"AND(DataSheet!B62,\"AAAAAE8/u0I=\")","v":{"$error":"#VALUE!"}},{"$f":"AND(DataSheet!C62,\"AAAAAE8/u0M=\")","v":{"$error":"#VALUE!"}},{"$f":"AND(DataSheet!D62,\"AAAAAE8/u0Q=\")","v":{"$error":"#VALUE!"}},{"$f":"AND(DataSheet!E62,\"AAAAAE8/u0U=\")","v":{"$error":"#VALUE!"}},{"$f":"AND(DataSheet!F62,\"AAAAAE8/u0Y=\")","v":{"$error":"#VALUE!"}},{"$f":"AND(DataSheet!G62,\"AAAAAE8/u0c=\")","v":{"$error":"#VALUE!"}},{"$f":"AND(DataSheet!H62,\"AAAAAE8/u0g=\")","v":{"$error":"#VALUE!"}},{"$f":"IF(DataSheet!63:63,\"AAAAAE8/u0k=\",0)","v":0},{"$f":"AND(DataSheet!A63,\"AAAAAE8/u0o=\")","v":{"$error":"#VALUE!"}},{"$f":"AND(DataSheet!B63,\"AAAAAE8/u0s=\")","v":{"$error":"#VALUE!"}},{"$f":"AND(DataSheet!C63,\"AAAAAE8/u0w=\")","v":{"$error":"#VALUE!"}},{"$f":"AND(DataSheet!D63,\"AAAAAE8/u00=\")","v":{"$error":"#VALUE!"}},{"$f":"AND(DataSheet!E63,\"AAAAAE8/u04=\")","v":{"$error":"#VALUE!"}},{"$f":"AND(DataSheet!F63,\"AAAAAE8/u08=\")","v":{"$error":"#VALUE!"}},{"$f":"AND(DataSheet!G63,\"AAAAAE8/u1A=\")","v":{"$error":"#VALUE!"}},{"$f":"AND(DataSheet!H63,\"AAAAAE8/u1E=\")","v":{"$error":"#VALUE!"}},{"$f":"IF(DataSheet!64:64,\"AAAAAE8/u1I=\",0)","v":0},{"$f":"AND(DataSheet!A64,\"AAAAAE8/u1M=\")","v":{"$error":"#VALUE!"}},{"$f":"AND(DataSheet!B64,\"AAAAAE8/u1Q=\")","v":{"$error":"#VALUE!"}},{"$f":"AND(DataSheet!C64,\"AAAAAE8/u1U=\")","v":{"$error":"#VALUE!"}},{"$f":"AND(DataSheet!D64,\"AAAAAE8/u1Y=\")","v":{"$error":"#VALUE!"}},{"$f":"AND(DataSheet!E64,\"AAAAAE8/u1c=\")","v":{"$error":"#VALUE!"}},{"$f":"AND(DataSheet!F64,\"AAAAAE8/u1g=\")","v":{"$error":"#VALUE!"}},{"$f":"AND(DataSheet!G64,\"AAAAAE8/u1k=\")","v":{"$error":"#VALUE!"}},{"$f":"AND(DataSheet!H64,\"AAAAAE8/u1o=\")","v":{"$error":"#VALUE!"}},{"$f":"IF(DataSheet!65:65,\"AAAAAE8/u1s=\",0)","v":0},{"$f":"AND(DataSheet!A65,\"AAAAAE8/u1w=\")","v":{"$error":"#VALUE!"}},{"$f":"AND(DataSheet!B65,\"AAAAAE8/u10=\")","v":{"$error":"#VALUE!"}},{"$f":"AND(DataSheet!C65,\"AAAAAE8/u14=\")","v":{"$error":"#VALUE!"}},{"$f":"AND(DataSheet!D65,\"AAAAAE8/u18=\")","v":{"$error":"#VALUE!"}},{"$f":"AND(DataSheet!E65,\"AAAAAE8/u2A=\")","v":{"$error":"#VALUE!"}},{"$f":"AND(DataSheet!F65,\"AAAAAE8/u2E=\")","v":{"$error":"#VALUE!"}},{"$f":"AND(DataSheet!G65,\"AAAAAE8/u2I=\")","v":{"$error":"#VALUE!"}},{"$f":"AND(DataSheet!H65,\"AAAAAE8/u2M=\")","v":{"$error":"#VALUE!"}},{"$f":"IF(DataSheet!66:66,\"AAAAAE8/u2Q=\",0)","v":0},{"$f":"AND(DataSheet!A66,\"AAAAAE8/u2U=\")","v":{"$error":"#VALUE!"}},{"$f":"AND(DataSheet!B66,\"AAAAAE8/u2Y=\")","v":{"$error":"#VALUE!"}},{"$f":"AND(DataSheet!C66,\"AAAAAE8/u2c=\")","v":{"$error":"#VALUE!"}},{"$f":"AND(DataSheet!D66,\"AAAAAE8/u2g=\")","v":{"$error":"#VALUE!"}},{"$f":"AND(DataSheet!E66,\"AAAAAE8/u2k=\")","v":{"$error":"#VALUE!"}},{"$f":"AND(DataSheet!F66,\"AAAAAE8/u2o=\")","v":{"$error":"#VALUE!"}},{"$f":"AND(DataSheet!G66,\"AAAAAE8/u2s=\")","v":{"$error":"#VALUE!"}},{"$f":"AND(DataSheet!H66,\"AAAAAE8/u2w=\")","v":{"$error":"#VALUE!"}},{"$f":"IF(DataSheet!67:67,\"AAAAAE8/u20=\",0)","v":0},{"$f":"AND(DataSheet!A67,\"AAAAAE8/u24=\")","v":{"$error":"#VALUE!"}},{"$f":"AND(DataSheet!B67,\"AAAAAE8/u28=\")","v":{"$error":"#VALUE!"}},{"$f":"AND(DataSheet!C67,\"AAAAAE8/u3A=\")","v":{"$error":"#VALUE!"}},{"$f":"AND(DataSheet!D67,\"AAAAAE8/u3E=\")","v":{"$error":"#VALUE!"}},{"$f":"AND(DataSheet!E67,\"AAAAAE8/u3I=\")","v":{"$error":"#VALUE!"}},{"$f":"AND(DataSheet!F67,\"AAAAAE8/u3M=\")","v":{"$error":"#VALUE!"}},{"$f":"AND(DataSheet!G67,\"AAAAAE8/u3Q=\")","v":{"$error":"#VALUE!"}},{"$f":"AND(DataSheet!H67,\"AAAAAE8/u3U=\")","v":{"$error":"#VALUE!"}},{"$f":"IF(DataSheet!68:68,\"AAAAAE8/u3Y=\",0)","v":0},{"$f":"AND(DataSheet!A68,\"AAAAAE8/u3c=\")","v":{"$error":"#VALUE!"}},{"$f":"AND(DataSheet!B68,\"AAAAAE8/u3g=\")","v":{"$error":"#VALUE!"}},{"$f":"AND(DataSheet!C68,\"AAAAAE8/u3k=\")","v":{"$error":"#VALUE!"}},{"$f":"AND(DataSheet!D68,\"AAAAAE8/u3o=\")","v":{"$error":"#VALUE!"}},{"$f":"AND(DataSheet!E68,\"AAAAAE8/u3s=\")","v":{"$error":"#VALUE!"}},{"$f":"AND(DataSheet!F68,\"AAAAAE8/u3w=\")","v":{"$error":"#VALUE!"}},{"$f":"AND(DataSheet!G68,\"AAAAAE8/u30=\")","v":{"$error":"#VALUE!"}},{"$f":"AND(DataSheet!H68,\"AAAAAE8/u34=\")","v":{"$error":"#VALUE!"}},{"$f":"IF(DataSheet!69:69,\"AAAAAE8/u38=\",0)","v":0},{"$f":"AND(DataSheet!A69,\"AAAAAE8/u4A=\")","v":{"$error":"#VALUE!"}},{"$f":"AND(DataSheet!B69,\"AAAAAE8/u4E=\")","v":{"$error":"#VALUE!"}},{"$f":"AND(DataSheet!C69,\"AAAAAE8/u4I=\")","v":{"$error":"#VALUE!"}},{"$f":"AND(DataSheet!D69,\"AAAAAE8/u4M=\")","v":{"$error":"#VALUE!"}},{"$f":"AND(DataSheet!E69,\"AAAAAE8/u4Q=\")","v":{"$error":"#VALUE!"}},{"$f":"AND(DataSheet!F69,\"AAAAAE8/u4U=\")","v":{"$error":"#VALUE!"}},{"$f":"AND(DataSheet!G69,\"AAAAAE8/u4Y=\")","v":{"$error":"#VALUE!"}},{"$f":"AND(DataSheet!H69,\"AAAAAE8/u4c=\")","v":{"$error":"#VALUE!"}},{"$f":"IF(DataSheet!70:70,\"AAAAAE8/u4g=\",0)","v":0},{"$f":"AND(DataSheet!A70,\"AAAAAE8/u4k=\")","v":{"$error":"#VALUE!"}},{"$f":"AND(DataSheet!B70,\"AAAAAE8/u4o=\")","v":{"$error":"#VALUE!"}},{"$f":"AND(DataSheet!C70,\"AAAAAE8/u4s=\")","v":{"$error":"#VALUE!"}},{"$f":"AND(DataSheet!D70,\"AAAAAE8/u4w=\")","v":{"$error":"#VALUE!"}},{"$f":"AND(DataSheet!E70,\"AAAAAE8/u40=\")","v":{"$error":"#VALUE!"}},{"$f":"AND(DataSheet!F70,\"AAAAAE8/u44=\")","v":{"$error":"#VALUE!"}},{"$f":"AND(DataSheet!G70,\"AAAAAE8/u48=\")","v":{"$error":"#VALUE!"}},{"$f":"AND(DataSheet!H70,\"AAAAAE8/u5A=\")","v":{"$error":"#VALUE!"}},{"$f":"IF(DataSheet!71:71,\"AAAAAE8/u5E=\",0)","v":0},{"$f":"AND(DataSheet!A71,\"AAAAAE8/u5I=\")","v":{"$error":"#VALUE!"}},{"$f":"AND(DataSheet!B71,\"AAAAAE8/u5M=\")","v":{"$error":"#VALUE!"}},{"$f":"AND(DataSheet!C71,\"AAAAAE8/u5Q=\")","v":{"$error":"#VALUE!"}},{"$f":"AND(DataSheet!D71,\"AAAAAE8/u5U=\")","v":{"$error":"#VALUE!"}},{"$f":"AND(DataSheet!E71,\"AAAAAE8/u5Y=\")","v":{"$error":"#VALUE!"}},{"$f":"AND(DataSheet!F71,\"AAAAAE8/u5c=\")","v":{"$error":"#VALUE!"}},{"$f":"AND(DataSheet!G71,\"AAAAAE8/u5g=\")","v":{"$error":"#VALUE!"}},{"$f":"AND(DataSheet!H71,\"AAAAAE8/u5k=\")","v":{"$error":"#VALUE!"}},{"$f":"IF(DataSheet!72:72,\"AAAAAE8/u5o=\",0)","v":0},{"$f":"AND(DataSheet!A72,\"AAAAAE8/u5s=\")","v":{"$error":"#VALUE!"}},{"$f":"AND(DataSheet!B72,\"AAAAAE8/u5w=\")","v":{"$error":"#VALUE!"}},{"$f":"AND(DataSheet!C72,\"AAAAAE8/u50=\")","v":{"$error":"#VALUE!"}},{"$f":"AND(DataSheet!D72,\"AAAAAE8/u54=\")","v":{"$error":"#VALUE!"}},{"$f":"AND(DataSheet!E72,\"AAAAAE8/u58=\")","v":{"$error":"#VALUE!"}},{"$f":"AND(DataSheet!F72,\"AAAAAE8/u6A=\")","v":{"$error":"#VALUE!"}},{"$f":"AND(DataSheet!G72,\"AAAAAE8/u6E=\")","v":{"$error":"#VALUE!"}},{"$f":"AND(DataSheet!H72,\"AAAAAE8/u6I=\")","v":{"$error":"#VALUE!"}},{"$f":"IF(DataSheet!73:73,\"AAAAAE8/u6M=\",0)","v":0},{"$f":"AND(DataSheet!A73,\"AAAAAE8/u6Q=\")","v":{"$error":"#VALUE!"}},{"$f":"AND(DataSheet!B73,\"AAAAAE8/u6U=\")","v":{"$error":"#VALUE!"}},{"$f":"AND(DataSheet!C73,\"AAAAAE8/u6Y=\")","v":{"$error":"#VALUE!"}},{"$f":"AND(DataSheet!D73,\"AAAAAE8/u6c=\")","v":{"$error":"#VALUE!"}},{"$f":"AND(DataSheet!E73,\"AAAAAE8/u6g=\")","v":{"$error":"#VALUE!"}},{"$f":"AND(DataSheet!F73,\"AAAAAE8/u6k=\")","v":{"$error":"#VALUE!"}},{"$f":"AND(DataSheet!G73,\"AAAAAE8/u6o=\")","v":{"$error":"#VALUE!"}},{"$f":"AND(DataSheet!H73,\"AAAAAE8/u6s=\")","v":{"$error":"#VALUE!"}},{"$f":"IF(DataSheet!74:74,\"AAAAAE8/u6w=\",0)","v":0},{"$f":"AND(DataSheet!A74,\"AAAAAE8/u60=\")","v":{"$error":"#VALUE!"}},{"$f":"AND(DataSheet!B74,\"AAAAAE8/u64=\")","v":{"$error":"#VALUE!"}},{"$f":"AND(DataSheet!C74,\"AAAAAE8/u68=\")","v":{"$error":"#VALUE!"}},{"$f":"AND(DataSheet!D74,\"AAAAAE8/u7A=\")","v":{"$error":"#VALUE!"}},{"$f":"AND(DataSheet!E74,\"AAAAAE8/u7E=\")","v":{"$error":"#VALUE!"}},{"$f":"AND(DataSheet!F74,\"AAAAAE8/u7I=\")","v":{"$error":"#VALUE!"}},{"$f":"AND(DataSheet!G74,\"AAAAAE8/u7M=\")","v":{"$error":"#VALUE!"}},{"$f":"AND(DataSheet!H74,\"AAAAAE8/u7Q=\")","v":{"$error":"#VALUE!"}},{"$f":"IF(DataSheet!75:75,\"AAAAAE8/u7U=\",0)","v":0},{"$f":"AND(DataSheet!A75,\"AAAAAE8/u7Y=\")","v":{"$error":"#VALUE!"}},{"$f":"AND(DataSheet!B75,\"AAAAAE8/u7c=\")","v":{"$error":"#VALUE!"}},{"$f":"AND(DataSheet!C75,\"AAAAAE8/u7g=\")","v":{"$error":"#VALUE!"}},{"$f":"AND(DataSheet!D75,\"AAAAAE8/u7k=\")","v":{"$error":"#VALUE!"}},{"$f":"AND(DataSheet!E75,\"AAAAAE8/u7o=\")","v":{"$error":"#VALUE!"}},{"$f":"AND(DataSheet!F75,\"AAAAAE8/u7s=\")","v":{"$error":"#VALUE!"}},{"$f":"AND(DataSheet!G75,\"AAAAAE8/u7w=\")","v":{"$error":"#VALUE!"}},{"$f":"AND(DataSheet!H75,\"AAAAAE8/u70=\")","v":{"$error":"#VALUE!"}},{"$f":"IF(DataSheet!76:76,\"AAAAAE8/u74=\",0)","v":0},{"$f":"AND(DataSheet!A76,\"AAAAAE8/u78=\")","v":{"$error":"#VALUE!"}},{"$f":"AND(DataSheet!B76,\"AAAAAE8/u8A=\")","v":{"$error":"#VALUE!"}},{"$f":"AND(DataSheet!C76,\"AAAAAE8/u8E=\")","v":{"$error":"#VALUE!"}},{"$f":"AND(DataSheet!D76,\"AAAAAE8/u8I=\")","v":{"$error":"#VALUE!"}},{"$f":"AND(DataSheet!E76,\"AAAAAE8/u8M=\")","v":{"$error":"#VALUE!"}},{"$f":"AND(DataSheet!F76,\"AAAAAE8/u8Q=\")","v":{"$error":"#VALUE!"}},{"$f":"AND(DataSheet!G76,\"AAAAAE8/u8U=\")","v":{"$error":"#VALUE!"}},{"$f":"AND(DataSheet!H76,\"AAAAAE8/u8Y=\")","v":{"$error":"#VALUE!"}},{"$f":"IF(DataSheet!77:77,\"AAAAAE8/u8c=\",0)","v":0},{"$f":"AND(DataSheet!A77,\"AAAAAE8/u8g=\")","v":{"$error":"#VALUE!"}},{"$f":"AND(DataSheet!B77,\"AAAAAE8/u8k=\")","v":{"$error":"#VALUE!"}},{"$f":"AND(DataSheet!C77,\"AAAAAE8/u8o=\")","v":{"$error":"#VALUE!"}},{"$f":"AND(DataSheet!D77,\"AAAAAE8/u8s=\")","v":{"$error":"#VALUE!"}},{"$f":"AND(DataSheet!E77,\"AAAAAE8/u8w=\")","v":{"$error":"#VALUE!"}},{"$f":"AND(DataSheet!F77,\"AAAAAE8/u80=\")","v":{"$error":"#VALUE!"}},{"$f":"AND(DataSheet!G77,\"AAAAAE8/u84=\")","v":{"$error":"#VALUE!"}},{"$f":"AND(DataSheet!H77,\"AAAAAE8/u88=\")","v":{"$error":"#VALUE!"}},{"$f":"IF(DataSheet!78:78,\"AAAAAE8/u9A=\",0)","v":0},{"$f":"AND(DataSheet!A78,\"AAAAAE8/u9E=\")","v":{"$error":"#VALUE!"}},{"$f":"AND(DataSheet!B78,\"AAAAAE8/u9I=\")","v":{"$error":"#VALUE!"}},{"$f":"AND(DataSheet!C78,\"AAAAAE8/u9M=\")","v":{"$error":"#VALUE!"}},{"$f":"AND(DataSheet!D78,\"AAAAAE8/u9Q=\")","v":{"$error":"#VALUE!"}},{"$f":"AND(DataSheet!E78,\"AAAAAE8/u9U=\")","v":{"$error":"#VALUE!"}},{"$f":"AND(DataSheet!F78,\"AAAAAE8/u9Y=\")","v":{"$error":"#VALUE!"}},{"$f":"AND(DataSheet!G78,\"AAAAAE8/u9c=\")","v":{"$error":"#VALUE!"}},{"$f":"AND(DataSheet!H78,\"AAAAAE8/u9g=\")","v":{"$error":"#VALUE!"}},{"$f":"IF(DataSheet!79:79,\"AAAAAE8/u9k=\",0)","v":0},{"$f":"AND(DataSheet!A79,\"AAAAAE8/u9o=\")","v":{"$error":"#VALUE!"}},{"$f":"AND(DataSheet!B79,\"AAAAAE8/u9s=\")","v":{"$error":"#VALUE!"}},{"$f":"AND(DataSheet!C79,\"AAAAAE8/u9w=\")","v":{"$error":"#VALUE!"}},{"$f":"AND(DataSheet!D79,\"AAAAAE8/u90=\")","v":{"$error":"#VALUE!"}},{"$f":"AND(DataSheet!E79,\"AAAAAE8/u94=\")","v":{"$error":"#VALUE!"}},{"$f":"AND(DataSheet!F79,\"AAAAAE8/u98=\")","v":{"$error":"#VALUE!"}},{"$f":"AND(DataSheet!G79,\"AAAAAE8/u+A=\")","v":{"$error":"#VALUE!"}},{"$f":"AND(DataSheet!H79,\"AAAAAE8/u+E=\")","v":{"$error":"#VALUE!"}},{"$f":"IF(DataSheet!80:80,\"AAAAAE8/u+I=\",0)","v":0},{"$f":"AND(DataSheet!A80,\"AAAAAE8/u+M=\")","v":{"$error":"#VALUE!"}},{"$f":"AND(DataSheet!B80,\"AAAAAE8/u+Q=\")","v":{"$error":"#VALUE!"}},{"$f":"AND(DataSheet!C80,\"AAAAAE8/u+U=\")","v":{"$error":"#VALUE!"}},{"$f":"AND(DataSheet!D80,\"AAAAAE8/u+Y=\")","v":{"$error":"#VALUE!"}},{"$f":"AND(DataSheet!E80,\"AAAAAE8/u+c=\")","v":{"$error":"#VALUE!"}},{"$f":"AND(DataSheet!F80,\"AAAAAE8/u+g=\")","v":{"$error":"#VALUE!"}},{"$f":"AND(DataSheet!G80,\"AAAAAE8/u+k=\")","v":{"$error":"#VALUE!"}},{"$f":"AND(DataSheet!H80,\"AAAAAE8/u+o=\")","v":{"$error":"#VALUE!"}},{"$f":"IF(DataSheet!81:81,\"AAAAAE8/u+s=\",0)","v":0},{"$f":"AND(DataSheet!A81,\"AAAAAE8/u+w=\")","v":{"$error":"#VALUE!"}},{"$f":"AND(DataSheet!B81,\"AAAAAE8/u+0=\")","v":{"$error":"#VALUE!"}},{"$f":"AND(DataSheet!C81,\"AAAAAE8/u+4=\")","v":{"$error":"#VALUE!"}},{"$f":"AND(DataSheet!D81,\"AAAAAE8/u+8=\")","v":{"$error":"#VALUE!"}},{"$f":"AND(DataSheet!E81,\"AAAAAE8/u/A=\")","v":{"$error":"#VALUE!"}},{"$f":"AND(DataSheet!F81,\"AAAAAE8/u/E=\")","v":{"$error":"#VALUE!"}},{"$f":"AND(DataSheet!G81,\"AAAAAE8/u/I=\")","v":{"$error":"#VALUE!"}},{"$f":"AND(DataSheet!H81,\"AAAAAE8/u/M=\")","v":{"$error":"#VALUE!"}},{"$f":"IF(DataSheet!82:82,\"AAAAAE8/u/Q=\",0)","v":0},{"$f":"AND(DataSheet!A82,\"AAAAAE8/u/U=\")","v":{"$error":"#VALUE!"}},{"$f":"AND(DataSheet!B82,\"AAAAAE8/u/Y=\")","v":{"$error":"#VALUE!"}},{"$f":"AND(DataSheet!C82,\"AAAAAE8/u/c=\")","v":{"$error":"#VALUE!"}},{"$f":"AND(DataSheet!D82,\"AAAAAE8/u/g=\")","v":{"$error":"#VALUE!"}},{"$f":"AND(DataSheet!E82,\"AAAAAE8/u/k=\")","v":{"$error":"#VALUE!"}},{"$f":"AND(DataSheet!F82,\"AAAAAE8/u/o=\")","v":{"$error":"#VALUE!"}},{"$f":"AND(DataSheet!G82,\"AAAAAE8/u/s=\")","v":{"$error":"#VALUE!"}},{"$f":"AND(DataSheet!H82,\"AAAAAE8/u/w=\")","v":{"$error":"#VALUE!"}},{"$f":"IF(DataSheet!83:83,\"AAAAAE8/u/0=\",0)","v":0},{"$f":"AND(DataSheet!A83,\"AAAAAE8/u/4=\")","v":{"$error":"#VALUE!"}},{"$f":"AND(DataSheet!B83,\"AAAAAE8/u/8=\")","v":{"$error":"#VALUE!"}}]
[{"$f":"AND(DataSheet!C83,\"AAAAAH/c9QA=\")","v":{"$error":"#VALUE!"}},{"$f":"AND(DataSheet!D83,\"AAAAAH/c9QE=\")","v":{"$error":"#VALUE!"}},{"$f":"AND(DataSheet!E83,\"AAAAAH/c9QI=\")","v":{"$error":"#VALUE!"}},{"$f":"AND(DataSheet!F83,\"AAAAAH/c9QM=\")","v":{"$error":"#VALUE!"}},{"$f":"AND(DataSheet!G83,\"AAAAAH/c9QQ=\")","v":{"$error":"#VALUE!"}},{"$f":"AND(DataSheet!H83,\"AAAAAH/c9QU=\")","v":{"$error":"#VALUE!"}},{"$f":"IF(DataSheet!84:84,\"AAAAAH/c9QY=\",0)","v":{"$error":"#VALUE!"}},{"$f":"AND(DataSheet!A84,\"AAAAAH/c9Qc=\")","v":{"$error":"#VALUE!"}},{"$f":"AND(DataSheet!B84,\"AAAAAH/c9Qg=\")","v":{"$error":"#VALUE!"}},{"$f":"AND(DataSheet!C84,\"AAAAAH/c9Qk=\")","v":{"$error":"#VALUE!"}},{"$f":"AND(DataSheet!D84,\"AAAAAH/c9Qo=\")","v":{"$error":"#VALUE!"}},{"$f":"AND(DataSheet!E84,\"AAAAAH/c9Qs=\")","v":{"$error":"#VALUE!"}},{"$f":"AND(DataSheet!F84,\"AAAAAH/c9Qw=\")","v":{"$error":"#VALUE!"}},{"$f":"AND(DataSheet!G84,\"AAAAAH/c9Q0=\")","v":{"$error":"#VALUE!"}},{"$f":"AND(DataSheet!H84,\"AAAAAH/c9Q4=\")","v":{"$error":"#VALUE!"}},{"$f":"IF(DataSheet!85:85,\"AAAAAH/c9Q8=\",0)","v":0},{"$f":"AND(DataSheet!A85,\"AAAAAH/c9RA=\")","v":{"$error":"#VALUE!"}},{"$f":"AND(DataSheet!B85,\"AAAAAH/c9RE=\")","v":{"$error":"#VALUE!"}},{"$f":"AND(DataSheet!C85,\"AAAAAH/c9RI=\")","v":{"$error":"#VALUE!"}},{"$f":"AND(DataSheet!D85,\"AAAAAH/c9RM=\")","v":{"$error":"#VALUE!"}},{"$f":"AND(DataSheet!E85,\"AAAAAH/c9RQ=\")","v":{"$error":"#VALUE!"}},{"$f":"AND(DataSheet!F85,\"AAAAAH/c9RU=\")","v":{"$error":"#VALUE!"}},{"$f":"AND(DataSheet!G85,\"AAAAAH/c9RY=\")","v":{"$error":"#VALUE!"}},{"$f":"AND(DataSheet!H85,\"AAAAAH/c9Rc=\")","v":{"$error":"#VALUE!"}},{"$f":"IF(DataSheet!86:86,\"AAAAAH/c9Rg=\",0)","v":0},{"$f":"AND(DataSheet!A86,\"AAAAAH/c9Rk=\")","v":{"$error":"#VALUE!"}},{"$f":"AND(DataSheet!B86,\"AAAAAH/c9Ro=\")","v":{"$error":"#VALUE!"}},{"$f":"AND(DataSheet!C86,\"AAAAAH/c9Rs=\")","v":{"$error":"#VALUE!"}},{"$f":"AND(DataSheet!D86,\"AAAAAH/c9Rw=\")","v":{"$error":"#VALUE!"}},{"$f":"AND(DataSheet!E86,\"AAAAAH/c9R0=\")","v":{"$error":"#VALUE!"}},{"$f":"AND(DataSheet!F86,\"AAAAAH/c9R4=\")","v":{"$error":"#VALUE!"}},{"$f":"AND(DataSheet!G86,\"AAAAAH/c9R8=\")","v":{"$error":"#VALUE!"}},{"$f":"AND(DataSheet!H86,\"AAAAAH/c9SA=\")","v":{"$error":"#VALUE!"}},{"$f":"IF(DataSheet!87:87,\"AAAAAH/c9SE=\",0)","v":0},{"$f":"AND(DataSheet!A87,\"AAAAAH/c9SI=\")","v":{"$error":"#VALUE!"}},{"$f":"AND(DataSheet!B87,\"AAAAAH/c9SM=\")","v":{"$error":"#VALUE!"}},{"$f":"AND(DataSheet!C87,\"AAAAAH/c9SQ=\")","v":{"$error":"#VALUE!"}},{"$f":"AND(DataSheet!D87,\"AAAAAH/c9SU=\")","v":{"$error":"#VALUE!"}},{"$f":"AND(DataSheet!E87,\"AAAAAH/c9SY=\")","v":{"$error":"#VALUE!"}},{"$f":"AND(DataSheet!F87,\"AAAAAH/c9Sc=\")","v":{"$error":"#VALUE!"}},{"$f":"AND(DataSheet!G87,\"AAAAAH/c9Sg=\")","v":{"$error":"#VALUE!"}},{"$f":"AND(DataSheet!H87,\"AAAAAH/c9Sk=\")","v":{"$error":"#VALUE!"}},{"$f":"IF(DataSheet!88:88,\"AAAAAH/c9So=\",0)","v":0},{"$f":"AND(DataSheet!A88,\"AAAAAH/c9Ss=\")","v":{"$error":"#VALUE!"}},{"$f":"AND(DataSheet!B88,\"AAAAAH/c9Sw=\")","v":{"$error":"#VALUE!"}},{"$f":"AND(DataSheet!C88,\"AAAAAH/c9S0=\")","v":{"$error":"#VALUE!"}},{"$f":"AND(DataSheet!D88,\"AAAAAH/c9S4=\")","v":{"$error":"#VALUE!"}},{"$f":"AND(DataSheet!E88,\"AAAAAH/c9S8=\")","v":{"$error":"#VALUE!"}},{"$f":"AND(DataSheet!F88,\"AAAAAH/c9TA=\")","v":{"$error":"#VALUE!"}},{"$f":"AND(DataSheet!G88,\"AAAAAH/c9TE=\")","v":{"$error":"#VALUE!"}},{"$f":"AND(DataSheet!H88,\"AAAAAH/c9TI=\")","v":{"$error":"#VALUE!"}},{"$f":"IF(DataSheet!89:89,\"AAAAAH/c9TM=\",0)","v":0},{"$f":"AND(DataSheet!A89,\"AAAAAH/c9TQ=\")","v":{"$error":"#VALUE!"}},{"$f":"AND(DataSheet!B89,\"AAAAAH/c9TU=\")","v":{"$error":"#VALUE!"}},{"$f":"AND(DataSheet!C89,\"AAAAAH/c9TY=\")","v":{"$error":"#VALUE!"}},{"$f":"AND(DataSheet!D89,\"AAAAAH/c9Tc=\")","v":{"$error":"#VALUE!"}},{"$f":"AND(DataSheet!E89,\"AAAAAH/c9Tg=\")","v":{"$error":"#VALUE!"}},{"$f":"AND(DataSheet!F89,\"AAAAAH/c9Tk=\")","v":{"$error":"#VALUE!"}},{"$f":"AND(DataSheet!G89,\"AAAAAH/c9To=\")","v":{"$error":"#VALUE!"}},{"$f":"AND(DataSheet!H89,\"AAAAAH/c9Ts=\")","v":{"$error":"#VALUE!"}},{"$f":"IF(DataSheet!90:90,\"AAAAAH/c9Tw=\",0)","v":0},{"$f":"AND(DataSheet!A90,\"AAAAAH/c9T0=\")","v":{"$error":"#VALUE!"}},{"$f":"AND(DataSheet!B90,\"AAAAAH/c9T4=\")","v":{"$error":"#VALUE!"}},{"$f":"AND(DataSheet!C90,\"AAAAAH/c9T8=\")","v":{"$error":"#VALUE!"}},{"$f":"AND(DataSheet!D90,\"AAAAAH/c9UA=\")","v":{"$error":"#VALUE!"}},{"$f":"AND(DataSheet!E90,\"AAAAAH/c9UE=\")","v":{"$error":"#VALUE!"}},{"$f":"AND(DataSheet!F90,\"AAAAAH/c9UI=\")","v":{"$error":"#VALUE!"}},{"$f":"AND(DataSheet!G90,\"AAAAAH/c9UM=\")","v":{"$error":"#VALUE!"}},{"$f":"AND(DataSheet!H90,\"AAAAAH/c9UQ=\")","v":{"$error":"#VALUE!"}},{"$f":"IF(DataSheet!91:91,\"AAAAAH/c9UU=\",0)","v":0},{"$f":"AND(DataSheet!A91,\"AAAAAH/c9UY=\")","v":{"$error":"#VALUE!"}},{"$f":"AND(DataSheet!B91,\"AAAAAH/c9Uc=\")","v":{"$error":"#VALUE!"}},{"$f":"AND(DataSheet!C91,\"AAAAAH/c9Ug=\")","v":{"$error":"#VALUE!"}},{"$f":"AND(DataSheet!D91,\"AAAAAH/c9Uk=\")","v":{"$error":"#VALUE!"}},{"$f":"AND(DataSheet!E91,\"AAAAAH/c9Uo=\")","v":{"$error":"#VALUE!"}},{"$f":"AND(DataSheet!F91,\"AAAAAH/c9Us=\")","v":{"$error":"#VALUE!"}},{"$f":"AND(DataSheet!G91,\"AAAAAH/c9Uw=\")","v":{"$error":"#VALUE!"}},{"$f":"AND(DataSheet!H91,\"AAAAAH/c9U0=\")","v":{"$error":"#VALUE!"}},{"$f":"IF(DataSheet!92:92,\"AAAAAH/c9U4=\",0)","v":0},{"$f":"AND(DataSheet!A92,\"AAAAAH/c9U8=\")","v":{"$error":"#VALUE!"}},{"$f":"AND(DataSheet!B92,\"AAAAAH/c9VA=\")","v":{"$error":"#VALUE!"}},{"$f":"AND(DataSheet!C92,\"AAAAAH/c9VE=\")","v":{"$error":"#VALUE!"}},{"$f":"AND(DataSheet!D92,\"AAAAAH/c9VI=\")","v":{"$error":"#VALUE!"}},{"$f":"AND(DataSheet!E92,\"AAAAAH/c9VM=\")","v":{"$error":"#VALUE!"}},{"$f":"AND(DataSheet!F92,\"AAAAAH/c9VQ=\")","v":{"$error":"#VALUE!"}},{"$f":"AND(DataSheet!G92,\"AAAAAH/c9VU=\")","v":{"$error":"#VALUE!"}},{"$f":"AND(DataSheet!H92,\"AAAAAH/c9VY=\")","v":{"$error":"#VALUE!"}},{"$f":"IF(DataSheet!93:93,\"AAAAAH/c9Vc=\",0)","v":0},{"$f":"AND(DataSheet!A93,\"AAAAAH/c9Vg=\")","v":{"$error":"#VALUE!"}},{"$f":"AND(DataSheet!B93,\"AAAAAH/c9Vk=\")","v":{"$error":"#VALUE!"}},{"$f":"AND(DataSheet!C93,\"AAAAAH/c9Vo=\")","v":{"$error":"#VALUE!"}},{"$f":"AND(DataSheet!D93,\"AAAAAH/c9Vs=\")","v":{"$error":"#VALUE!"}},{"$f":"AND(DataSheet!E93,\"AAAAAH/c9Vw=\")","v":{"$error":"#VALUE!"}},{"$f":"AND(DataSheet!F93,\"AAAAAH/c9V0=\")","v":{"$error":"#VALUE!"}},{"$f":"AND(DataSheet!G93,\"AAAAAH/c9V4=\")","v":{"$error":"#VALUE!"}},{"$f":"AND(DataSheet!H93,\"AAAAAH/c9V8=\")","v":{"$error":"#VALUE!"}},{"$f":"IF(DataSheet!94:94,\"AAAAAH/c9WA=\",0)","v":0},{"$f":"AND(DataSheet!A94,\"AAAAAH/c9WE=\")","v":{"$error":"#VALUE!"}},{"$f":"AND(DataSheet!B94,\"AAAAAH/c9WI=\")","v":{"$error":"#VALUE!"}},{"$f":"AND(DataSheet!C94,\"AAAAAH/c9WM=\")","v":{"$error":"#VALUE!"}},{"$f":"AND(DataSheet!D94,\"AAAAAH/c9WQ=\")","v":{"$error":"#VALUE!"}},{"$f":"AND(DataSheet!E94,\"AAAAAH/c9WU=\")","v":{"$error":"#VALUE!"}},{"$f":"AND(DataSheet!F94,\"AAAAAH/c9WY=\")","v":{"$error":"#VALUE!"}},{"$f":"AND(DataSheet!G94,\"AAAAAH/c9Wc=\")","v":{"$error":"#VALUE!"}},{"$f":"AND(DataSheet!H94,\"AAAAAH/c9Wg=\")","v":{"$error":"#VALUE!"}},{"$f":"IF(DataSheet!95:95,\"AAAAAH/c9Wk=\",0)","v":0},{"$f":"AND(DataSheet!A95,\"AAAAAH/c9Wo=\")","v":{"$error":"#VALUE!"}},{"$f":"AND(DataSheet!B95,\"AAAAAH/c9Ws=\")","v":{"$error":"#VALUE!"}},{"$f":"AND(DataSheet!C95,\"AAAAAH/c9Ww=\")","v":{"$error":"#VALUE!"}},{"$f":"AND(DataSheet!D95,\"AAAAAH/c9W0=\")","v":{"$error":"#VALUE!"}},{"$f":"AND(DataSheet!E95,\"AAAAAH/c9W4=\")","v":{"$error":"#VALUE!"}},{"$f":"AND(DataSheet!F95,\"AAAAAH/c9W8=\")","v":{"$error":"#VALUE!"}},{"$f":"AND(DataSheet!G95,\"AAAAAH/c9XA=\")","v":{"$error":"#VALUE!"}},{"$f":"AND(DataSheet!H95,\"AAAAAH/c9XE=\")","v":{"$error":"#VALUE!"}},{"$f":"IF(DataSheet!96:96,\"AAAAAH/c9XI=\",0)","v":0},{"$f":"AND(DataSheet!A96,\"AAAAAH/c9XM=\")","v":{"$error":"#VALUE!"}},{"$f":"AND(DataSheet!B96,\"AAAAAH/c9XQ=\")","v":{"$error":"#VALUE!"}},{"$f":"AND(DataSheet!C96,\"AAAAAH/c9XU=\")","v":{"$error":"#VALUE!"}},{"$f":"AND(DataSheet!D96,\"AAAAAH/c9XY=\")","v":{"$error":"#VALUE!"}},{"$f":"AND(DataSheet!E96,\"AAAAAH/c9Xc=\")","v":{"$error":"#VALUE!"}},{"$f":"AND(DataSheet!F96,\"AAAAAH/c9Xg=\")","v":{"$error":"#VALUE!"}},{"$f":"AND(DataSheet!G96,\"AAAAAH/c9Xk=\")","v":{"$error":"#VALUE!"}},{"$f":"AND(DataSheet!H96,\"AAAAAH/c9Xo=\")","v":{"$error":"#VALUE!"}},{"$f":"IF(DataSheet!97:97,\"AAAAAH/c9Xs=\",0)","v":0},{"$f":"AND(DataSheet!A97,\"AAAAAH/c9Xw=\")","v":{"$error":"#VALUE!"}},{"$f":"AND(DataSheet!B97,\"AAAAAH/c9X0=\")","v":{"$error":"#VALUE!"}},{"$f":"AND(DataSheet!C97,\"AAAAAH/c9X4=\")","v":{"$error":"#VALUE!"}},{"$f":"AND(DataSheet!D97,\"AAAAAH/c9X8=\")","v":{"$error":"#VALUE!"}},{"$f":"AND(DataSheet!E97,\"AAAAAH/c9YA=\")","v":{"$error":"#VALUE!"}},{"$f":"AND(DataSheet!F97,\"AAAAAH/c9YE=\")","v":{"$error":"#VALUE!"}},{"$f":"AND(DataSheet!G97,\"AAAAAH/c9YI=\")","v":{"$error":"#VALUE!"}},{"$f":"AND(DataSheet!H97,\"AAAAAH/c9YM=\")","v":{"$error":"#VALUE!"}},{"$f":"IF(DataSheet!98:98,\"AAAAAH/c9YQ=\",0)","v":0},{"$f":"AND(DataSheet!A98,\"AAAAAH/c9YU=\")","v":{"$error":"#VALUE!"}},{"$f":"AND(DataSheet!B98,\"AAAAAH/c9YY=\")","v":{"$error":"#VALUE!"}},{"$f":"AND(DataSheet!C98,\"AAAAAH/c9Yc=\")","v":{"$error":"#VALUE!"}},{"$f":"AND(DataSheet!D98,\"AAAAAH/c9Yg=\")","v":{"$error":"#VALUE!"}},{"$f":"AND(DataSheet!E98,\"AAAAAH/c9Yk=\")","v":{"$error":"#VALUE!"}},{"$f":"AND(DataSheet!F98,\"AAAAAH/c9Yo=\")","v":{"$error":"#VALUE!"}},{"$f":"AND(DataSheet!G98,\"AAAAAH/c9Ys=\")","v":{"$error":"#VALUE!"}},{"$f":"AND(DataSheet!H98,\"AAAAAH/c9Yw=\")","v":{"$error":"#VALUE!"}},{"$f":"IF(DataSheet!99:99,\"AAAAAH/c9Y0=\",0)","v":0},{"$f":"AND(DataSheet!A99,\"AAAAAH/c9Y4=\")","v":{"$error":"#VALUE!"}},{"$f":"AND(DataSheet!B99,\"AAAAAH/c9Y8=\")","v":{"$error":"#VALUE!"}},{"$f":"AND(DataSheet!C99,\"AAAAAH/c9ZA=\")","v":{"$error":"#VALUE!"}},{"$f":"AND(DataSheet!D99,\"AAAAAH/c9ZE=\")","v":{"$error":"#VALUE!"}},{"$f":"AND(DataSheet!E99,\"AAAAAH/c9ZI=\")","v":{"$error":"#VALUE!"}},{"$f":"AND(DataSheet!F99,\"AAAAAH/c9ZM=\")","v":{"$error":"#VALUE!"}},{"$f":"AND(DataSheet!G99,\"AAAAAH/c9ZQ=\")","v":{"$error":"#VALUE!"}},{"$f":"AND(DataSheet!H99,\"AAAAAH/c9ZU=\")","v":{"$error":"#VALUE!"}},{"$f":"IF(DataSheet!100:100,\"AAAAAH/c9ZY=\",0)","v":0},{"$f":"AND(DataSheet!A100,\"AAAAAH/c9Zc=\")","v":{"$error":"#VALUE!"}},{"$f":"AND(DataSheet!B100,\"AAAAAH/c9Zg=\")","v":{"$error":"#VALUE!"}},{"$f":"AND(DataSheet!C100,\"AAAAAH/c9Zk=\")","v":{"$error":"#VALUE!"}},{"$f":"AND(DataSheet!D100,\"AAAAAH/c9Zo=\")","v":{"$error":"#VALUE!"}},{"$f":"AND(DataSheet!E100,\"AAAAAH/c9Zs=\")","v":{"$error":"#VALUE!"}},{"$f":"AND(DataSheet!F100,\"AAAAAH/c9Zw=\")","v":{"$error":"#VALUE!"}},{"$f":"AND(DataSheet!G100,\"AAAAAH/c9Z0=\")","v":{"$error":"#VALUE!"}},{"$f":"AND(DataSheet!H100,\"AAAAAH/c9Z4=\")","v":{"$error":"#VALUE!"}},{"$f":"IF(DataSheet!101:101,\"AAAAAH/c9Z8=\",0)","v":0},{"$f":"AND(DataSheet!A101,\"AAAAAH/c9aA=\")","v":{"$error":"#VALUE!"}},{"$f":"AND(DataSheet!B101,\"AAAAAH/c9aE=\")","v":{"$error":"#VALUE!"}},{"$f":"AND(DataSheet!C101,\"AAAAAH/c9aI=\")","v":{"$error":"#VALUE!"}},{"$f":"AND(DataSheet!D101,\"AAAAAH/c9aM=\")","v":{"$error":"#VALUE!"}},{"$f":"AND(DataSheet!E101,\"AAAAAH/c9aQ=\")","v":{"$error":"#VALUE!"}},{"$f":"AND(DataSheet!F101,\"AAAAAH/c9aU=\")","v":{"$error":"#VALUE!"}},{"$f":"AND(DataSheet!G101,\"AAAAAH/c9aY=\")","v":{"$error":"#VALUE!"}},{"$f":"AND(DataSheet!H101,\"AAAAAH/c9ac=\")","v":{"$error":"#VALUE!"}},{"$f":"IF(DataSheet!102:102,\"AAAAAH/c9ag=\",0)","v":0},{"$f":"AND(DataSheet!A102,\"AAAAAH/c9ak=\")","v":{"$error":"#VALUE!"}},{"$f":"AND(DataSheet!B102,\"AAAAAH/c9ao=\")","v":{"$error":"#VALUE!"}},{"$f":"AND(DataSheet!C102,\"AAAAAH/c9as=\")","v":{"$error":"#VALUE!"}},{"$f":"AND(DataSheet!D102,\"AAAAAH/c9aw=\")","v":{"$error":"#VALUE!"}},{"$f":"AND(DataSheet!E102,\"AAAAAH/c9a0=\")","v":{"$error":"#VALUE!"}},{"$f":"AND(DataSheet!F102,\"AAAAAH/c9a4=\")","v":{"$error":"#VALUE!"}},{"$f":"AND(DataSheet!G102,\"AAAAAH/c9a8=\")","v":{"$error":"#VALUE!"}},{"$f":"AND(DataSheet!H102,\"AAAAAH/c9bA=\")","v":{"$error":"#VALUE!"}},{"$f":"IF(DataSheet!103:103,\"AAAAAH/c9bE=\",0)","v":0},{"$f":"AND(DataSheet!A103,\"AAAAAH/c9bI=\")","v":{"$error":"#VALUE!"}},{"$f":"AND(DataSheet!B103,\"AAAAAH/c9bM=\")","v":{"$error":"#VALUE!"}},{"$f":"AND(DataSheet!C103,\"AAAAAH/c9bQ=\")","v":{"$error":"#VALUE!"}},{"$f":"AND(DataSheet!D103,\"AAAAAH/c9bU=\")","v":{"$error":"#VALUE!"}},{"$f":"AND(DataSheet!E103,\"AAAAAH/c9bY=\")","v":{"$error":"#VALUE!"}},{"$f":"AND(DataSheet!F103,\"AAAAAH/c9bc=\")","v":{"$error":"#VALUE!"}},{"$f":"AND(DataSheet!G103,\"AAAAAH/c9bg=\")","v":{"$error":"#VALUE!"}},{"$f":"AND(DataSheet!H103,\"AAAAAH/c9bk=\")","v":{"$error":"#VALUE!"}},{"$f":"IF(DataSheet!104:104,\"AAAAAH/c9bo=\",0)","v":0},{"$f":"AND(DataSheet!A104,\"AAAAAH/c9bs=\")","v":{"$error":"#VALUE!"}},{"$f":"AND(DataSheet!B104,\"AAAAAH/c9bw=\")","v":{"$error":"#VALUE!"}},{"$f":"AND(DataSheet!C104,\"AAAAAH/c9b0=\")","v":{"$error":"#VALUE!"}},{"$f":"AND(DataSheet!D104,\"AAAAAH/c9b4=\")","v":{"$error":"#VALUE!"}},{"$f":"AND(DataSheet!E104,\"AAAAAH/c9b8=\")","v":{"$error":"#VALUE!"}},{"$f":"AND(DataSheet!F104,\"AAAAAH/c9cA=\")","v":{"$error":"#VALUE!"}},{"$f":"AND(DataSheet!G104,\"AAAAAH/c9cE=\")","v":{"$error":"#VALUE!"}},{"$f":"AND(DataSheet!H104,\"AAAAAH/c9cI=\")","v":{"$error":"#VALUE!"}},{"$f":"IF(DataSheet!105:105,\"AAAAAH/c9cM=\",0)","v":0},{"$f":"AND(DataSheet!A105,\"AAAAAH/c9cQ=\")","v":{"$error":"#VALUE!"}},{"$f":"AND(DataSheet!B105,\"AAAAAH/c9cU=\")","v":{"$error":"#VALUE!"}},{"$f":"AND(DataSheet!C105,\"AAAAAH/c9cY=\")","v":{"$error":"#VALUE!"}},{"$f":"AND(DataSheet!D105,\"AAAAAH/c9cc=\")","v":{"$error":"#VALUE!"}},{"$f":"AND(DataSheet!E105,\"AAAAAH/c9cg=\")","v":{"$error":"#VALUE!"}},{"$f":"AND(DataSheet!F105,\"AAAAAH/c9ck=\")","v":{"$error":"#VALUE!"}},{"$f":"AND(DataSheet!G105,\"AAAAAH/c9co=\")","v":{"$error":"#VALUE!"}},{"$f":"AND(DataSheet!H105,\"AAAAAH/c9cs=\")","v":{"$error":"#VALUE!"}},{"$f":"IF(DataSheet!106:106,\"AAAAAH/c9cw=\",0)","v":0},{"$f":"AND(DataSheet!A106,\"AAAAAH/c9c0=\")","v":{"$error":"#VALUE!"}},{"$f":"AND(DataSheet!B106,\"AAAAAH/c9c4=\")","v":{"$error":"#VALUE!"}},{"$f":"AND(DataSheet!C106,\"AAAAAH/c9c8=\")","v":{"$error":"#VALUE!"}},{"$f":"AND(DataSheet!D106,\"AAAAAH/c9dA=\")","v":{"$error":"#VALUE!"}},{"$f":"AND(DataSheet!E106,\"AAAAAH/c9dE=\")","v":{"$error":"#VALUE!"}},{"$f":"AND(DataSheet!F106,\"AAAAAH/c9dI=\")","v":{"$error":"#VALUE!"}},{"$f":"AND(DataSheet!G106,\"AAAAAH/c9dM=\")","v":{"$error":"#VALUE!"}},{"$f":"AND(DataSheet!H106,\"AAAAAH/c9dQ=\")","v":{"$error":"#VALUE!"}},{"$f":"IF(DataSheet!107:107,\"AAAAAH/c9dU=\",0)","v":0},{"$f":"AND(DataSheet!A107,\"AAAAAH/c9dY=\")","v":{"$error":"#VALUE!"}},{"$f":"AND(DataSheet!B107,\"AAAAAH/c9dc=\")","v":{"$error":"#VALUE!"}},{"$f":"AND(DataSheet!C107,\"AAAAAH/c9dg=\")","v":{"$error":"#VALUE!"}},{"$f":"AND(DataSheet!D107,\"AAAAAH/c9dk=\")","v":{"$error":"#VALUE!"}},{"$f":"AND(DataSheet!E107,\"AAAAAH/c9do=\")","v":{"$error":"#VALUE!"}},{"$f":"AND(DataSheet!F107,\"AAAAAH/c9ds=\")","v":{"$error":"#VALUE!"}},{"$f":"AND(DataSheet!G107,\"AAAAAH/c9dw=\")","v":{"$error":"#VALUE!"}},{"$f":"AND(DataSheet!H107,\"AAAAAH/c9d0=\")","v":{"$error":"#VALUE!"}},{"$f":"IF(DataSheet!108:108,\"AAAAAH/c9d4=\",0)","v":0},{"$f":"AND(DataSheet!A108,\"AAAAAH/c9d8=\")","v":{"$error":"#VALUE!"}},{"$f":"AND(DataSheet!B108,\"AAAAAH/c9eA=\")","v":{"$error":"#VALUE!"}},{"$f":"AND(DataSheet!C108,\"AAAAAH/c9eE=\")","v":{"$error":"#VALUE!"}},{"$f":"AND(DataSheet!D108,\"AAAAAH/c9eI=\")","v":{"$error":"#VALUE!"}},{"$f":"AND(DataSheet!E108,\"AAAAAH/c9eM=\")","v":{"$error":"#VALUE!"}},{"$f":"AND(DataSheet!F108,\"AAAAAH/c9eQ=\")","v":{"$error":"#VALUE!"}},{"$f":"AND(DataSheet!G108,\"AAAAAH/c9eU=\")","v":{"$error":"#VALUE!"}},{"$f":"AND(DataSheet!H108,\"AAAAAH/c9eY=\")","v":{"$error":"#VALUE!"}},{"$f":"IF(DataSheet!109:109,\"AAAAAH/c9ec=\",0)","v":0},{"$f":"AND(DataSheet!A109,\"AAAAAH/c9eg=\")","v":{"$error":"#VALUE!"}},{"$f":"AND(DataSheet!B109,\"AAAAAH/c9ek=\")","v":{"$error":"#VALUE!"}},{"$f":"AND(DataSheet!C109,\"AAAAAH/c9eo=\")","v":{"$error":"#VALUE!"}},{"$f":"AND(DataSheet!D109,\"AAAAAH/c9es=\")","v":{"$error":"#VALUE!"}},{"$f":"AND(DataSheet!E109,\"AAAAAH/c9ew=\")","v":{"$error":"#VALUE!"}},{"$f":"AND(DataSheet!F109,\"AAAAAH/c9e0=\")","v":{"$error":"#VALUE!"}},{"$f":"AND(DataSheet!G109,\"AAAAAH/c9e4=\")","v":{"$error":"#VALUE!"}},{"$f":"AND(DataSheet!H109,\"AAAAAH/c9e8=\")","v":{"$error":"#VALUE!"}},{"$f":"IF(DataSheet!110:110,\"AAAAAH/c9fA=\",0)","v":0},{"$f":"AND(DataSheet!A110,\"AAAAAH/c9fE=\")","v":{"$error":"#VALUE!"}},{"$f":"AND(DataSheet!B110,\"AAAAAH/c9fI=\")","v":{"$error":"#VALUE!"}},{"$f":"AND(DataSheet!C110,\"AAAAAH/c9fM=\")","v":{"$error":"#VALUE!"}},{"$f":"AND(DataSheet!D110,\"AAAAAH/c9fQ=\")","v":{"$error":"#VALUE!"}},{"$f":"AND(DataSheet!E110,\"AAAAAH/c9fU=\")","v":{"$error":"#VALUE!"}},{"$f":"AND(DataSheet!F110,\"AAAAAH/c9fY=\")","v":{"$error":"#VALUE!"}},{"$f":"AND(DataSheet!G110,\"AAAAAH/c9fc=\")","v":{"$error":"#VALUE!"}},{"$f":"AND(DataSheet!H110,\"AAAAAH/c9fg=\")","v":{"$error":"#VALUE!"}},{"$f":"IF(DataSheet!111:111,\"AAAAAH/c9fk=\",0)","v":0},{"$f":"AND(DataSheet!A111,\"AAAAAH/c9fo=\")","v":{"$error":"#VALUE!"}},{"$f":"AND(DataSheet!B111,\"AAAAAH/c9fs=\")","v":{"$error":"#VALUE!"}},{"$f":"AND(DataSheet!C111,\"AAAAAH/c9fw=\")","v":{"$error":"#VALUE!"}},{"$f":"AND(DataSheet!D111,\"AAAAAH/c9f0=\")","v":{"$error":"#VALUE!"}},{"$f":"AND(DataSheet!E111,\"AAAAAH/c9f4=\")","v":{"$error":"#VALUE!"}},{"$f":"AND(DataSheet!F111,\"AAAAAH/c9f8=\")","v":{"$error":"#VALUE!"}}]
[{"$f":"AND(DataSheet!G111,\"AAAAAH5/+gA=\")","v":{"$error":"#VALUE!"}},{"$f":"AND(DataSheet!H111,\"AAAAAH5/+gE=\")","v":{"$error":"#VALUE!"}},{"$f":"IF(DataSheet!112:112,\"AAAAAH5/+gI=\",0)","v":{"$error":"#VALUE!"}},{"$f":"AND(DataSheet!A112,\"AAAAAH5/+gM=\")","v":{"$error":"#VALUE!"}},{"$f":"AND(DataSheet!B112,\"AAAAAH5/+gQ=\")","v":{"$error":"#VALUE!"}},{"$f":"AND(DataSheet!C112,\"AAAAAH5/+gU=\")","v":{"$error":"#VALUE!"}},{"$f":"AND(DataSheet!D112,\"AAAAAH5/+gY=\")","v":{"$error":"#VALUE!"}},{"$f":"AND(DataSheet!E112,\"AAAAAH5/+gc=\")","v":{"$error":"#VALUE!"}},{"$f":"AND(DataSheet!F112,\"AAAAAH5/+gg=\")","v":{"$error":"#VALUE!"}},{"$f":"AND(DataSheet!G112,\"AAAAAH5/+gk=\")","v":{"$error":"#VALUE!"}},{"$f":"AND(DataSheet!H112,\"AAAAAH5/+go=\")","v":{"$error":"#VALUE!"}},{"$f":"IF(DataSheet!113:113,\"AAAAAH5/+gs=\",0)","v":0},{"$f":"AND(DataSheet!A113,\"AAAAAH5/+gw=\")","v":{"$error":"#VALUE!"}},{"$f":"AND(DataSheet!B113,\"AAAAAH5/+g0=\")","v":{"$error":"#VALUE!"}},{"$f":"AND(DataSheet!C113,\"AAAAAH5/+g4=\")","v":{"$error":"#VALUE!"}},{"$f":"AND(DataSheet!D113,\"AAAAAH5/+g8=\")","v":{"$error":"#VALUE!"}},{"$f":"AND(DataSheet!E113,\"AAAAAH5/+hA=\")","v":{"$error":"#VALUE!"}},{"$f":"AND(DataSheet!F113,\"AAAAAH5/+hE=\")","v":{"$error":"#VALUE!"}},{"$f":"AND(DataSheet!G113,\"AAAAAH5/+hI=\")","v":{"$error":"#VALUE!"}},{"$f":"AND(DataSheet!H113,\"AAAAAH5/+hM=\")","v":{"$error":"#VALUE!"}},{"$f":"IF(DataSheet!114:114,\"AAAAAH5/+hQ=\",0)","v":0},{"$f":"AND(DataSheet!A114,\"AAAAAH5/+hU=\")","v":{"$error":"#VALUE!"}},{"$f":"AND(DataSheet!B114,\"AAAAAH5/+hY=\")","v":{"$error":"#VALUE!"}},{"$f":"AND(DataSheet!C114,\"AAAAAH5/+hc=\")","v":{"$error":"#VALUE!"}},{"$f":"AND(DataSheet!D114,\"AAAAAH5/+hg=\")","v":{"$error":"#VALUE!"}},{"$f":"AND(DataSheet!E114,\"AAAAAH5/+hk=\")","v":{"$error":"#VALUE!"}},{"$f":"AND(DataSheet!F114,\"AAAAAH5/+ho=\")","v":{"$error":"#VALUE!"}},{"$f":"AND(DataSheet!G114,\"AAAAAH5/+hs=\")","v":{"$error":"#VALUE!"}},{"$f":"AND(DataSheet!H114,\"AAAAAH5/+hw=\")","v":{"$error":"#VALUE!"}},{"$f":"IF(DataSheet!115:115,\"AAAAAH5/+h0=\",0)","v":0},{"$f":"AND(DataSheet!A115,\"AAAAAH5/+h4=\")","v":{"$error":"#VALUE!"}},{"$f":"AND(DataSheet!B115,\"AAAAAH5/+h8=\")","v":{"$error":"#VALUE!"}},{"$f":"AND(DataSheet!C115,\"AAAAAH5/+iA=\")","v":{"$error":"#VALUE!"}},{"$f":"AND(DataSheet!D115,\"AAAAAH5/+iE=\")","v":{"$error":"#VALUE!"}},{"$f":"AND(DataSheet!E115,\"AAAAAH5/+iI=\")","v":{"$error":"#VALUE!"}},{"$f":"AND(DataSheet!F115,\"AAAAAH5/+iM=\")","v":{"$error":"#VALUE!"}},{"$f":"AND(DataSheet!G115,\"AAAAAH5/+iQ=\")","v":{"$error":"#VALUE!"}},{"$f":"AND(DataSheet!H115,\"AAAAAH5/+iU=\")","v":{"$error":"#VALUE!"}},{"$f":"IF(DataSheet!116:116,\"AAAAAH5/+iY=\",0)","v":0},{"$f":"AND(DataSheet!A116,\"AAAAAH5/+ic=\")","v":{"$error":"#VALUE!"}},{"$f":"AND(DataSheet!B116,\"AAAAAH5/+ig=\")","v":{"$error":"#VALUE!"}},{"$f":"AND(DataSheet!C116,\"AAAAAH5/+ik=\")","v":{"$error":"#VALUE!"}},{"$f":"AND(DataSheet!D116,\"AAAAAH5/+io=\")","v":{"$error":"#VALUE!"}},{"$f":"AND(DataSheet!E116,\"AAAAAH5/+is=\")","v":{"$error":"#VALUE!"}},{"$f":"AND(DataSheet!F116,\"AAAAAH5/+iw=\")","v":{"$error":"#VALUE!"}},{"$f":"AND(DataSheet!G116,\"AAAAAH5/+i0=\")","v":{"$error":"#VALUE!"}},{"$f":"AND(DataSheet!H116,\"AAAAAH5/+i4=\")","v":{"$error":"#VALUE!"}},{"$f":"IF(DataSheet!117:117,\"AAAAAH5/+i8=\",0)","v":0},{"$f":"AND(DataSheet!A117,\"AAAAAH5/+jA=\")","v":{"$error":"#VALUE!"}},{"$f":"AND(DataSheet!B117,\"AAAAAH5/+jE=\")","v":{"$error":"#VALUE!"}},{"$f":"AND(DataSheet!C117,\"AAAAAH5/+jI=\")","v":{"$error":"#VALUE!"}},{"$f":"AND(DataSheet!D117,\"AAAAAH5/+jM=\")","v":{"$error":"#VALUE!"}},{"$f":"AND(DataSheet!E117,\"AAAAAH5/+jQ=\")","v":{"$error":"#VALUE!"}},{"$f":"AND(DataSheet!F117,\"AAAAAH5/+jU=\")","v":{"$error":"#VALUE!"}},{"$f":"AND(DataSheet!G117,\"AAAAAH5/+jY=\")","v":{"$error":"#VALUE!"}},{"$f":"AND(DataSheet!H117,\"AAAAAH5/+jc=\")","v":{"$error":"#VALUE!"}},{"$f":"IF(DataSheet!118:118,\"AAAAAH5/+jg=\",0)","v":0},{"$f":"AND(DataSheet!A118,\"AAAAAH5/+jk=\")","v":{"$error":"#VALUE!"}},{"$f":"AND(DataSheet!B118,\"AAAAAH5/+jo=\")","v":{"$error":"#VALUE!"}},{"$f":"AND(DataSheet!C118,\"AAAAAH5/+js=\")","v":{"$error":"#VALUE!"}},{"$f":"AND(DataSheet!D118,\"AAAAAH5/+jw=\")","v":{"$error":"#VALUE!"}},{"$f":"AND(DataSheet!E118,\"AAAAAH5/+j0=\")","v":{"$error":"#VALUE!"}},{"$f":"AND(DataSheet!F118,\"AAAAAH5/+j4=\")","v":{"$error":"#VALUE!"}},{"$f":"AND(DataSheet!G118,\"AAAAAH5/+j8=\")","v":{"$error":"#VALUE!"}},{"$f":"AND(DataSheet!H118,\"AAAAAH5/+kA=\")","v":{"$error":"#VALUE!"}},{"$f":"IF(DataSheet!A:A,\"AAAAAH5/+kE=\",0)","v":{"$error":"#VALUE!"}},{"$f":"IF(DataSheet!B:B,\"AAAAAH5/+kI=\",0)","v":"AAAAAH5/+kI="},{"$f":"IF(DataSheet!C:C,\"AAAAAH5/+kM=\",0)","v":{"$error":"#VALUE!"}},{"$f":"IF(DataSheet!D:D,\"AAAAAH5/+kQ=\",0)","v":{"$error":"#VALUE!"}},{"$f":"IF(DataSheet!E:E,\"AAAAAH5/+kU=\",0)","v":{"$error":"#VALUE!"}},{"$f":"IF(DataSheet!F:F,\"AAAAAH5/+kY=\",0)","v":{"$error":"#VALUE!"}},{"$f":"IF(DataSheet!G:G,\"AAAAAH5/+kc=\",0)","v":{"$error":"#VALUE!"}},{"$f":"IF(DataSheet!H:H,\"AAAAAH5/+kg=\",0)","v":{"$error":"#VALUE!"}},{"$f":"IF(DataSheet!I:I,\"AAAAAH5/+kk=\",0)","v":0},{"$f":"IF(DataSheet!J:J,\"AAAAAH5/+ko=\",0)","v":0},{"$f":"IF(DataSheet!K:K,\"AAAAAH5/+ks=\",0)","v":0},{"$f":"IF(DataSheet!L:L,\"AAAAAH5/+kw=\",0)","v":0},{"$f":"IF(DataSheet!M:M,\"AAAAAH5/+k0=\",0)","v":0},{"$f":"IF(DataSheet!N:N,\"AAAAAH5/+k4=\",0)","v":0},{"$f":"IF(DataSheet!O:O,\"AAAAAH5/+k8=\",0)","v":0},{"$f":"IF(DataSheet!P:P,\"AAAAAH5/+lA=\",0)","v":0},{"$f":"IF(DataSheet!Q:Q,\"AAAAAH5/+lE=\",0)","v":0},{"$f":"IF(DataSheet!R:R,\"AAAAAH5/+lI=\",0)","v":0},{"$f":"IF(DataSheet!S:S,\"AAAAAH5/+lM=\",0)","v":0},{"$f":"IF(DataSheet!T:T,\"AAAAAH5/+lQ=\",0)","v":0},{"$f":"IF(DataSheet!U:U,\"AAAAAH5/+lU=\",0)","v":0},{"$f":"IF(DataSheet!V:V,\"AAAAAH5/+lY=\",0)","v":0},{"$f":"IF(DataSheet!W:W,\"AAAAAH5/+lc=\",0)","v":0},{"$f":"IF(DataSheet!X:X,\"AAAAAH5/+lg=\",0)","v":0},{"$f":"IF(DataSheet!Y:Y,\"AAAAAH5/+lk=\",0)","v":0},{"$f":"IF(DataSheet!Z:Z,\"AAAAAH5/+lo=\",0)","v":0},{"$f":"IF(DataSheet!AA:AA,\"AAAAAH5/+ls=\",0)","v":0},{"$f":"IF(DataSheet!AB:AB,\"AAAAAH5/+lw=\",0)","v":0},{"$f":"IF(DataSheet!AC:AC,\"AAAAAH5/+l0=\",0)","v":0},{"$f":"IF(DataSheet!AD:AD,\"AAAAAH5/+l4=\",0)","v":0},{"$f":"IF(DataSheet!AE:AE,\"AAAAAH5/+l8=\",0)","v":0},{"$f":"IF(DataSheet!AF:AF,\"AAAAAH5/+mA=\",0)","v":0},{"$f":"IF(DataSheet!AG:AG,\"AAAAAH5/+mE=\",0)","v":0},{"$f":"IF(DataSheet!AH:AH,\"AAAAAH5/+mI=\",0)","v":0},{"$f":"IF(DataSheet!AI:AI,\"AAAAAH5/+mM=\",0)","v":0},{"$f":"IF(DataSheet!AJ:AJ,\"AAAAAH5/+mQ=\",0)","v":0},{"$f":"IF(DataSheet!AK:AK,\"AAAAAH5/+mU=\",0)","v":0},{"$f":"IF(DataSheet!AL:AL,\"AAAAAH5/+mY=\",0)","v":0},{"$f":"IF(DataSheet!AM:AM,\"AAAAAH5/+mc=\",0)","v":0},{"$f":"IF(DataSheet!AN:AN,\"AAAAAH5/+mg=\",0)","v":0},{"$f":"IF(DataSheet!AO:AO,\"AAAAAH5/+mk=\",0)","v":0},{"$f":"IF(DataSheet!AP:AP,\"AAAAAH5/+mo=\",0)","v":0},{"$f":"IF(DataSheet!AQ:AQ,\"AAAAAH5/+ms=\",0)","v":0},{"$f":"IF(DataSheet!AR:AR,\"AAAAAH5/+mw=\",0)","v":0},{"$f":"IF(DataSheet!AS:AS,\"AAAAAH5/+m0=\",0)","v":0},{"$f":"IF(DataSheet!AT:AT,\"AAAAAH5/+m4=\",0)","v":0},{"$f":"IF(DataSheet!AU:AU,\"AAAAAH5/+m8=\",0)","v":0},{"$f":"IF(DataForm!1:1,\"AAAAAH5/+nA=\",0)","v":0},{"$f":"AND(DataForm!A1,\"AAAAAH5/+nE=\")","v":{"$error":"#VALUE!"}},{"$f":"AND(DataForm!B1,\"AAAAAH5/+nI=\")","v":{"$error":"#VALUE!"}},{"$f":"AND(DataForm!C1,\"AAAAAH5/+nM=\")","v":{"$error":"#VALUE!"}},{"$f":"AND(DataForm!D1,\"AAAAAH5/+nQ=\")","v":{"$error":"#VALUE!"}},{"$f":"AND(DataForm!E1,\"AAAAAH5/+nU=\")","v":{"$error":"#VALUE!"}},{"$f":"AND(DataForm!F1,\"AAAAAH5/+nY=\")","v":{"$error":"#VALUE!"}},{"$f":"AND(DataForm!G1,\"AAAAAH5/+nc=\")","v":{"$error":"#VALUE!"}},{"$f":"AND(DataForm!H1,\"AAAAAH5/+ng=\")","v":{"$error":"#VALUE!"}},{"$f":"AND(DataForm!I1,\"AAAAAH5/+nk=\")","v":{"$error":"#VALUE!"}},{"$f":"AND(DataForm!J1,\"AAAAAH5/+no=\")","v":{"$error":"#VALUE!"}},{"$f":"AND(DataForm!K1,\"AAAAAH5/+ns=\")","v":{"$error":"#VALUE!"}},{"$f":"AND(DataForm!L1,\"AAAAAH5/+nw=\")","v":{"$error":"#VALUE!"}},{"$f":"AND(DataForm!M1,\"AAAAAH5/+n0=\")","v":{"$error":"#VALUE!"}},{"$f":"AND(DataForm!N1,\"AAAAAH5/+n4=\")","v":{"$error":"#VALUE!"}},{"$f":"AND(DataForm!O1,\"AAAAAH5/+n8=\")","v":{"$error":"#VALUE!"}},{"$f":"AND(DataForm!P1,\"AAAAAH5/+oA=\")","v":{"$error":"#VALUE!"}},{"$f":"AND(DataForm!Q1,\"AAAAAH5/+oE=\")","v":{"$error":"#VALUE!"}},{"$f":"AND(DataForm!R1,\"AAAAAH5/+oI=\")","v":{"$error":"#VALUE!"}},{"$f":"AND(DataForm!S1,\"AAAAAH5/+oM=\")","v":{"$error":"#VALUE!"}},{"$f":"AND(DataForm!T1,\"AAAAAH5/+oQ=\")","v":{"$error":"#VALUE!"}},{"$f":"AND(DataForm!U1,\"AAAAAH5/+oU=\")","v":{"$error":"#VALUE!"}},{"$f":"AND(DataForm!V1,\"AAAAAH5/+oY=\")","v":{"$error":"#VALUE!"}},{"$f":"IF(DataForm!2:2,\"AAAAAH5/+oc=\",0)","v":0},{"$f":"AND(DataForm!A2,\"AAAAAH5/+og=\")","v":{"$error":"#VALUE!"}},{"$f":"AND(DataForm!B2,\"AAAAAH5/+ok=\")","v":{"$error":"#VALUE!"}},{"$f":"AND(DataForm!C2,\"AAAAAH5/+oo=\")","v":{"$error":"#VALUE!"}},{"$f":"AND(DataForm!D2,\"AAAAAH5/+os=\")","v":{"$error":"#VALUE!"}},{"$f":"AND(DataForm!E2,\"AAAAAH5/+ow=\")","v":{"$error":"#VALUE!"}},{"$f":"AND(DataForm!F2,\"AAAAAH5/+o0=\")","v":{"$error":"#VALUE!"}},{"$f":"AND(DataForm!G2,\"AAAAAH5/+o4=\")","v":{"$error":"#VALUE!"}},{"$f":"AND(DataForm!H2,\"AAAAAH5/+o8=\")","v":{"$error":"#VALUE!"}},{"$f":"AND(DataForm!I2,\"AAAAAH5/+pA=\")","v":{"$error":"#VALUE!"}},{"$f":"AND(DataForm!J2,\"AAAAAH5/+pE=\")","v":{"$error":"#VALUE!"}},{"$f":"AND(DataForm!K2,\"AAAAAH5/+pI=\")","v":{"$error":"#VALUE!"}},{"$f":"AND(DataForm!L2,\"AAAAAH5/+pM=\")","v":{"$error":"#VALUE!"}},{"$f":"AND(DataForm!M2,\"AAAAAH5/+pQ=\")","v":{"$error":"#VALUE!"}},{"$f":"AND(DataForm!N2,\"AAAAAH5/+pU=\")","v":{"$error":"#VALUE!"}},{"$f":"AND(DataForm!O2,\"AAAAAH5/+pY=\")","v":{"$error":"#VALUE!"}},{"$f":"AND(DataForm!P2,\"AAAAAH5/+pc=\")","v":{"$error":"#VALUE!"}},{"$f":"AND(DataForm!Q2,\"AAAAAH5/+pg=\")","v":{"$error":"#VALUE!"}},{"$f":"AND(DataForm!R2,\"AAAAAH5/+pk=\")","v":{"$error":"#VALUE!"}},{"$f":"AND(DataForm!S2,\"AAAAAH5/+po=\")","v":{"$error":"#VALUE!"}},{"$f":"AND(DataForm!T2,\"AAAAAH5/+ps=\")","v":{"$error":"#VALUE!"}},{"$f":"AND(DataForm!U2,\"AAAAAH5/+pw=\")","v":{"$error":"#VALUE!"}},{"$f":"AND(DataForm!V2,\"AAAAAH5/+p0=\")","v":{"$error":"#VALUE!"}},{"$f":"IF(DataForm!3:3,\"AAAAAH5/+p4=\",0)","v":0},{"$f":"AND(DataForm!A3,\"AAAAAH5/+p8=\")","v":{"$error":"#VALUE!"}},{"$f":"AND(DataForm!B3,\"AAAAAH5/+qA=\")","v":{"$error":"#VALUE!"}},{"$f":"AND(DataForm!C3,\"AAAAAH5/+qE=\")","v":{"$error":"#VALUE!"}},{"$f":"AND(DataForm!D3,\"AAAAAH5/+qI=\")","v":{"$error":"#VALUE!"}},{"$f":"AND(DataForm!E3,\"AAAAAH5/+qM=\")","v":{"$error":"#VALUE!"}},{"$f":"AND(DataForm!F3,\"AAAAAH5/+qQ=\")","v":{"$error":"#VALUE!"}},{"$f":"AND(DataForm!G3,\"AAAAAH5/+qU=\")","v":{"$error":"#VALUE!"}},{"$f":"AND(DataForm!H3,\"AAAAAH5/+qY=\")","v":{"$error":"#VALUE!"}},{"$f":"AND(DataForm!I3,\"AAAAAH5/+qc=\")","v":{"$error":"#VALUE!"}},{"$f":"AND(DataForm!J3,\"AAAAAH5/+qg=\")","v":{"$error":"#VALUE!"}},{"$f":"AND(DataForm!K3,\"AAAAAH5/+qk=\")","v":{"$error":"#VALUE!"}},{"$f":"AND(DataForm!L3,\"AAAAAH5/+qo=\")","v":{"$error":"#VALUE!"}},{"$f":"AND(DataForm!M3,\"AAAAAH5/+qs=\")","v":{"$error":"#VALUE!"}},{"$f":"AND(DataForm!N3,\"AAAAAH5/+qw=\")","v":{"$error":"#VALUE!"}},{"$f":"AND(DataForm!O3,\"AAAAAH5/+q0=\")","v":{"$error":"#VALUE!"}},{"$f":"AND(DataForm!P3,\"AAAAAH5/+q4=\")","v":{"$error":"#VALUE!"}},{"$f":"AND(DataForm!Q3,\"AAAAAH5/+q8=\")","v":{"$error":"#VALUE!"}},{"$f":"AND(DataForm!R3,\"AAAAAH5/+rA=\")","v":{"$error":"#VALUE!"}},{"$f":"AND(DataForm!S3,\"AAAAAH5/+rE=\")","v":{"$error":"#VALUE!"}},{"$f":"AND(DataForm!T3,\"AAAAAH5/+rI=\")","v":{"$error":"#VALUE!"}},{"$f":"AND(DataForm!U3,\"AAAAAH5/+rM=\")","v":{"$error":"#VALUE!"}},{"$f":"AND(DataForm!V3,\"AAAAAH5/+rQ=\")","v":{"$error":"#VALUE!"}},{"$f":"IF(DataForm!4:4,\"AAAAAH5/+rU=\",0)","v":0},{"$f":"AND(DataForm!A4,\"AAAAAH5/+rY=\")","v":{"$error":"#VALUE!"}},{"$f":"AND(DataForm!B4,\"AAAAAH5/+rc=\")","v":{"$error":"#VALUE!"}},{"$f":"AND(DataForm!C4,\"AAAAAH5/+rg=\")","v":{"$error":"#VALUE!"}},{"$f":"AND(DataForm!D4,\"AAAAAH5/+rk=\")","v":{"$error":"#VALUE!"}},{"$f":"AND(DataForm!E4,\"AAAAAH5/+ro=\")","v":{"$error":"#VALUE!"}},{"$f":"AND(DataForm!F4,\"AAAAAH5/+rs=\")","v":{"$error":"#VALUE!"}},{"$f":"AND(DataForm!G4,\"AAAAAH5/+rw=\")","v":{"$error":"#VALUE!"}},{"$f":"AND(DataForm!H4,\"AAAAAH5/+r0=\")","v":{"$error":"#VALUE!"}},{"$f":"AND(DataForm!I4,\"AAAAAH5/+r4=\")","v":{"$error":"#VALUE!"}},{"$f":"AND(DataForm!J4,\"AAAAAH5/+r8=\")","v":{"$error":"#VALUE!"}},{"$f":"AND(DataForm!K4,\"AAAAAH5/+sA=\")","v":{"$error":"#VALUE!"}},{"$f":"AND(DataForm!L4,\"AAAAAH5/+sE=\")","v":{"$error":"#VALUE!"}},{"$f":"AND(DataForm!M4,\"AAAAAH5/+sI=\")","v":{"$error":"#VALUE!"}},{"$f":"AND(DataForm!N4,\"AAAAAH5/+sM=\")","v":{"$error":"#VALUE!"}},{"$f":"AND(DataForm!O4,\"AAAAAH5/+sQ=\")","v":{"$error":"#VALUE!"}},{"$f":"AND(DataForm!P4,\"AAAAAH5/+sU=\")","v":{"$error":"#VALUE!"}},{"$f":"AND(DataForm!Q4,\"AAAAAH5/+sY=\")","v":{"$error":"#VALUE!"}},{"$f":"AND(DataForm!R4,\"AAAAAH5/+sc=\")","v":{"$error":"#VALUE!"}},{"$f":"AND(DataForm!S4,\"AAAAAH5/+sg=\")","v":{"$error":"#VALUE!"}},{"$f":"AND(DataForm!T4,\"AAAAAH5/+sk=\")","v":{"$error":"#VALUE!"}},{"$f":"AND(DataForm!U4,\"AAAAAH5/+so=\")","v":{"$error":"#VALUE!"}},{"$f":"AND(DataForm!V4,\"AAAAAH5/+ss=\")","v":{"$error":"#VALUE!"}},{"$f":"IF(DataForm!5:5,\"AAAAAH5/+sw=\",0)","v":0},{"$f":"AND(DataForm!A5,\"AAAAAH5/+s0=\")","v":{"$error":"#VALUE!"}},{"$f":"AND(DataForm!B5,\"AAAAAH5/+s4=\")","v":{"$error":"#VALUE!"}},{"$f":"AND(DataForm!C5,\"AAAAAH5/+s8=\")","v":{"$error":"#VALUE!"}},{"$f":"AND(DataForm!D5,\"AAAAAH5/+tA=\")","v":{"$error":"#VALUE!"}},{"$f":"AND(DataForm!E5,\"AAAAAH5/+tE=\")","v":{"$error":"#VALUE!"}},{"$f":"AND(DataForm!F5,\"AAAAAH5/+tI=\")","v":{"$error":"#VALUE!"}},{"$f":"AND(DataForm!G5,\"AAAAAH5/+tM=\")","v":{"$error":"#VALUE!"}},{"$f":"AND(DataForm!H5,\"AAAAAH5/+tQ=\")","v":{"$error":"#VALUE!"}},{"$f":"AND(DataForm!I5,\"AAAAAH5/+tU=\")","v":{"$error":"#VALUE!"}},{"$f":"AND(DataForm!J5,\"AAAAAH5/+tY=\")","v":{"$error":"#VALUE!"}},{"$f":"AND(DataForm!K5,\"AAAAAH5/+tc=\")","v":{"$error":"#VALUE!"}},{"$f":"AND(DataForm!L5,\"AAAAAH5/+tg=\")","v":{"$error":"#VALUE!"}},{"$f":"AND(DataForm!M5,\"AAAAAH5/+tk=\")","v":{"$error":"#VALUE!"}},{"$f":"AND(DataForm!N5,\"AAAAAH5/+to=\")","v":{"$error":"#VALUE!"}},{"$f":"AND(DataForm!O5,\"AAAAAH5/+ts=\")","v":{"$error":"#VALUE!"}},{"$f":"AND(DataForm!P5,\"AAAAAH5/+tw=\")","v":{"$error":"#VALUE!"}},{"$f":"AND(DataForm!Q5,\"AAAAAH5/+t0=\")","v":{"$error":"#VALUE!"}},{"$f":"AND(DataForm!R5,\"AAAAAH5/+t4=\")","v":{"$error":"#VALUE!"}},{"$f":"AND(DataForm!S5,\"AAAAAH5/+t8=\")","v":{"$error":"#VALUE!"}},{"$f":"AND(DataForm!T5,\"AAAAAH5/+uA=\")","v":{"$error":"#VALUE!"}},{"$f":"AND(DataForm!U5,\"AAAAAH5/+uE=\")","v":{"$error":"#VALUE!"}},{"$f":"AND(DataForm!V5,\"AAAAAH5/+uI=\")","v":{"$error":"#VALUE!"}},{"$f":"IF(DataForm!6:6,\"AAAAAH5/+uM=\",0)","v":0},{"$f":"AND(DataForm!A6,\"AAAAAH5/+uQ=\")","v":{"$error":"#VALUE!"}},{"$f":"AND(DataForm!B6,\"AAAAAH5/+uU=\")","v":{"$error":"#VALUE!"}},{"$f":"AND(DataForm!C6,\"AAAAAH5/+uY=\")","v":{"$error":"#VALUE!"}},{"$f":"AND(DataForm!D6,\"AAAAAH5/+uc=\")","v":{"$error":"#VALUE!"}},{"$f":"AND(DataForm!E6,\"AAAAAH5/+ug=\")","v":{"$error":"#VALUE!"}},{"$f":"AND(DataForm!F6,\"AAAAAH5/+uk=\")","v":{"$error":"#VALUE!"}},{"$f":"AND(DataForm!G6,\"AAAAAH5/+uo=\")","v":{"$error":"#VALUE!"}},{"$f":"AND(DataForm!H6,\"AAAAAH5/+us=\")","v":{"$error":"#VALUE!"}},{"$f":"AND(DataForm!I6,\"AAAAAH5/+uw=\")","v":{"$error":"#VALUE!"}},{"$f":"AND(DataForm!J6,\"AAAAAH5/+u0=\")","v":{"$error":"#VALUE!"}},{"$f":"AND(DataForm!K6,\"AAAAAH5/+u4=\")","v":{"$error":"#VALUE!"}},{"$f":"AND(DataForm!L6,\"AAAAAH5/+u8=\")","v":{"$error":"#VALUE!"}},{"$f":"AND(DataForm!M6,\"AAAAAH5/+vA=\")","v":{"$error":"#VALUE!"}},{"$f":"AND(DataForm!N6,\"AAAAAH5/+vE=\")","v":{"$error":"#VALUE!"}},{"$f":"AND(DataForm!O6,\"AAAAAH5/+vI=\")","v":{"$error":"#VALUE!"}},{"$f":"AND(DataForm!P6,\"AAAAAH5/+vM=\")","v":{"$error":"#VALUE!"}},{"$f":"AND(DataForm!Q6,\"AAAAAH5/+vQ=\")","v":{"$error":"#VALUE!"}},{"$f":"AND(DataForm!R6,\"AAAAAH5/+vU=\")","v":{"$error":"#VALUE!"}},{"$f":"AND(DataForm!S6,\"AAAAAH5/+vY=\")","v":{"$error":"#VALUE!"}},{"$f":"AND(DataForm!T6,\"AAAAAH5/+vc=\")","v":{"$error":"#VALUE!"}},{"$f":"AND(DataForm!U6,\"AAAAAH5/+vg=\")","v":{"$error":"#VALUE!"}},{"$f":"AND(DataForm!V6,\"AAAAAH5/+vk=\")","v":{"$error":"#VALUE!"}},{"$f":"IF(DataForm!7:7,\"AAAAAH5/+vo=\",0)","v":0},{"$f":"AND(DataForm!A7,\"AAAAAH5/+vs=\")","v":{"$error":"#VALUE!"}},{"$f":"AND(DataForm!B7,\"AAAAAH5/+vw=\")","v":{"$error":"#VALUE!"}},{"$f":"AND(DataForm!C7,\"AAAAAH5/+v0=\")","v":{"$error":"#VALUE!"}},{"$f":"AND(DataForm!D7,\"AAAAAH5/+v4=\")","v":{"$error":"#VALUE!"}},{"$f":"AND(DataForm!E7,\"AAAAAH5/+v8=\")","v":{"$error":"#VALUE!"}}]
[{"$f":"AND(DataForm!F7,\"AAAAAG/+nwA=\")","v":{"$error":"#VALUE!"}},{"$f":"AND(DataForm!G7,\"AAAAAG/+nwE=\")","v":{"$error":"#VALUE!"}},{"$f":"AND(DataForm!H7,\"AAAAAG/+nwI=\")","v":{"$error":"#VALUE!"}},{"$f":"AND(DataForm!I7,\"AAAAAG/+nwM=\")","v":{"$error":"#VALUE!"}},{"$f":"AND(DataForm!J7,\"AAAAAG/+nwQ=\")","v":{"$error":"#VALUE!"}},{"$f":"AND(DataForm!K7,\"AAAAAG/+nwU=\")","v":{"$error":"#VALUE!"}},{"$f":"AND(DataForm!L7,\"AAAAAG/+nwY=\")","v":{"$error":"#VALUE!"}},{"$f":"AND(DataForm!M7,\"AAAAAG/+nwc=\")","v":{"$error":"#VALUE!"}},{"$f":"AND(DataForm!N7,\"AAAAAG/+nwg=\")","v":{"$error":"#VALUE!"}},{"$f":"AND(DataForm!O7,\"AAAAAG/+nwk=\")","v":{"$error":"#VALUE!"}},{"$f":"AND(DataForm!P7,\"AAAAAG/+nwo=\")","v":{"$error":"#VALUE!"}},{"$f":"AND(DataForm!Q7,\"AAAAAG/+nws=\")","v":{"$error":"#VALUE!"}},{"$f":"AND(DataForm!R7,\"AAAAAG/+nww=\")","v":{"$error":"#VALUE!"}},{"$f":"AND(DataForm!S7,\"AAAAAG/+nw0=\")","v":{"$error":"#VALUE!"}},{"$f":"AND(DataForm!T7,\"AAAAAG/+nw4=\")","v":{"$error":"#VALUE!"}},{"$f":"AND(DataForm!U7,\"AAAAAG/+nw8=\")","v":{"$error":"#VALUE!"}},{"$f":"AND(DataForm!V7,\"AAAAAG/+nxA=\")","v":{"$error":"#VALUE!"}},{"$f":"IF(DataForm!8:8,\"AAAAAG/+nxE=\",0)","v":{"$error":"#VALUE!"}},{"$f":"AND(DataForm!A8,\"AAAAAG/+nxI=\")","v":{"$error":"#VALUE!"}},{"$f":"AND(DataForm!B8,\"AAAAAG/+nxM=\")","v":{"$error":"#VALUE!"}},{"$f":"AND(DataForm!C8,\"AAAAAG/+nxQ=\")","v":{"$error":"#VALUE!"}},{"$f":"AND(DataForm!D8,\"AAAAAG/+nxU=\")","v":{"$error":"#VALUE!"}},{"$f":"AND(DataForm!E8,\"AAAAAG/+nxY=\")","v":{"$error":"#VALUE!"}},{"$f":"AND(DataForm!F8,\"AAAAAG/+nxc=\")","v":{"$error":"#VALUE!"}},{"$f":"AND(DataForm!G8,\"AAAAAG/+nxg=\")","v":{"$error":"#VALUE!"}},{"$f":"AND(DataForm!H8,\"AAAAAG/+nxk=\")","v":{"$error":"#VALUE!"}},{"$f":"AND(DataForm!I8,\"AAAAAG/+nxo=\")","v":{"$error":"#VALUE!"}},{"$f":"AND(DataForm!J8,\"AAAAAG/+nxs=\")","v":{"$error":"#VALUE!"}},{"$f":"AND(DataForm!K8,\"AAAAAG/+nxw=\")","v":{"$error":"#VALUE!"}},{"$f":"AND(DataForm!L8,\"AAAAAG/+nx0=\")","v":{"$error":"#VALUE!"}},{"$f":"AND(DataForm!M8,\"AAAAAG/+nx4=\")","v":{"$error":"#VALUE!"}},{"$f":"AND(DataForm!N8,\"AAAAAG/+nx8=\")","v":{"$error":"#VALUE!"}},{"$f":"AND(DataForm!O8,\"AAAAAG/+nyA=\")","v":{"$error":"#VALUE!"}},{"$f":"AND(DataForm!P8,\"AAAAAG/+nyE=\")","v":{"$error":"#VALUE!"}},{"$f":"AND(DataForm!Q8,\"AAAAAG/+nyI=\")","v":{"$error":"#VALUE!"}},{"$f":"AND(DataForm!R8,\"AAAAAG/+nyM=\")","v":{"$error":"#VALUE!"}},{"$f":"AND(DataForm!S8,\"AAAAAG/+nyQ=\")","v":{"$error":"#VALUE!"}},{"$f":"AND(DataForm!T8,\"AAAAAG/+nyU=\")","v":{"$error":"#VALUE!"}},{"$f":"AND(DataForm!U8,\"AAAAAG/+nyY=\")","v":{"$error":"#VALUE!"}},{"$f":"AND(DataForm!V8,\"AAAAAG/+nyc=\")","v":{"$error":"#VALUE!"}},{"$f":"IF(DataForm!9:9,\"AAAAAG/+nyg=\",0)","v":0},{"$f":"AND(DataForm!A9,\"AAAAAG/+nyk=\")","v":{"$error":"#VALUE!"}},{"$f":"AND(DataForm!B9,\"AAAAAG/+nyo=\")","v":{"$error":"#VALUE!"}},{"$f":"AND(DataForm!C9,\"AAAAAG/+nys=\")","v":{"$error":"#VALUE!"}},{"$f":"AND(DataForm!D9,\"AAAAAG/+nyw=\")","v":{"$error":"#VALUE!"}},{"$f":"AND(DataForm!E9,\"AAAAAG/+ny0=\")","v":{"$error":"#VALUE!"}},{"$f":"AND(DataForm!F9,\"AAAAAG/+ny4=\")","v":{"$error":"#VALUE!"}},{"$f":"AND(DataForm!G9,\"AAAAAG/+ny8=\")","v":{"$error":"#VALUE!"}},{"$f":"AND(DataForm!H9,\"AAAAAG/+nzA=\")","v":{"$error":"#VALUE!"}},{"$f":"AND(DataForm!I9,\"AAAAAG/+nzE=\")","v":{"$error":"#VALUE!"}},{"$f":"AND(DataForm!J9,\"AAAAAG/+nzI=\")","v":{"$error":"#VALUE!"}},{"$f":"AND(DataForm!K9,\"AAAAAG/+nzM=\")","v":{"$error":"#VALUE!"}},{"$f":"AND(DataForm!L9,\"AAAAAG/+nzQ=\")","v":{"$error":"#VALUE!"}},{"$f":"AND(DataForm!M9,\"AAAAAG/+nzU=\")","v":{"$error":"#VALUE!"}},{"$f":"AND(DataForm!N9,\"AAAAAG/+nzY=\")","v":{"$error":"#VALUE!"}},{"$f":"AND(DataForm!O9,\"AAAAAG/+nzc=\")","v":{"$error":"#VALUE!"}},{"$f":"AND(DataForm!P9,\"AAAAAG/+nzg=\")","v":{"$error":"#VALUE!"}},{"$f":"AND(DataForm!Q9,\"AAAAAG/+nzk=\")","v":{"$error":"#VALUE!"}},{"$f":"AND(DataForm!R9,\"AAAAAG/+nzo=\")","v":{"$error":"#VALUE!"}},{"$f":"AND(DataForm!S9,\"AAAAAG/+nzs=\")","v":{"$error":"#VALUE!"}},{"$f":"AND(DataForm!T9,\"AAAAAG/+nzw=\")","v":{"$error":"#VALUE!"}},{"$f":"AND(DataForm!U9,\"AAAAAG/+nz0=\")","v":{"$error":"#VALUE!"}},{"$f":"AND(DataForm!V9,\"AAAAAG/+nz4=\")","v":{"$error":"#VALUE!"}},{"$f":"IF(DataForm!10:10,\"AAAAAG/+nz8=\",0)","v":0},{"$f":"AND(DataForm!A10,\"AAAAAG/+n0A=\")","v":{"$error":"#VALUE!"}},{"$f":"AND(DataForm!B10,\"AAAAAG/+n0E=\")","v":{"$error":"#VALUE!"}},{"$f":"AND(DataForm!C10,\"AAAAAG/+n0I=\")","v":{"$error":"#VALUE!"}},{"$f":"AND(DataForm!D10,\"AAAAAG/+n0M=\")","v":{"$error":"#VALUE!"}},{"$f":"AND(DataForm!E10,\"AAAAAG/+n0Q=\")","v":{"$error":"#VALUE!"}},{"$f":"AND(DataForm!F10,\"AAAAAG/+n0U=\")","v":{"$error":"#VALUE!"}},{"$f":"AND(DataForm!G10,\"AAAAAG/+n0Y=\")","v":{"$error":"#VALUE!"}},{"$f":"AND(DataForm!H10,\"AAAAAG/+n0c=\")","v":{"$error":"#VALUE!"}},{"$f":"AND(DataForm!I10,\"AAAAAG/+n0g=\")","v":{"$error":"#VALUE!"}},{"$f":"AND(DataForm!J10,\"AAAAAG/+n0k=\")","v":{"$error":"#VALUE!"}},{"$f":"AND(DataForm!K10,\"AAAAAG/+n0o=\")","v":{"$error":"#VALUE!"}},{"$f":"AND(DataForm!L10,\"AAAAAG/+n0s=\")","v":{"$error":"#VALUE!"}},{"$f":"AND(DataForm!M10,\"AAAAAG/+n0w=\")","v":{"$error":"#VALUE!"}},{"$f":"AND(DataForm!N10,\"AAAAAG/+n00=\")","v":{"$error":"#VALUE!"}},{"$f":"AND(DataForm!O10,\"AAAAAG/+n04=\")","v":{"$error":"#VALUE!"}},{"$f":"AND(DataForm!P10,\"AAAAAG/+n08=\")","v":{"$error":"#VALUE!"}},{"$f":"AND(DataForm!Q10,\"AAAAAG/+n1A=\")","v":{"$error":"#VALUE!"}},{"$f":"AND(DataForm!R10,\"AAAAAG/+n1E=\")","v":{"$error":"#VALUE!"}},{"$f":"AND(DataForm!S10,\"AAAAAG/+n1I=\")","v":{"$error":"#VALUE!"}},{"$f":"AND(DataForm!T10,\"AAAAAG/+n1M=\")","v":{"$error":"#VALUE!"}},{"$f":"AND(DataForm!U10,\"AAAAAG/+n1Q=\")","v":{"$error":"#VALUE!"}},{"$f":"AND(DataForm!V10,\"AAAAAG/+n1U=\")","v":{"$error":"#VALUE!"}},{"$f":"IF(DataForm!11:11,\"AAAAAG/+n1Y=\",0)","v":0},{"$f":"AND(DataForm!A11,\"AAAAAG/+n1c=\")","v":{"$error":"#VALUE!"}},{"$f":"AND(DataForm!B11,\"AAAAAG/+n1g=\")","v":{"$error":"#VALUE!"}},{"$f":"AND(DataForm!C11,\"AAAAAG/+n1k=\")","v":{"$error":"#VALUE!"}},{"$f":"AND(DataForm!D11,\"AAAAAG/+n1o=\")","v":{"$error":"#VALUE!"}},{"$f":"AND(DataForm!E11,\"AAAAAG/+n1s=\")","v":{"$error":"#VALUE!"}},{"$f":"AND(DataForm!F11,\"AAAAAG/+n1w=\")","v":{"$error":"#VALUE!"}},{"$f":"AND(DataForm!G11,\"AAAAAG/+n10=\")","v":{"$error":"#VALUE!"}},{"$f":"AND(DataForm!H11,\"AAAAAG/+n14=\")","v":{"$error":"#VALUE!"}},{"$f":"AND(DataForm!I11,\"AAAAAG/+n18=\")","v":{"$error":"#VALUE!"}},{"$f":"AND(DataForm!J11,\"AAAAAG/+n2A=\")","v":{"$error":"#VALUE!"}},{"$f":"AND(DataForm!K11,\"AAAAAG/+n2E=\")","v":{"$error":"#VALUE!"}},{"$f":"AND(DataForm!L11,\"AAAAAG/+n2I=\")","v":{"$error":"#VALUE!"}},{"$f":"AND(DataForm!M11,\"AAAAAG/+n2M=\")","v":{"$error":"#VALUE!"}},{"$f":"AND(DataForm!N11,\"AAAAAG/+n2Q=\")","v":{"$error":"#VALUE!"}},{"$f":"AND(DataForm!O11,\"AAAAAG/+n2U=\")","v":{"$error":"#VALUE!"}},{"$f":"AND(DataForm!P11,\"AAAAAG/+n2Y=\")","v":{"$error":"#VALUE!"}},{"$f":"AND(DataForm!Q11,\"AAAAAG/+n2c=\")","v":{"$error":"#VALUE!"}},{"$f":"AND(DataForm!R11,\"AAAAAG/+n2g=\")","v":{"$error":"#VALUE!"}},{"$f":"AND(DataForm!S11,\"AAAAAG/+n2k=\")","v":{"$error":"#VALUE!"}},{"$f":"AND(DataForm!T11,\"AAAAAG/+n2o=\")","v":{"$error":"#VALUE!"}},{"$f":"AND(DataForm!U11,\"AAAAAG/+n2s=\")","v":{"$error":"#VALUE!"}},{"$f":"AND(DataForm!V11,\"AAAAAG/+n2w=\")","v":{"$error":"#VALUE!"}},{"$f":"IF(DataForm!12:12,\"AAAAAG/+n20=\",0)","v":0},{"$f":"AND(DataForm!A12,\"AAAAAG/+n24=\")","v":{"$error":"#VALUE!"}},{"$f":"AND(DataForm!B12,\"AAAAAG/+n28=\")","v":{"$error":"#VALUE!"}},{"$f":"AND(DataForm!C12,\"AAAAAG/+n3A=\")","v":{"$error":"#VALUE!"}},{"$f":"AND(DataForm!D12,\"AAAAAG/+n3E=\")","v":{"$error":"#VALUE!"}},{"$f":"AND(DataForm!E12,\"AAAAAG/+n3I=\")","v":{"$error":"#VALUE!"}},{"$f":"AND(DataForm!F12,\"AAAAAG/+n3M=\")","v":{"$error":"#VALUE!"}},{"$f":"AND(DataForm!G12,\"AAAAAG/+n3Q=\")","v":{"$error":"#VALUE!"}},{"$f":"AND(DataForm!H12,\"AAAAAG/+n3U=\")","v":{"$error":"#VALUE!"}},{"$f":"AND(DataForm!I12,\"AAAAAG/+n3Y=\")","v":{"$error":"#VALUE!"}},{"$f":"AND(DataForm!J12,\"AAAAAG/+n3c=\")","v":{"$error":"#VALUE!"}},{"$f":"AND(DataForm!K12,\"AAAAAG/+n3g=\")","v":{"$error":"#VALUE!"}},{"$f":"AND(DataForm!L12,\"AAAAAG/+n3k=\")","v":{"$error":"#VALUE!"}},{"$f":"AND(DataForm!M12,\"AAAAAG/+n3o=\")","v":{"$error":"#VALUE!"}},{"$f":"AND(DataForm!N12,\"AAAAAG/+n3s=\")","v":{"$error":"#VALUE!"}},{"$f":"AND(DataForm!O12,\"AAAAAG/+n3w=\")","v":{"$error":"#VALUE!"}},{"$f":"AND(DataForm!P12,\"AAAAAG/+n30=\")","v":{"$error":"#VALUE!"}},{"$f":"AND(DataForm!Q12,\"AAAAAG/+n34=\")","v":{"$error":"#VALUE!"}},{"$f":"AND(DataForm!R12,\"AAAAAG/+n38=\")","v":{"$error":"#VALUE!"}},{"$f":"AND(DataForm!S12,\"AAAAAG/+n4A=\")","v":{"$error":"#VALUE!"}},{"$f":"AND(DataForm!T12,\"AAAAAG/+n4E=\")","v":{"$error":"#VALUE!"}},{"$f":"AND(DataForm!U12,\"AAAAAG/+n4I=\")","v":{"$error":"#VALUE!"}},{"$f":"AND(DataForm!V12,\"AAAAAG/+n4M=\")","v":{"$error":"#VALUE!"}},{"$f":"IF(DataForm!13:13,\"AAAAAG/+n4Q=\",0)","v":0},{"$f":"AND(DataForm!A13,\"AAAAAG/+n4U=\")","v":{"$error":"#VALUE!"}},{"$f":"AND(DataForm!B13,\"AAAAAG/+n4Y=\")","v":{"$error":"#VALUE!"}},{"$f":"AND(DataForm!C13,\"AAAAAG/+n4c=\")","v":{"$error":"#VALUE!"}},{"$f":"AND(DataForm!D13,\"AAAAAG/+n4g=\")","v":{"$error":"#VALUE!"}},{"$f":"AND(DataForm!E13,\"AAAAAG/+n4k=\")","v":{"$error":"#VALUE!"}},{"$f":"AND(DataForm!F13,\"AAAAAG/+n4o=\")","v":{"$error":"#VALUE!"}},{"$f":"AND(DataForm!G13,\"AAAAAG/+n4s=\")","v":{"$error":"#VALUE!"}},{"$f":"AND(DataForm!H13,\"AAAAAG/+n4w=\")","v":{"$error":"#VALUE!"}},{"$f":"AND(DataForm!I13,\"AAAAAG/+n40=\")","v":{"$error":"#VALUE!"}},{"$f":"AND(DataForm!J13,\"AAAAAG/+n44=\")","v":{"$error":"#VALUE!"}},{"$f":"AND(DataForm!K13,\"AAAAAG/+n48=\")","v":{"$error":"#VALUE!"}},{"$f":"AND(DataForm!L13,\"AAAAAG/+n5A=\")","v":{"$error":"#VALUE!"}},{"$f":"AND(DataForm!M13,\"AAAAAG/+n5E=\")","v":{"$error":"#VALUE!"}},{"$f":"AND(DataForm!N13,\"AAAAAG/+n5I=\")","v":{"$error":"#VALUE!"}},{"$f":"AND(DataForm!O13,\"AAAAAG/+n5M=\")","v":{"$error":"#VALUE!"}},{"$f":"AND(DataForm!P13,\"AAAAAG/+n5Q=\")","v":{"$error":"#VALUE!"}},{"$f":"AND(DataForm!Q13,\"AAAAAG/+n5U=\")","v":{"$error":"#VALUE!"}},{"$f":"AND(DataForm!R13,\"AAAAAG/+n5Y=\")","v":{"$error":"#VALUE!"}},{"$f":"AND(DataForm!S13,\"AAAAAG/+n5c=\")","v":{"$error":"#VALUE!"}},{"$f":"AND(DataForm!T13,\"AAAAAG/+n5g=\")","v":{"$error":"#VALUE!"}},{"$f":"AND(DataForm!U13,\"AAAAAG/+n5k=\")","v":{"$error":"#VALUE!"}},{"$f":"AND(DataForm!V13,\"AAAAAG/+n5o=\")","v":{"$error":"#VALUE!"}},{"$f":"IF(DataForm!14:14,\"AAAAAG/+n5s=\",0)","v":0},{"$f":"AND(DataForm!A14,\"AAAAAG/+n5w=\")","v":{"$error":"#VALUE!"}},{"$f":"AND(DataForm!B14,\"AAAAAG/+n50=\")","v":{"$error":"#VALUE!"}},{"$f":"AND(DataForm!C14,\"AAAAAG/+n54=\")","v":{"$error":"#VALUE!"}},{"$f":"AND(DataForm!D14,\"AAAAAG/+n58=\")","v":{"$error":"#VALUE!"}},{"$f":"AND(DataForm!E14,\"AAAAAG/+n6A=\")","v":{"$error":"#VALUE!"}},{"$f":"AND(DataForm!F14,\"AAAAAG/+n6E=\")","v":{"$error":"#VALUE!"}},{"$f":"AND(DataForm!G14,\"AAAAAG/+n6I=\")","v":{"$error":"#VALUE!"}},{"$f":"AND(DataForm!H14,\"AAAAAG/+n6M=\")","v":{"$error":"#VALUE!"}},{"$f":"AND(DataForm!I14,\"AAAAAG/+n6Q=\")","v":{"$error":"#VALUE!"}},{"$f":"AND(DataForm!J14,\"AAAAAG/+n6U=\")","v":{"$error":"#VALUE!"}},{"$f":"AND(DataForm!K14,\"AAAAAG/+n6Y=\")","v":{"$error":"#VALUE!"}},{"$f":"AND(DataForm!L14,\"AAAAAG/+n6c=\")","v":{"$error":"#VALUE!"}},{"$f":"AND(DataForm!M14,\"AAAAAG/+n6g=\")","v":{"$error":"#VALUE!"}},{"$f":"AND(DataForm!N14,\"AAAAAG/+n6k=\")","v":{"$error":"#VALUE!"}},{"$f":"AND(DataForm!O14,\"AAAAAG/+n6o=\")","v":{"$error":"#VALUE!"}},{"$f":"AND(DataForm!P14,\"AAAAAG/+n6s=\")","v":{"$error":"#VALUE!"}},{"$f":"AND(DataForm!Q14,\"AAAAAG/+n6w=\")","v":{"$error":"#VALUE!"}},{"$f":"AND(DataForm!R14,\"AAAAAG/+n60=\")","v":{"$error":"#VALUE!"}},{"$f":"AND(DataForm!S14,\"AAAAAG/+n64=\")","v":{"$error":"#VALUE!"}},{"$f":"AND(DataForm!T14,\"AAAAAG/+n68=\")","v":{"$error":"#VALUE!"}},{"$f":"AND(DataForm!U14,\"AAAAAG/+n7A=\")","v":{"$error":"#VALUE!"}},{"$f":"AND(DataForm!V14,\"AAAAAG/+n7E=\")","v":{"$error":"#VALUE!"}},{"$f":"IF(DataForm!15:15,\"AAAAAG/+n7I=\",0)","v":0},{"$f":"AND(DataForm!A15,\"AAAAAG/+n7M=\")","v":{"$error":"#VALUE!"}},{"$f":"AND(DataForm!B15,\"AAAAAG/+n7Q=\")","v":{"$error":"#VALUE!"}},{"$f":"AND(DataForm!C15,\"AAAAAG/+n7U=\")","v":{"$error":"#VALUE!"}},{"$f":"AND(DataForm!D15,\"AAAAAG/+n7Y=\")","v":{"$error":"#VALUE!"}},{"$f":"AND(DataForm!E15,\"AAAAAG/+n7c=\")","v":{"$error":"#VALUE!"}},{"$f":"AND(DataForm!F15,\"AAAAAG/+n7g=\")","v":{"$error":"#VALUE!"}},{"$f":"AND(DataForm!G15,\"AAAAAG/+n7k=\")","v":{"$error":"#VALUE!"}},{"$f":"AND(DataForm!H15,\"AAAAAG/+n7o=\")","v":{"$error":"#VALUE!"}},{"$f":"AND(DataForm!I15,\"AAAAAG/+n7s=\")","v":{"$error":"#VALUE!"}},{"$f":"AND(DataForm!J15,\"AAAAAG/+n7w=\")","v":{"$error":"#VALUE!"}},{"$f":"AND(DataForm!K15,\"AAAAAG/+n70=\")","v":{"$error":"#VALUE!"}},{"$f":"AND(DataForm!L15,\"AAAAAG/+n74=\")","v":{"$error":"#VALUE!"}},{"$f":"AND(DataForm!M15,\"AAAAAG/+n78=\")","v":{"$error":"#VALUE!"}},{"$f":"AND(DataForm!N15,\"AAAAAG/+n8A=\")","v":{"$error":"#VALUE!"}},{"$f":"AND(DataForm!O15,\"AAAAAG/+n8E=\")","v":{"$error":"#VALUE!"}},{"$f":"AND(DataForm!P15,\"AAAAAG/+n8I=\")","v":{"$error":"#VALUE!"}},{"$f":"AND(DataForm!Q15,\"AAAAAG/+n8M=\")","v":{"$error":"#VALUE!"}},{"$f":"AND(DataForm!R15,\"AAAAAG/+n8Q=\")","v":{"$error":"#VALUE!"}},{"$f":"AND(DataForm!S15,\"AAAAAG/+n8U=\")","v":{"$error":"#VALUE!"}},{"$f":"AND(DataForm!T15,\"AAAAAG/+n8Y=\")","v":{"$error":"#VALUE!"}},{"$f":"AND(DataForm!U15,\"AAAAAG/+n8c=\")","v":{"$error":"#VALUE!"}},{"$f":"AND(DataForm!V15,\"AAAAAG/+n8g=\")","v":{"$error":"#VALUE!"}},{"$f":"IF(DataForm!16:16,\"AAAAAG/+n8k=\",0)","v":0},{"$f":"AND(DataForm!A16,\"AAAAAG/+n8o=\")","v":{"$error":"#VALUE!"}},{"$f":"AND(DataForm!B16,\"AAAAAG/+n8s=\")","v":{"$error":"#VALUE!"}},{"$f":"AND(DataForm!C16,\"AAAAAG/+n8w=\")","v":{"$error":"#VALUE!"}},{"$f":"AND(DataForm!D16,\"AAAAAG/+n80=\")","v":{"$error":"#VALUE!"}},{"$f":"AND(DataForm!E16,\"AAAAAG/+n84=\")","v":{"$error":"#VALUE!"}},{"$f":"AND(DataForm!F16,\"AAAAAG/+n88=\")","v":{"$error":"#VALUE!"}},{"$f":"AND(DataForm!G16,\"AAAAAG/+n9A=\")","v":{"$error":"#VALUE!"}},{"$f":"AND(DataForm!H16,\"AAAAAG/+n9E=\")","v":{"$error":"#VALUE!"}},{"$f":"AND(DataForm!I16,\"AAAAAG/+n9I=\")","v":{"$error":"#VALUE!"}},{"$f":"AND(DataForm!J16,\"AAAAAG/+n9M=\")","v":{"$error":"#VALUE!"}},{"$f":"AND(DataForm!K16,\"AAAAAG/+n9Q=\")","v":{"$error":"#VALUE!"}},{"$f":"AND(DataForm!L16,\"AAAAAG/+n9U=\")","v":{"$error":"#VALUE!"}},{"$f":"AND(DataForm!M16,\"AAAAAG/+n9Y=\")","v":{"$error":"#VALUE!"}},{"$f":"AND(DataForm!N16,\"AAAAAG/+n9c=\")","v":{"$error":"#VALUE!"}},{"$f":"AND(DataForm!O16,\"AAAAAG/+n9g=\")","v":{"$error":"#VALUE!"}},{"$f":"AND(DataForm!P16,\"AAAAAG/+n9k=\")","v":{"$error":"#VALUE!"}},{"$f":"AND(DataForm!Q16,\"AAAAAG/+n9o=\")","v":{"$error":"#VALUE!"}},{"$f":"AND(DataForm!R16,\"AAAAAG/+n9s=\")","v":{"$error":"#VALUE!"}},{"$f":"AND(DataForm!S16,\"AAAAAG/+n9w=\")","v":{"$error":"#VALUE!"}},{"$f":"AND(DataForm!T16,\"AAAAAG/+n90=\")","v":{"$error":"#VALUE!"}},{"$f":"AND(DataForm!U16,\"AAAAAG/+n94=\")","v":{"$error":"#VALUE!"}},{"$f":"AND(DataForm!V16,\"AAAAAG/+n98=\")","v":{"$error":"#VALUE!"}},{"$f":"IF(DataForm!17:17,\"AAAAAG/+n+A=\",0)","v":0},{"$f":"AND(DataForm!A17,\"AAAAAG/+n+E=\")","v":{"$error":"#VALUE!"}},{"$f":"AND(DataForm!B17,\"AAAAAG/+n+I=\")","v":{"$error":"#VALUE!"}},{"$f":"AND(DataForm!C17,\"AAAAAG/+n+M=\")","v":{"$error":"#VALUE!"}},{"$f":"AND(DataForm!D17,\"AAAAAG/+n+Q=\")","v":{"$error":"#VALUE!"}},{"$f":"AND(DataForm!E17,\"AAAAAG/+n+U=\")","v":{"$error":"#VALUE!"}},{"$f":"AND(DataForm!F17,\"AAAAAG/+n+Y=\")","v":{"$error":"#VALUE!"}},{"$f":"AND(DataForm!G17,\"AAAAAG/+n+c=\")","v":{"$error":"#VALUE!"}},{"$f":"AND(DataForm!H17,\"AAAAAG/+n+g=\")","v":{"$error":"#VALUE!"}},{"$f":"AND(DataForm!I17,\"AAAAAG/+n+k=\")","v":{"$error":"#VALUE!"}},{"$f":"AND(DataForm!J17,\"AAAAAG/+n+o=\")","v":{"$error":"#VALUE!"}},{"$f":"AND(DataForm!K17,\"AAAAAG/+n+s=\")","v":{"$error":"#VALUE!"}},{"$f":"AND(DataForm!L17,\"AAAAAG/+n+w=\")","v":{"$error":"#VALUE!"}},{"$f":"AND(DataForm!M17,\"AAAAAG/+n+0=\")","v":{"$error":"#VALUE!"}},{"$f":"AND(DataForm!N17,\"AAAAAG/+n+4=\")","v":{"$error":"#VALUE!"}},{"$f":"AND(DataForm!O17,\"AAAAAG/+n+8=\")","v":{"$error":"#VALUE!"}},{"$f":"AND(DataForm!P17,\"AAAAAG/+n/A=\")","v":{"$error":"#VALUE!"}},{"$f":"AND(DataForm!Q17,\"AAAAAG/+n/E=\")","v":{"$error":"#VALUE!"}},{"$f":"AND(DataForm!R17,\"AAAAAG/+n/I=\")","v":{"$error":"#VALUE!"}},{"$f":"AND(DataForm!S17,\"AAAAAG/+n/M=\")","v":{"$error":"#VALUE!"}},{"$f":"AND(DataForm!T17,\"AAAAAG/+n/Q=\")","v":{"$error":"#VALUE!"}},{"$f":"AND(DataForm!U17,\"AAAAAG/+n/U=\")","v":{"$error":"#VALUE!"}},{"$f":"AND(DataForm!V17,\"AAAAAG/+n/Y=\")","v":{"$error":"#VALUE!"}},{"$f":"IF(DataForm!18:18,\"AAAAAG/+n/c=\",0)","v":0},{"$f":"AND(DataForm!A18,\"AAAAAG/+n/g=\")","v":{"$error":"#VALUE!"}},{"$f":"AND(DataForm!B18,\"AAAAAG/+n/k=\")","v":{"$error":"#VALUE!"}},{"$f":"AND(DataForm!C18,\"AAAAAG/+n/o=\")","v":{"$error":"#VALUE!"}},{"$f":"AND(DataForm!D18,\"AAAAAG/+n/s=\")","v":{"$error":"#VALUE!"}},{"$f":"AND(DataForm!E18,\"AAAAAG/+n/w=\")","v":{"$error":"#VALUE!"}},{"$f":"AND(DataForm!F18,\"AAAAAG/+n/0=\")","v":{"$error":"#VALUE!"}},{"$f":"AND(DataForm!G18,\"AAAAAG/+n/4=\")","v":{"$error":"#VALUE!"}},{"$f":"AND(DataForm!H18,\"AAAAAG/+n/8=\")","v":{"$error":"#VALUE!"}}]
[{"$f":"AND(DataForm!I18,\"AAAAAEfXNwA=\")","v":{"$error":"#VALUE!"}},{"$f":"AND(DataForm!J18,\"AAAAAEfXNwE=\")","v":{"$error":"#VALUE!"}},{"$f":"AND(DataForm!K18,\"AAAAAEfXNwI=\")","v":{"$error":"#VALUE!"}},{"$f":"AND(DataForm!L18,\"AAAAAEfXNwM=\")","v":{"$error":"#VALUE!"}},{"$f":"AND(DataForm!M18,\"AAAAAEfXNwQ=\")","v":{"$error":"#VALUE!"}},{"$f":"AND(DataForm!N18,\"AAAAAEfXNwU=\")","v":{"$error":"#VALUE!"}},{"$f":"AND(DataForm!O18,\"AAAAAEfXNwY=\")","v":{"$error":"#VALUE!"}},{"$f":"AND(DataForm!P18,\"AAAAAEfXNwc=\")","v":{"$error":"#VALUE!"}},{"$f":"AND(DataForm!Q18,\"AAAAAEfXNwg=\")","v":{"$error":"#VALUE!"}},{"$f":"AND(DataForm!R18,\"AAAAAEfXNwk=\")","v":{"$error":"#VALUE!"}},{"$f":"AND(DataForm!S18,\"AAAAAEfXNwo=\")","v":{"$error":"#VALUE!"}},{"$f":"AND(DataForm!T18,\"AAAAAEfXNws=\")","v":{"$error":"#VALUE!"}},{"$f":"AND(DataForm!U18,\"AAAAAEfXNww=\")","v":{"$error":"#VALUE!"}},{"$f":"AND(DataForm!V18,\"AAAAAEfXNw0=\")","v":{"$error":"#VALUE!"}},{"$f":"IF(DataForm!19:19,\"AAAAAEfXNw4=\",0)","v":0},{"$f":"AND(DataForm!A19,\"AAAAAEfXNw8=\")","v":{"$error":"#VALUE!"}},{"$f":"AND(DataForm!B19,\"AAAAAEfXNxA=\")","v":{"$error":"#VALUE!"}},{"$f":"AND(DataForm!C19,\"AAAAAEfXNxE=\")","v":{"$error":"#VALUE!"}},{"$f":"AND(DataForm!D19,\"AAAAAEfXNxI=\")","v":{"$error":"#VALUE!"}},{"$f":"AND(DataForm!E19,\"AAAAAEfXNxM=\")","v":{"$error":"#VALUE!"}},{"$f":"AND(DataForm!F19,\"AAAAAEfXNxQ=\")","v":{"$error":"#VALUE!"}},{"$f":"AND(DataForm!G19,\"AAAAAEfXNxU=\")","v":{"$error":"#VALUE!"}},{"$f":"AND(DataForm!H19,\"AAAAAEfXNxY=\")","v":{"$error":"#VALUE!"}},{"$f":"AND(DataForm!I19,\"AAAAAEfXNxc=\")","v":{"$error":"#VALUE!"}},{"$f":"AND(DataForm!J19,\"AAAAAEfXNxg=\")","v":{"$error":"#VALUE!"}},{"$f":"AND(DataForm!K19,\"AAAAAEfXNxk=\")","v":{"$error":"#VALUE!"}},{"$f":"AND(DataForm!L19,\"AAAAAEfXNxo=\")","v":{"$error":"#VALUE!"}},{"$f":"AND(DataForm!M19,\"AAAAAEfXNxs=\")","v":{"$error":"#VALUE!"}},{"$f":"AND(DataForm!N19,\"AAAAAEfXNxw=\")","v":{"$error":"#VALUE!"}},{"$f":"AND(DataForm!O19,\"AAAAAEfXNx0=\")","v":{"$error":"#VALUE!"}},{"$f":"AND(DataForm!P19,\"AAAAAEfXNx4=\")","v":{"$error":"#VALUE!"}},{"$f":"AND(DataForm!Q19,\"AAAAAEfXNx8=\")","v":{"$error":"#VALUE!"}},{"$f":"AND(DataForm!R19,\"AAAAAEfXNyA=\")","v":{"$error":"#VALUE!"}},{"$f":"AND(DataForm!S19,\"AAAAAEfXNyE=\")","v":{"$error":"#VALUE!"}},{"$f":"AND(DataForm!T19,\"AAAAAEfXNyI=\")","v":{"$error":"#VALUE!"}},{"$f":"AND(DataForm!U19,\"AAAAAEfXNyM=\")","v":{"$error":"#VALUE!"}},{"$f":"AND(DataForm!V19,\"AAAAAEfXNyQ=\")","v":{"$error":"#VALUE!"}},{"$f":"IF(DataForm!20:20,\"AAAAAEfXNyU=\",0)","v":0},{"$f":"AND(DataForm!A20,\"AAAAAEfXNyY=\")","v":{"$error":"#VALUE!"}},{"$f":"AND(DataForm!B20,\"AAAAAEfXNyc=\")","v":{"$error":"#VALUE!"}},{"$f":"AND(DataForm!C20,\"AAAAAEfXNyg=\")","v":{"$error":"#VALUE!"}},{"$f":"AND(DataForm!D20,\"AAAAAEfXNyk=\")","v":{"$error":"#VALUE!"}},{"$f":"AND(DataForm!E20,\"AAAAAEfXNyo=\")","v":{"$error":"#VALUE!"}},{"$f":"AND(DataForm!F20,\"AAAAAEfXNys=\")","v":{"$error":"#VALUE!"}},{"$f":"AND(DataForm!G20,\"AAAAAEfXNyw=\")","v":{"$error":"#VALUE!"}},{"$f":"AND(DataForm!H20,\"AAAAAEfXNy0=\")","v":{"$error":"#VALUE!"}},{"$f":"AND(DataForm!I20,\"AAAAAEfXNy4=\")","v":{"$error":"#VALUE!"}},{"$f":"AND(DataForm!J20,\"AAAAAEfXNy8=\")","v":{"$error":"#VALUE!"}},{"$f":"AND(DataForm!K20,\"AAAAAEfXNzA=\")","v":{"$error":"#VALUE!"}},{"$f":"AND(DataForm!L20,\"AAAAAEfXNzE=\")","v":{"$error":"#VALUE!"}},{"$f":"AND(DataForm!M20,\"AAAAAEfXNzI=\")","v":{"$error":"#VALUE!"}},{"$f":"AND(DataForm!N20,\"AAAAAEfXNzM=\")","v":{"$error":"#VALUE!"}},{"$f":"AND(DataForm!O20,\"AAAAAEfXNzQ=\")","v":{"$error":"#VALUE!"}},{"$f":"AND(DataForm!P20,\"AAAAAEfXNzU=\")","v":{"$error":"#VALUE!"}},{"$f":"AND(DataForm!Q20,\"AAAAAEfXNzY=\")","v":{"$error":"#VALUE!"}},{"$f":"AND(DataForm!R20,\"AAAAAEfXNzc=\")","v":{"$error":"#VALUE!"}},{"$f":"AND(DataForm!S20,\"AAAAAEfXNzg=\")","v":{"$error":"#VALUE!"}},{"$f":"AND(DataForm!T20,\"AAAAAEfXNzk=\")","v":{"$error":"#VALUE!"}},{"$f":"AND(DataForm!U20,\"AAAAAEfXNzo=\")","v":{"$error":"#VALUE!"}},{"$f":"AND(DataForm!V20,\"AAAAAEfXNzs=\")","v":{"$error":"#VALUE!"}},{"$f":"IF(DataForm!21:21,\"AAAAAEfXNzw=\",0)","v":0},{"$f":"AND(DataForm!A21,\"AAAAAEfXNz0=\")","v":{"$error":"#VALUE!"}},{"$f":"AND(DataForm!B21,\"AAAAAEfXNz4=\")","v":{"$error":"#VALUE!"}},{"$f":"AND(DataForm!C21,\"AAAAAEfXNz8=\")","v":{"$error":"#VALUE!"}},{"$f":"AND(DataForm!D21,\"AAAAAEfXN0A=\")","v":{"$error":"#VALUE!"}},{"$f":"AND(DataForm!E21,\"AAAAAEfXN0E=\")","v":{"$error":"#VALUE!"}},{"$f":"AND(DataForm!F21,\"AAAAAEfXN0I=\")","v":{"$error":"#VALUE!"}},{"$f":"AND(DataForm!G21,\"AAAAAEfXN0M=\")","v":{"$error":"#VALUE!"}},{"$f":"AND(DataForm!H21,\"AAAAAEfXN0Q=\")","v":{"$error":"#VALUE!"}},{"$f":"AND(DataForm!I21,\"AAAAAEfXN0U=\")","v":{"$error":"#VALUE!"}},{"$f":"AND(DataForm!J21,\"AAAAAEfXN0Y=\")","v":{"$error":"#VALUE!"}},{"$f":"AND(DataForm!K21,\"AAAAAEfXN0c=\")","v":{"$error":"#VALUE!"}},{"$f":"AND(DataForm!L21,\"AAAAAEfXN0g=\")","v":{"$error":"#VALUE!"}},{"$f":"AND(DataForm!M21,\"AAAAAEfXN0k=\")","v":{"$error":"#VALUE!"}},{"$f":"AND(DataForm!N21,\"AAAAAEfXN0o=\")","v":{"$error":"#VALUE!"}},{"$f":"AND(DataForm!O21,\"AAAAAEfXN0s=\")","v":{"$error":"#VALUE!"}},{"$f":"AND(DataForm!P21,\"AAAAAEfXN0w=\")","v":{"$error":"#VALUE!"}},{"$f":"AND(DataForm!Q21,\"AAAAAEfXN00=\")","v":{"$error":"#VALUE!"}},{"$f":"AND(DataForm!R21,\"AAAAAEfXN04=\")","v":{"$error":"#VALUE!"}},{"$f":"AND(DataForm!S21,\"AAAAAEfXN08=\")","v":{"$error":"#VALUE!"}},{"$f":"AND(DataForm!T21,\"AAAAAEfXN1A=\")","v":{"$error":"#VALUE!"}},{"$f":"AND(DataForm!U21,\"AAAAAEfXN1E=\")","v":{"$error":"#VALUE!"}},{"$f":"AND(DataForm!V21,\"AAAAAEfXN1I=\")","v":{"$error":"#VALUE!"}},{"$f":"IF(DataForm!22:22,\"AAAAAEfXN1M=\",0)","v":0},{"$f":"AND(DataForm!A22,\"AAAAAEfXN1Q=\")","v":{"$error":"#VALUE!"}},{"$f":"AND(DataForm!B22,\"AAAAAEfXN1U=\")","v":{"$error":"#VALUE!"}},{"$f":"AND(DataForm!C22,\"AAAAAEfXN1Y=\")","v":{"$error":"#VALUE!"}},{"$f":"AND(DataForm!D22,\"AAAAAEfXN1c=\")","v":{"$error":"#VALUE!"}},{"$f":"AND(DataForm!E22,\"AAAAAEfXN1g=\")","v":{"$error":"#VALUE!"}},{"$f":"AND(DataForm!F22,\"AAAAAEfXN1k=\")","v":{"$error":"#VALUE!"}},{"$f":"AND(DataForm!G22,\"AAAAAEfXN1o=\")","v":{"$error":"#VALUE!"}},{"$f":"AND(DataForm!H22,\"AAAAAEfXN1s=\")","v":{"$error":"#VALUE!"}},{"$f":"AND(DataForm!I22,\"AAAAAEfXN1w=\")","v":{"$error":"#VALUE!"}},{"$f":"AND(DataForm!J22,\"AAAAAEfXN10=\")","v":{"$error":"#VALUE!"}},{"$f":"AND(DataForm!K22,\"AAAAAEfXN14=\")","v":{"$error":"#VALUE!"}},{"$f":"AND(DataForm!L22,\"AAAAAEfXN18=\")","v":{"$error":"#VALUE!"}},{"$f":"AND(DataForm!M22,\"AAAAAEfXN2A=\")","v":{"$error":"#VALUE!"}},{"$f":"AND(DataForm!N22,\"AAAAAEfXN2E=\")","v":{"$error":"#VALUE!"}},{"$f":"AND(DataForm!O22,\"AAAAAEfXN2I=\")","v":{"$error":"#VALUE!"}},{"$f":"AND(DataForm!P22,\"AAAAAEfXN2M=\")","v":{"$error":"#VALUE!"}},{"$f":"AND(DataForm!Q22,\"AAAAAEfXN2Q=\")","v":{"$error":"#VALUE!"}},{"$f":"AND(DataForm!R22,\"AAAAAEfXN2U=\")","v":{"$error":"#VALUE!"}},{"$f":"AND(DataForm!S22,\"AAAAAEfXN2Y=\")","v":{"$error":"#VALUE!"}},{"$f":"AND(DataForm!T22,\"AAAAAEfXN2c=\")","v":{"$error":"#VALUE!"}},{"$f":"AND(DataForm!U22,\"AAAAAEfXN2g=\")","v":{"$error":"#VALUE!"}},{"$f":"AND(DataForm!V22,\"AAAAAEfXN2k=\")","v":{"$error":"#VALUE!"}},{"$f":"IF(DataForm!23:23,\"AAAAAEfXN2o=\",0)","v":0},{"$f":"AND(DataForm!A23,\"AAAAAEfXN2s=\")","v":{"$error":"#VALUE!"}},{"$f":"AND(DataForm!B23,\"AAAAAEfXN2w=\")","v":{"$error":"#VALUE!"}},{"$f":"AND(DataForm!C23,\"AAAAAEfXN20=\")","v":{"$error":"#VALUE!"}},{"$f":"AND(DataForm!D23,\"AAAAAEfXN24=\")","v":{"$error":"#VALUE!"}},{"$f":"AND(DataForm!E23,\"AAAAAEfXN28=\")","v":{"$error":"#VALUE!"}},{"$f":"AND(DataForm!F23,\"AAAAAEfXN3A=\")","v":{"$error":"#VALUE!"}},{"$f":"AND(DataForm!G23,\"AAAAAEfXN3E=\")","v":{"$error":"#VALUE!"}},{"$f":"AND(DataForm!H23,\"AAAAAEfXN3I=\")","v":{"$error":"#VALUE!"}},{"$f":"AND(DataForm!I23,\"AAAAAEfXN3M=\")","v":{"$error":"#VALUE!"}},{"$f":"AND(DataForm!J23,\"AAAAAEfXN3Q=\")","v":{"$error":"#VALUE!"}},{"$f":"AND(DataForm!K23,\"AAAAAEfXN3U=\")","v":{"$error":"#VALUE!"}},{"$f":"AND(DataForm!L23,\"AAAAAEfXN3Y=\")","v":{"$error":"#VALUE!"}},{"$f":"AND(DataForm!M23,\"AAAAAEfXN3c=\")","v":{"$error":"#VALUE!"}},{"$f":"AND(DataForm!N23,\"AAAAAEfXN3g=\")","v":{"$error":"#VALUE!"}},{"$f":"AND(DataForm!O23,\"AAAAAEfXN3k=\")","v":{"$error":"#VALUE!"}},{"$f":"AND(DataForm!P23,\"AAAAAEfXN3o=\")","v":{"$error":"#VALUE!"}},{"$f":"AND(DataForm!Q23,\"AAAAAEfXN3s=\")","v":{"$error":"#VALUE!"}},{"$f":"AND(DataForm!R23,\"AAAAAEfXN3w=\")","v":{"$error":"#VALUE!"}},{"$f":"AND(DataForm!S23,\"AAAAAEfXN30=\")","v":{"$error":"#VALUE!"}},{"$f":"AND(DataForm!T23,\"AAAAAEfXN34=\")","v":{"$error":"#VALUE!"}},{"$f":"AND(DataForm!U23,\"AAAAAEfXN38=\")","v":{"$error":"#VALUE!"}},{"$f":"AND(DataForm!V23,\"AAAAAEfXN4A=\")","v":{"$error":"#VALUE!"}},{"$f":"IF(DataForm!24:24,\"AAAAAEfXN4E=\",0)","v":0},{"$f":"AND(DataForm!A24,\"AAAAAEfXN4I=\")","v":{"$error":"#VALUE!"}},{"$f":"AND(DataForm!B24,\"AAAAAEfXN4M=\")","v":{"$error":"#VALUE!"}},{"$f":"AND(DataForm!C24,\"AAAAAEfXN4Q=\")","v":{"$error":"#VALUE!"}},{"$f":"AND(DataForm!D24,\"AAAAAEfXN4U=\")","v":{"$error":"#VALUE!"}},{"$f":"AND(DataForm!E24,\"AAAAAEfXN4Y=\")","v":{"$error":"#VALUE!"}},{"$f":"AND(DataForm!F24,\"AAAAAEfXN4c=\")","v":{"$error":"#VALUE!"}},{"$f":"AND(DataForm!G24,\"AAAAAEfXN4g=\")","v":{"$error":"#VALUE!"}},{"$f":"AND(DataForm!H24,\"AAAAAEfXN4k=\")","v":{"$error":"#VALUE!"}},{"$f":"AND(DataForm!I24,\"AAAAAEfXN4o=\")","v":{"$error":"#VALUE!"}},{"$f":"AND(DataForm!J24,\"AAAAAEfXN4s=\")","v":{"$error":"#VALUE!"}},{"$f":"AND(DataForm!K24,\"AAAAAEfXN4w=\")","v":{"$error":"#VALUE!"}},{"$f":"AND(DataForm!L24,\"AAAAAEfXN40=\")","v":{"$error":"#VALUE!"}},{"$f":"AND(DataForm!M24,\"AAAAAEfXN44=\")","v":{"$error":"#VALUE!"}},{"$f":"AND(DataForm!N24,\"AAAAAEfXN48=\")","v":{"$error":"#VALUE!"}},{"$f":"AND(DataForm!O24,\"AAAAAEfXN5A=\")","v":{"$error":"#VALUE!"}},{"$f":"AND(DataForm!P24,\"AAAAAEfXN5E=\")","v":{"$error":"#VALUE!"}},{"$f":"AND(DataForm!Q24,\"AAAAAEfXN5I=\")","v":{"$error":"#VALUE!"}},{"$f":"AND(DataForm!R24,\"AAAAAEfXN5M=\")","v":{"$error":"#VALUE!"}},{"$f":"AND(DataForm!S24,\"AAAAAEfXN5Q=\")","v":{"$error":"#VALUE!"}},{"$f":"AND(DataForm!T24,\"AAAAAEfXN5U=\")","v":{"$error":"#VALUE!"}},{"$f":"AND(DataForm!U24,\"AAAAAEfXN5Y=\")","v":{"$error":"#VALUE!"}},{"$f":"AND(DataForm!V24,\"AAAAAEfXN5c=\")","v":{"$error":"#VALUE!"}},{"$f":"IF(DataForm!25:25,\"AAAAAEfXN5g=\",0)","v":0},{"$f":"AND(DataForm!A25,\"AAAAAEfXN5k=\")","v":{"$error":"#VALUE!"}},{"$f":"AND(DataForm!B25,\"AAAAAEfXN5o=\")","v":{"$error":"#VALUE!"}},{"$f":"AND(DataForm!C25,\"AAAAAEfXN5s=\")","v":{"$error":"#VALUE!"}},{"$f":"AND(DataForm!D25,\"AAAAAEfXN5w=\")","v":{"$error":"#VALUE!"}},{"$f":"AND(DataForm!E25,\"AAAAAEfXN50=\")","v":{"$error":"#VALUE!"}},{"$f":"AND(DataForm!F25,\"AAAAAEfXN54=\")","v":{"$error":"#VALUE!"}},{"$f":"AND(DataForm!G25,\"AAAAAEfXN58=\")","v":{"$error":"#VALUE!"}},{"$f":"AND(DataForm!H25,\"AAAAAEfXN6A=\")","v":{"$error":"#VALUE!"}},{"$f":"AND(DataForm!I25,\"AAAAAEfXN6E=\")","v":{"$error":"#VALUE!"}},{"$f":"AND(DataForm!J25,\"AAAAAEfXN6I=\")","v":{"$error":"#VALUE!"}},{"$f":"AND(DataForm!K25,\"AAAAAEfXN6M=\")","v":{"$error":"#VALUE!"}},{"$f":"AND(DataForm!L25,\"AAAAAEfXN6Q=\")","v":{"$error":"#VALUE!"}},{"$f":"AND(DataForm!M25,\"AAAAAEfXN6U=\")","v":{"$error":"#VALUE!"}},{"$f":"AND(DataForm!N25,\"AAAAAEfXN6Y=\")","v":{"$error":"#VALUE!"}},{"$f":"AND(DataForm!O25,\"AAAAAEfXN6c=\")","v":{"$error":"#VALUE!"}},{"$f":"AND(DataForm!P25,\"AAAAAEfXN6g=\")","v":{"$error":"#VALUE!"}},{"$f":"AND(DataForm!Q25,\"AAAAAEfXN6k=\")","v":{"$error":"#VALUE!"}},{"$f":"AND(DataForm!R25,\"AAAAAEfXN6o=\")","v":{"$error":"#VALUE!"}},{"$f":"AND(DataForm!S25,\"AAAAAEfXN6s=\")","v":{"$error":"#VALUE!"}},{"$f":"AND(DataForm!T25,\"AAAAAEfXN6w=\")","v":{"$error":"#VALUE!"}},{"$f":"AND(DataForm!U25,\"AAAAAEfXN60=\")","v":{"$error":"#VALUE!"}},{"$f":"AND(DataForm!V25,\"AAAAAEfXN64=\")","v":{"$error":"#VALUE!"}},{"$f":"IF(DataForm!26:26,\"AAAAAEfXN68=\",0)","v":0},{"$f":"AND(DataForm!A26,\"AAAAAEfXN7A=\")","v":{"$error":"#VALUE!"}},{"$f":"AND(DataForm!B26,\"AAAAAEfXN7E=\")","v":{"$error":"#VALUE!"}},{"$f":"AND(DataForm!C26,\"AAAAAEfXN7I=\")","v":{"$error":"#VALUE!"}},{"$f":"AND(DataForm!D26,\"AAAAAEfXN7M=\")","v":{"$error":"#VALUE!"}},{"$f":"AND(DataForm!E26,\"AAAAAEfXN7Q=\")","v":{"$error":"#VALUE!"}},{"$f":"AND(DataForm!F26,\"AAAAAEfXN7U=\")","v":{"$error":"#VALUE!"}},{"$f":"AND(DataForm!G26,\"AAAAAEfXN7Y=\")","v":{"$error":"#VALUE!"}},{"$f":"AND(DataForm!H26,\"AAAAAEfXN7c=\")","v":{"$error":"#VALUE!"}},{"$f":"AND(DataForm!I26,\"AAAAAEfXN7g=\")","v":{"$error":"#VALUE!"}},{"$f":"AND(DataForm!J26,\"AAAAAEfXN7k=\")","v":{"$error":"#VALUE!"}},{"$f":"AND(DataForm!K26,\"AAAAAEfXN7o=\")","v":{"$error":"#VALUE!"}},{"$f":"AND(DataForm!L26,\"AAAAAEfXN7s=\")","v":{"$error":"#VALUE!"}},{"$f":"AND(DataForm!M26,\"AAAAAEfXN7w=\")","v":{"$error":"#VALUE!"}},{"$f":"AND(DataForm!N26,\"AAAAAEfXN70=\")","v":{"$error":"#VALUE!"}},{"$f":"AND(DataForm!O26,\"AAAAAEfXN74=\")","v":{"$error":"#VALUE!"}},{"$f":"AND(DataForm!P26,\"AAAAAEfXN78=\")","v":{"$error":"#VALUE!"}},{"$f":"AND(DataForm!Q26,\"AAAAAEfXN8A=\")","v":{"$error":"#VALUE!"}},{"$f":"AND(DataForm!R26,\"AAAAAEfXN8E=\")","v":{"$error":"#VALUE!"}},{"$f":"AND(DataForm!S26,\"AAAAAEfXN8I=\")","v":{"$error":"#VALUE!"}},{"$f":"AND(DataForm!T26,\"AAAAAEfXN8M=\")","v":{"$error":"#VALUE!"}},{"$f":"AND(DataForm!U26,\"AAAAAEfXN8Q=\")","v":{"$error":"#VALUE!"}},{"$f":"AND(DataForm!V26,\"AAAAAEfXN8U=\")","v":{"$error":"#VALUE!"}},{"$f":"IF(DataForm!27:27,\"AAAAAEfXN8Y=\",0)","v":0},{"$f":"AND(DataForm!A27,\"AAAAAEfXN8c=\")","v":{"$error":"#VALUE!"}},{"$f":"AND(DataForm!B27,\"AAAAAEfXN8g=\")","v":{"$error":"#VALUE!"}},{"$f":"AND(DataForm!C27,\"AAAAAEfXN8k=\")","v":{"$error":"#VALUE!"}},{"$f":"AND(DataForm!D27,\"AAAAAEfXN8o=\")","v":{"$error":"#VALUE!"}},{"$f":"AND(DataForm!E27,\"AAAAAEfXN8s=\")","v":{"$error":"#VALUE!"}},{"$f":"AND(DataForm!F27,\"AAAAAEfXN8w=\")","v":{"$error":"#VALUE!"}},{"$f":"AND(DataForm!G27,\"AAAAAEfXN80=\")","v":{"$error":"#VALUE!"}},{"$f":"AND(DataForm!H27,\"AAAAAEfXN84=\")","v":{"$error":"#VALUE!"}},{"$f":"AND(DataForm!I27,\"AAAAAEfXN88=\")","v":{"$error":"#VALUE!"}},{"$f":"AND(DataForm!J27,\"AAAAAEfXN9A=\")","v":{"$error":"#VALUE!"}},{"$f":"AND(DataForm!K27,\"AAAAAEfXN9E=\")","v":{"$error":"#VALUE!"}},{"$f":"AND(DataForm!L27,\"AAAAAEfXN9I=\")","v":{"$error":"#VALUE!"}},{"$f":"AND(DataForm!M27,\"AAAAAEfXN9M=\")","v":{"$error":"#VALUE!"}},{"$f":"AND(DataForm!N27,\"AAAAAEfXN9Q=\")","v":{"$error":"#VALUE!"}},{"$f":"AND(DataForm!O27,\"AAAAAEfXN9U=\")","v":{"$error":"#VALUE!"}},{"$f":"AND(DataForm!P27,\"AAAAAEfXN9Y=\")","v":{"$error":"#VALUE!"}},{"$f":"AND(DataForm!Q27,\"AAAAAEfXN9c=\")","v":{"$error":"#VALUE!"}},{"$f":"AND(DataForm!R27,\"AAAAAEfXN9g=\")","v":{"$error":"#VALUE!"}},{"$f":"AND(DataForm!S27,\"AAAAAEfXN9k=\")","v":{"$error":"#VALUE!"}},{"$f":"AND(DataForm!T27,\"AAAAAEfXN9o=\")","v":{"$error":"#VALUE!"}},{"$f":"AND(DataForm!U27,\"AAAAAEfXN9s=\")","v":{"$error":"#VALUE!"}},{"$f":"AND(DataForm!V27,\"AAAAAEfXN9w=\")","v":{"$error":"#VALUE!"}},{"$f":"IF(DataForm!28:28,\"AAAAAEfXN90=\",0)","v":0},{"$f":"AND(DataForm!A28,\"AAAAAEfXN94=\")","v":{"$error":"#VALUE!"}},{"$f":"AND(DataForm!B28,\"AAAAAEfXN98=\")","v":{"$error":"#VALUE!"}},{"$f":"AND(DataForm!C28,\"AAAAAEfXN+A=\")","v":{"$error":"#VALUE!"}},{"$f":"AND(DataForm!D28,\"AAAAAEfXN+E=\")","v":{"$error":"#VALUE!"}},{"$f":"AND(DataForm!E28,\"AAAAAEfXN+I=\")","v":{"$error":"#VALUE!"}},{"$f":"AND(DataForm!F28,\"AAAAAEfXN+M=\")","v":{"$error":"#VALUE!"}},{"$f":"AND(DataForm!G28,\"AAAAAEfXN+Q=\")","v":{"$error":"#VALUE!"}},{"$f":"AND(DataForm!H28,\"AAAAAEfXN+U=\")","v":{"$error":"#VALUE!"}},{"$f":"AND(DataForm!I28,\"AAAAAEfXN+Y=\")","v":{"$error":"#VALUE!"}},{"$f":"AND(DataForm!J28,\"AAAAAEfXN+c=\")","v":{"$error":"#VALUE!"}},{"$f":"AND(DataForm!K28,\"AAAAAEfXN+g=\")","v":{"$error":"#VALUE!"}},{"$f":"AND(DataForm!L28,\"AAAAAEfXN+k=\")","v":{"$error":"#VALUE!"}},{"$f":"AND(DataForm!M28,\"AAAAAEfXN+o=\")","v":{"$error":"#VALUE!"}},{"$f":"AND(DataForm!N28,\"AAAAAEfXN+s=\")","v":{"$error":"#VALUE!"}},{"$f":"AND(DataForm!O28,\"AAAAAEfXN+w=\")","v":{"$error":"#VALUE!"}},{"$f":"AND(DataForm!P28,\"AAAAAEfXN+0=\")","v":{"$error":"#VALUE!"}},{"$f":"AND(DataForm!Q28,\"AAAAAEfXN+4=\")","v":{"$error":"#VALUE!"}},{"$f":"AND(DataForm!R28,\"AAAAAEfXN+8=\")","v":{"$error":"#VALUE!"}},{"$f":"AND(DataForm!S28,\"AAAAAEfXN/A=\")","v":{"$error":"#VALUE!"}},{"$f":"AND(DataForm!T28,\"AAAAAEfXN/E=\")","v":{"$error":"#VALUE!"}},{"$f":"AND(DataForm!U28,\"AAAAAEfXN/I=\")","v":{"$error":"#VALUE!"}},{"$f":"AND(DataForm!V28,\"AAAAAEfXN/M=\")","v":{"$error":"#VALUE!"}},{"$f":"IF(DataForm!29:29,\"AAAAAEfXN/Q=\",0)","v":0},{"$f":"AND(DataForm!A29,\"AAAAAEfXN/U=\")","v":{"$error":"#VALUE!"}},{"$f":"AND(DataForm!B29,\"AAAAAEfXN/Y=\")","v":{"$error":"#VALUE!"}},{"$f":"AND(DataForm!C29,\"AAAAAEfXN/c=\")","v":{"$error":"#VALUE!"}},{"$f":"AND(DataForm!D29,\"AAAAAEfXN/g=\")","v":{"$error":"#VALUE!"}},{"$f":"AND(DataForm!E29,\"AAAAAEfXN/k=\")","v":{"$error":"#VALUE!"}},{"$f":"AND(DataForm!F29,\"AAAAAEfXN/o=\")","v":{"$error":"#VALUE!"}},{"$f":"AND(DataForm!G29,\"AAAAAEfXN/s=\")","v":{"$error":"#VALUE!"}},{"$f":"AND(DataForm!H29,\"AAAAAEfXN/w=\")","v":{"$error":"#VALUE!"}},{"$f":"AND(DataForm!I29,\"AAAAAEfXN/0=\")","v":{"$error":"#VALUE!"}},{"$f":"AND(DataForm!J29,\"AAAAAEfXN/4=\")","v":{"$error":"#VALUE!"}},{"$f":"AND(DataForm!K29,\"AAAAAEfXN/8=\")","v":{"$error":"#VALUE!"}}]
[{"$f":"AND(DataForm!L29,\"AAAAAFQPegA=\")","v":{"$error":"#VALUE!"}},{"$f":"AND(DataForm!M29,\"AAAAAFQPegE=\")","v":{"$error":"#VALUE!"}},{"$f":"AND(DataForm!N29,\"AAAAAFQPegI=\")","v":{"$error":"#VALUE!"}},{"$f":"AND(DataForm!O29,\"AAAAAFQPegM=\")","v":{"$error":"#VALUE!"}},{"$f":"AND(DataForm!P29,\"AAAAAFQPegQ=\")","v":{"$error":"#VALUE!"}},{"$f":"AND(DataForm!Q29,\"AAAAAFQPegU=\")","v":{"$error":"#VALUE!"}},{"$f":"AND(DataForm!R29,\"AAAAAFQPegY=\")","v":{"$error":"#VALUE!"}},{"$f":"AND(DataForm!S29,\"AAAAAFQPegc=\")","v":{"$error":"#VALUE!"}},{"$f":"AND(DataForm!T29,\"AAAAAFQPegg=\")","v":{"$error":"#VALUE!"}},{"$f":"AND(DataForm!U29,\"AAAAAFQPegk=\")","v":{"$error":"#VALUE!"}},{"$f":"AND(DataForm!V29,\"AAAAAFQPego=\")","v":{"$error":"#VALUE!"}},{"$f":"IF(DataForm!30:30,\"AAAAAFQPegs=\",0)","v":"AAAAAFQPegs="},{"$f":"AND(DataForm!A30,\"AAAAAFQPegw=\")","v":{"$error":"#VALUE!"}},{"$f":"AND(DataForm!B30,\"AAAAAFQPeg0=\")","v":{"$error":"#VALUE!"}},{"$f":"AND(DataForm!C30,\"AAAAAFQPeg4=\")","v":{"$error":"#VALUE!"}},{"$f":"AND(DataForm!D30,\"AAAAAFQPeg8=\")","v":{"$error":"#VALUE!"}},{"$f":"AND(DataForm!E30,\"AAAAAFQPehA=\")","v":{"$error":"#VALUE!"}},{"$f":"AND(DataForm!F30,\"AAAAAFQPehE=\")","v":{"$error":"#VALUE!"}},{"$f":"AND(DataForm!G30,\"AAAAAFQPehI=\")","v":{"$error":"#VALUE!"}},{"$f":"AND(DataForm!H30,\"AAAAAFQPehM=\")","v":{"$error":"#VALUE!"}},{"$f":"AND(DataForm!I30,\"AAAAAFQPehQ=\")","v":{"$error":"#VALUE!"}},{"$f":"AND(DataForm!J30,\"AAAAAFQPehU=\")","v":{"$error":"#VALUE!"}},{"$f":"AND(DataForm!K30,\"AAAAAFQPehY=\")","v":{"$error":"#VALUE!"}},{"$f":"AND(DataForm!L30,\"AAAAAFQPehc=\")","v":{"$error":"#VALUE!"}},{"$f":"AND(DataForm!M30,\"AAAAAFQPehg=\")","v":{"$error":"#VALUE!"}},{"$f":"AND(DataForm!N30,\"AAAAAFQPehk=\")","v":{"$error":"#VALUE!"}},{"$f":"AND(DataForm!O30,\"AAAAAFQPeho=\")","v":{"$error":"#VALUE!"}},{"$f":"AND(DataForm!P30,\"AAAAAFQPehs=\")","v":{"$error":"#VALUE!"}},{"$f":"AND(DataForm!Q30,\"AAAAAFQPehw=\")","v":{"$error":"#VALUE!"}},{"$f":"AND(DataForm!R30,\"AAAAAFQPeh0=\")","v":{"$error":"#VALUE!"}},{"$f":"AND(DataForm!S30,\"AAAAAFQPeh4=\")","v":{"$error":"#VALUE!"}},{"$f":"AND(DataForm!T30,\"AAAAAFQPeh8=\")","v":{"$error":"#VALUE!"}},{"$f":"AND(DataForm!U30,\"AAAAAFQPeiA=\")","v":{"$error":"#VALUE!"}},{"$f":"AND(DataForm!V30,\"AAAAAFQPeiE=\")","v":{"$error":"#VALUE!"}},{"$f":"IF(DataForm!31:31,\"AAAAAFQPeiI=\",0)","v":0},{"$f":"AND(DataForm!A31,\"AAAAAFQPeiM=\")","v":{"$error":"#VALUE!"}},{"$f":"AND(DataForm!B31,\"AAAAAFQPeiQ=\")","v":{"$error":"#VALUE!"}},{"$f":"AND(DataForm!C31,\"AAAAAFQPeiU=\")","v":{"$error":"#VALUE!"}},{"$f":"AND(DataForm!D31,\"AAAAAFQPeiY=\")","v":{"$error":"#VALUE!"}},{"$f":"AND(DataForm!E31,\"AAAAAFQPeic=\")","v":{"$error":"#VALUE!"}},{"$f":"AND(DataForm!F31,\"AAAAAFQPeig=\")","v":{"$error":"#VALUE!"}},{"$f":"AND(DataForm!G31,\"AAAAAFQPeik=\")","v":{"$error":"#VALUE!"}},{"$f":"AND(DataForm!H31,\"AAAAAFQPeio=\")","v":{"$error":"#VALUE!"}},{"$f":"AND(DataForm!I31,\"AAAAAFQPeis=\")","v":{"$error":"#VALUE!"}},{"$f":"AND(DataForm!J31,\"AAAAAFQPeiw=\")","v":{"$error":"#VALUE!"}},{"$f":"AND(DataForm!K31,\"AAAAAFQPei0=\")","v":{"$error":"#VALUE!"}},{"$f":"AND(DataForm!L31,\"AAAAAFQPei4=\")","v":{"$error":"#VALUE!"}},{"$f":"AND(DataForm!M31,\"AAAAAFQPei8=\")","v":{"$error":"#VALUE!"}},{"$f":"AND(DataForm!N31,\"AAAAAFQPejA=\")","v":{"$error":"#VALUE!"}},{"$f":"AND(DataForm!O31,\"AAAAAFQPejE=\")","v":{"$error":"#VALUE!"}},{"$f":"AND(DataForm!P31,\"AAAAAFQPejI=\")","v":{"$error":"#VALUE!"}},{"$f":"AND(DataForm!Q31,\"AAAAAFQPejM=\")","v":{"$error":"#VALUE!"}},{"$f":"AND(DataForm!R31,\"AAAAAFQPejQ=\")","v":{"$error":"#VALUE!"}},{"$f":"AND(DataForm!S31,\"AAAAAFQPejU=\")","v":{"$error":"#VALUE!"}},{"$f":"AND(DataForm!T31,\"AAAAAFQPejY=\")","v":{"$error":"#VALUE!"}},{"$f":"AND(DataForm!U31,\"AAAAAFQPejc=\")","v":{"$error":"#VALUE!"}},{"$f":"AND(DataForm!V31,\"AAAAAFQPejg=\")","v":{"$error":"#VALUE!"}},{"$f":"IF(DataForm!32:32,\"AAAAAFQPejk=\",0)","v":0},{"$f":"AND(DataForm!A32,\"AAAAAFQPejo=\")","v":{"$error":"#VALUE!"}},{"$f":"AND(DataForm!B32,\"AAAAAFQPejs=\")","v":{"$error":"#VALUE!"}},{"$f":"AND(DataForm!C32,\"AAAAAFQPejw=\")","v":{"$error":"#VALUE!"}},{"$f":"AND(DataForm!D32,\"AAAAAFQPej0=\")","v":{"$error":"#VALUE!"}},{"$f":"AND(DataForm!E32,\"AAAAAFQPej4=\")","v":{"$error":"#VALUE!"}},{"$f":"AND(DataForm!F32,\"AAAAAFQPej8=\")","v":{"$error":"#VALUE!"}},{"$f":"AND(DataForm!G32,\"AAAAAFQPekA=\")","v":{"$error":"#VALUE!"}},{"$f":"AND(DataForm!H32,\"AAAAAFQPekE=\")","v":{"$error":"#VALUE!"}},{"$f":"AND(DataForm!I32,\"AAAAAFQPekI=\")","v":{"$error":"#VALUE!"}},{"$f":"AND(DataForm!J32,\"AAAAAFQPekM=\")","v":{"$error":"#VALUE!"}},{"$f":"AND(DataForm!K32,\"AAAAAFQPekQ=\")","v":{"$error":"#VALUE!"}},{"$f":"AND(DataForm!L32,\"AAAAAFQPekU=\")","v":{"$error":"#VALUE!"}},{"$f":"AND(DataForm!M32,\"AAAAAFQPekY=\")","v":{"$error":"#VALUE!"}},{"$f":"AND(DataForm!N32,\"AAAAAFQPekc=\")","v":{"$error":"#VALUE!"}},{"$f":"AND(DataForm!O32,\"AAAAAFQPekg=\")","v":{"$error":"#VALUE!"}},{"$f":"AND(DataForm!P32,\"AAAAAFQPekk=\")","v":{"$error":"#VALUE!"}},{"$f":"AND(DataForm!Q32,\"AAAAAFQPeko=\")","v":{"$error":"#VALUE!"}},{"$f":"AND(DataForm!R32,\"AAAAAFQPeks=\")","v":{"$error":"#VALUE!"}},{"$f":"AND(DataForm!S32,\"AAAAAFQPekw=\")","v":{"$error":"#VALUE!"}},{"$f":"AND(DataForm!T32,\"AAAAAFQPek0=\")","v":{"$error":"#VALUE!"}},{"$f":"AND(DataForm!U32,\"AAAAAFQPek4=\")","v":{"$error":"#VALUE!"}},{"$f":"AND(DataForm!V32,\"AAAAAFQPek8=\")","v":{"$error":"#VALUE!"}},{"$f":"IF(DataForm!33:33,\"AAAAAFQPelA=\",0)","v":0},{"$f":"AND(DataForm!A33,\"AAAAAFQPelE=\")","v":{"$error":"#VALUE!"}},{"$f":"AND(DataForm!B33,\"AAAAAFQPelI=\")","v":{"$error":"#VALUE!"}},{"$f":"AND(DataForm!C33,\"AAAAAFQPelM=\")","v":{"$error":"#VALUE!"}},{"$f":"AND(DataForm!D33,\"AAAAAFQPelQ=\")","v":{"$error":"#VALUE!"}},{"$f":"AND(DataForm!E33,\"AAAAAFQPelU=\")","v":{"$error":"#VALUE!"}},{"$f":"AND(DataForm!F33,\"AAAAAFQPelY=\")","v":{"$error":"#VALUE!"}},{"$f":"AND(DataForm!G33,\"AAAAAFQPelc=\")","v":{"$error":"#VALUE!"}},{"$f":"AND(DataForm!H33,\"AAAAAFQPelg=\")","v":{"$error":"#VALUE!"}},{"$f":"AND(DataForm!I33,\"AAAAAFQPelk=\")","v":{"$error":"#VALUE!"}},{"$f":"AND(DataForm!J33,\"AAAAAFQPelo=\")","v":{"$error":"#VALUE!"}},{"$f":"AND(DataForm!K33,\"AAAAAFQPels=\")","v":{"$error":"#VALUE!"}},{"$f":"AND(DataForm!L33,\"AAAAAFQPelw=\")","v":{"$error":"#VALUE!"}},{"$f":"AND(DataForm!M33,\"AAAAAFQPel0=\")","v":{"$error":"#VALUE!"}},{"$f":"AND(DataForm!N33,\"AAAAAFQPel4=\")","v":{"$error":"#VALUE!"}},{"$f":"AND(DataForm!O33,\"AAAAAFQPel8=\")","v":{"$error":"#VALUE!"}},{"$f":"AND(DataForm!P33,\"AAAAAFQPemA=\")","v":{"$error":"#VALUE!"}},{"$f":"AND(DataForm!Q33,\"AAAAAFQPemE=\")","v":{"$error":"#VALUE!"}},{"$f":"AND(DataForm!R33,\"AAAAAFQPemI=\")","v":{"$error":"#VALUE!"}},{"$f":"AND(DataForm!S33,\"AAAAAFQPemM=\")","v":{"$error":"#VALUE!"}},{"$f":"AND(DataForm!T33,\"AAAAAFQPemQ=\")","v":{"$error":"#VALUE!"}},{"$f":"AND(DataForm!U33,\"AAAAAFQPemU=\")","v":{"$error":"#VALUE!"}},{"$f":"AND(DataForm!V33,\"AAAAAFQPemY=\")","v":{"$error":"#VALUE!"}},{"$f":"IF(DataForm!34:34,\"AAAAAFQPemc=\",0)","v":0},{"$f":"AND(DataForm!A34,\"AAAAAFQPemg=\")","v":{"$error":"#VALUE!"}},{"$f":"AND(DataForm!B34,\"AAAAAFQPemk=\")","v":{"$error":"#VALUE!"}},{"$f":"AND(DataForm!C34,\"AAAAAFQPemo=\")","v":{"$error":"#VALUE!"}},{"$f":"AND(DataForm!D34,\"AAAAAFQPems=\")","v":{"$error":"#VALUE!"}},{"$f":"AND(DataForm!E34,\"AAAAAFQPemw=\")","v":{"$error":"#VALUE!"}},{"$f":"AND(DataForm!F34,\"AAAAAFQPem0=\")","v":{"$error":"#VALUE!"}},{"$f":"AND(DataForm!G34,\"AAAAAFQPem4=\")","v":{"$error":"#VALUE!"}},{"$f":"AND(DataForm!H34,\"AAAAAFQPem8=\")","v":{"$error":"#VALUE!"}},{"$f":"AND(DataForm!I34,\"AAAAAFQPenA=\")","v":{"$error":"#VALUE!"}},{"$f":"AND(DataForm!J34,\"AAAAAFQPenE=\")","v":{"$error":"#VALUE!"}},{"$f":"AND(DataForm!K34,\"AAAAAFQPenI=\")","v":{"$error":"#VALUE!"}},{"$f":"AND(DataForm!L34,\"AAAAAFQPenM=\")","v":{"$error":"#VALUE!"}},{"$f":"AND(DataForm!M34,\"AAAAAFQPenQ=\")","v":{"$error":"#VALUE!"}},{"$f":"AND(DataForm!N34,\"AAAAAFQPenU=\")","v":{"$error":"#VALUE!"}},{"$f":"AND(DataForm!O34,\"AAAAAFQPenY=\")","v":{"$error":"#VALUE!"}},{"$f":"AND(DataForm!P34,\"AAAAAFQPenc=\")","v":{"$error":"#VALUE!"}},{"$f":"AND(DataForm!Q34,\"AAAAAFQPeng=\")","v":{"$error":"#VALUE!"}},{"$f":"AND(DataForm!R34,\"AAAAAFQPenk=\")","v":{"$error":"#VALUE!"}},{"$f":"AND(DataForm!S34,\"AAAAAFQPeno=\")","v":{"$error":"#VALUE!"}},{"$f":"AND(DataForm!T34,\"AAAAAFQPens=\")","v":{"$error":"#VALUE!"}},{"$f":"AND(DataForm!U34,\"AAAAAFQPenw=\")","v":{"$error":"#VALUE!"}},{"$f":"AND(DataForm!V34,\"AAAAAFQPen0=\")","v":{"$error":"#VALUE!"}},{"$f":"IF(DataForm!35:35,\"AAAAAFQPen4=\",0)","v":0},{"$f":"AND(DataForm!A35,\"AAAAAFQPen8=\")","v":{"$error":"#VALUE!"}},{"$f":"AND(DataForm!B35,\"AAAAAFQPeoA=\")","v":{"$error":"#VALUE!"}},{"$f":"AND(DataForm!C35,\"AAAAAFQPeoE=\")","v":{"$error":"#VALUE!"}},{"$f":"AND(DataForm!D35,\"AAAAAFQPeoI=\")","v":{"$error":"#VALUE!"}},{"$f":"AND(DataForm!E35,\"AAAAAFQPeoM=\")","v":{"$error":"#VALUE!"}},{"$f":"AND(DataForm!F35,\"AAAAAFQPeoQ=\")","v":{"$error":"#VALUE!"}},{"$f":"AND(DataForm!G35,\"AAAAAFQPeoU=\")","v":{"$error":"#VALUE!"}},{"$f":"AND(DataForm!H35,\"AAAAAFQPeoY=\")","v":{"$error":"#VALUE!"}},{"$f":"AND(DataForm!I35,\"AAAAAFQPeoc=\")","v":{"$error":"#VALUE!"}},{"$f":"AND(DataForm!J35,\"AAAAAFQPeog=\")","v":{"$error":"#VALUE!"}},{"$f":"AND(DataForm!K35,\"AAAAAFQPeok=\")","v":{"$error":"#VALUE!"}},{"$f":"AND(DataForm!L35,\"AAAAAFQPeoo=\")","v":{"$error":"#VALUE!"}},{"$f":"AND(DataForm!M35,\"AAAAAFQPeos=\")","v":{"$error":"#VALUE!"}},{"$f":"AND(DataForm!N35,\"AAAAAFQPeow=\")","v":{"$error":"#VALUE!"}},{"$f":"AND(DataForm!O35,\"AAAAAFQPeo0=\")","v":{"$error":"#VALUE!"}},{"$f":"AND(DataForm!P35,\"AAAAAFQPeo4=\")","v":{"$error":"#VALUE!"}},{"$f":"AND(DataForm!Q35,\"AAAAAFQPeo8=\")","v":{"$error":"#VALUE!"}},{"$f":"AND(DataForm!R35,\"AAAAAFQPepA=\")","v":{"$error":"#VALUE!"}},{"$f":"AND(DataForm!S35,\"AAAAAFQPepE=\")","v":{"$error":"#VALUE!"}},{"$f":"AND(DataForm!T35,\"AAAAAFQPepI=\")","v":{"$error":"#VALUE!"}},{"$f":"AND(DataForm!U35,\"AAAAAFQPepM=\")","v":{"$error":"#VALUE!"}},{"$f":"AND(DataForm!V35,\"AAAAAFQPepQ=\")","v":{"$error":"#VALUE!"}},{"$f":"IF(DataForm!36:36,\"AAAAAFQPepU=\",0)","v":0},{"$f":"AND(DataForm!A36,\"AAAAAFQPepY=\")","v":{"$error":"#VALUE!"}},{"$f":"AND(DataForm!B36,\"AAAAAFQPepc=\")","v":{"$error":"#VALUE!"}},{"$f":"AND(DataForm!C36,\"AAAAAFQPepg=\")","v":{"$error":"#VALUE!"}},{"$f":"AND(DataForm!D36,\"AAAAAFQPepk=\")","v":{"$error":"#VALUE!"}},{"$f":"AND(DataForm!E36,\"AAAAAFQPepo=\")","v":{"$error":"#VALUE!"}},{"$f":"AND(DataForm!F36,\"AAAAAFQPeps=\")","v":{"$error":"#VALUE!"}},{"$f":"AND(DataForm!G36,\"AAAAAFQPepw=\")","v":{"$error":"#VALUE!"}},{"$f":"AND(DataForm!H36,\"AAAAAFQPep0=\")","v":{"$error":"#VALUE!"}},{"$f":"AND(DataForm!I36,\"AAAAAFQPep4=\")","v":{"$error":"#VALUE!"}},{"$f":"AND(DataForm!J36,\"AAAAAFQPep8=\")","v":{"$error":"#VALUE!"}},{"$f":"AND(DataForm!K36,\"AAAAAFQPeqA=\")","v":{"$error":"#VALUE!"}},{"$f":"AND(DataForm!L36,\"AAAAAFQPeqE=\")","v":{"$error":"#VALUE!"}},{"$f":"AND(DataForm!M36,\"AAAAAFQPeqI=\")","v":{"$error":"#VALUE!"}},{"$f":"AND(DataForm!N36,\"AAAAAFQPeqM=\")","v":{"$error":"#VALUE!"}},{"$f":"AND(DataForm!O36,\"AAAAAFQPeqQ=\")","v":{"$error":"#VALUE!"}},{"$f":"AND(DataForm!P36,\"AAAAAFQPeqU=\")","v":{"$error":"#VALUE!"}},{"$f":"AND(DataForm!Q36,\"AAAAAFQPeqY=\")","v":{"$error":"#VALUE!"}},{"$f":"AND(DataForm!R36,\"AAAAAFQPeqc=\")","v":{"$error":"#VALUE!"}},{"$f":"AND(DataForm!S36,\"AAAAAFQPeqg=\")","v":{"$error":"#VALUE!"}},{"$f":"AND(DataForm!T36,\"AAAAAFQPeqk=\")","v":{"$error":"#VALUE!"}},{"$f":"AND(DataForm!U36,\"AAAAAFQPeqo=\")","v":{"$error":"#VALUE!"}},{"$f":"AND(DataForm!V36,\"AAAAAFQPeqs=\")","v":{"$error":"#VALUE!"}},{"$f":"IF(DataForm!37:37,\"AAAAAFQPeqw=\",0)","v":0},{"$f":"AND(DataForm!A37,\"AAAAAFQPeq0=\")","v":{"$error":"#VALUE!"}},{"$f":"AND(DataForm!B37,\"AAAAAFQPeq4=\")","v":{"$error":"#VALUE!"}},{"$f":"AND(DataForm!C37,\"AAAAAFQPeq8=\")","v":{"$error":"#VALUE!"}},{"$f":"AND(DataForm!D37,\"AAAAAFQPerA=\")","v":{"$error":"#VALUE!"}},{"$f":"AND(DataForm!E37,\"AAAAAFQPerE=\")","v":{"$error":"#VALUE!"}},{"$f":"AND(DataForm!F37,\"AAAAAFQPerI=\")","v":{"$error":"#VALUE!"}},{"$f":"AND(DataForm!G37,\"AAAAAFQPerM=\")","v":{"$error":"#VALUE!"}},{"$f":"AND(DataForm!H37,\"AAAAAFQPerQ=\")","v":{"$error":"#VALUE!"}},{"$f":"AND(DataForm!I37,\"AAAAAFQPerU=\")","v":{"$error":"#VALUE!"}},{"$f":"AND(DataForm!J37,\"AAAAAFQPerY=\")","v":{"$error":"#VALUE!"}},{"$f":"AND(DataForm!K37,\"AAAAAFQPerc=\")","v":{"$error":"#VALUE!"}},{"$f":"AND(DataForm!L37,\"AAAAAFQPerg=\")","v":{"$error":"#VALUE!"}},{"$f":"AND(DataForm!M37,\"AAAAAFQPerk=\")","v":{"$error":"#VALUE!"}},{"$f":"AND(DataForm!N37,\"AAAAAFQPero=\")","v":{"$error":"#VALUE!"}},{"$f":"AND(DataForm!O37,\"AAAAAFQPers=\")","v":{"$error":"#VALUE!"}},{"$f":"AND(DataForm!P37,\"AAAAAFQPerw=\")","v":{"$error":"#VALUE!"}},{"$f":"AND(DataForm!Q37,\"AAAAAFQPer0=\")","v":{"$error":"#VALUE!"}},{"$f":"AND(DataForm!R37,\"AAAAAFQPer4=\")","v":{"$error":"#VALUE!"}},{"$f":"AND(DataForm!S37,\"AAAAAFQPer8=\")","v":{"$error":"#VALUE!"}},{"$f":"AND(DataForm!T37,\"AAAAAFQPesA=\")","v":{"$error":"#VALUE!"}},{"$f":"AND(DataForm!U37,\"AAAAAFQPesE=\")","v":{"$error":"#VALUE!"}},{"$f":"AND(DataForm!V37,\"AAAAAFQPesI=\")","v":{"$error":"#VALUE!"}},{"$f":"IF(DataForm!38:38,\"AAAAAFQPesM=\",0)","v":0},{"$f":"AND(DataForm!A38,\"AAAAAFQPesQ=\")","v":{"$error":"#VALUE!"}},{"$f":"AND(DataForm!B38,\"AAAAAFQPesU=\")","v":{"$error":"#VALUE!"}},{"$f":"AND(DataForm!C38,\"AAAAAFQPesY=\")","v":{"$error":"#VALUE!"}},{"$f":"AND(DataForm!D38,\"AAAAAFQPesc=\")","v":{"$error":"#VALUE!"}},{"$f":"AND(DataForm!E38,\"AAAAAFQPesg=\")","v":{"$error":"#VALUE!"}},{"$f":"AND(DataForm!F38,\"AAAAAFQPesk=\")","v":{"$error":"#VALUE!"}},{"$f":"AND(DataForm!G38,\"AAAAAFQPeso=\")","v":{"$error":"#VALUE!"}},{"$f":"AND(DataForm!H38,\"AAAAAFQPess=\")","v":{"$error":"#VALUE!"}},{"$f":"AND(DataForm!I38,\"AAAAAFQPesw=\")","v":{"$error":"#VALUE!"}},{"$f":"AND(DataForm!J38,\"AAAAAFQPes0=\")","v":{"$error":"#VALUE!"}},{"$f":"AND(DataForm!K38,\"AAAAAFQPes4=\")","v":{"$error":"#VALUE!"}},{"$f":"AND(DataForm!L38,\"AAAAAFQPes8=\")","v":{"$error":"#VALUE!"}},{"$f":"AND(DataForm!M38,\"AAAAAFQPetA=\")","v":{"$error":"#VALUE!"}},{"$f":"AND(DataForm!N38,\"AAAAAFQPetE=\")","v":{"$error":"#VALUE!"}},{"$f":"AND(DataForm!O38,\"AAAAAFQPetI=\")","v":{"$error":"#VALUE!"}},{"$f":"AND(DataForm!P38,\"AAAAAFQPetM=\")","v":{"$error":"#VALUE!"}},{"$f":"AND(DataForm!Q38,\"AAAAAFQPetQ=\")","v":{"$error":"#VALUE!"}},{"$f":"AND(DataForm!R38,\"AAAAAFQPetU=\")","v":{"$error":"#VALUE!"}},{"$f":"AND(DataForm!S38,\"AAAAAFQPetY=\")","v":{"$error":"#VALUE!"}},{"$f":"AND(DataForm!T38,\"AAAAAFQPetc=\")","v":{"$error":"#VALUE!"}},{"$f":"AND(DataForm!U38,\"AAAAAFQPetg=\")","v":{"$error":"#VALUE!"}},{"$f":"AND(DataForm!V38,\"AAAAAFQPetk=\")","v":{"$error":"#VALUE!"}},{"$f":"IF(DataForm!39:39,\"AAAAAFQPeto=\",0)","v":0},{"$f":"AND(DataForm!A39,\"AAAAAFQPets=\")","v":{"$error":"#VALUE!"}},{"$f":"AND(DataForm!B39,\"AAAAAFQPetw=\")","v":{"$error":"#VALUE!"}},{"$f":"AND(DataForm!C39,\"AAAAAFQPet0=\")","v":{"$error":"#VALUE!"}},{"$f":"AND(DataForm!D39,\"AAAAAFQPet4=\")","v":{"$error":"#VALUE!"}},{"$f":"AND(DataForm!E39,\"AAAAAFQPet8=\")","v":{"$error":"#VALUE!"}},{"$f":"AND(DataForm!F39,\"AAAAAFQPeuA=\")","v":{"$error":"#VALUE!"}},{"$f":"AND(DataForm!G39,\"AAAAAFQPeuE=\")","v":{"$error":"#VALUE!"}},{"$f":"AND(DataForm!H39,\"AAAAAFQPeuI=\")","v":{"$error":"#VALUE!"}},{"$f":"AND(DataForm!I39,\"AAAAAFQPeuM=\")","v":{"$error":"#VALUE!"}},{"$f":"AND(DataForm!J39,\"AAAAAFQPeuQ=\")","v":{"$error":"#VALUE!"}},{"$f":"AND(DataForm!K39,\"AAAAAFQPeuU=\")","v":{"$error":"#VALUE!"}},{"$f":"AND(DataForm!L39,\"AAAAAFQPeuY=\")","v":{"$error":"#VALUE!"}},{"$f":"AND(DataForm!M39,\"AAAAAFQPeuc=\")","v":{"$error":"#VALUE!"}},{"$f":"AND(DataForm!N39,\"AAAAAFQPeug=\")","v":{"$error":"#VALUE!"}},{"$f":"AND(DataForm!O39,\"AAAAAFQPeuk=\")","v":{"$error":"#VALUE!"}},{"$f":"AND(DataForm!P39,\"AAAAAFQPeuo=\")","v":{"$error":"#VALUE!"}},{"$f":"AND(DataForm!Q39,\"AAAAAFQPeus=\")","v":{"$error":"#VALUE!"}},{"$f":"AND(DataForm!R39,\"AAAAAFQPeuw=\")","v":{"$error":"#VALUE!"}},{"$f":"AND(DataForm!S39,\"AAAAAFQPeu0=\")","v":{"$error":"#VALUE!"}},{"$f":"AND(DataForm!T39,\"AAAAAFQPeu4=\")","v":{"$error":"#VALUE!"}},{"$f":"AND(DataForm!U39,\"AAAAAFQPeu8=\")","v":{"$error":"#VALUE!"}},{"$f":"AND(DataForm!V39,\"AAAAAFQPevA=\")","v":{"$error":"#VALUE!"}},{"$f":"IF(DataForm!40:40,\"AAAAAFQPevE=\",0)","v":0},{"$f":"AND(DataForm!A40,\"AAAAAFQPevI=\")","v":{"$error":"#VALUE!"}},{"$f":"AND(DataForm!B40,\"AAAAAFQPevM=\")","v":{"$error":"#VALUE!"}},{"$f":"AND(DataForm!C40,\"AAAAAFQPevQ=\")","v":{"$error":"#VALUE!"}},{"$f":"AND(DataForm!D40,\"AAAAAFQPevU=\")","v":{"$error":"#VALUE!"}},{"$f":"AND(DataForm!E40,\"AAAAAFQPevY=\")","v":{"$error":"#VALUE!"}},{"$f":"AND(DataForm!F40,\"AAAAAFQPevc=\")","v":{"$error":"#VALUE!"}},{"$f":"AND(DataForm!G40,\"AAAAAFQPevg=\")","v":{"$error":"#VALUE!"}},{"$f":"AND(DataForm!H40,\"AAAAAFQPevk=\")","v":{"$error":"#VALUE!"}},{"$f":"AND(DataForm!I40,\"AAAAAFQPevo=\")","v":{"$error":"#VALUE!"}},{"$f":"AND(DataForm!J40,\"AAAAAFQPevs=\")","v":{"$error":"#VALUE!"}},{"$f":"AND(DataForm!K40,\"AAAAAFQPevw=\")","v":{"$error":"#VALUE!"}},{"$f":"AND(DataForm!L40,\"AAAAAFQPev0=\")","v":{"$error":"#VALUE!"}},{"$f":"AND(DataForm!M40,\"AAAAAFQPev4=\")","v":{"$error":"#VALUE!"}},{"$f":"AND(DataForm!N40,\"AAAAAFQPev8=\")","v":{"$error":"#VALUE!"}}]
[{"$f":"AND(DataForm!O40,\"AAAAABz2dwA=\")","v":{"$error":"#VALUE!"}},{"$f":"AND(DataForm!P40,\"AAAAABz2dwE=\")","v":{"$error":"#VALUE!"}},{"$f":"AND(DataForm!Q40,\"AAAAABz2dwI=\")","v":{"$error":"#VALUE!"}},{"$f":"AND(DataForm!R40,\"AAAAABz2dwM=\")","v":{"$error":"#VALUE!"}},{"$f":"AND(DataForm!S40,\"AAAAABz2dwQ=\")","v":{"$error":"#VALUE!"}},{"$f":"AND(DataForm!T40,\"AAAAABz2dwU=\")","v":{"$error":"#VALUE!"}},{"$f":"AND(DataForm!U40,\"AAAAABz2dwY=\")","v":{"$error":"#VALUE!"}},{"$f":"AND(DataForm!V40,\"AAAAABz2dwc=\")","v":{"$error":"#VALUE!"}},{"$f":"IF(DataForm!41:41,\"AAAAABz2dwg=\",0)","v":{"$error":"#VALUE!"}},{"$f":"AND(DataForm!A41,\"AAAAABz2dwk=\")","v":{"$error":"#VALUE!"}},{"$f":"AND(DataForm!B41,\"AAAAABz2dwo=\")","v":{"$error":"#VALUE!"}},{"$f":"AND(DataForm!C41,\"AAAAABz2dws=\")","v":{"$error":"#VALUE!"}},{"$f":"AND(DataForm!D41,\"AAAAABz2dww=\")","v":{"$error":"#VALUE!"}},{"$f":"AND(DataForm!E41,\"AAAAABz2dw0=\")","v":{"$error":"#VALUE!"}},{"$f":"AND(DataForm!F41,\"AAAAABz2dw4=\")","v":{"$error":"#VALUE!"}},{"$f":"AND(DataForm!G41,\"AAAAABz2dw8=\")","v":{"$error":"#VALUE!"}},{"$f":"AND(DataForm!H41,\"AAAAABz2dxA=\")","v":{"$error":"#VALUE!"}},{"$f":"AND(DataForm!I41,\"AAAAABz2dxE=\")","v":{"$error":"#VALUE!"}},{"$f":"AND(DataForm!J41,\"AAAAABz2dxI=\")","v":{"$error":"#VALUE!"}},{"$f":"AND(DataForm!K41,\"AAAAABz2dxM=\")","v":{"$error":"#VALUE!"}},{"$f":"AND(DataForm!L41,\"AAAAABz2dxQ=\")","v":{"$error":"#VALUE!"}},{"$f":"AND(DataForm!M41,\"AAAAABz2dxU=\")","v":{"$error":"#VALUE!"}},{"$f":"AND(DataForm!N41,\"AAAAABz2dxY=\")","v":{"$error":"#VALUE!"}},{"$f":"AND(DataForm!O41,\"AAAAABz2dxc=\")","v":{"$error":"#VALUE!"}},{"$f":"AND(DataForm!P41,\"AAAAABz2dxg=\")","v":{"$error":"#VALUE!"}},{"$f":"AND(DataForm!Q41,\"AAAAABz2dxk=\")","v":{"$error":"#VALUE!"}},{"$f":"AND(DataForm!R41,\"AAAAABz2dxo=\")","v":{"$error":"#VALUE!"}},{"$f":"AND(DataForm!S41,\"AAAAABz2dxs=\")","v":{"$error":"#VALUE!"}},{"$f":"AND(DataForm!T41,\"AAAAABz2dxw=\")","v":{"$error":"#VALUE!"}},{"$f":"AND(DataForm!U41,\"AAAAABz2dx0=\")","v":{"$error":"#VALUE!"}},{"$f":"AND(DataForm!V41,\"AAAAABz2dx4=\")","v":{"$error":"#VALUE!"}},{"$f":"IF(DataForm!42:42,\"AAAAABz2dx8=\",0)","v":0},{"$f":"AND(DataForm!A42,\"AAAAABz2dyA=\")","v":{"$error":"#VALUE!"}},{"$f":"AND(DataForm!B42,\"AAAAABz2dyE=\")","v":{"$error":"#VALUE!"}},{"$f":"AND(DataForm!C42,\"AAAAABz2dyI=\")","v":{"$error":"#VALUE!"}},{"$f":"AND(DataForm!D42,\"AAAAABz2dyM=\")","v":{"$error":"#VALUE!"}},{"$f":"AND(DataForm!E42,\"AAAAABz2dyQ=\")","v":{"$error":"#VALUE!"}},{"$f":"AND(DataForm!F42,\"AAAAABz2dyU=\")","v":{"$error":"#VALUE!"}},{"$f":"AND(DataForm!G42,\"AAAAABz2dyY=\")","v":{"$error":"#VALUE!"}},{"$f":"AND(DataForm!H42,\"AAAAABz2dyc=\")","v":{"$error":"#VALUE!"}},{"$f":"AND(DataForm!I42,\"AAAAABz2dyg=\")","v":{"$error":"#VALUE!"}},{"$f":"AND(DataForm!J42,\"AAAAABz2dyk=\")","v":{"$error":"#VALUE!"}},{"$f":"AND(DataForm!K42,\"AAAAABz2dyo=\")","v":{"$error":"#VALUE!"}},{"$f":"AND(DataForm!L42,\"AAAAABz2dys=\")","v":{"$error":"#VALUE!"}},{"$f":"AND(DataForm!M42,\"AAAAABz2dyw=\")","v":{"$error":"#VALUE!"}},{"$f":"AND(DataForm!N42,\"AAAAABz2dy0=\")","v":{"$error":"#VALUE!"}},{"$f":"AND(DataForm!O42,\"AAAAABz2dy4=\")","v":{"$error":"#VALUE!"}},{"$f":"AND(DataForm!P42,\"AAAAABz2dy8=\")","v":{"$error":"#VALUE!"}},{"$f":"AND(DataForm!Q42,\"AAAAABz2dzA=\")","v":{"$error":"#VALUE!"}},{"$f":"AND(DataForm!R42,\"AAAAABz2dzE=\")","v":{"$error":"#VALUE!"}},{"$f":"AND(DataForm!S42,\"AAAAABz2dzI=\")","v":{"$error":"#VALUE!"}},{"$f":"AND(DataForm!T42,\"AAAAABz2dzM=\")","v":{"$error":"#VALUE!"}},{"$f":"AND(DataForm!U42,\"AAAAABz2dzQ=\")","v":{"$error":"#VALUE!"}},{"$f":"AND(DataForm!V42,\"AAAAABz2dzU=\")","v":{"$error":"#VALUE!"}},{"$f":"IF(DataForm!43:43,\"AAAAABz2dzY=\",0)","v":0},{"$f":"AND(DataForm!A43,\"AAAAABz2dzc=\")","v":{"$error":"#VALUE!"}},{"$f":"AND(DataForm!B43,\"AAAAABz2dzg=\")","v":{"$error":"#VALUE!"}},{"$f":"AND(DataForm!C43,\"AAAAABz2dzk=\")","v":{"$error":"#VALUE!"}},{"$f":"AND(DataForm!D43,\"AAAAABz2dzo=\")","v":{"$error":"#VALUE!"}},{"$f":"AND(DataForm!E43,\"AAAAABz2dzs=\")","v":{"$error":"#VALUE!"}},{"$f":"AND(DataForm!F43,\"AAAAABz2dzw=\")","v":{"$error":"#VALUE!"}},{"$f":"AND(DataForm!G43,\"AAAAABz2dz0=\")","v":{"$error":"#VALUE!"}},{"$f":"AND(DataForm!H43,\"AAAAABz2dz4=\")","v":{"$error":"#VALUE!"}},{"$f":"AND(DataForm!I43,\"AAAAABz2dz8=\")","v":{"$error":"#VALUE!"}},{"$f":"AND(DataForm!J43,\"AAAAABz2d0A=\")","v":{"$error":"#VALUE!"}},{"$f":"AND(DataForm!K43,\"AAAAABz2d0E=\")","v":{"$error":"#VALUE!"}},{"$f":"AND(DataForm!L43,\"AAAAABz2d0I=\")","v":{"$error":"#VALUE!"}},{"$f":"AND(DataForm!M43,\"AAAAABz2d0M=\")","v":{"$error":"#VALUE!"}},{"$f":"AND(DataForm!N43,\"AAAAABz2d0Q=\")","v":{"$error":"#VALUE!"}},{"$f":"AND(DataForm!O43,\"AAAAABz2d0U=\")","v":{"$error":"#VALUE!"}},{"$f":"AND(DataForm!P43,\"AAAAABz2d0Y=\")","v":{"$error":"#VALUE!"}},{"$f":"AND(DataForm!Q43,\"AAAAABz2d0c=\")","v":{"$error":"#VALUE!"}},{"$f":"AND(DataForm!R43,\"AAAAABz2d0g=\")","v":{"$error":"#VALUE!"}},{"$f":"AND(DataForm!S43,\"AAAAABz2d0k=\")","v":{"$error":"#VALUE!"}},{"$f":"AND(DataForm!T43,\"AAAAABz2d0o=\")","v":{"$error":"#VALUE!"}},{"$f":"AND(DataForm!U43,\"AAAAABz2d0s=\")","v":{"$error":"#VALUE!"}},{"$f":"AND(DataForm!V43,\"AAAAABz2d0w=\")","v":{"$error":"#VALUE!"}},{"$f":"IF(DataForm!44:44,\"AAAAABz2d00=\",0)","v":0},{"$f":"AND(DataForm!A44,\"AAAAABz2d04=\")","v":{"$error":"#VALUE!"}},{"$f":"AND(DataForm!B44,\"AAAAABz2d08=\")","v":{"$error":"#VALUE!"}},{"$f":"AND(DataForm!C44,\"AAAAABz2d1A=\")","v":{"$error":"#VALUE!"}},{"$f":"AND(DataForm!D44,\"AAAAABz2d1E=\")","v":{"$error":"#VALUE!"}},{"$f":"AND(DataForm!E44,\"AAAAABz2d1I=\")","v":{"$error":"#VALUE!"}},{"$f":"AND(DataForm!F44,\"AAAAABz2d1M=\")","v":{"$error":"#VALUE!"}},{"$f":"AND(DataForm!G44,\"AAAAABz2d1Q=\")","v":{"$error":"#VALUE!"}},{"$f":"AND(DataForm!H44,\"AAAAABz2d1U=\")","v":{"$error":"#VALUE!"}},{"$f":"AND(DataForm!I44,\"AAAAABz2d1Y=\")","v":{"$error":"#VALUE!"}},{"$f":"AND(DataForm!J44,\"AAAAABz2d1c=\")","v":{"$error":"#VALUE!"}},{"$f":"AND(DataForm!K44,\"AAAAABz2d1g=\")","v":{"$error":"#VALUE!"}},{"$f":"AND(DataForm!L44,\"AAAAABz2d1k=\")","v":{"$error":"#VALUE!"}},{"$f":"AND(DataForm!M44,\"AAAAABz2d1o=\")","v":{"$error":"#VALUE!"}},{"$f":"AND(DataForm!N44,\"AAAAABz2d1s=\")","v":{"$error":"#VALUE!"}},{"$f":"AND(DataForm!O44,\"AAAAABz2d1w=\")","v":{"$error":"#VALUE!"}},{"$f":"AND(DataForm!P44,\"AAAAABz2d10=\")","v":{"$error":"#VALUE!"}},{"$f":"AND(DataForm!Q44,\"AAAAABz2d14=\")","v":{"$error":"#VALUE!"}},{"$f":"AND(DataForm!R44,\"AAAAABz2d18=\")","v":{"$error":"#VALUE!"}},{"$f":"AND(DataForm!S44,\"AAAAABz2d2A=\")","v":{"$error":"#VALUE!"}},{"$f":"AND(DataForm!T44,\"AAAAABz2d2E=\")","v":{"$error":"#VALUE!"}},{"$f":"AND(DataForm!U44,\"AAAAABz2d2I=\")","v":{"$error":"#VALUE!"}},{"$f":"AND(DataForm!V44,\"AAAAABz2d2M=\")","v":{"$error":"#VALUE!"}},{"$f":"IF(DataForm!45:45,\"AAAAABz2d2Q=\",0)","v":0},{"$f":"AND(DataForm!A45,\"AAAAABz2d2U=\")","v":{"$error":"#VALUE!"}},{"$f":"AND(DataForm!B45,\"AAAAABz2d2Y=\")","v":{"$error":"#VALUE!"}},{"$f":"AND(DataForm!C45,\"AAAAABz2d2c=\")","v":{"$error":"#VALUE!"}},{"$f":"AND(DataForm!D45,\"AAAAABz2d2g=\")","v":{"$error":"#VALUE!"}},{"$f":"AND(DataForm!E45,\"AAAAABz2d2k=\")","v":{"$error":"#VALUE!"}},{"$f":"AND(DataForm!F45,\"AAAAABz2d2o=\")","v":{"$error":"#VALUE!"}},{"$f":"AND(DataForm!G45,\"AAAAABz2d2s=\")","v":{"$error":"#VALUE!"}},{"$f":"AND(DataForm!H45,\"AAAAABz2d2w=\")","v":{"$error":"#VALUE!"}},{"$f":"AND(DataForm!I45,\"AAAAABz2d20=\")","v":{"$error":"#VALUE!"}},{"$f":"AND(DataForm!J45,\"AAAAABz2d24=\")","v":{"$error":"#VALUE!"}},{"$f":"AND(DataForm!K45,\"AAAAABz2d28=\")","v":{"$error":"#VALUE!"}},{"$f":"AND(DataForm!L45,\"AAAAABz2d3A=\")","v":{"$error":"#VALUE!"}},{"$f":"AND(DataForm!M45,\"AAAAABz2d3E=\")","v":{"$error":"#VALUE!"}},{"$f":"AND(DataForm!N45,\"AAAAABz2d3I=\")","v":{"$error":"#VALUE!"}},{"$f":"AND(DataForm!O45,\"AAAAABz2d3M=\")","v":{"$error":"#VALUE!"}},{"$f":"AND(DataForm!P45,\"AAAAABz2d3Q=\")","v":{"$error":"#VALUE!"}},{"$f":"AND(DataForm!Q45,\"AAAAABz2d3U=\")","v":{"$error":"#VALUE!"}},{"$f":"AND(DataForm!R45,\"AAAAABz2d3Y=\")","v":{"$error":"#VALUE!"}},{"$f":"AND(DataForm!S45,\"AAAAABz2d3c=\")","v":{"$error":"#VALUE!"}},{"$f":"AND(DataForm!T45,\"AAAAABz2d3g=\")","v":{"$error":"#VALUE!"}},{"$f":"AND(DataForm!U45,\"AAAAABz2d3k=\")","v":{"$error":"#VALUE!"}},{"$f":"AND(DataForm!V45,\"AAAAABz2d3o=\")","v":{"$error":"#VALUE!"}},{"$f":"IF(DataForm!46:46,\"AAAAABz2d3s=\",0)","v":0},{"$f":"AND(DataForm!A46,\"AAAAABz2d3w=\")","v":{"$error":"#VALUE!"}},{"$f":"AND(DataForm!B46,\"AAAAABz2d30=\")","v":{"$error":"#VALUE!"}},{"$f":"AND(DataForm!C46,\"AAAAABz2d34=\")","v":{"$error":"#VALUE!"}},{"$f":"AND(DataForm!D46,\"AAAAABz2d38=\")","v":{"$error":"#VALUE!"}},{"$f":"AND(DataForm!E46,\"AAAAABz2d4A=\")","v":{"$error":"#VALUE!"}},{"$f":"AND(DataForm!F46,\"AAAAABz2d4E=\")","v":{"$error":"#VALUE!"}},{"$f":"AND(DataForm!G46,\"AAAAABz2d4I=\")","v":{"$error":"#VALUE!"}},{"$f":"AND(DataForm!H46,\"AAAAABz2d4M=\")","v":{"$error":"#VALUE!"}},{"$f":"AND(DataForm!I46,\"AAAAABz2d4Q=\")","v":{"$error":"#VALUE!"}},{"$f":"AND(DataForm!J46,\"AAAAABz2d4U=\")","v":{"$error":"#VALUE!"}},{"$f":"AND(DataForm!K46,\"AAAAABz2d4Y=\")","v":{"$error":"#VALUE!"}},{"$f":"AND(DataForm!L46,\"AAAAABz2d4c=\")","v":{"$error":"#VALUE!"}},{"$f":"AND(DataForm!M46,\"AAAAABz2d4g=\")","v":{"$error":"#VALUE!"}},{"$f":"AND(DataForm!N46,\"AAAAABz2d4k=\")","v":{"$error":"#VALUE!"}},{"$f":"AND(DataForm!O46,\"AAAAABz2d4o=\")","v":{"$error":"#VALUE!"}},{"$f":"AND(DataForm!P46,\"AAAAABz2d4s=\")","v":{"$error":"#VALUE!"}},{"$f":"AND(DataForm!Q46,\"AAAAABz2d4w=\")","v":{"$error":"#VALUE!"}},{"$f":"AND(DataForm!R46,\"AAAAABz2d40=\")","v":{"$error":"#VALUE!"}},{"$f":"AND(DataForm!S46,\"AAAAABz2d44=\")","v":{"$error":"#VALUE!"}},{"$f":"AND(DataForm!T46,\"AAAAABz2d48=\")","v":{"$error":"#VALUE!"}},{"$f":"AND(DataForm!U46,\"AAAAABz2d5A=\")","v":{"$error":"#VALUE!"}},{"$f":"AND(DataForm!V46,\"AAAAABz2d5E=\")","v":{"$error":"#VALUE!"}},{"$f":"IF(DataForm!47:47,\"AAAAABz2d5I=\",0)","v":0},{"$f":"AND(DataForm!A47,\"AAAAABz2d5M=\")","v":{"$error":"#VALUE!"}},{"$f":"AND(DataForm!B47,\"AAAAABz2d5Q=\")","v":{"$error":"#VALUE!"}},{"$f":"AND(DataForm!C47,\"AAAAABz2d5U=\")","v":{"$error":"#VALUE!"}},{"$f":"AND(DataForm!D47,\"AAAAABz2d5Y=\")","v":{"$error":"#VALUE!"}},{"$f":"AND(DataForm!E47,\"AAAAABz2d5c=\")","v":{"$error":"#VALUE!"}},{"$f":"AND(DataForm!F47,\"AAAAABz2d5g=\")","v":{"$error":"#VALUE!"}},{"$f":"AND(DataForm!G47,\"AAAAABz2d5k=\")","v":{"$error":"#VALUE!"}},{"$f":"AND(DataForm!H47,\"AAAAABz2d5o=\")","v":{"$error":"#VALUE!"}},{"$f":"AND(DataForm!I47,\"AAAAABz2d5s=\")","v":{"$error":"#VALUE!"}},{"$f":"AND(DataForm!J47,\"AAAAABz2d5w=\")","v":{"$error":"#VALUE!"}},{"$f":"AND(DataForm!K47,\"AAAAABz2d50=\")","v":{"$error":"#VALUE!"}},{"$f":"AND(DataForm!L47,\"AAAAABz2d54=\")","v":{"$error":"#VALUE!"}},{"$f":"AND(DataForm!M47,\"AAAAABz2d58=\")","v":{"$error":"#VALUE!"}},{"$f":"AND(DataForm!N47,\"AAAAABz2d6A=\")","v":{"$error":"#VALUE!"}},{"$f":"AND(DataForm!O47,\"AAAAABz2d6E=\")","v":{"$error":"#VALUE!"}},{"$f":"AND(DataForm!P47,\"AAAAABz2d6I=\")","v":{"$error":"#VALUE!"}},{"$f":"AND(DataForm!Q47,\"AAAAABz2d6M=\")","v":{"$error":"#VALUE!"}},{"$f":"AND(DataForm!R47,\"AAAAABz2d6Q=\")","v":{"$error":"#VALUE!"}},{"$f":"AND(DataForm!S47,\"AAAAABz2d6U=\")","v":{"$error":"#VALUE!"}},{"$f":"AND(DataForm!T47,\"AAAAABz2d6Y=\")","v":{"$error":"#VALUE!"}},{"$f":"AND(DataForm!U47,\"AAAAABz2d6c=\")","v":{"$error":"#VALUE!"}},{"$f":"AND(DataForm!V47,\"AAAAABz2d6g=\")","v":{"$error":"#VALUE!"}},{"$f":"IF(DataForm!48:48,\"AAAAABz2d6k=\",0)","v":0},{"$f":"AND(DataForm!A48,\"AAAAABz2d6o=\")","v":{"$error":"#VALUE!"}},{"$f":"AND(DataForm!B48,\"AAAAABz2d6s=\")","v":{"$error":"#VALUE!"}},{"$f":"AND(DataForm!C48,\"AAAAABz2d6w=\")","v":{"$error":"#VALUE!"}},{"$f":"AND(DataForm!D48,\"AAAAABz2d60=\")","v":{"$error":"#VALUE!"}},{"$f":"AND(DataForm!E48,\"AAAAABz2d64=\")","v":{"$error":"#VALUE!"}},{"$f":"AND(DataForm!F48,\"AAAAABz2d68=\")","v":{"$error":"#VALUE!"}},{"$f":"AND(DataForm!G48,\"AAAAABz2d7A=\")","v":{"$error":"#VALUE!"}},{"$f":"AND(DataForm!H48,\"AAAAABz2d7E=\")","v":{"$error":"#VALUE!"}},{"$f":"AND(DataForm!I48,\"AAAAABz2d7I=\")","v":{"$error":"#VALUE!"}},{"$f":"AND(DataForm!J48,\"AAAAABz2d7M=\")","v":{"$error":"#VALUE!"}},{"$f":"AND(DataForm!K48,\"AAAAABz2d7Q=\")","v":{"$error":"#VALUE!"}},{"$f":"AND(DataForm!L48,\"AAAAABz2d7U=\")","v":{"$error":"#VALUE!"}},{"$f":"AND(DataForm!M48,\"AAAAABz2d7Y=\")","v":{"$error":"#VALUE!"}},{"$f":"AND(DataForm!N48,\"AAAAABz2d7c=\")","v":{"$error":"#VALUE!"}},{"$f":"AND(DataForm!O48,\"AAAAABz2d7g=\")","v":{"$error":"#VALUE!"}},{"$f":"AND(DataForm!P48,\"AAAAABz2d7k=\")","v":{"$error":"#VALUE!"}},{"$f":"AND(DataForm!Q48,\"AAAAABz2d7o=\")","v":{"$error":"#VALUE!"}},{"$f":"AND(DataForm!R48,\"AAAAABz2d7s=\")","v":{"$error":"#VALUE!"}},{"$f":"AND(DataForm!S48,\"AAAAABz2d7w=\")","v":{"$error":"#VALUE!"}},{"$f":"AND(DataForm!T48,\"AAAAABz2d70=\")","v":{"$error":"#VALUE!"}},{"$f":"AND(DataForm!U48,\"AAAAABz2d74=\")","v":{"$error":"#VALUE!"}},{"$f":"AND(DataForm!V48,\"AAAAABz2d78=\")","v":{"$error":"#VALUE!"}},{"$f":"IF(DataForm!49:49,\"AAAAABz2d8A=\",0)","v":0},{"$f":"AND(DataForm!A49,\"AAAAABz2d8E=\")","v":{"$error":"#VALUE!"}},{"$f":"AND(DataForm!B49,\"AAAAABz2d8I=\")","v":{"$error":"#VALUE!"}},{"$f":"AND(DataForm!C49,\"AAAAABz2d8M=\")","v":{"$error":"#VALUE!"}},{"$f":"AND(DataForm!D49,\"AAAAABz2d8Q=\")","v":{"$error":"#VALUE!"}},{"$f":"AND(DataForm!E49,\"AAAAABz2d8U=\")","v":{"$error":"#VALUE!"}},{"$f":"AND(DataForm!F49,\"AAAAABz2d8Y=\")","v":{"$error":"#VALUE!"}},{"$f":"AND(DataForm!G49,\"AAAAABz2d8c=\")","v":{"$error":"#VALUE!"}},{"$f":"AND(DataForm!H49,\"AAAAABz2d8g=\")","v":{"$error":"#VALUE!"}},{"$f":"AND(DataForm!I49,\"AAAAABz2d8k=\")","v":{"$error":"#VALUE!"}},{"$f":"AND(DataForm!J49,\"AAAAABz2d8o=\")","v":{"$error":"#VALUE!"}},{"$f":"AND(DataForm!K49,\"AAAAABz2d8s=\")","v":{"$error":"#VALUE!"}},{"$f":"AND(DataForm!L49,\"AAAAABz2d8w=\")","v":{"$error":"#VALUE!"}},{"$f":"AND(DataForm!M49,\"AAAAABz2d80=\")","v":{"$error":"#VALUE!"}},{"$f":"AND(DataForm!N49,\"AAAAABz2d84=\")","v":{"$error":"#VALUE!"}},{"$f":"AND(DataForm!O49,\"AAAAABz2d88=\")","v":{"$error":"#VALUE!"}},{"$f":"AND(DataForm!P49,\"AAAAABz2d9A=\")","v":{"$error":"#VALUE!"}},{"$f":"AND(DataForm!Q49,\"AAAAABz2d9E=\")","v":{"$error":"#VALUE!"}},{"$f":"AND(DataForm!R49,\"AAAAABz2d9I=\")","v":{"$error":"#VALUE!"}},{"$f":"AND(DataForm!S49,\"AAAAABz2d9M=\")","v":{"$error":"#VALUE!"}},{"$f":"AND(DataForm!T49,\"AAAAABz2d9Q=\")","v":{"$error":"#VALUE!"}},{"$f":"AND(DataForm!U49,\"AAAAABz2d9U=\")","v":{"$error":"#VALUE!"}},{"$f":"AND(DataForm!V49,\"AAAAABz2d9Y=\")","v":{"$error":"#VALUE!"}},{"$f":"IF(DataForm!50:50,\"AAAAABz2d9c=\",0)","v":0},{"$f":"AND(DataForm!A50,\"AAAAABz2d9g=\")","v":{"$error":"#VALUE!"}},{"$f":"AND(DataForm!B50,\"AAAAABz2d9k=\")","v":{"$error":"#VALUE!"}},{"$f":"AND(DataForm!C50,\"AAAAABz2d9o=\")","v":{"$error":"#VALUE!"}},{"$f":"AND(DataForm!D50,\"AAAAABz2d9s=\")","v":{"$error":"#VALUE!"}},{"$f":"AND(DataForm!E50,\"AAAAABz2d9w=\")","v":{"$error":"#VALUE!"}},{"$f":"AND(DataForm!F50,\"AAAAABz2d90=\")","v":{"$error":"#VALUE!"}},{"$f":"AND(DataForm!G50,\"AAAAABz2d94=\")","v":{"$error":"#VALUE!"}},{"$f":"AND(DataForm!H50,\"AAAAABz2d98=\")","v":{"$error":"#VALUE!"}},{"$f":"AND(DataForm!I50,\"AAAAABz2d+A=\")","v":{"$error":"#VALUE!"}},{"$f":"AND(DataForm!J50,\"AAAAABz2d+E=\")","v":{"$error":"#VALUE!"}},{"$f":"AND(DataForm!K50,\"AAAAABz2d+I=\")","v":{"$error":"#VALUE!"}},{"$f":"AND(DataForm!L50,\"AAAAABz2d+M=\")","v":{"$error":"#VALUE!"}},{"$f":"AND(DataForm!M50,\"AAAAABz2d+Q=\")","v":{"$error":"#VALUE!"}},{"$f":"AND(DataForm!N50,\"AAAAABz2d+U=\")","v":{"$error":"#VALUE!"}},{"$f":"AND(DataForm!O50,\"AAAAABz2d+Y=\")","v":{"$error":"#VALUE!"}},{"$f":"AND(DataForm!P50,\"AAAAABz2d+c=\")","v":{"$error":"#VALUE!"}},{"$f":"AND(DataForm!Q50,\"AAAAABz2d+g=\")","v":{"$error":"#VALUE!"}},{"$f":"AND(DataForm!R50,\"AAAAABz2d+k=\")","v":{"$error":"#VALUE!"}},{"$f":"AND(DataForm!S50,\"AAAAABz2d+o=\")","v":{"$error":"#VALUE!"}},{"$f":"AND(DataForm!T50,\"AAAAABz2d+s=\")","v":{"$error":"#VALUE!"}},{"$f":"AND(DataForm!U50,\"AAAAABz2d+w=\")","v":{"$error":"#VALUE!"}},{"$f":"AND(DataForm!V50,\"AAAAABz2d+0=\")","v":{"$error":"#VALUE!"}},{"$f":"IF(DataForm!51:51,\"AAAAABz2d+4=\",0)","v":0},{"$f":"AND(DataForm!A51,\"AAAAABz2d+8=\")","v":{"$error":"#VALUE!"}},{"$f":"AND(DataForm!B51,\"AAAAABz2d/A=\")","v":{"$error":"#VALUE!"}},{"$f":"AND(DataForm!C51,\"AAAAABz2d/E=\")","v":{"$error":"#VALUE!"}},{"$f":"AND(DataForm!D51,\"AAAAABz2d/I=\")","v":{"$error":"#VALUE!"}},{"$f":"AND(DataForm!E51,\"AAAAABz2d/M=\")","v":{"$error":"#VALUE!"}},{"$f":"AND(DataForm!F51,\"AAAAABz2d/Q=\")","v":{"$error":"#VALUE!"}},{"$f":"AND(DataForm!G51,\"AAAAABz2d/U=\")","v":{"$error":"#VALUE!"}},{"$f":"AND(DataForm!H51,\"AAAAABz2d/Y=\")","v":{"$error":"#VALUE!"}},{"$f":"AND(DataForm!I51,\"AAAAABz2d/c=\")","v":{"$error":"#VALUE!"}},{"$f":"AND(DataForm!J51,\"AAAAABz2d/g=\")","v":{"$error":"#VALUE!"}},{"$f":"AND(DataForm!K51,\"AAAAABz2d/k=\")","v":{"$error":"#VALUE!"}},{"$f":"AND(DataForm!L51,\"AAAAABz2d/o=\")","v":{"$error":"#VALUE!"}},{"$f":"AND(DataForm!M51,\"AAAAABz2d/s=\")","v":{"$error":"#VALUE!"}},{"$f":"AND(DataForm!N51,\"AAAAABz2d/w=\")","v":{"$error":"#VALUE!"}},{"$f":"AND(DataForm!O51,\"AAAAABz2d/0=\")","v":{"$error":"#VALUE!"}},{"$f":"AND(DataForm!P51,\"AAAAABz2d/4=\")","v":{"$error":"#VALUE!"}},{"$f":"AND(DataForm!Q51,\"AAAAABz2d/8=\")","v":{"$error":"#VALUE!"}}]
[{"$f":"AND(DataForm!R51,\"AAAAAH93/gA=\")","v":{"$error":"#VALUE!"}},{"$f":"AND(DataForm!S51,\"AAAAAH93/gE=\")","v":{"$error":"#VALUE!"}},{"$f":"AND(DataForm!T51,\"AAAAAH93/gI=\")","v":{"$error":"#VALUE!"}},{"$f":"AND(DataForm!U51,\"AAAAAH93/gM=\")","v":{"$error":"#VALUE!"}},{"$f":"AND(DataForm!V51,\"AAAAAH93/gQ=\")","v":{"$error":"#VALUE!"}},{"$f":"IF(DataForm!52:52,\"AAAAAH93/gU=\",0)","v":0},{"$f":"AND(DataForm!A52,\"AAAAAH93/gY=\")","v":{"$error":"#VALUE!"}},{"$f":"AND(DataForm!B52,\"AAAAAH93/gc=\")","v":{"$error":"#VALUE!"}},{"$f":"AND(DataForm!C52,\"AAAAAH93/gg=\")","v":{"$error":"#VALUE!"}},{"$f":"AND(DataForm!D52,\"AAAAAH93/gk=\")","v":{"$error":"#VALUE!"}},{"$f":"AND(DataForm!E52,\"AAAAAH93/go=\")","v":{"$error":"#VALUE!"}},{"$f":"AND(DataForm!F52,\"AAAAAH93/gs=\")","v":{"$error":"#VALUE!"}},{"$f":"AND(DataForm!G52,\"AAAAAH93/gw=\")","v":{"$error":"#VALUE!"}},{"$f":"AND(DataForm!H52,\"AAAAAH93/g0=\")","v":{"$error":"#VALUE!"}},{"$f":"AND(DataForm!I52,\"AAAAAH93/g4=\")","v":{"$error":"#VALUE!"}},{"$f":"AND(DataForm!J52,\"AAAAAH93/g8=\")","v":{"$error":"#VALUE!"}},{"$f":"AND(DataForm!K52,\"AAAAAH93/hA=\")","v":{"$error":"#VALUE!"}},{"$f":"AND(DataForm!L52,\"AAAAAH93/hE=\")","v":{"$error":"#VALUE!"}},{"$f":"AND(DataForm!M52,\"AAAAAH93/hI=\")","v":{"$error":"#VALUE!"}},{"$f":"AND(DataForm!N52,\"AAAAAH93/hM=\")","v":{"$error":"#VALUE!"}},{"$f":"AND(DataForm!O52,\"AAAAAH93/hQ=\")","v":{"$error":"#VALUE!"}},{"$f":"AND(DataForm!P52,\"AAAAAH93/hU=\")","v":{"$error":"#VALUE!"}},{"$f":"AND(DataForm!Q52,\"AAAAAH93/hY=\")","v":{"$error":"#VALUE!"}},{"$f":"AND(DataForm!R52,\"AAAAAH93/hc=\")","v":{"$error":"#VALUE!"}},{"$f":"AND(DataForm!S52,\"AAAAAH93/hg=\")","v":{"$error":"#VALUE!"}},{"$f":"AND(DataForm!T52,\"AAAAAH93/hk=\")","v":{"$error":"#VALUE!"}},{"$f":"AND(DataForm!U52,\"AAAAAH93/ho=\")","v":{"$error":"#VALUE!"}},{"$f":"AND(DataForm!V52,\"AAAAAH93/hs=\")","v":{"$error":"#VALUE!"}},{"$f":"IF(DataForm!53:53,\"AAAAAH93/hw=\",0)","v":0},{"$f":"AND(DataForm!A53,\"AAAAAH93/h0=\")","v":{"$error":"#VALUE!"}},{"$f":"AND(DataForm!B53,\"AAAAAH93/h4=\")","v":{"$error":"#VALUE!"}},{"$f":"AND(DataForm!C53,\"AAAAAH93/h8=\")","v":{"$error":"#VALUE!"}},{"$f":"AND(DataForm!D53,\"AAAAAH93/iA=\")","v":{"$error":"#VALUE!"}},{"$f":"AND(DataForm!E53,\"AAAAAH93/iE=\")","v":{"$error":"#VALUE!"}},{"$f":"AND(DataForm!F53,\"AAAAAH93/iI=\")","v":{"$error":"#VALUE!"}},{"$f":"AND(DataForm!G53,\"AAAAAH93/iM=\")","v":{"$error":"#VALUE!"}},{"$f":"AND(DataForm!H53,\"AAAAAH93/iQ=\")","v":{"$error":"#VALUE!"}},{"$f":"AND(DataForm!I53,\"AAAAAH93/iU=\")","v":{"$error":"#VALUE!"}},{"$f":"AND(DataForm!J53,\"AAAAAH93/iY=\")","v":{"$error":"#VALUE!"}},{"$f":"AND(DataForm!K53,\"AAAAAH93/ic=\")","v":{"$error":"#VALUE!"}},{"$f":"AND(DataForm!L53,\"AAAAAH93/ig=\")","v":{"$error":"#VALUE!"}},{"$f":"AND(DataForm!M53,\"AAAAAH93/ik=\")","v":{"$error":"#VALUE!"}},{"$f":"AND(DataForm!N53,\"AAAAAH93/io=\")","v":{"$error":"#VALUE!"}},{"$f":"AND(DataForm!O53,\"AAAAAH93/is=\")","v":{"$error":"#VALUE!"}},{"$f":"AND(DataForm!P53,\"AAAAAH93/iw=\")","v":{"$error":"#VALUE!"}},{"$f":"AND(DataForm!Q53,\"AAAAAH93/i0=\")","v":{"$error":"#VALUE!"}},{"$f":"AND(DataForm!R53,\"AAAAAH93/i4=\")","v":{"$error":"#VALUE!"}},{"$f":"AND(DataForm!S53,\"AAAAAH93/i8=\")","v":{"$error":"#VALUE!"}},{"$f":"AND(DataForm!T53,\"AAAAAH93/jA=\")","v":{"$error":"#VALUE!"}},{"$f":"AND(DataForm!U53,\"AAAAAH93/jE=\")","v":{"$error":"#VALUE!"}},{"$f":"AND(DataForm!V53,\"AAAAAH93/jI=\")","v":{"$error":"#VALUE!"}},{"$f":"IF(DataForm!54:54,\"AAAAAH93/jM=\",0)","v":0},{"$f":"AND(DataForm!A54,\"AAAAAH93/jQ=\")","v":{"$error":"#VALUE!"}},{"$f":"AND(DataForm!B54,\"AAAAAH93/jU=\")","v":{"$error":"#VALUE!"}},{"$f":"AND(DataForm!C54,\"AAAAAH93/jY=\")","v":{"$error":"#VALUE!"}},{"$f":"AND(DataForm!D54,\"AAAAAH93/jc=\")","v":{"$error":"#VALUE!"}},{"$f":"AND(DataForm!E54,\"AAAAAH93/jg=\")","v":{"$error":"#VALUE!"}},{"$f":"AND(DataForm!F54,\"AAAAAH93/jk=\")","v":{"$error":"#VALUE!"}},{"$f":"AND(DataForm!G54,\"AAAAAH93/jo=\")","v":{"$error":"#VALUE!"}},{"$f":"AND(DataForm!H54,\"AAAAAH93/js=\")","v":{"$error":"#VALUE!"}},{"$f":"AND(DataForm!I54,\"AAAAAH93/jw=\")","v":{"$error":"#VALUE!"}},{"$f":"AND(DataForm!J54,\"AAAAAH93/j0=\")","v":{"$error":"#VALUE!"}},{"$f":"AND(DataForm!K54,\"AAAAAH93/j4=\")","v":{"$error":"#VALUE!"}},{"$f":"AND(DataForm!L54,\"AAAAAH93/j8=\")","v":{"$error":"#VALUE!"}},{"$f":"AND(DataForm!M54,\"AAAAAH93/kA=\")","v":{"$error":"#VALUE!"}},{"$f":"AND(DataForm!N54,\"AAAAAH93/kE=\")","v":{"$error":"#VALUE!"}},{"$f":"AND(DataForm!O54,\"AAAAAH93/kI=\")","v":{"$error":"#VALUE!"}},{"$f":"AND(DataForm!P54,\"AAAAAH93/kM=\")","v":{"$error":"#VALUE!"}},{"$f":"AND(DataForm!Q54,\"AAAAAH93/kQ=\")","v":{"$error":"#VALUE!"}},{"$f":"AND(DataForm!R54,\"AAAAAH93/kU=\")","v":{"$error":"#VALUE!"}},{"$f":"AND(DataForm!S54,\"AAAAAH93/kY=\")","v":{"$error":"#VALUE!"}},{"$f":"AND(DataForm!T54,\"AAAAAH93/kc=\")","v":{"$error":"#VALUE!"}},{"$f":"AND(DataForm!U54,\"AAAAAH93/kg=\")","v":{"$error":"#VALUE!"}},{"$f":"AND(DataForm!V54,\"AAAAAH93/kk=\")","v":{"$error":"#VALUE!"}},{"$f":"IF(DataForm!55:55,\"AAAAAH93/ko=\",0)","v":0},{"$f":"AND(DataForm!A55,\"AAAAAH93/ks=\")","v":{"$error":"#VALUE!"}},{"$f":"AND(DataForm!B55,\"AAAAAH93/kw=\")","v":{"$error":"#VALUE!"}},{"$f":"AND(DataForm!C55,\"AAAAAH93/k0=\")","v":{"$error":"#VALUE!"}},{"$f":"AND(DataForm!D55,\"AAAAAH93/k4=\")","v":{"$error":"#VALUE!"}},{"$f":"AND(DataForm!E55,\"AAAAAH93/k8=\")","v":{"$error":"#VALUE!"}},{"$f":"AND(DataForm!F55,\"AAAAAH93/lA=\")","v":{"$error":"#VALUE!"}},{"$f":"AND(DataForm!G55,\"AAAAAH93/lE=\")","v":{"$error":"#VALUE!"}},{"$f":"AND(DataForm!H55,\"AAAAAH93/lI=\")","v":{"$error":"#VALUE!"}},{"$f":"AND(DataForm!I55,\"AAAAAH93/lM=\")","v":{"$error":"#VALUE!"}},{"$f":"AND(DataForm!J55,\"AAAAAH93/lQ=\")","v":{"$error":"#VALUE!"}},{"$f":"AND(DataForm!K55,\"AAAAAH93/lU=\")","v":{"$error":"#VALUE!"}},{"$f":"AND(DataForm!L55,\"AAAAAH93/lY=\")","v":{"$error":"#VALUE!"}},{"$f":"AND(DataForm!M55,\"AAAAAH93/lc=\")","v":{"$error":"#VALUE!"}},{"$f":"AND(DataForm!N55,\"AAAAAH93/lg=\")","v":{"$error":"#VALUE!"}},{"$f":"AND(DataForm!O55,\"AAAAAH93/lk=\")","v":{"$error":"#VALUE!"}},{"$f":"AND(DataForm!P55,\"AAAAAH93/lo=\")","v":{"$error":"#VALUE!"}},{"$f":"AND(DataForm!Q55,\"AAAAAH93/ls=\")","v":{"$error":"#VALUE!"}},{"$f":"AND(DataForm!R55,\"AAAAAH93/lw=\")","v":{"$error":"#VALUE!"}},{"$f":"AND(DataForm!S55,\"AAAAAH93/l0=\")","v":{"$error":"#VALUE!"}},{"$f":"AND(DataForm!T55,\"AAAAAH93/l4=\")","v":{"$error":"#VALUE!"}},{"$f":"AND(DataForm!U55,\"AAAAAH93/l8=\")","v":{"$error":"#VALUE!"}},{"$f":"AND(DataForm!V55,\"AAAAAH93/mA=\")","v":{"$error":"#VALUE!"}},{"$f":"IF(DataForm!56:56,\"AAAAAH93/mE=\",0)","v":0},{"$f":"AND(DataForm!A56,\"AAAAAH93/mI=\")","v":{"$error":"#VALUE!"}},{"$f":"AND(DataForm!B56,\"AAAAAH93/mM=\")","v":{"$error":"#VALUE!"}},{"$f":"AND(DataForm!C56,\"AAAAAH93/mQ=\")","v":{"$error":"#VALUE!"}},{"$f":"AND(DataForm!D56,\"AAAAAH93/mU=\")","v":{"$error":"#VALUE!"}},{"$f":"AND(DataForm!E56,\"AAAAAH93/mY=\")","v":{"$error":"#VALUE!"}},{"$f":"AND(DataForm!F56,\"AAAAAH93/mc=\")","v":{"$error":"#VALUE!"}},{"$f":"AND(DataForm!G56,\"AAAAAH93/mg=\")","v":{"$error":"#VALUE!"}},{"$f":"AND(DataForm!H56,\"AAAAAH93/mk=\")","v":{"$error":"#VALUE!"}},{"$f":"AND(DataForm!I56,\"AAAAAH93/mo=\")","v":{"$error":"#VALUE!"}},{"$f":"AND(DataForm!J56,\"AAAAAH93/ms=\")","v":{"$error":"#VALUE!"}},{"$f":"AND(DataForm!K56,\"AAAAAH93/mw=\")","v":{"$error":"#VALUE!"}},{"$f":"AND(DataForm!L56,\"AAAAAH93/m0=\")","v":{"$error":"#VALUE!"}},{"$f":"AND(DataForm!M56,\"AAAAAH93/m4=\")","v":{"$error":"#VALUE!"}},{"$f":"AND(DataForm!N56,\"AAAAAH93/m8=\")","v":{"$error":"#VALUE!"}},{"$f":"AND(DataForm!O56,\"AAAAAH93/nA=\")","v":{"$error":"#VALUE!"}},{"$f":"AND(DataForm!P56,\"AAAAAH93/nE=\")","v":{"$error":"#VALUE!"}},{"$f":"AND(DataForm!Q56,\"AAAAAH93/nI=\")","v":{"$error":"#VALUE!"}},{"$f":"AND(DataForm!R56,\"AAAAAH93/nM=\")","v":{"$error":"#VALUE!"}},{"$f":"AND(DataForm!S56,\"AAAAAH93/nQ=\")","v":{"$error":"#VALUE!"}},{"$f":"AND(DataForm!T56,\"AAAAAH93/nU=\")","v":{"$error":"#VALUE!"}},{"$f":"AND(DataForm!U56,\"AAAAAH93/nY=\")","v":{"$error":"#VALUE!"}},{"$f":"AND(DataForm!V56,\"AAAAAH93/nc=\")","v":{"$error":"#VALUE!"}},{"$f":"IF(DataForm!57:57,\"AAAAAH93/ng=\",0)","v":0},{"$f":"AND(DataForm!A57,\"AAAAAH93/nk=\")","v":{"$error":"#VALUE!"}},{"$f":"AND(DataForm!B57,\"AAAAAH93/no=\")","v":{"$error":"#VALUE!"}},{"$f":"AND(DataForm!C57,\"AAAAAH93/ns=\")","v":{"$error":"#VALUE!"}},{"$f":"AND(DataForm!D57,\"AAAAAH93/nw=\")","v":{"$error":"#VALUE!"}},{"$f":"AND(DataForm!E57,\"AAAAAH93/n0=\")","v":{"$error":"#VALUE!"}},{"$f":"AND(DataForm!F57,\"AAAAAH93/n4=\")","v":{"$error":"#VALUE!"}},{"$f":"AND(DataForm!G57,\"AAAAAH93/n8=\")","v":{"$error":"#VALUE!"}},{"$f":"AND(DataForm!H57,\"AAAAAH93/oA=\")","v":{"$error":"#VALUE!"}},{"$f":"AND(DataForm!I57,\"AAAAAH93/oE=\")","v":{"$error":"#VALUE!"}},{"$f":"AND(DataForm!J57,\"AAAAAH93/oI=\")","v":{"$error":"#VALUE!"}},{"$f":"AND(DataForm!K57,\"AAAAAH93/oM=\")","v":{"$error":"#VALUE!"}},{"$f":"AND(DataForm!L57,\"AAAAAH93/oQ=\")","v":{"$error":"#VALUE!"}},{"$f":"AND(DataForm!M57,\"AAAAAH93/oU=\")","v":{"$error":"#VALUE!"}},{"$f":"AND(DataForm!N57,\"AAAAAH93/oY=\")","v":{"$error":"#VALUE!"}},{"$f":"AND(DataForm!O57,\"AAAAAH93/oc=\")","v":{"$error":"#VALUE!"}},{"$f":"AND(DataForm!P57,\"AAAAAH93/og=\")","v":{"$error":"#VALUE!"}},{"$f":"AND(DataForm!Q57,\"AAAAAH93/ok=\")","v":{"$error":"#VALUE!"}},{"$f":"AND(DataForm!R57,\"AAAAAH93/oo=\")","v":{"$error":"#VALUE!"}},{"$f":"AND(DataForm!S57,\"AAAAAH93/os=\")","v":{"$error":"#VALUE!"}},{"$f":"AND(DataForm!T57,\"AAAAAH93/ow=\")","v":{"$error":"#VALUE!"}},{"$f":"AND(DataForm!U57,\"AAAAAH93/o0=\")","v":{"$error":"#VALUE!"}},{"$f":"AND(DataForm!V57,\"AAAAAH93/o4=\")","v":{"$error":"#VALUE!"}},{"$f":"IF(DataForm!58:58,\"AAAAAH93/o8=\",0)","v":0},{"$f":"AND(DataForm!A58,\"AAAAAH93/pA=\")","v":{"$error":"#VALUE!"}},{"$f":"AND(DataForm!B58,\"AAAAAH93/pE=\")","v":{"$error":"#VALUE!"}},{"$f":"AND(DataForm!C58,\"AAAAAH93/pI=\")","v":{"$error":"#VALUE!"}},{"$f":"AND(DataForm!D58,\"AAAAAH93/pM=\")","v":{"$error":"#VALUE!"}},{"$f":"AND(DataForm!E58,\"AAAAAH93/pQ=\")","v":{"$error":"#VALUE!"}},{"$f":"AND(DataForm!F58,\"AAAAAH93/pU=\")","v":{"$error":"#VALUE!"}},{"$f":"AND(DataForm!G58,\"AAAAAH93/pY=\")","v":{"$error":"#VALUE!"}},{"$f":"AND(DataForm!H58,\"AAAAAH93/pc=\")","v":{"$error":"#VALUE!"}},{"$f":"AND(DataForm!I58,\"AAAAAH93/pg=\")","v":{"$error":"#VALUE!"}},{"$f":"AND(DataForm!J58,\"AAAAAH93/pk=\")","v":{"$error":"#VALUE!"}},{"$f":"AND(DataForm!K58,\"AAAAAH93/po=\")","v":{"$error":"#VALUE!"}},{"$f":"AND(DataForm!L58,\"AAAAAH93/ps=\")","v":{"$error":"#VALUE!"}},{"$f":"AND(DataForm!M58,\"AAAAAH93/pw=\")","v":{"$error":"#VALUE!"}},{"$f":"AND(DataForm!N58,\"AAAAAH93/p0=\")","v":{"$error":"#VALUE!"}},{"$f":"AND(DataForm!O58,\"AAAAAH93/p4=\")","v":{"$error":"#VALUE!"}},{"$f":"AND(DataForm!P58,\"AAAAAH93/p8=\")","v":{"$error":"#VALUE!"}},{"$f":"AND(DataForm!Q58,\"AAAAAH93/qA=\")","v":{"$error":"#VALUE!"}},{"$f":"AND(DataForm!R58,\"AAAAAH93/qE=\")","v":{"$error":"#VALUE!"}},{"$f":"AND(DataForm!S58,\"AAAAAH93/qI=\")","v":{"$error":"#VALUE!"}},{"$f":"AND(DataForm!T58,\"AAAAAH93/qM=\")","v":{"$error":"#VALUE!"}},{"$f":"AND(DataForm!U58,\"AAAAAH93/qQ=\")","v":{"$error":"#VALUE!"}},{"$f":"AND(DataForm!V58,\"AAAAAH93/qU=\")","v":{"$error":"#VALUE!"}},{"$f":"IF(DataForm!59:59,\"AAAAAH93/qY=\",0)","v":0},{"$f":"AND(DataForm!A59,\"AAAAAH93/qc=\")","v":{"$error":"#VALUE!"}},{"$f":"AND(DataForm!B59,\"AAAAAH93/qg=\")","v":{"$error":"#VALUE!"}},{"$f":"AND(DataForm!C59,\"AAAAAH93/qk=\")","v":{"$error":"#VALUE!"}},{"$f":"AND(DataForm!D59,\"AAAAAH93/qo=\")","v":{"$error":"#VALUE!"}},{"$f":"AND(DataForm!E59,\"AAAAAH93/qs=\")","v":{"$error":"#VALUE!"}},{"$f":"AND(DataForm!F59,\"AAAAAH93/qw=\")","v":{"$error":"#VALUE!"}},{"$f":"AND(DataForm!G59,\"AAAAAH93/q0=\")","v":{"$error":"#VALUE!"}},{"$f":"AND(DataForm!H59,\"AAAAAH93/q4=\")","v":{"$error":"#VALUE!"}},{"$f":"AND(DataForm!I59,\"AAAAAH93/q8=\")","v":{"$error":"#VALUE!"}},{"$f":"AND(DataForm!J59,\"AAAAAH93/rA=\")","v":{"$error":"#VALUE!"}},{"$f":"AND(DataForm!K59,\"AAAAAH93/rE=\")","v":{"$error":"#VALUE!"}},{"$f":"AND(DataForm!L59,\"AAAAAH93/rI=\")","v":{"$error":"#VALUE!"}},{"$f":"AND(DataForm!M59,\"AAAAAH93/rM=\")","v":{"$error":"#VALUE!"}},{"$f":"AND(DataForm!N59,\"AAAAAH93/rQ=\")","v":{"$error":"#VALUE!"}},{"$f":"AND(DataForm!O59,\"AAAAAH93/rU=\")","v":{"$error":"#VALUE!"}},{"$f":"AND(DataForm!P59,\"AAAAAH93/rY=\")","v":{"$error":"#VALUE!"}},{"$f":"AND(DataForm!Q59,\"AAAAAH93/rc=\")","v":{"$error":"#VALUE!"}},{"$f":"AND(DataForm!R59,\"AAAAAH93/rg=\")","v":{"$error":"#VALUE!"}},{"$f":"AND(DataForm!S59,\"AAAAAH93/rk=\")","v":{"$error":"#VALUE!"}},{"$f":"AND(DataForm!T59,\"AAAAAH93/ro=\")","v":{"$error":"#VALUE!"}},{"$f":"AND(DataForm!U59,\"AAAAAH93/rs=\")","v":{"$error":"#VALUE!"}},{"$f":"AND(DataForm!V59,\"AAAAAH93/rw=\")","v":{"$error":"#VALUE!"}},{"$f":"IF(DataForm!60:60,\"AAAAAH93/r0=\",0)","v":0},{"$f":"AND(DataForm!A60,\"AAAAAH93/r4=\")","v":{"$error":"#VALUE!"}},{"$f":"AND(DataForm!B60,\"AAAAAH93/r8=\")","v":{"$error":"#VALUE!"}},{"$f":"AND(DataForm!C60,\"AAAAAH93/sA=\")","v":{"$error":"#VALUE!"}},{"$f":"AND(DataForm!D60,\"AAAAAH93/sE=\")","v":{"$error":"#VALUE!"}},{"$f":"AND(DataForm!E60,\"AAAAAH93/sI=\")","v":{"$error":"#VALUE!"}},{"$f":"AND(DataForm!F60,\"AAAAAH93/sM=\")","v":{"$error":"#VALUE!"}},{"$f":"AND(DataForm!G60,\"AAAAAH93/sQ=\")","v":{"$error":"#VALUE!"}},{"$f":"AND(DataForm!H60,\"AAAAAH93/sU=\")","v":{"$error":"#VALUE!"}},{"$f":"AND(DataForm!I60,\"AAAAAH93/sY=\")","v":{"$error":"#VALUE!"}},{"$f":"AND(DataForm!J60,\"AAAAAH93/sc=\")","v":{"$error":"#VALUE!"}},{"$f":"AND(DataForm!K60,\"AAAAAH93/sg=\")","v":{"$error":"#VALUE!"}},{"$f":"AND(DataForm!L60,\"AAAAAH93/sk=\")","v":{"$error":"#VALUE!"}},{"$f":"AND(DataForm!M60,\"AAAAAH93/so=\")","v":{"$error":"#VALUE!"}},{"$f":"AND(DataForm!N60,\"AAAAAH93/ss=\")","v":{"$error":"#VALUE!"}},{"$f":"AND(DataForm!O60,\"AAAAAH93/sw=\")","v":{"$error":"#VALUE!"}},{"$f":"AND(DataForm!P60,\"AAAAAH93/s0=\")","v":{"$error":"#VALUE!"}},{"$f":"AND(DataForm!Q60,\"AAAAAH93/s4=\")","v":{"$error":"#VALUE!"}},{"$f":"AND(DataForm!R60,\"AAAAAH93/s8=\")","v":{"$error":"#VALUE!"}},{"$f":"AND(DataForm!S60,\"AAAAAH93/tA=\")","v":{"$error":"#VALUE!"}},{"$f":"AND(DataForm!T60,\"AAAAAH93/tE=\")","v":{"$error":"#VALUE!"}},{"$f":"AND(DataForm!U60,\"AAAAAH93/tI=\")","v":{"$error":"#VALUE!"}},{"$f":"AND(DataForm!V60,\"AAAAAH93/tM=\")","v":{"$error":"#VALUE!"}},{"$f":"IF(DataForm!61:61,\"AAAAAH93/tQ=\",0)","v":0},{"$f":"AND(DataForm!A61,\"AAAAAH93/tU=\")","v":{"$error":"#VALUE!"}},{"$f":"AND(DataForm!B61,\"AAAAAH93/tY=\")","v":{"$error":"#VALUE!"}},{"$f":"AND(DataForm!C61,\"AAAAAH93/tc=\")","v":{"$error":"#VALUE!"}},{"$f":"AND(DataForm!D61,\"AAAAAH93/tg=\")","v":{"$error":"#VALUE!"}},{"$f":"IF(DataForm!62:62,\"AAAAAH93/tk=\",0)","v":0},{"$f":"AND(DataForm!A62,\"AAAAAH93/to=\")","v":{"$error":"#VALUE!"}},{"$f":"AND(DataForm!B62,\"AAAAAH93/ts=\")","v":{"$error":"#VALUE!"}},{"$f":"AND(DataForm!C62,\"AAAAAH93/tw=\")","v":{"$error":"#VALUE!"}},{"$f":"AND(DataForm!D62,\"AAAAAH93/t0=\")","v":{"$error":"#VALUE!"}},{"$f":"IF(DataForm!63:63,\"AAAAAH93/t4=\",0)","v":0},{"$f":"AND(DataForm!A63,\"AAAAAH93/t8=\")","v":{"$error":"#VALUE!"}},{"$f":"AND(DataForm!B63,\"AAAAAH93/uA=\")","v":{"$error":"#VALUE!"}},{"$f":"AND(DataForm!C63,\"AAAAAH93/uE=\")","v":{"$error":"#VALUE!"}},{"$f":"AND(DataForm!D63,\"AAAAAH93/uI=\")","v":{"$error":"#VALUE!"}},{"$f":"IF(DataForm!64:64,\"AAAAAH93/uM=\",0)","v":0},{"$f":"AND(DataForm!A64,\"AAAAAH93/uQ=\")","v":{"$error":"#VALUE!"}},{"$f":"AND(DataForm!B64,\"AAAAAH93/uU=\")","v":{"$error":"#VALUE!"}},{"$f":"AND(DataForm!C64,\"AAAAAH93/uY=\")","v":{"$error":"#VALUE!"}},{"$f":"AND(DataForm!D64,\"AAAAAH93/uc=\")","v":{"$error":"#VALUE!"}},{"$f":"IF(DataForm!65:65,\"AAAAAH93/ug=\",0)","v":0},{"$f":"AND(DataForm!A65,\"AAAAAH93/uk=\")","v":{"$error":"#VALUE!"}},{"$f":"AND(DataForm!B65,\"AAAAAH93/uo=\")","v":{"$error":"#VALUE!"}},{"$f":"AND(DataForm!C65,\"AAAAAH93/us=\")","v":{"$error":"#VALUE!"}},{"$f":"AND(DataForm!D65,\"AAAAAH93/uw=\")","v":{"$error":"#VALUE!"}},{"$f":"IF(DataForm!66:66,\"AAAAAH93/u0=\",0)","v":0},{"$f":"AND(DataForm!A66,\"AAAAAH93/u4=\")","v":{"$error":"#VALUE!"}},{"$f":"AND(DataForm!B66,\"AAAAAH93/u8=\")","v":{"$error":"#VALUE!"}},{"$f":"AND(DataForm!C66,\"AAAAAH93/vA=\")","v":{"$error":"#VALUE!"}},{"$f":"AND(DataForm!D66,\"AAAAAH93/vE=\")","v":{"$error":"#VALUE!"}},{"$f":"IF(DataForm!67:67,\"AAAAAH93/vI=\",0)","v":0},{"$f":"AND(DataForm!A67,\"AAAAAH93/vM=\")","v":{"$error":"#VALUE!"}},{"$f":"AND(DataForm!B67,\"AAAAAH93/vQ=\")","v":{"$error":"#VALUE!"}},{"$f":"AND(DataForm!C67,\"AAAAAH93/vU=\")","v":{"$error":"#VALUE!"}},{"$f":"AND(DataForm!D67,\"AAAAAH93/vY=\")","v":{"$error":"#VALUE!"}},{"$f":"IF(DataForm!68:68,\"AAAAAH93/vc=\",0)","v":0},{"$f":"AND(DataForm!A68,\"AAAAAH93/vg=\")","v":{"$error":"#VALUE!"}},{"$f":"AND(DataForm!B68,\"AAAAAH93/vk=\")","v":{"$error":"#VALUE!"}},{"$f":"AND(DataForm!C68,\"AAAAAH93/vo=\")","v":{"$error":"#VALUE!"}},{"$f":"AND(DataForm!D68,\"AAAAAH93/vs=\")","v":{"$error":"#VALUE!"}},{"$f":"IF(DataForm!69:69,\"AAAAAH93/vw=\",0)","v":0},{"$f":"AND(DataForm!A69,\"AAAAAH93/v0=\")","v":{"$error":"#VALUE!"}},{"$f":"AND(DataForm!B69,\"AAAAAH93/v4=\")","v":{"$error":"#VALUE!"}},{"$f":"AND(DataForm!C69,\"AAAAAH93/v8=\")","v":{"$error":"#VALUE!"}}]
[{"$f":"AND(DataForm!D69,\"AAAAAHu/nwA=\")","v":{"$error":"#VALUE!"}},{"$f":"IF(DataForm!70:70,\"AAAAAHu/nwE=\",0)","v":0},{"$f":"AND(DataForm!A70,\"AAAAAHu/nwI=\")","v":{"$error":"#VALUE!"}},{"$f":"AND(DataForm!B70,\"AAAAAHu/nwM=\")","v":{"$error":"#VALUE!"}},{"$f":"AND(DataForm!C70,\"AAAAAHu/nwQ=\")","v":{"$error":"#VALUE!"}},{"$f":"AND(DataForm!D70,\"AAAAAHu/nwU=\")","v":{"$error":"#VALUE!"}},{"$f":"IF(DataForm!71:71,\"AAAAAHu/nwY=\",0)","v":0},{"$f":"AND(DataForm!A71,\"AAAAAHu/nwc=\")","v":{"$error":"#VALUE!"}},{"$f":"AND(DataForm!B71,\"AAAAAHu/nwg=\")","v":{"$error":"#VALUE!"}},{"$f":"AND(DataForm!C71,\"AAAAAHu/nwk=\")","v":{"$error":"#VALUE!"}},{"$f":"AND(DataForm!D71,\"AAAAAHu/nwo=\")","v":{"$error":"#VALUE!"}},{"$f":"IF(DataForm!72:72,\"AAAAAHu/nws=\",0)","v":0},{"$f":"AND(DataForm!A72,\"AAAAAHu/nww=\")","v":{"$error":"#VALUE!"}},{"$f":"AND(DataForm!B72,\"AAAAAHu/nw0=\")","v":{"$error":"#VALUE!"}},{"$f":"AND(DataForm!C72,\"AAAAAHu/nw4=\")","v":{"$error":"#VALUE!"}},{"$f":"AND(DataForm!D72,\"AAAAAHu/nw8=\")","v":{"$error":"#VALUE!"}},{"$f":"IF(DataForm!73:73,\"AAAAAHu/nxA=\",0)","v":0},{"$f":"AND(DataForm!A73,\"AAAAAHu/nxE=\")","v":{"$error":"#VALUE!"}},{"$f":"AND(DataForm!B73,\"AAAAAHu/nxI=\")","v":{"$error":"#VALUE!"}},{"$f":"AND(DataForm!C73,\"AAAAAHu/nxM=\")","v":{"$error":"#VALUE!"}},{"$f":"AND(DataForm!D73,\"AAAAAHu/nxQ=\")","v":{"$error":"#VALUE!"}},{"$f":"IF(DataForm!74:74,\"AAAAAHu/nxU=\",0)","v":0},{"$f":"AND(DataForm!A74,\"AAAAAHu/nxY=\")","v":{"$error":"#VALUE!"}},{"$f":"AND(DataForm!B74,\"AAAAAHu/nxc=\")","v":{"$error":"#VALUE!"}},{"$f":"AND(DataForm!C74,\"AAAAAHu/nxg=\")","v":{"$error":"#VALUE!"}},{"$f":"AND(DataForm!D74,\"AAAAAHu/nxk=\")","v":{"$error":"#VALUE!"}},{"$f":"IF(DataForm!75:75,\"AAAAAHu/nxo=\",0)","v":0},{"$f":"AND(DataForm!A75,\"AAAAAHu/nxs=\")","v":{"$error":"#VALUE!"}},{"$f":"AND(DataForm!B75,\"AAAAAHu/nxw=\")","v":{"$error":"#VALUE!"}},{"$f":"AND(DataForm!C75,\"AAAAAHu/nx0=\")","v":{"$error":"#VALUE!"}},{"$f":"AND(DataForm!D75,\"AAAAAHu/nx4=\")","v":{"$error":"#VALUE!"}},{"$f":"IF(DataForm!76:76,\"AAAAAHu/nx8=\",0)","v":0},{"$f":"AND(DataForm!A76,\"AAAAAHu/nyA=\")","v":{"$error":"#VALUE!"}},{"$f":"AND(DataForm!B76,\"AAAAAHu/nyE=\")","v":{"$error":"#VALUE!"}},{"$f":"AND(DataForm!C76,\"AAAAAHu/nyI=\")","v":{"$error":"#VALUE!"}},{"$f":"AND(DataForm!D76,\"AAAAAHu/nyM=\")","v":{"$error":"#VALUE!"}},{"$f":"IF(DataForm!77:77,\"AAAAAHu/nyQ=\",0)","v":0},{"$f":"AND(DataForm!A77,\"AAAAAHu/nyU=\")","v":{"$error":"#VALUE!"}},{"$f":"AND(DataForm!B77,\"AAAAAHu/nyY=\")","v":{"$error":"#VALUE!"}},{"$f":"AND(DataForm!C77,\"AAAAAHu/nyc=\")","v":{"$error":"#VALUE!"}},{"$f":"AND(DataForm!D77,\"AAAAAHu/nyg=\")","v":{"$error":"#VALUE!"}},{"$f":"IF(DataForm!78:78,\"AAAAAHu/nyk=\",0)","v":0},{"$f":"AND(DataForm!A78,\"AAAAAHu/nyo=\")","v":{"$error":"#VALUE!"}},{"$f":"AND(DataForm!B78,\"AAAAAHu/nys=\")","v":{"$error":"#VALUE!"}},{"$f":"AND(DataForm!C78,\"AAAAAHu/nyw=\")","v":{"$error":"#VALUE!"}},{"$f":"AND(DataForm!D78,\"AAAAAHu/ny0=\")","v":{"$error":"#VALUE!"}},{"$f":"IF(DataForm!79:79,\"AAAAAHu/ny4=\",0)","v":0},{"$f":"AND(DataForm!A79,\"AAAAAHu/ny8=\")","v":{"$error":"#VALUE!"}},{"$f":"AND(DataForm!B79,\"AAAAAHu/nzA=\")","v":{"$error":"#VALUE!"}},{"$f":"AND(DataForm!C79,\"AAAAAHu/nzE=\")","v":{"$error":"#VALUE!"}},{"$f":"AND(DataForm!D79,\"AAAAAHu/nzI=\")","v":{"$error":"#VALUE!"}},{"$f":"IF(DataForm!80:80,\"AAAAAHu/nzM=\",0)","v":0},{"$f":"AND(DataForm!A80,\"AAAAAHu/nzQ=\")","v":{"$error":"#VALUE!"}},{"$f":"AND(DataForm!B80,\"AAAAAHu/nzU=\")","v":{"$error":"#VALUE!"}},{"$f":"AND(DataForm!C80,\"AAAAAHu/nzY=\")","v":{"$error":"#VALUE!"}},{"$f":"AND(DataForm!D80,\"AAAAAHu/nzc=\")","v":{"$error":"#VALUE!"}},{"$f":"IF(DataForm!81:81,\"AAAAAHu/nzg=\",0)","v":0},{"$f":"AND(DataForm!A81,\"AAAAAHu/nzk=\")","v":{"$error":"#VALUE!"}},{"$f":"AND(DataForm!B81,\"AAAAAHu/nzo=\")","v":{"$error":"#VALUE!"}},{"$f":"AND(DataForm!C81,\"AAAAAHu/nzs=\")","v":{"$error":"#VALUE!"}},{"$f":"AND(DataForm!D81,\"AAAAAHu/nzw=\")","v":{"$error":"#VALUE!"}},{"$f":"IF(DataForm!82:82,\"AAAAAHu/nz0=\",0)","v":0},{"$f":"AND(DataForm!A82,\"AAAAAHu/nz4=\")","v":{"$error":"#VALUE!"}},{"$f":"AND(DataForm!B82,\"AAAAAHu/nz8=\")","v":{"$error":"#VALUE!"}},{"$f":"AND(DataForm!C82,\"AAAAAHu/n0A=\")","v":{"$error":"#VALUE!"}},{"$f":"AND(DataForm!D82,\"AAAAAHu/n0E=\")","v":{"$error":"#VALUE!"}},{"$f":"IF(DataForm!83:83,\"AAAAAHu/n0I=\",0)","v":0},{"$f":"AND(DataForm!A83,\"AAAAAHu/n0M=\")","v":{"$error":"#VALUE!"}},{"$f":"AND(DataForm!B83,\"AAAAAHu/n0Q=\")","v":{"$error":"#VALUE!"}},{"$f":"AND(DataForm!C83,\"AAAAAHu/n0U=\")","v":{"$error":"#VALUE!"}},{"$f":"AND(DataForm!D83,\"AAAAAHu/n0Y=\")","v":{"$error":"#VALUE!"}},{"$f":"IF(DataForm!84:84,\"AAAAAHu/n0c=\",0)","v":0},{"$f":"AND(DataForm!A84,\"AAAAAHu/n0g=\")","v":{"$error":"#VALUE!"}},{"$f":"AND(DataForm!B84,\"AAAAAHu/n0k=\")","v":{"$error":"#VALUE!"}},{"$f":"AND(DataForm!C84,\"AAAAAHu/n0o=\")","v":{"$error":"#VALUE!"}},{"$f":"AND(DataForm!D84,\"AAAAAHu/n0s=\")","v":{"$error":"#VALUE!"}},{"$f":"IF(DataForm!85:85,\"AAAAAHu/n0w=\",0)","v":0},{"$f":"AND(DataForm!A85,\"AAAAAHu/n00=\")","v":{"$error":"#VALUE!"}},{"$f":"AND(DataForm!B85,\"AAAAAHu/n04=\")","v":{"$error":"#VALUE!"}},{"$f":"AND(DataForm!C85,\"AAAAAHu/n08=\")","v":{"$error":"#VALUE!"}},{"$f":"AND(DataForm!D85,\"AAAAAHu/n1A=\")","v":{"$error":"#VALUE!"}},{"$f":"IF(DataForm!86:86,\"AAAAAHu/n1E=\",0)","v":0},{"$f":"AND(DataForm!A86,\"AAAAAHu/n1I=\")","v":{"$error":"#VALUE!"}},{"$f":"AND(DataForm!B86,\"AAAAAHu/n1M=\")","v":{"$error":"#VALUE!"}},{"$f":"AND(DataForm!C86,\"AAAAAHu/n1Q=\")","v":{"$error":"#VALUE!"}},{"$f":"AND(DataForm!D86,\"AAAAAHu/n1U=\")","v":{"$error":"#VALUE!"}},{"$f":"IF(DataForm!87:87,\"AAAAAHu/n1Y=\",0)","v":0},{"$f":"AND(DataForm!A87,\"AAAAAHu/n1c=\")","v":{"$error":"#VALUE!"}},{"$f":"AND(DataForm!B87,\"AAAAAHu/n1g=\")","v":{"$error":"#VALUE!"}},{"$f":"AND(DataForm!C87,\"AAAAAHu/n1k=\")","v":{"$error":"#VALUE!"}},{"$f":"AND(DataForm!D87,\"AAAAAHu/n1o=\")","v":{"$error":"#VALUE!"}},{"$f":"IF(DataForm!88:88,\"AAAAAHu/n1s=\",0)","v":0},{"$f":"AND(DataForm!A88,\"AAAAAHu/n1w=\")","v":{"$error":"#VALUE!"}},{"$f":"AND(DataForm!B88,\"AAAAAHu/n10=\")","v":{"$error":"#VALUE!"}},{"$f":"AND(DataForm!C88,\"AAAAAHu/n14=\")","v":{"$error":"#VALUE!"}},{"$f":"AND(DataForm!D88,\"AAAAAHu/n18=\")","v":{"$error":"#VALUE!"}},{"$f":"IF(DataForm!89:89,\"AAAAAHu/n2A=\",0)","v":0},{"$f":"AND(DataForm!A89,\"AAAAAHu/n2E=\")","v":{"$error":"#VALUE!"}},{"$f":"AND(DataForm!B89,\"AAAAAHu/n2I=\")","v":{"$error":"#VALUE!"}},{"$f":"AND(DataForm!C89,\"AAAAAHu/n2M=\")","v":{"$error":"#VALUE!"}},{"$f":"AND(DataForm!D89,\"AAAAAHu/n2Q=\")","v":{"$error":"#VALUE!"}},{"$f":"IF(DataForm!90:90,\"AAAAAHu/n2U=\",0)","v":0},{"$f":"AND(DataForm!A90,\"AAAAAHu/n2Y=\")","v":{"$error":"#VALUE!"}},{"$f":"AND(DataForm!B90,\"AAAAAHu/n2c=\")","v":{"$error":"#VALUE!"}},{"$f":"AND(DataForm!C90,\"AAAAAHu/n2g=\")","v":{"$error":"#VALUE!"}},{"$f":"AND(DataForm!D90,\"AAAAAHu/n2k=\")","v":{"$error":"#VALUE!"}},{"$f":"IF(DataForm!91:91,\"AAAAAHu/n2o=\",0)","v":0},{"$f":"AND(DataForm!A91,\"AAAAAHu/n2s=\")","v":{"$error":"#VALUE!"}},{"$f":"AND(DataForm!B91,\"AAAAAHu/n2w=\")","v":{"$error":"#VALUE!"}},{"$f":"AND(DataForm!C91,\"AAAAAHu/n20=\")","v":{"$error":"#VALUE!"}},{"$f":"AND(DataForm!D91,\"AAAAAHu/n24=\")","v":{"$error":"#VALUE!"}},{"$f":"IF(DataForm!92:92,\"AAAAAHu/n28=\",0)","v":0},{"$f":"AND(DataForm!A92,\"AAAAAHu/n3A=\")","v":{"$error":"#VALUE!"}},{"$f":"AND(DataForm!B92,\"AAAAAHu/n3E=\")","v":{"$error":"#VALUE!"}},{"$f":"AND(DataForm!C92,\"AAAAAHu/n3I=\")","v":{"$error":"#VALUE!"}},{"$f":"AND(DataForm!D92,\"AAAAAHu/n3M=\")","v":{"$error":"#VALUE!"}},{"$f":"IF(DataForm!93:93,\"AAAAAHu/n3Q=\",0)","v":0},{"$f":"AND(DataForm!A93,\"AAAAAHu/n3U=\")","v":{"$error":"#VALUE!"}},{"$f":"AND(DataForm!B93,\"AAAAAHu/n3Y=\")","v":{"$error":"#VALUE!"}},{"$f":"AND(DataForm!C93,\"AAAAAHu/n3c=\")","v":{"$error":"#VALUE!"}},{"$f":"AND(DataForm!D93,\"AAAAAHu/n3g=\")","v":{"$error":"#VALUE!"}},{"$f":"IF(DataForm!94:94,\"AAAAAHu/n3k=\",0)","v":0},{"$f":"AND(DataForm!A94,\"AAAAAHu/n3o=\")","v":{"$error":"#VALUE!"}},{"$f":"AND(DataForm!B94,\"AAAAAHu/n3s=\")","v":{"$error":"#VALUE!"}},{"$f":"AND(DataForm!C94,\"AAAAAHu/n3w=\")","v":{"$error":"#VALUE!"}},{"$f":"AND(DataForm!D94,\"AAAAAHu/n30=\")","v":{"$error":"#VALUE!"}},{"$f":"IF(DataForm!95:95,\"AAAAAHu/n34=\",0)","v":0},{"$f":"AND(DataForm!A95,\"AAAAAHu/n38=\")","v":{"$error":"#VALUE!"}},{"$f":"AND(DataForm!B95,\"AAAAAHu/n4A=\")","v":{"$error":"#VALUE!"}},{"$f":"AND(DataForm!C95,\"AAAAAHu/n4E=\")","v":{"$error":"#VALUE!"}},{"$f":"AND(DataForm!D95,\"AAAAAHu/n4I=\")","v":{"$error":"#VALUE!"}},{"$f":"IF(DataForm!96:96,\"AAAAAHu/n4M=\",0)","v":0},{"$f":"AND(DataForm!A96,\"AAAAAHu/n4Q=\")","v":{"$error":"#VALUE!"}},{"$f":"AND(DataForm!B96,\"AAAAAHu/n4U=\")","v":{"$error":"#VALUE!"}},{"$f":"AND(DataForm!C96,\"AAAAAHu/n4Y=\")","v":{"$error":"#VALUE!"}},{"$f":"AND(DataForm!D96,\"AAAAAHu/n4c=\")","v":{"$error":"#VALUE!"}},{"$f":"IF(DataForm!97:97,\"AAAAAHu/n4g=\",0)","v":0},{"$f":"AND(DataForm!A97,\"AAAAAHu/n4k=\")","v":{"$error":"#VALUE!"}},{"$f":"AND(DataForm!B97,\"AAAAAHu/n4o=\")","v":{"$error":"#VALUE!"}},{"$f":"AND(DataForm!C97,\"AAAAAHu/n4s=\")","v":{"$error":"#VALUE!"}},{"$f":"AND(DataForm!D97,\"AAAAAHu/n4w=\")","v":{"$error":"#VALUE!"}},{"$f":"IF(DataForm!98:98,\"AAAAAHu/n40=\",0)","v":0},{"$f":"AND(DataForm!A98,\"AAAAAHu/n44=\")","v":{"$error":"#VALUE!"}},{"$f":"AND(DataForm!B98,\"AAAAAHu/n48=\")","v":{"$error":"#VALUE!"}},{"$f":"AND(DataForm!C98,\"AAAAAHu/n5A=\")","v":{"$error":"#VALUE!"}},{"$f":"AND(DataForm!D98,\"AAAAAHu/n5E=\")","v":{"$error":"#VALUE!"}},{"$f":"IF(DataForm!99:99,\"AAAAAHu/n5I=\",0)","v":0},{"$f":"AND(DataForm!A99,\"AAAAAHu/n5M=\")","v":{"$error":"#VALUE!"}},{"$f":"AND(DataForm!B99,\"AAAAAHu/n5Q=\")","v":{"$error":"#VALUE!"}},{"$f":"AND(DataForm!C99,\"AAAAAHu/n5U=\")","v":{"$error":"#VALUE!"}},{"$f":"AND(DataForm!D99,\"AAAAAHu/n5Y=\")","v":{"$error":"#VALUE!"}},{"$f":"IF(DataForm!100:100,\"AAAAAHu/n5c=\",0)","v":0},{"$f":"AND(DataForm!A100,\"AAAAAHu/n5g=\")","v":{"$error":"#VALUE!"}},{"$f":"AND(DataForm!B100,\"AAAAAHu/n5k=\")","v":{"$error":"#VALUE!"}},{"$f":"AND(DataForm!C100,\"AAAAAHu/n5o=\")","v":{"$error":"#VALUE!"}},{"$f":"AND(DataForm!D100,\"AAAAAHu/n5s=\")","v":{"$error":"#VALUE!"}},{"$f":"IF(DataForm!101:101,\"AAAAAHu/n5w=\",0)","v":0},{"$f":"AND(DataForm!A101,\"AAAAAHu/n50=\")","v":{"$error":"#VALUE!"}},{"$f":"AND(DataForm!B101,\"AAAAAHu/n54=\")","v":{"$error":"#VALUE!"}},{"$f":"AND(DataForm!C101,\"AAAAAHu/n58=\")","v":{"$error":"#VALUE!"}},{"$f":"AND(DataForm!D101,\"AAAAAHu/n6A=\")","v":{"$error":"#VALUE!"}},{"$f":"IF(DataForm!102:102,\"AAAAAHu/n6E=\",0)","v":0},{"$f":"AND(DataForm!A102,\"AAAAAHu/n6I=\")","v":{"$error":"#VALUE!"}},{"$f":"AND(DataForm!B102,\"AAAAAHu/n6M=\")","v":{"$error":"#VALUE!"}},{"$f":"AND(DataForm!C102,\"AAAAAHu/n6Q=\")","v":{"$error":"#VALUE!"}},{"$f":"AND(DataForm!D102,\"AAAAAHu/n6U=\")","v":{"$error":"#VALUE!"}},{"$f":"IF(DataForm!103:103,\"AAAAAHu/n6Y=\",0)","v":0},{"$f":"AND(DataForm!A103,\"AAAAAHu/n6c=\")","v":{"$error":"#VALUE!"}},{"$f":"AND(DataForm!B103,\"AAAAAHu/n6g=\")","v":{"$error":"#VALUE!"}},{"$f":"AND(DataForm!C103,\"AAAAAHu/n6k=\")","v":{"$error":"#VALUE!"}},{"$f":"AND(DataForm!D103,\"AAAAAHu/n6o=\")","v":{"$error":"#VALUE!"}},{"$f":"IF(DataForm!104:104,\"AAAAAHu/n6s=\",0)","v":0},{"$f":"AND(DataForm!A104,\"AAAAAHu/n6w=\")","v":{"$error":"#VALUE!"}},{"$f":"AND(DataForm!B104,\"AAAAAHu/n60=\")","v":{"$error":"#VALUE!"}},{"$f":"AND(DataForm!C104,\"AAAAAHu/n64=\")","v":{"$error":"#VALUE!"}},{"$f":"AND(DataForm!D104,\"AAAAAHu/n68=\")","v":{"$error":"#VALUE!"}},{"$f":"IF(DataForm!105:105,\"AAAAAHu/n7A=\",0)","v":0},{"$f":"AND(DataForm!A105,\"AAAAAHu/n7E=\")","v":{"$error":"#VALUE!"}},{"$f":"AND(DataForm!B105,\"AAAAAHu/n7I=\")","v":{"$error":"#VALUE!"}},{"$f":"AND(DataForm!C105,\"AAAAAHu/n7M=\")","v":{"$error":"#VALUE!"}},{"$f":"AND(DataForm!D105,\"AAAAAHu/n7Q=\")","v":{"$error":"#VALUE!"}},{"$f":"IF(DataForm!106:106,\"AAAAAHu/n7U=\",0)","v":0},{"$f":"AND(DataForm!A106,\"AAAAAHu/n7Y=\")","v":{"$error":"#VALUE!"}},{"$f":"AND(DataForm!B106,\"AAAAAHu/n7c=\")","v":{"$error":"#VALUE!"}},{"$f":"AND(DataForm!C106,\"AAAAAHu/n7g=\")","v":{"$error":"#VALUE!"}},{"$f":"AND(DataForm!D106,\"AAAAAHu/n7k=\")","v":{"$error":"#VALUE!"}},{"$f":"IF(DataForm!107:107,\"AAAAAHu/n7o=\",0)","v":0},{"$f":"AND(DataForm!A107,\"AAAAAHu/n7s=\")","v":{"$error":"#VALUE!"}},{"$f":"AND(DataForm!B107,\"AAAAAHu/n7w=\")","v":{"$error":"#VALUE!"}},{"$f":"AND(DataForm!C107,\"AAAAAHu/n70=\")","v":{"$error":"#VALUE!"}},{"$f":"AND(DataForm!D107,\"AAAAAHu/n74=\")","v":{"$error":"#VALUE!"}},{"$f":"IF(DataForm!108:108,\"AAAAAHu/n78=\",0)","v":0},{"$f":"AND(DataForm!A108,\"AAAAAHu/n8A=\")","v":{"$error":"#VALUE!"}},{"$f":"AND(DataForm!B108,\"AAAAAHu/n8E=\")","v":{"$error":"#VALUE!"}},{"$f":"AND(DataForm!C108,\"AAAAAHu/n8I=\")","v":{"$error":"#VALUE!"}},{"$f":"AND(DataForm!D108,\"AAAAAHu/n8M=\")","v":{"$error":"#VALUE!"}},{"$f":"IF(DataForm!109:109,\"AAAAAHu/n8Q=\",0)","v":0},{"$f":"AND(DataForm!A109,\"AAAAAHu/n8U=\")","v":{"$error":"#VALUE!"}},{"$f":"AND(DataForm!B109,\"AAAAAHu/n8Y=\")","v":{"$error":"#VALUE!"}},{"$f":"AND(DataForm!C109,\"AAAAAHu/n8c=\")","v":{"$error":"#VALUE!"}},{"$f":"AND(DataForm!D109,\"AAAAAHu/n8g=\")","v":{"$error":"#VALUE!"}},{"$f":"IF(DataForm!110:110,\"AAAAAHu/n8k=\",0)","v":0},{"$f":"AND(DataForm!A110,\"AAAAAHu/n8o=\")","v":{"$error":"#VALUE!"}},{"$f":"AND(DataForm!B110,\"AAAAAHu/n8s=\")","v":{"$error":"#VALUE!"}},{"$f":"AND(DataForm!C110,\"AAAAAHu/n8w=\")","v":{"$error":"#VALUE!"}},{"$f":"AND(DataForm!D110,\"AAAAAHu/n80=\")","v":{"$error":"#VALUE!"}},{"$f":"IF(DataForm!111:111,\"AAAAAHu/n84=\",0)","v":0},{"$f":"AND(DataForm!A111,\"AAAAAHu/n88=\")","v":{"$error":"#VALUE!"}},{"$f":"AND(DataForm!B111,\"AAAAAHu/n9A=\")","v":{"$error":"#VALUE!"}},{"$f":"AND(DataForm!C111,\"AAAAAHu/n9E=\")","v":{"$error":"#VALUE!"}},{"$f":"AND(DataForm!D111,\"AAAAAHu/n9I=\")","v":{"$error":"#VALUE!"}},{"$f":"IF(DataForm!112:112,\"AAAAAHu/n9M=\",0)","v":0},{"$f":"AND(DataForm!A112,\"AAAAAHu/n9Q=\")","v":{"$error":"#VALUE!"}},{"$f":"AND(DataForm!B112,\"AAAAAHu/n9U=\")","v":{"$error":"#VALUE!"}},{"$f":"AND(DataForm!C112,\"AAAAAHu/n9Y=\")","v":{"$error":"#VALUE!"}},{"$f":"AND(DataForm!D112,\"AAAAAHu/n9c=\")","v":{"$error":"#VALUE!"}},{"$f":"IF(DataForm!113:113,\"AAAAAHu/n9g=\",0)","v":0},{"$f":"AND(DataForm!A113,\"AAAAAHu/n9k=\")","v":{"$error":"#VALUE!"}},{"$f":"AND(DataForm!B113,\"AAAAAHu/n9o=\")","v":{"$error":"#VALUE!"}},{"$f":"AND(DataForm!C113,\"AAAAAHu/n9s=\")","v":{"$error":"#VALUE!"}},{"$f":"AND(DataForm!D113,\"AAAAAHu/n9w=\")","v":{"$error":"#VALUE!"}},{"$f":"IF(DataForm!114:114,\"AAAAAHu/n90=\",0)","v":0},{"$f":"AND(DataForm!A114,\"AAAAAHu/n94=\")","v":{"$error":"#VALUE!"}},{"$f":"AND(DataForm!B114,\"AAAAAHu/n98=\")","v":{"$error":"#VALUE!"}},{"$f":"AND(DataForm!C114,\"AAAAAHu/n+A=\")","v":{"$error":"#VALUE!"}},{"$f":"AND(DataForm!D114,\"AAAAAHu/n+E=\")","v":{"$error":"#VALUE!"}},{"$f":"IF(DataForm!115:115,\"AAAAAHu/n+I=\",0)","v":0},{"$f":"AND(DataForm!A115,\"AAAAAHu/n+M=\")","v":{"$error":"#VALUE!"}},{"$f":"AND(DataForm!B115,\"AAAAAHu/n+Q=\")","v":{"$error":"#VALUE!"}},{"$f":"AND(DataForm!C115,\"AAAAAHu/n+U=\")","v":{"$error":"#VALUE!"}},{"$f":"AND(DataForm!D115,\"AAAAAHu/n+Y=\")","v":{"$error":"#VALUE!"}},{"$f":"IF(DataForm!116:116,\"AAAAAHu/n+c=\",0)","v":0},{"$f":"AND(DataForm!A116,\"AAAAAHu/n+g=\")","v":{"$error":"#VALUE!"}},{"$f":"AND(DataForm!B116,\"AAAAAHu/n+k=\")","v":{"$error":"#VALUE!"}},{"$f":"AND(DataForm!C116,\"AAAAAHu/n+o=\")","v":{"$error":"#VALUE!"}},{"$f":"AND(DataForm!D116,\"AAAAAHu/n+s=\")","v":{"$error":"#VALUE!"}},{"$f":"IF(DataForm!117:117,\"AAAAAHu/n+w=\",0)","v":0},{"$f":"AND(DataForm!A117,\"AAAAAHu/n+0=\")","v":{"$error":"#VALUE!"}},{"$f":"AND(DataForm!B117,\"AAAAAHu/n+4=\")","v":{"$error":"#VALUE!"}},{"$f":"AND(DataForm!C117,\"AAAAAHu/n+8=\")","v":{"$error":"#VALUE!"}},{"$f":"AND(DataForm!D117,\"AAAAAHu/n/A=\")","v":{"$error":"#VALUE!"}},{"$f":"IF(DataForm!A:A,\"AAAAAHu/n/E=\",0)","v":0},{"$f":"IF(DataForm!B:B,\"AAAAAHu/n/I=\",0)","v":0},{"$f":"IF(DataForm!C:C,\"AAAAAHu/n/M=\",0)","v":0},{"$f":"IF(DataForm!D:D,\"AAAAAHu/n/Q=\",0)","v":{"$error":"#VALUE!"}},{"$f":"IF(DataForm!E:E,\"AAAAAHu/n/U=\",0)","v":0},{"$f":"IF(DataForm!F:F,\"AAAAAHu/n/Y=\",0)","v":0},{"$f":"IF(DataForm!G:G,\"AAAAAHu/n/c=\",0)","v":0},{"$f":"IF(DataForm!H:H,\"AAAAAHu/n/g=\",0)","v":0},{"$f":"IF(DataForm!I:I,\"AAAAAHu/n/k=\",0)","v":{"$error":"#VALUE!"}},{"$f":"IF(DataForm!J:J,\"AAAAAHu/n/o=\",0)","v":{"$error":"#VALUE!"}},{"$f":"IF(DataForm!K:K,\"AAAAAHu/n/s=\",0)","v":{"$error":"#VALUE!"}},{"$f":"IF(DataForm!L:L,\"AAAAAHu/n/w=\",0)","v":"AAAAAHu/n/w="},{"$f":"IF(DataForm!M:M,\"AAAAAHu/n/0=\",0)","v":{"$error":"#VALUE!"}},{"$f":"IF(DataForm!N:N,\"AAAAAHu/n/4=\",0)","v":{"$error":"#VALUE!"}},{"$f":"IF(DataForm!O:O,\"AAAAAHu/n/8=\",0)","v":0}]
[{"$f":"IF(DataForm!P:P,\"AAAAAHM//AA=\",0)","v":0},{"$f":"IF(DataForm!Q:Q,\"AAAAAHM//AE=\",0)","v":0},{"$f":"IF(DataForm!R:R,\"AAAAAHM//AI=\",0)","v":0},{"$f":"IF(DataForm!S:S,\"AAAAAHM//AM=\",0)","v":0},{"$f":"IF(DataForm!T:T,\"AAAAAHM//AQ=\",0)","v":0},{"$f":"IF(DataForm!U:U,\"AAAAAHM//AU=\",0)","v":0},{"$f":"IF(DataForm!V:V,\"AAAAAHM//AY=\",0)","v":0},"AAAAAHM//Ac=",{"$f":"IF(\"N\",DataForm!_xlnm._FilterDatabase,\"AAAAAHM//Ag=\")","v":{"$error":"#VALUE!"}},{"$f":"IF(\"N\",ProductsList!_xlnm._FilterDatabase,\"AAAAAHM//Ak=\")","v":{"$error":"#VALUE!"}},{"$f":"IF(\"N\",CoolerLabelsDairy!BINNUMB,\"AAAAAHM//Ao=\")","v":{"$error":"#VALUE!"}},{"$f":"IF(\"N\",DataForm!BINNUMB,\"AAAAAHM//As=\")","v":{"$error":"#VALUE!"}},{"$f":"IF(\"N\",BINNUMB,\"AAAAAHM//Aw=\")","v":{"$error":"#VALUE!"}},{"$f":"IF(\"N\",DataForm!BINNUMB2,\"AAAAAHM//A0=\")","v":{"$error":"#VALUE!"}},{"$f":"IF(\"N\",BINNUMB2,\"AAAAAHM//A4=\")","v":{"$error":"#VALUE!"}},{"$f":"IF(\"N\",Downtime,\"AAAAAHM//A8=\")","v":{"$error":"#VALUE!"}},{"$f":"IF(\"N\",GeneralIssue,\"AAAAAHM//BA=\")","v":{"$error":"#VALUE!"}},{"$f":"IF(\"N\",GeneralIssueIssue1,\"AAAAAHM//BE=\")","v":{"$error":"#VALUE!"}},{"$f":"IF(\"N\",GeneralIssueIssue10,\"AAAAAHM//BI=\")","v":{"$error":"#VALUE!"}},{"$f":"IF(\"N\",GeneralIssueIssue11,\"AAAAAHM//BM=\")","v":{"$error":"#VALUE!"}},{"$f":"IF(\"N\",GeneralIssueIssue12,\"AAAAAHM//BQ=\")","v":{"$error":"#VALUE!"}},{"$f":"IF(\"N\",GeneralIssueIssue13,\"AAAAAHM//BU=\")","v":{"$error":"#VALUE!"}},{"$f":"IF(\"N\",GeneralIssueIssue14,\"AAAAAHM//BY=\")","v":{"$error":"#VALUE!"}},{"$f":"IF(\"N\",GeneralIssueIssue15,\"AAAAAHM//Bc=\")","v":{"$error":"#VALUE!"}},{"$f":"IF(\"N\",GeneralIssueIssue16,\"AAAAAHM//Bg=\")","v":{"$error":"#VALUE!"}},{"$f":"IF(\"N\",GeneralIssueIssue17,\"AAAAAHM//Bk=\")","v":{"$error":"#VALUE!"}},{"$f":"IF(\"N\",GeneralIssueIssue18,\"AAAAAHM//Bo=\")","v":{"$error":"#VALUE!"}},{"$f":"IF(\"N\",GeneralIssueIssue19,\"AAAAAHM//Bs=\")","v":{"$error":"#VALUE!"}},{"$f":"IF(\"N\",GeneralIssueIssue2,\"AAAAAHM//Bw=\")","v":{"$error":"#VALUE!"}},{"$f":"IF(\"N\",GeneralIssueIssue20,\"AAAAAHM//B0=\")","v":{"$error":"#VALUE!"}},{"$f":"IF(\"N\",GeneralIssueIssue3,\"AAAAAHM//B4=\")","v":{"$error":"#VALUE!"}},{"$f":"IF(\"N\",GeneralIssueIssue4,\"AAAAAHM//B8=\")","v":{"$error":"#VALUE!"}},{"$f":"IF(\"N\",GeneralIssueIssue5,\"AAAAAHM//CA=\")","v":{"$error":"#VALUE!"}},{"$f":"IF(\"N\",GeneralIssueIssue6,\"AAAAAHM//CE=\")","v":{"$error":"#VALUE!"}},{"$f":"IF(\"N\",GeneralIssueIssue7,\"AAAAAHM//CI=\")","v":{"$error":"#VALUE!"}},{"$f":"IF(\"N\",GeneralIssueIssue8,\"AAAAAHM//CM=\")","v":{"$error":"#VALUE!"}},{"$f":"IF(\"N\",GeneralIssueIssue9,\"AAAAAHM//CQ=\")","v":{"$error":"#VALUE!"}},{"$f":"IF(\"N\",genIssues,\"AAAAAHM//CU=\")","v":{"$error":"#VALUE!"}},{"$f":"IF(\"N\",Issue1,\"AAAAAHM//CY=\")","v":{"$error":"#VALUE!"}},{"$f":"IF(\"N\",Issue10,\"AAAAAHM//Cc=\")","v":{"$error":"#VALUE!"}},{"$f":"IF(\"N\",Issue11,\"AAAAAHM//Cg=\")","v":{"$error":"#VALUE!"}},{"$f":"IF(\"N\",Issue12,\"AAAAAHM//Ck=\")","v":{"$error":"#VALUE!"}},{"$f":"IF(\"N\",Issue13,\"AAAAAHM//Co=\")","v":{"$error":"#VALUE!"}},{"$f":"IF(\"N\",Issue14,\"AAAAAHM//Cs=\")","v":{"$error":"#VALUE!"}},{"$f":"IF(\"N\",Issue15,\"AAAAAHM//Cw=\")","v":{"$error":"#VALUE!"}},{"$f":"IF(\"N\",Issue16,\"AAAAAHM//C0=\")","v":{"$error":"#VALUE!"}},{"$f":"IF(\"N\",Issue18,\"AAAAAHM//C4=\")","v":{"$error":"#VALUE!"}},{"$f":"IF(\"N\",Issue19,\"AAAAAHM//C8=\")","v":{"$error":"#VALUE!"}},{"$f":"IF(\"N\",Issue2,\"AAAAAHM//DA=\")","v":{"$error":"#VALUE!"}},{"$f":"IF(\"N\",Issue20,\"AAAAAHM//DE=\")","v":{"$error":"#VALUE!"}},{"$f":"IF(\"N\",Issue3,\"AAAAAHM//DI=\")","v":{"$error":"#VALUE!"}},{"$f":"IF(\"N\",Issue4,\"AAAAAHM//DM=\")","v":{"$error":"#VALUE!"}},{"$f":"IF(\"N\",Issue5,\"AAAAAHM//DQ=\")","v":{"$error":"#VALUE!"}},{"$f":"IF(\"N\",Issue6,\"AAAAAHM//DU=\")","v":{"$error":"#VALUE!"}},{"$f":"IF(\"N\",Issue7,\"AAAAAHM//DY=\")","v":{"$error":"#VALUE!"}},{"$f":"IF(\"N\",Issue8,\"AAAAAHM//Dc=\")","v":{"$error":"#VALUE!"}},{"$f":"IF(\"N\",Issue9,\"AAAAAHM//Dg=\")","v":{"$error":"#VALUE!"}},{"$f":"IF(\"N\",itemProds,\"AAAAAHM//Dk=\")","v":{"$error":"#VALUE!"}},{"$f":"IF(\"N\",DataForm!Line,\"AAAAAHM//Do=\")","v":{"$error":"#VALUE!"}},{"$f":"IF(\"N\",Line,\"AAAAAHM//Ds=\")","v":{"$error":"#VALUE!"}},{"$f":"IF(\"N\",Location,\"AAAAAHM//Dw=\")","v":{"$error":"#VALUE!"}},{"$f":"IF(\"N\",Location1,\"AAAAAHM//D0=\")","v":{"$error":"#VALUE!"}},{"$f":"IF(\"N\",CoolerLabelsDairy!_xlnm.Print_Area,\"AAAAAHM//D4=\")","v":{"$error":"#VALUE!"}},{"$f":"IF(\"N\",CoolerLabelsShelves!_xlnm.Print_Area,\"AAAAAHM//D8=\")","v":{"$error":"#VALUE!"}},{"$f":"IF(\"N\",DataForm!_xlnm.Print_Area,\"AAAAAHM//EA=\")","v":{"$error":"#VALUE!"}},{"$f":"IF(\"N\",ProductsList!_xlnm.Print_Area,\"AAAAAHM//EE=\")","v":{"$error":"#VALUE!"}},{"$f":"IF(\"N\",ProcessLocation,\"AAAAAHM//EI=\")","v":{"$error":"#VALUE!"}},{"$f":"IF(\"N\",prodStorages,\"AAAAAHM//EM=\")","v":{"$error":"#VALUE!"}},{"$f":"IF(\"N\",quantProds,\"AAAAAHM//EQ=\")","v":{"$error":"#VALUE!"}},{"$f":"IF(\"N\",Shift,\"AAAAAHM//EU=\")","v":{"$error":"#VALUE!"}},{"$f":"IF(\"N\",shifts,\"AAAAAHM//EY=\")","v":{"$error":"#VALUE!"}},{"$f":"IF(\"N\",SubIssue1,\"AAAAAHM//Ec=\")","v":{"$error":"#VALUE!"}},{"$f":"IF(\"N\",SubIssue10,\"AAAAAHM//Eg=\")","v":{"$error":"#VALUE!"}},{"$f":"IF(\"N\",SubIssue10A,\"AAAAAHM//Ek=\")","v":{"$error":"#VALUE!"}},{"$f":"IF(\"N\",SubIssue11,\"AAAAAHM//Eo=\")","v":{"$error":"#VALUE!"}},{"$f":"IF(\"N\",SubIssue11A,\"AAAAAHM//Es=\")","v":{"$error":"#VALUE!"}},{"$f":"IF(\"N\",SubIssue12,\"AAAAAHM//Ew=\")","v":{"$error":"#VALUE!"}},{"$f":"IF(\"N\",SubIssue12A,\"AAAAAHM//E0=\")","v":{"$error":"#VALUE!"}},{"$f":"IF(\"N\",SubIssue13,\"AAAAAHM//E4=\")","v":{"$error":"#VALUE!"}},{"$f":"IF(\"N\",SubIssue13A,\"AAAAAHM//E8=\")","v":{"$error":"#VALUE!"}},{"$f":"IF(\"N\",SubIssue14,\"AAAAAHM//FA=\")","v":{"$error":"#VALUE!"}},{"$f":"IF(\"N\",SubIssue14A,\"AAAAAHM//FE=\")","v":{"$error":"#VALUE!"}},{"$f":"IF(\"N\",SubIssue15,\"AAAAAHM//FI=\")","v":{"$error":"#VALUE!"}},{"$f":"IF(\"N\",SubIssue15A,\"AAAAAHM//FM=\")","v":{"$error":"#VALUE!"}},{"$f":"IF(\"N\",SubIssue16,\"AAAAAHM//FQ=\")","v":{"$error":"#VALUE!"}},{"$f":"IF(\"N\",SubIssue16A,\"AAAAAHM//FU=\")","v":{"$error":"#VALUE!"}},{"$f":"IF(\"N\",SubIssue17,\"AAAAAHM//FY=\")","v":{"$error":"#VALUE!"}},{"$f":"IF(\"N\",SubIssue17A,\"AAAAAHM//Fc=\")","v":{"$error":"#VALUE!"}},{"$f":"IF(\"N\",SubIssue18,\"AAAAAHM//Fg=\")","v":{"$error":"#VALUE!"}},{"$f":"IF(\"N\",SubIssue18A,\"AAAAAHM//Fk=\")","v":{"$error":"#VALUE!"}},{"$f":"IF(\"N\",SubIssue19,\"AAAAAHM//Fo=\")","v":{"$error":"#VALUE!"}},{"$f":"IF(\"N\",SubIssue19A,\"AAAAAHM//Fs=\")","v":{"$error":"#VALUE!"}},{"$f":"IF(\"N\",SubIssue1A,\"AAAAAHM//Fw=\")","v":{"$error":"#VALUE!"}},{"$f":"IF(\"N\",SubIssue2,\"AAAAAHM//F0=\")","v":{"$error":"#VALUE!"}},{"$f":"IF(\"N\",SubIssue20,\"AAAAAHM//F4=\")","v":{"$error":"#VALUE!"}},{"$f":"IF(\"N\",SubIssue20A,\"AAAAAHM//F8=\")","v":{"$error":"#VALUE!"}},{"$f":"IF(\"N\",SubIssue2A,\"AAAAAHM//GA=\")","v":{"$error":"#VALUE!"}},{"$f":"IF(\"N\",SubIssue3,\"AAAAAHM//GE=\")","v":{"$error":"#VALUE!"}},{"$f":"IF(\"N\",SubIssue3A,\"AAAAAHM//GI=\")","v":{"$error":"#VALUE!"}},{"$f":"IF(\"N\",SubIssue4,\"AAAAAHM//GM=\")","v":{"$error":"#VALUE!"}},{"$f":"IF(\"N\",SubIssue4A,\"AAAAAHM//GQ=\")","v":{"$error":"#VALUE!"}},{"$f":"IF(\"N\",SubIssue5,\"AAAAAHM//GU=\")","v":{"$error":"#VALUE!"}},{"$f":"IF(\"N\",SubIssue5A,\"AAAAAHM//GY=\")","v":{"$error":"#VALUE!"}},{"$f":"IF(\"N\",SubIssue6,\"AAAAAHM//Gc=\")","v":{"$error":"#VALUE!"}},{"$f":"IF(\"N\",SubIssue6A,\"AAAAAHM//Gg=\")","v":{"$error":"#VALUE!"}},{"$f":"IF(\"N\",SubIssue7,\"AAAAAHM//Gk=\")","v":{"$error":"#VALUE!"}},{"$f":"IF(\"N\",SubIssue7A,\"AAAAAHM//Go=\")","v":{"$error":"#VALUE!"}},{"$f":"IF(\"N\",SubIssue8,\"AAAAAHM//Gs=\")","v":{"$error":"#VALUE!"}},{"$f":"IF(\"N\",SubIssue8A,\"AAAAAHM//Gw=\")","v":{"$error":"#VALUE!"}},{"$f":"IF(\"N\",SubIssue9,\"AAAAAHM//G0=\")","v":{"$error":"#VALUE!"}},{"$f":"IF(\"N\",SubIssue9A,\"AAAAAHM//G4=\")","v":{"$error":"#VALUE!"}},{"$f":"IF(\"N\",subIssues1,\"AAAAAHM//G8=\")","v":{"$error":"#VALUE!"}},{"$f":"IF(\"N\",subIssues2,\"AAAAAHM//HA=\")","v":{"$error":"#VALUE!"}},{"$f":"IF(\"N\",typeProds,\"AAAAAHM//HE=\")","v":{"$error":"#VALUE!"}}]