{"text_format":"1","workbook":"xlsx","n_sheets":9,"sheets":["Main Page","Item Breakdown","Breakdown","PivotTable","Input New Data Here","Running Total","Costco Data Per Day","Sales by UPC Codes","Testing Puposes Costco Data"],"not_rendered":{"charts":0,"images":0,"macros":1,"external_links":2,"defined_names":9,"comments":0,"pivot_tables":1},"unopened":[],"bounds":{"document_bytes":16777216,"sheet_cells":100000,"rows_first":2000,"rows_last":500,"rows_between":2000,"halvings":0,"cell_chars":16384,"cell_head_chars":4096},"cells_cut":0,"cells_raw":0,"read":"whole","date_system":"1900"}

{"sheet":"Main Page","index":0,"n_rows":146,"n_cols":5,"rows_kept":146,"cut":false,"hidden":false,"merged":[[0,0,0,7]]}
["Main Purpose:  to allow Lilac to determine the total sales for each day along with totals for each Costco location.  In addition, the complete breakdown of each item can be found on the following tab, \"Item Breakdown.\""]
["Warehouse","Total for the Day"]
["Grand Total",{"$f":"SUMIF(C4:C146,\"TRUE\",B4:B146)","v":0},{"$f":"ISNUMBER(B3)","v":true},null,"Sales Date:"]
["781 Total",null,{"$f":"ISNUMBER(B4)","v":false},null,{"$f":"TODAY()-1","v":"2010-04-12"}]
["401 Total",null,{"$f":"ISNUMBER(B5)","v":false}]
["487 Total",null,{"$f":"ISNUMBER(B6)","v":false}]
["761 Total",null,{"$f":"ISNUMBER(B7)","v":false},null,"For testing purposes, just use "]
["110 Total",null,{"$f":"ISNUMBER(B8)","v":false},null,"the button to the right because it"]
["2 Total",null,{"$f":"ISNUMBER(B9)","v":false},null,"pulls data from \"Testing Purposes"]
["6 Total",null,{"$f":"ISNUMBER(B10)","v":false},null,"Costco Data\" sheet and uses"]
["13 Total",null,{"$f":"ISNUMBER(B11)","v":false},null,"that data in sheet \"Input New"]
["61 Total",null,{"$f":"ISNUMBER(B12)","v":false},null,"Data Here.\"  Normally, the user"]
["67 Total",null,{"$f":"ISNUMBER(B13)","v":false},null,"will get the data from Costco; "]
["69 Total",null,{"$f":"ISNUMBER(B14)","v":false},null,"however, you do not have the"]
["95 Total",null,{"$f":"ISNUMBER(B15)","v":false},null,"password or have downloaded"]
["96 Total",null,{"$f":"ISNUMBER(B16)","v":false},null,"the certificate to make it work."]
["97 Total",null,{"$f":"ISNUMBER(B17)","v":false},null,"Note:  Allow it to delete Data - I "]
["106 Total",null,{"$f":"ISNUMBER(B18)","v":false},null,"couldn't figure out how to create"]
["111 Total",null,{"$f":"ISNUMBER(B19)","v":false},null,"a new pivot table within the sheet"]
["113 Total",null,{"$f":"ISNUMBER(B20)","v":false},null,"so I have to delete it out each time."]
["116 Total",null,{"$f":"ISNUMBER(B21)","v":false}]
["121 Total",null,{"$f":"ISNUMBER(B22)","v":false}]
["145 Total",null,{"$f":"ISNUMBER(B23)","v":false}]
["403 Total",null,{"$f":"ISNUMBER(B24)","v":false}]
["407 Total",null,{"$f":"ISNUMBER(B25)","v":false}]
["427 Total",null,{"$f":"ISNUMBER(B26)","v":false}]
["431 Total",null,{"$f":"ISNUMBER(B27)","v":false}]
["436 Total",null,{"$f":"ISNUMBER(B28)","v":false}]
["439 Total",null,{"$f":"ISNUMBER(B29)","v":false}]
["440 Total",null,{"$f":"ISNUMBER(B30)","v":false}]
["452 Total",null,{"$f":"ISNUMBER(B31)","v":false}]
["460 Total",null,{"$f":"ISNUMBER(B32)","v":false}]
["462 Total",null,{"$f":"ISNUMBER(B33)","v":false}]
["465 Total",null,{"$f":"ISNUMBER(B34)","v":false}]
["469 Total",null,{"$f":"ISNUMBER(B35)","v":false}]
["480 Total",null,{"$f":"ISNUMBER(B36)","v":false}]
["481 Total",null,{"$f":"ISNUMBER(B37)","v":false}]
["483 Total",null,{"$f":"ISNUMBER(B38)","v":false}]
["484 Total",null,{"$f":"ISNUMBER(B39)","v":false}]
["488 Total",null,{"$f":"ISNUMBER(B40)","v":false}]
["490 Total",null,{"$f":"ISNUMBER(B41)","v":false}]
["491 Total",null,{"$f":"ISNUMBER(B42)","v":false}]
["622 Total",null,{"$f":"ISNUMBER(B43)","v":false}]
["633 Total",null,{"$f":"ISNUMBER(B44)","v":false}]
["629 Total",null,{"$f":"ISNUMBER(B45)","v":false}]
["637 Total",null,{"$f":"ISNUMBER(B46)","v":false}]
["642 Total",null,{"$f":"ISNUMBER(B47)","v":false}]
["644 Total",null,{"$f":"ISNUMBER(B48)","v":false}]
["665 Total",null,{"$f":"ISNUMBER(B49)","v":false}]
["667 Total",null,{"$f":"ISNUMBER(B50)","v":false}]
["674 Total",null,{"$f":"ISNUMBER(B51)","v":false}]
["676 Total",null,{"$f":"ISNUMBER(B52)","v":false}]
["682 Total",null,{"$f":"ISNUMBER(B53)","v":false}]
["685 Total",null,{"$f":"ISNUMBER(B54)","v":false}]
["691 Total",null,{"$f":"ISNUMBER(B55)","v":false}]
["736 Total",null,{"$f":"ISNUMBER(B56)","v":false}]
["745 Total",null,{"$f":"ISNUMBER(B57)","v":false}]
["746 Total",null,{"$f":"ISNUMBER(B58)","v":false}]
["766 Total",null,{"$f":"ISNUMBER(B59)","v":false}]
["770 Total",null,{"$f":"ISNUMBER(B60)","v":false}]
["772 Total",null,{"$f":"ISNUMBER(B61)","v":false}]
["775 Total",null,{"$f":"ISNUMBER(B62)","v":false}]
["1014 Total",null,{"$f":"ISNUMBER(B63)","v":false}]
["1016 Total",null,{"$f":"ISNUMBER(B64)","v":false}]
["1022 Total",null,{"$f":"ISNUMBER(B65)","v":false}]
["1027 Total",null,{"$f":"ISNUMBER(B66)","v":false}]
["1029 Total",null,{"$f":"ISNUMBER(B67)","v":false}]
["1033 Total",null,{"$f":"ISNUMBER(B68)","v":false}]
[null,null,{"$f":"ISNUMBER(B69)","v":false}]
[null,null,{"$f":"ISNUMBER(B70)","v":false}]
[null,null,{"$f":"ISNUMBER(B71)","v":false}]
[null,null,{"$f":"ISNUMBER(B72)","v":false}]
[null,null,{"$f":"ISNUMBER(B73)","v":false}]
[null,null,{"$f":"ISNUMBER(B74)","v":false}]
[null,null,{"$f":"ISNUMBER(B75)","v":false}]
[null,null,{"$f":"ISNUMBER(B76)","v":false}]
[null,null,{"$f":"ISNUMBER(B77)","v":false}]
[null,null,{"$f":"ISNUMBER(B78)","v":false}]
[null,null,{"$f":"ISNUMBER(B79)","v":false}]
[null,null,{"$f":"ISNUMBER(B80)","v":false}]
[null,null,{"$f":"ISNUMBER(B81)","v":false}]
[null,null,{"$f":"ISNUMBER(B82)","v":false}]
[null,null,{"$f":"ISNUMBER(B83)","v":false}]
[null,null,{"$f":"ISNUMBER(B84)","v":false}]
[null,null,{"$f":"ISNUMBER(B85)","v":false}]
[null,null,{"$f":"ISNUMBER(B86)","v":false}]
[null,null,{"$f":"ISNUMBER(B87)","v":false}]
[null,null,{"$f":"ISNUMBER(B88)","v":false}]
[null,null,{"$f":"ISNUMBER(B89)","v":false}]
[null,null,{"$f":"ISNUMBER(B90)","v":false}]
[null,null,{"$f":"ISNUMBER(B91)","v":false}]
[null,null,{"$f":"ISNUMBER(B92)","v":false}]
[null,null,{"$f":"ISNUMBER(B93)","v":false}]
[null,null,{"$f":"ISNUMBER(B94)","v":false}]
[null,null,{"$f":"ISNUMBER(B95)","v":false}]
[null,null,{"$f":"ISNUMBER(B96)","v":false}]
[null,null,{"$f":"ISNUMBER(B97)","v":false}]
[null,null,{"$f":"ISNUMBER(B98)","v":false}]
[null,null,{"$f":"ISNUMBER(B99)","v":false}]
[null,null,{"$f":"ISNUMBER(B100)","v":false}]
[null,null,{"$f":"ISNUMBER(B101)","v":false}]
[null,null,{"$f":"ISNUMBER(B102)","v":false}]
[null,null,{"$f":"ISNUMBER(B103)","v":false}]
[null,null,{"$f":"ISNUMBER(B104)","v":false}]
[null,null,{"$f":"ISNUMBER(B105)","v":false}]
[null,null,{"$f":"ISNUMBER(B106)","v":false}]
[null,null,{"$f":"ISNUMBER(B107)","v":false}]
[null,null,{"$f":"ISNUMBER(B108)","v":false}]
[null,null,{"$f":"ISNUMBER(B109)","v":false}]
[null,null,{"$f":"ISNUMBER(B110)","v":false}]
[null,null,{"$f":"ISNUMBER(B111)","v":false}]
[null,null,{"$f":"ISNUMBER(B112)","v":false}]
[null,null,{"$f":"ISNUMBER(B113)","v":false}]
[null,null,{"$f":"ISNUMBER(B114)","v":false}]
[null,null,{"$f":"ISNUMBER(B115)","v":false}]
[null,null,{"$f":"ISNUMBER(B116)","v":false}]
[null,null,{"$f":"ISNUMBER(B117)","v":false}]
[null,null,{"$f":"ISNUMBER(B118)","v":false}]
[null,null,{"$f":"ISNUMBER(B119)","v":false}]
[null,null,{"$f":"ISNUMBER(B120)","v":false}]
[null,null,{"$f":"ISNUMBER(B121)","v":false}]
[null,null,{"$f":"ISNUMBER(B122)","v":false}]
[null,null,{"$f":"ISNUMBER(B123)","v":false}]
[null,null,{"$f":"ISNUMBER(B124)","v":false}]
[null,null,{"$f":"ISNUMBER(B125)","v":false}]
[null,null,{"$f":"ISNUMBER(B126)","v":false}]
[null,null,{"$f":"ISNUMBER(B127)","v":false}]
[null,null,{"$f":"ISNUMBER(B128)","v":false}]
[null,null,{"$f":"ISNUMBER(B129)","v":false}]
[null,null,{"$f":"ISNUMBER(B130)","v":false}]
[null,null,{"$f":"ISNUMBER(B131)","v":false}]
[null,null,{"$f":"ISNUMBER(B132)","v":false}]
[null,null,{"$f":"ISNUMBER(B133)","v":false}]
[null,null,{"$f":"ISNUMBER(B134)","v":false}]
[null,null,{"$f":"ISNUMBER(B135)","v":false}]
[null,null,{"$f":"ISNUMBER(B136)","v":false}]
[null,null,{"$f":"ISNUMBER(B137)","v":false}]
[null,null,{"$f":"ISNUMBER(B138)","v":false}]
[null,null,{"$f":"ISNUMBER(B139)","v":false}]
[null,null,{"$f":"ISNUMBER(B140)","v":false}]
[null,null,{"$f":"ISNUMBER(B141)","v":false}]
[null,null,{"$f":"ISNUMBER(B142)","v":false}]
[null,null,{"$f":"ISNUMBER(B143)","v":false}]
[null,null,{"$f":"ISNUMBER(B144)","v":false}]
[null,null,{"$f":"ISNUMBER(B145)","v":false}]
[null,null,{"$f":"ISNUMBER(B146)","v":false}]

{"sheet":"Item Breakdown","index":1,"n_rows":67,"n_cols":12,"rows_kept":67,"cut":false,"hidden":false,"merged":[]}
[]
[]
["Style","Color","Size","item",110,401,487,761,781,"Grand Total",null,"Note:  some of the items do not have additional info"]
[{"$f":"VLOOKUP(D4,'Sales by UPC Codes'!$A$1:$E$300,2,FALSE)","v":{"$error":"#N/A"}},{"$f":"VLOOKUP(D4,'Sales by UPC Codes'!$A$1:$E$300,3,FALSE)","v":{"$error":"#N/A"}},{"$f":"VLOOKUP(D4,'Sales by UPC Codes'!$A$1:$E$300,4,FALSE)","v":{"$error":"#N/A"}},451332,null,null,-1,null,null,-1,null,"and appear as an error."]
[{"$f":"VLOOKUP(D5,'Sales by UPC Codes'!$A$1:$E$300,2,FALSE)","v":{"$error":"#N/A"}},{"$f":"VLOOKUP(D5,'Sales by UPC Codes'!$A$1:$E$300,3,FALSE)","v":{"$error":"#N/A"}},{"$f":"VLOOKUP(D5,'Sales by UPC Codes'!$A$1:$E$300,4,FALSE)","v":{"$error":"#N/A"}},451333,1,null,null,null,null,1]
[{"$f":"VLOOKUP(D6,'Sales by UPC Codes'!$A$1:$E$300,2,FALSE)","v":{"$error":"#N/A"}},{"$f":"VLOOKUP(D6,'Sales by UPC Codes'!$A$1:$E$300,3,FALSE)","v":{"$error":"#N/A"}},{"$f":"VLOOKUP(D6,'Sales by UPC Codes'!$A$1:$E$300,4,FALSE)","v":{"$error":"#N/A"}},451336,6,1,5,3,null,15]
[{"$f":"VLOOKUP(D7,'Sales by UPC Codes'!$A$1:$E$300,2,FALSE)","v":{"$error":"#N/A"}},{"$f":"VLOOKUP(D7,'Sales by UPC Codes'!$A$1:$E$300,3,FALSE)","v":{"$error":"#N/A"}},{"$f":"VLOOKUP(D7,'Sales by UPC Codes'!$A$1:$E$300,4,FALSE)","v":{"$error":"#N/A"}},501036,6,1,3,5,2,17]
[{"$f":"VLOOKUP(D8,'Sales by UPC Codes'!$A$1:$E$300,2,FALSE)","v":{"$error":"#N/A"}},{"$f":"VLOOKUP(D8,'Sales by UPC Codes'!$A$1:$E$300,3,FALSE)","v":{"$error":"#N/A"}},{"$f":"VLOOKUP(D8,'Sales by UPC Codes'!$A$1:$E$300,4,FALSE)","v":{"$error":"#N/A"}},501039,23,-1,null,null,2,24]
[{"$f":"VLOOKUP(D9,'Sales by UPC Codes'!$A$1:$E$300,2,FALSE)","v":{"$error":"#N/A"}},{"$f":"VLOOKUP(D9,'Sales by UPC Codes'!$A$1:$E$300,3,FALSE)","v":{"$error":"#N/A"}},{"$f":"VLOOKUP(D9,'Sales by UPC Codes'!$A$1:$E$300,4,FALSE)","v":{"$error":"#N/A"}},506653,3,-1,2,null,1,5]
[{"$f":"VLOOKUP(D10,'Sales by UPC Codes'!$A$1:$E$300,2,FALSE)","v":{"$error":"#N/A"}},{"$f":"VLOOKUP(D10,'Sales by UPC Codes'!$A$1:$E$300,3,FALSE)","v":{"$error":"#N/A"}},{"$f":"VLOOKUP(D10,'Sales by UPC Codes'!$A$1:$E$300,4,FALSE)","v":{"$error":"#N/A"}},506654,5,1,1,null,-1,6]
[{"$f":"VLOOKUP(D11,'Sales by UPC Codes'!$A$1:$E$300,2,FALSE)","v":{"$error":"#N/A"}},{"$f":"VLOOKUP(D11,'Sales by UPC Codes'!$A$1:$E$300,3,FALSE)","v":{"$error":"#N/A"}},{"$f":"VLOOKUP(D11,'Sales by UPC Codes'!$A$1:$E$300,4,FALSE)","v":{"$error":"#N/A"}},506655,4,2,null,null,null,6]
[{"$f":"VLOOKUP(D12,'Sales by UPC Codes'!$A$1:$E$300,2,FALSE)","v":{"$error":"#N/A"}},{"$f":"VLOOKUP(D12,'Sales by UPC Codes'!$A$1:$E$300,3,FALSE)","v":{"$error":"#N/A"}},{"$f":"VLOOKUP(D12,'Sales by UPC Codes'!$A$1:$E$300,4,FALSE)","v":{"$error":"#N/A"}},506657,1,null,2,null,1,4]
[{"$f":"VLOOKUP(D13,'Sales by UPC Codes'!$A$1:$E$300,2,FALSE)","v":"Bella Top"},{"$f":"VLOOKUP(D13,'Sales by UPC Codes'!$A$1:$E$300,3,FALSE)","v":"Black"},{"$f":"VLOOKUP(D13,'Sales by UPC Codes'!$A$1:$E$300,4,FALSE)","v":"XXL"},506937,null,1,null,1,null,2]
[{"$f":"VLOOKUP(D14,'Sales by UPC Codes'!$A$1:$E$300,2,FALSE)","v":"Maxi Dress"},{"$f":"VLOOKUP(D14,'Sales by UPC Codes'!$A$1:$E$300,3,FALSE)","v":"Black"},{"$f":"VLOOKUP(D14,'Sales by UPC Codes'!$A$1:$E$300,4,FALSE)","v":"S"},506992,1,-1,null,null,null,0]
[{"$f":"VLOOKUP(D15,'Sales by UPC Codes'!$A$1:$E$300,2,FALSE)","v":"Maxi Dress"},{"$f":"VLOOKUP(D15,'Sales by UPC Codes'!$A$1:$E$300,3,FALSE)","v":"Black"},{"$f":"VLOOKUP(D15,'Sales by UPC Codes'!$A$1:$E$300,4,FALSE)","v":"M"},506993,null,1,null,1,null,2]
[{"$f":"VLOOKUP(D16,'Sales by UPC Codes'!$A$1:$E$300,2,FALSE)","v":"Maxi Dress"},{"$f":"VLOOKUP(D16,'Sales by UPC Codes'!$A$1:$E$300,3,FALSE)","v":"Black"},{"$f":"VLOOKUP(D16,'Sales by UPC Codes'!$A$1:$E$300,4,FALSE)","v":"XL"},507004,1,null,null,null,null,1]
[{"$f":"VLOOKUP(D17,'Sales by UPC Codes'!$A$1:$E$300,2,FALSE)","v":"Bella Top"},{"$f":"VLOOKUP(D17,'Sales by UPC Codes'!$A$1:$E$300,3,FALSE)","v":"Black"},{"$f":"VLOOKUP(D17,'Sales by UPC Codes'!$A$1:$E$300,4,FALSE)","v":"S"},507008,4,-1,null,null,null,3]
[{"$f":"VLOOKUP(D18,'Sales by UPC Codes'!$A$1:$E$300,2,FALSE)","v":"Bella Top"},{"$f":"VLOOKUP(D18,'Sales by UPC Codes'!$A$1:$E$300,3,FALSE)","v":"Black"},{"$f":"VLOOKUP(D18,'Sales by UPC Codes'!$A$1:$E$300,4,FALSE)","v":"M"},507010,3,3,null,3,1,10]
[{"$f":"VLOOKUP(D19,'Sales by UPC Codes'!$A$1:$E$300,2,FALSE)","v":"Bella Top"},{"$f":"VLOOKUP(D19,'Sales by UPC Codes'!$A$1:$E$300,3,FALSE)","v":"Black"},{"$f":"VLOOKUP(D19,'Sales by UPC Codes'!$A$1:$E$300,4,FALSE)","v":"L"},507011,3,1,5,2,null,11]
[{"$f":"VLOOKUP(D20,'Sales by UPC Codes'!$A$1:$E$300,2,FALSE)","v":"Bella Top"},{"$f":"VLOOKUP(D20,'Sales by UPC Codes'!$A$1:$E$300,3,FALSE)","v":"Black"},{"$f":"VLOOKUP(D20,'Sales by UPC Codes'!$A$1:$E$300,4,FALSE)","v":"XL"},507013,2,null,null,null,2,4]
[{"$f":"VLOOKUP(D21,'Sales by UPC Codes'!$A$1:$E$300,2,FALSE)","v":"Bella Top"},{"$f":"VLOOKUP(D21,'Sales by UPC Codes'!$A$1:$E$300,3,FALSE)","v":"Lilac"},{"$f":"VLOOKUP(D21,'Sales by UPC Codes'!$A$1:$E$300,4,FALSE)","v":"S"},507314,1,3,null,2,null,6]
[{"$f":"VLOOKUP(D22,'Sales by UPC Codes'!$A$1:$E$300,2,FALSE)","v":"Bella Top"},{"$f":"VLOOKUP(D22,'Sales by UPC Codes'!$A$1:$E$300,3,FALSE)","v":"Lilac"},{"$f":"VLOOKUP(D22,'Sales by UPC Codes'!$A$1:$E$300,4,FALSE)","v":"M"},507316,null,3,null,1,null,4]
[{"$f":"VLOOKUP(D23,'Sales by UPC Codes'!$A$1:$E$300,2,FALSE)","v":"Bella Top"},{"$f":"VLOOKUP(D23,'Sales by UPC Codes'!$A$1:$E$300,3,FALSE)","v":"Lilac"},{"$f":"VLOOKUP(D23,'Sales by UPC Codes'!$A$1:$E$300,4,FALSE)","v":"L"},507317,3,1,2,2,1,9]
[{"$f":"VLOOKUP(D24,'Sales by UPC Codes'!$A$1:$E$300,2,FALSE)","v":"Bella Top"},{"$f":"VLOOKUP(D24,'Sales by UPC Codes'!$A$1:$E$300,3,FALSE)","v":"Lilac"},{"$f":"VLOOKUP(D24,'Sales by UPC Codes'!$A$1:$E$300,4,FALSE)","v":"XL"},507318,1,null,null,1,null,2]
[{"$f":"VLOOKUP(D25,'Sales by UPC Codes'!$A$1:$E$300,2,FALSE)","v":"Bella Top"},{"$f":"VLOOKUP(D25,'Sales by UPC Codes'!$A$1:$E$300,3,FALSE)","v":"Lilac"},{"$f":"VLOOKUP(D25,'Sales by UPC Codes'!$A$1:$E$300,4,FALSE)","v":"XXL"},507319,null,1,null,null,null,1]
[{"$f":"VLOOKUP(D26,'Sales by UPC Codes'!$A$1:$E$300,2,FALSE)","v":"Taylor Top"},{"$f":"VLOOKUP(D26,'Sales by UPC Codes'!$A$1:$E$300,3,FALSE)","v":"Silver"},{"$f":"VLOOKUP(D26,'Sales by UPC Codes'!$A$1:$E$300,4,FALSE)","v":"S"},507329,4,2,null,null,null,6]
[{"$f":"VLOOKUP(D27,'Sales by UPC Codes'!$A$1:$E$300,2,FALSE)","v":"Taylor Top"},{"$f":"VLOOKUP(D27,'Sales by UPC Codes'!$A$1:$E$300,3,FALSE)","v":"Silver"},{"$f":"VLOOKUP(D27,'Sales by UPC Codes'!$A$1:$E$300,4,FALSE)","v":"M"},507330,2,-1,2,null,null,3]
[{"$f":"VLOOKUP(D28,'Sales by UPC Codes'!$A$1:$E$300,2,FALSE)","v":"Taylor Top"},{"$f":"VLOOKUP(D28,'Sales by UPC Codes'!$A$1:$E$300,3,FALSE)","v":"Silver"},{"$f":"VLOOKUP(D28,'Sales by UPC Codes'!$A$1:$E$300,4,FALSE)","v":"L"},507332,2,null,null,null,null,2]
[{"$f":"VLOOKUP(D29,'Sales by UPC Codes'!$A$1:$E$300,2,FALSE)","v":"Taylor Top"},{"$f":"VLOOKUP(D29,'Sales by UPC Codes'!$A$1:$E$300,3,FALSE)","v":"Silver"},{"$f":"VLOOKUP(D29,'Sales by UPC Codes'!$A$1:$E$300,4,FALSE)","v":"XL"},507333,2,-1,null,null,null,1]
[{"$f":"VLOOKUP(D30,'Sales by UPC Codes'!$A$1:$E$300,2,FALSE)","v":"Taylor Top"},{"$f":"VLOOKUP(D30,'Sales by UPC Codes'!$A$1:$E$300,3,FALSE)","v":"Silver"},{"$f":"VLOOKUP(D30,'Sales by UPC Codes'!$A$1:$E$300,4,FALSE)","v":"XXL"},507334,2,1,null,null,null,3]
[{"$f":"VLOOKUP(D31,'Sales by UPC Codes'!$A$1:$E$300,2,FALSE)","v":"Taylor Top"},{"$f":"VLOOKUP(D31,'Sales by UPC Codes'!$A$1:$E$300,3,FALSE)","v":"Olive"},{"$f":"VLOOKUP(D31,'Sales by UPC Codes'!$A$1:$E$300,4,FALSE)","v":"S"},507335,null,-1,null,2,null,1]
[{"$f":"VLOOKUP(D32,'Sales by UPC Codes'!$A$1:$E$300,2,FALSE)","v":"Taylor Top"},{"$f":"VLOOKUP(D32,'Sales by UPC Codes'!$A$1:$E$300,3,FALSE)","v":"Olive"},{"$f":"VLOOKUP(D32,'Sales by UPC Codes'!$A$1:$E$300,4,FALSE)","v":"M"},507337,null,null,1,6,1,8]
[{"$f":"VLOOKUP(D33,'Sales by UPC Codes'!$A$1:$E$300,2,FALSE)","v":"Taylor Top"},{"$f":"VLOOKUP(D33,'Sales by UPC Codes'!$A$1:$E$300,3,FALSE)","v":"Olive"},{"$f":"VLOOKUP(D33,'Sales by UPC Codes'!$A$1:$E$300,4,FALSE)","v":"L"},507338,null,null,1,-1,-1,-1]
[{"$f":"VLOOKUP(D34,'Sales by UPC Codes'!$A$1:$E$300,2,FALSE)","v":"Taylor Top"},{"$f":"VLOOKUP(D34,'Sales by UPC Codes'!$A$1:$E$300,3,FALSE)","v":"Olive"},{"$f":"VLOOKUP(D34,'Sales by UPC Codes'!$A$1:$E$300,4,FALSE)","v":"XXL"},507340,null,1,null,null,null,1]
[{"$f":"VLOOKUP(D35,'Sales by UPC Codes'!$A$1:$E$300,2,FALSE)","v":"Nina Top"},{"$f":"VLOOKUP(D35,'Sales by UPC Codes'!$A$1:$E$300,3,FALSE)","v":"White"},{"$f":"VLOOKUP(D35,'Sales by UPC Codes'!$A$1:$E$300,4,FALSE)","v":"S"},507573,2,1,1,null,null,4]
[{"$f":"VLOOKUP(D36,'Sales by UPC Codes'!$A$1:$E$300,2,FALSE)","v":"Nina Top"},{"$f":"VLOOKUP(D36,'Sales by UPC Codes'!$A$1:$E$300,3,FALSE)","v":"White"},{"$f":"VLOOKUP(D36,'Sales by UPC Codes'!$A$1:$E$300,4,FALSE)","v":"M"},507574,2,null,1,null,null,3]
[{"$f":"VLOOKUP(D37,'Sales by UPC Codes'!$A$1:$E$300,2,FALSE)","v":"Nina Top"},{"$f":"VLOOKUP(D37,'Sales by UPC Codes'!$A$1:$E$300,3,FALSE)","v":"White"},{"$f":"VLOOKUP(D37,'Sales by UPC Codes'!$A$1:$E$300,4,FALSE)","v":"XL"},507580,null,null,null,1,null,1]
[{"$f":"VLOOKUP(D38,'Sales by UPC Codes'!$A$1:$E$300,2,FALSE)","v":"Nina Top"},{"$f":"VLOOKUP(D38,'Sales by UPC Codes'!$A$1:$E$300,3,FALSE)","v":"White"},{"$f":"VLOOKUP(D38,'Sales by UPC Codes'!$A$1:$E$300,4,FALSE)","v":"XXL"},507583,2,1,null,null,null,3]
[{"$f":"VLOOKUP(D39,'Sales by UPC Codes'!$A$1:$E$300,2,FALSE)","v":"Nina Top"},{"$f":"VLOOKUP(D39,'Sales by UPC Codes'!$A$1:$E$300,3,FALSE)","v":"Turquoise"},{"$f":"VLOOKUP(D39,'Sales by UPC Codes'!$A$1:$E$300,4,FALSE)","v":"S"},507584,1,1,null,null,null,2]
[{"$f":"VLOOKUP(D40,'Sales by UPC Codes'!$A$1:$E$300,2,FALSE)","v":"Nina Top"},{"$f":"VLOOKUP(D40,'Sales by UPC Codes'!$A$1:$E$300,3,FALSE)","v":"Turquoise"},{"$f":"VLOOKUP(D40,'Sales by UPC Codes'!$A$1:$E$300,4,FALSE)","v":"M"},507588,null,null,1,null,null,1]
[{"$f":"VLOOKUP(D41,'Sales by UPC Codes'!$A$1:$E$300,2,FALSE)","v":"Nina Top"},{"$f":"VLOOKUP(D41,'Sales by UPC Codes'!$A$1:$E$300,3,FALSE)","v":"Turquoise"},{"$f":"VLOOKUP(D41,'Sales by UPC Codes'!$A$1:$E$300,4,FALSE)","v":"L"},507590,2,null,null,null,null,2]
[{"$f":"VLOOKUP(D42,'Sales by UPC Codes'!$A$1:$E$300,2,FALSE)","v":"Nina Top"},{"$f":"VLOOKUP(D42,'Sales by UPC Codes'!$A$1:$E$300,3,FALSE)","v":"Turquoise"},{"$f":"VLOOKUP(D42,'Sales by UPC Codes'!$A$1:$E$300,4,FALSE)","v":"XXL"},507592,1,null,null,null,null,1]
[{"$f":"VLOOKUP(D43,'Sales by UPC Codes'!$A$1:$E$300,2,FALSE)","v":"Hailey Top"},{"$f":"VLOOKUP(D43,'Sales by UPC Codes'!$A$1:$E$300,3,FALSE)","v":"Green Dot"},{"$f":"VLOOKUP(D43,'Sales by UPC Codes'!$A$1:$E$300,4,FALSE)","v":"S"},507610,2,1,1,1,null,5]
[{"$f":"VLOOKUP(D44,'Sales by UPC Codes'!$A$1:$E$300,2,FALSE)","v":"Hailey Top"},{"$f":"VLOOKUP(D44,'Sales by UPC Codes'!$A$1:$E$300,3,FALSE)","v":"Green Dot"},{"$f":"VLOOKUP(D44,'Sales by UPC Codes'!$A$1:$E$300,4,FALSE)","v":"M"},507612,8,3,2,6,1,20]
[{"$f":"VLOOKUP(D45,'Sales by UPC Codes'!$A$1:$E$300,2,FALSE)","v":"Hailey Top"},{"$f":"VLOOKUP(D45,'Sales by UPC Codes'!$A$1:$E$300,3,FALSE)","v":"Green Dot"},{"$f":"VLOOKUP(D45,'Sales by UPC Codes'!$A$1:$E$300,4,FALSE)","v":"L"},507613,2,5,1,null,null,8]
[{"$f":"VLOOKUP(D46,'Sales by UPC Codes'!$A$1:$E$300,2,FALSE)","v":"Hailey Top"},{"$f":"VLOOKUP(D46,'Sales by UPC Codes'!$A$1:$E$300,3,FALSE)","v":"Green Dot"},{"$f":"VLOOKUP(D46,'Sales by UPC Codes'!$A$1:$E$300,4,FALSE)","v":"XL"},507614,null,1,1,1,null,3]
[{"$f":"VLOOKUP(D47,'Sales by UPC Codes'!$A$1:$E$300,2,FALSE)","v":"Hailey Top"},{"$f":"VLOOKUP(D47,'Sales by UPC Codes'!$A$1:$E$300,3,FALSE)","v":"Green Dot"},{"$f":"VLOOKUP(D47,'Sales by UPC Codes'!$A$1:$E$300,4,FALSE)","v":"XXL"},507616,1,1,null,null,null,2]
[{"$f":"VLOOKUP(D48,'Sales by UPC Codes'!$A$1:$E$300,2,FALSE)","v":"Hailey Top"},{"$f":"VLOOKUP(D48,'Sales by UPC Codes'!$A$1:$E$300,3,FALSE)","v":"Pink Flower"},{"$f":"VLOOKUP(D48,'Sales by UPC Codes'!$A$1:$E$300,4,FALSE)","v":"S"},507617,5,null,1,6,null,12]
[{"$f":"VLOOKUP(D49,'Sales by UPC Codes'!$A$1:$E$300,2,FALSE)","v":"Hailey Top"},{"$f":"VLOOKUP(D49,'Sales by UPC Codes'!$A$1:$E$300,3,FALSE)","v":"Pink Flower"},{"$f":"VLOOKUP(D49,'Sales by UPC Codes'!$A$1:$E$300,4,FALSE)","v":"M"},507620,3,-1,3,2,null,7]
[{"$f":"VLOOKUP(D50,'Sales by UPC Codes'!$A$1:$E$300,2,FALSE)","v":"Hailey Top"},{"$f":"VLOOKUP(D50,'Sales by UPC Codes'!$A$1:$E$300,3,FALSE)","v":"Pink Flower"},{"$f":"VLOOKUP(D50,'Sales by UPC Codes'!$A$1:$E$300,4,FALSE)","v":"L"},507621,1,1,2,3,null,7]
[{"$f":"VLOOKUP(D51,'Sales by UPC Codes'!$A$1:$E$300,2,FALSE)","v":"Hailey Top"},{"$f":"VLOOKUP(D51,'Sales by UPC Codes'!$A$1:$E$300,3,FALSE)","v":"Pink Flower"},{"$f":"VLOOKUP(D51,'Sales by UPC Codes'!$A$1:$E$300,4,FALSE)","v":"XL"},507622,2,4,2,2,null,10]
[{"$f":"VLOOKUP(D52,'Sales by UPC Codes'!$A$1:$E$300,2,FALSE)","v":"Hailey Top"},{"$f":"VLOOKUP(D52,'Sales by UPC Codes'!$A$1:$E$300,3,FALSE)","v":"Pink Flower"},{"$f":"VLOOKUP(D52,'Sales by UPC Codes'!$A$1:$E$300,4,FALSE)","v":"XXL"},507623,null,1,null,2,null,3]
[{"$f":"VLOOKUP(D53,'Sales by UPC Codes'!$A$1:$E$300,2,FALSE)","v":{"$error":"#N/A"}},{"$f":"VLOOKUP(D53,'Sales by UPC Codes'!$A$1:$E$300,3,FALSE)","v":{"$error":"#N/A"}},{"$f":"VLOOKUP(D53,'Sales by UPC Codes'!$A$1:$E$300,4,FALSE)","v":{"$error":"#N/A"}},507644,null,1,null,null,null,1]
[{"$f":"VLOOKUP(D54,'Sales by UPC Codes'!$A$1:$E$300,2,FALSE)","v":{"$error":"#N/A"}},{"$f":"VLOOKUP(D54,'Sales by UPC Codes'!$A$1:$E$300,3,FALSE)","v":{"$error":"#N/A"}},{"$f":"VLOOKUP(D54,'Sales by UPC Codes'!$A$1:$E$300,4,FALSE)","v":{"$error":"#N/A"}},507645,null,1,null,null,1,2]
[{"$f":"VLOOKUP(D55,'Sales by UPC Codes'!$A$1:$E$300,2,FALSE)","v":{"$error":"#N/A"}},{"$f":"VLOOKUP(D55,'Sales by UPC Codes'!$A$1:$E$300,3,FALSE)","v":{"$error":"#N/A"}},{"$f":"VLOOKUP(D55,'Sales by UPC Codes'!$A$1:$E$300,4,FALSE)","v":{"$error":"#N/A"}},507651,null,1,null,null,null,1]
[{"$f":"VLOOKUP(D56,'Sales by UPC Codes'!$A$1:$E$300,2,FALSE)","v":{"$error":"#N/A"}},{"$f":"VLOOKUP(D56,'Sales by UPC Codes'!$A$1:$E$300,3,FALSE)","v":{"$error":"#N/A"}},{"$f":"VLOOKUP(D56,'Sales by UPC Codes'!$A$1:$E$300,4,FALSE)","v":{"$error":"#N/A"}},507653,null,null,null,null,2,2]
[{"$f":"VLOOKUP(D57,'Sales by UPC Codes'!$A$1:$E$300,2,FALSE)","v":{"$error":"#N/A"}},{"$f":"VLOOKUP(D57,'Sales by UPC Codes'!$A$1:$E$300,3,FALSE)","v":{"$error":"#N/A"}},{"$f":"VLOOKUP(D57,'Sales by UPC Codes'!$A$1:$E$300,4,FALSE)","v":{"$error":"#N/A"}},507654,null,1,null,null,null,1]
[{"$f":"VLOOKUP(D58,'Sales by UPC Codes'!$A$1:$E$300,2,FALSE)","v":{"$error":"#N/A"}},{"$f":"VLOOKUP(D58,'Sales by UPC Codes'!$A$1:$E$300,3,FALSE)","v":{"$error":"#N/A"}},{"$f":"VLOOKUP(D58,'Sales by UPC Codes'!$A$1:$E$300,4,FALSE)","v":{"$error":"#N/A"}},509642,null,null,null,-1,null,-1]
[{"$f":"VLOOKUP(D59,'Sales by UPC Codes'!$A$1:$E$300,2,FALSE)","v":{"$error":"#N/A"}},{"$f":"VLOOKUP(D59,'Sales by UPC Codes'!$A$1:$E$300,3,FALSE)","v":{"$error":"#N/A"}},{"$f":"VLOOKUP(D59,'Sales by UPC Codes'!$A$1:$E$300,4,FALSE)","v":{"$error":"#N/A"}},509645,null,null,null,-1,null,-1]
[{"$f":"VLOOKUP(D60,'Sales by UPC Codes'!$A$1:$E$300,2,FALSE)","v":{"$error":"#N/A"}},{"$f":"VLOOKUP(D60,'Sales by UPC Codes'!$A$1:$E$300,3,FALSE)","v":{"$error":"#N/A"}},{"$f":"VLOOKUP(D60,'Sales by UPC Codes'!$A$1:$E$300,4,FALSE)","v":{"$error":"#N/A"}},509646,null,null,null,1,null,1]
[{"$f":"VLOOKUP(D61,'Sales by UPC Codes'!$A$1:$E$300,2,FALSE)","v":{"$error":"#N/A"}},{"$f":"VLOOKUP(D61,'Sales by UPC Codes'!$A$1:$E$300,3,FALSE)","v":{"$error":"#N/A"}},{"$f":"VLOOKUP(D61,'Sales by UPC Codes'!$A$1:$E$300,4,FALSE)","v":{"$error":"#N/A"}},509648,null,null,null,-1,null,-1]
[{"$f":"VLOOKUP(D62,'Sales by UPC Codes'!$A$1:$E$300,2,FALSE)","v":{"$error":"#N/A"}},{"$f":"VLOOKUP(D62,'Sales by UPC Codes'!$A$1:$E$300,3,FALSE)","v":{"$error":"#N/A"}},{"$f":"VLOOKUP(D62,'Sales by UPC Codes'!$A$1:$E$300,4,FALSE)","v":{"$error":"#N/A"}},509649,null,null,null,2,null,2]
[{"$f":"VLOOKUP(D63,'Sales by UPC Codes'!$A$1:$E$300,2,FALSE)","v":{"$error":"#N/A"}},{"$f":"VLOOKUP(D63,'Sales by UPC Codes'!$A$1:$E$300,3,FALSE)","v":{"$error":"#N/A"}},{"$f":"VLOOKUP(D63,'Sales by UPC Codes'!$A$1:$E$300,4,FALSE)","v":{"$error":"#N/A"}},509650,null,null,null,-1,null,-1]
[{"$f":"VLOOKUP(D64,'Sales by UPC Codes'!$A$1:$E$300,2,FALSE)","v":{"$error":"#N/A"}},{"$f":"VLOOKUP(D64,'Sales by UPC Codes'!$A$1:$E$300,3,FALSE)","v":{"$error":"#N/A"}},{"$f":"VLOOKUP(D64,'Sales by UPC Codes'!$A$1:$E$300,4,FALSE)","v":{"$error":"#N/A"}},509652,null,null,null,2,null,2]
[{"$f":"VLOOKUP(D65,'Sales by UPC Codes'!$A$1:$E$300,2,FALSE)","v":{"$error":"#N/A"}},{"$f":"VLOOKUP(D65,'Sales by UPC Codes'!$A$1:$E$300,3,FALSE)","v":{"$error":"#N/A"}},{"$f":"VLOOKUP(D65,'Sales by UPC Codes'!$A$1:$E$300,4,FALSE)","v":{"$error":"#N/A"}},510757,null,null,null,1,null,1]
[{"$f":"VLOOKUP(D66,'Sales by UPC Codes'!$A$1:$E$300,2,FALSE)","v":{"$error":"#N/A"}},{"$f":"VLOOKUP(D66,'Sales by UPC Codes'!$A$1:$E$300,3,FALSE)","v":{"$error":"#N/A"}},{"$f":"VLOOKUP(D66,'Sales by UPC Codes'!$A$1:$E$300,4,FALSE)","v":{"$error":"#N/A"}},510758,null,null,null,2,null,2]
["x","x","x","Grand Total",114,39,39,56,13,261]

{"sheet":"Breakdown","index":2,"n_rows":7,"n_cols":73,"rows_kept":7,"cut":false,"hidden":false,"merged":[]}
[]
[null,"Store Number",506992,506993,507003,507004,507008,507010,507011,507013,506937,507314,507316,507317,507318,507319,507335,507337,507338,507339,507340,507329,507330,507332,507333,507334,507573,507574,507579,507580,507583,507584,507588,507590,507591,507592,507610,507612,507613,507614,507616,507617,507620,507621,507622,507623,507637,507638,507639,507641,451332,451333,451336,501036,501039,506653,506654,506655,506657,507644,507645,507651,507653,507654,509642,509645,509646,509648,509649,509650,509652,510757,510758]
[null,110,1,null,null,1,4,3,3,2,null,1,null,3,1,null,null,null,null,null,null,4,2,2,2,2,2,2,null,null,2,1,null,2,null,1,2,8,2,null,1,5,3,1,2,null,null,null,null,null,null,1,6,6,23,3,5,4,1]
[null,401,-1,1,null,null,-1,3,1,null,1,3,3,1,null,1,-1,null,null,null,1,2,-1,null,-1,1,1,null,null,null,1,1,null,null,null,null,1,3,5,1,1,null,-1,1,4,1,null,null,null,null,null,null,1,1,-1,-1,1,2,null,1,1,1,null,1]
[null,487,null,null,null,null,null,null,5,null,null,null,null,2,null,null,null,1,1,null,null,null,2,null,null,null,1,1,null,null,null,null,1,null,null,null,1,2,1,1,null,1,3,2,2,null,null,null,null,null,-1,1,5,3,null,2,1,null,2]
[null,761,null,1,null,null,null,3,2,null,1,2,1,2,1,null,2,6,-1,null,null,null,null,null,null,null,null,null,null,1,null,null,null,null,null,null,1,6,null,1,null,6,2,3,2,2,null,null,null,null,null,null,3,5,null,null,null,null,null,null,null,null,null,null,-1,-1,1,-1,2,-1,2,1,2]
[null,781,null,null,null,null,null,1,null,2,null,null,null,1,null,null,null,1,-1,null,null,null,null,null,null,null,null,null,null,null,null,null,null,null,null,null,null,1,null,null,null,null,null,null,null,null,null,null,null,null,null,null,null,2,2,1,-1,null,1,null,1,null,2]

{"sheet":"PivotTable","index":3,"n_rows":66,"n_cols":7,"rows_kept":66,"cut":false,"hidden":false,"merged":[]}
["Sum of quanitity","warehouse"]
["item",110,401,487,761,781,"Grand Total"]
[451332,null,null,-1,null,null,-1]
[451333,1,null,null,null,null,1]
[451336,6,1,5,3,null,15]
[501036,6,1,3,5,2,17]
[501039,23,-1,null,null,2,24]
[506653,3,-1,2,null,1,5]
[506654,5,1,1,null,-1,6]
[506655,4,2,null,null,null,6]
[506657,1,null,2,null,1,4]
[506937,null,1,null,1,null,2]
[506992,1,-1,null,null,null,0]
[506993,null,1,null,1,null,2]
[507004,1,null,null,null,null,1]
[507008,4,-1,null,null,null,3]
[507010,3,3,null,3,1,10]
[507011,3,1,5,2,null,11]
[507013,2,null,null,null,2,4]
[507314,1,3,null,2,null,6]
[507316,null,3,null,1,null,4]
[507317,3,1,2,2,1,9]
[507318,1,null,null,1,null,2]
[507319,null,1,null,null,null,1]
[507329,4,2,null,null,null,6]
[507330,2,-1,2,null,null,3]
[507332,2,null,null,null,null,2]
[507333,2,-1,null,null,null,1]
[507334,2,1,null,null,null,3]
[507335,null,-1,null,2,null,1]
[507337,null,null,1,6,1,8]
[507338,null,null,1,-1,-1,-1]
[507340,null,1,null,null,null,1]
[507573,2,1,1,null,null,4]
[507574,2,null,1,null,null,3]
[507580,null,null,null,1,null,1]
[507583,2,1,null,null,null,3]
[507584,1,1,null,null,null,2]
[507588,null,null,1,null,null,1]
[507590,2,null,null,null,null,2]
[507592,1,null,null,null,null,1]
[507610,2,1,1,1,null,5]
[507612,8,3,2,6,1,20]
[507613,2,5,1,null,null,8]
[507614,null,1,1,1,null,3]
[507616,1,1,null,null,null,2]
[507617,5,null,1,6,null,12]
[507620,3,-1,3,2,null,7]
[507621,1,1,2,3,null,7]
[507622,2,4,2,2,null,10]
[507623,null,1,null,2,null,3]
[507644,null,1,null,null,null,1]
[507645,null,1,null,null,1,2]
[507651,null,1,null,null,null,1]
[507653,null,null,null,null,2,2]
[507654,null,1,null,null,null,1]
[509642,null,null,null,-1,null,-1]
[509645,null,null,null,-1,null,-1]
[509646,null,null,null,1,null,1]
[509648,null,null,null,-1,null,-1]
[509649,null,null,null,2,null,2]
[509650,null,null,null,-1,null,-1]
[509652,null,null,null,2,null,2]
[510757,null,null,null,1,null,1]
[510758,null,null,null,2,null,2]
["Grand Total",114,39,39,56,13,261]

{"sheet":"Input New Data Here","index":4,"n_rows":2,"n_cols":1,"rows_kept":2,"cut":false,"hidden":false,"merged":[]}
[]
["Click this button in yellow and then paste new data here"]

{"sheet":"Running Total","index":5,"n_rows":146,"n_cols":5,"rows_kept":146,"cut":false,"hidden":false,"merged":[[0,0,0,7]]}
["Directions:  Click the button to start over the totals of each area.  Once you click the button, each box will began to add up the values each day and include a running total.  You don't need to change anything else on this page (the warehouses will automatically sink up to what you have on the main page."]
["Warehouse","Total Since Last Clear"]
[{"$f":"'Main Page'!A3","v":"Grand Total"}]
[{"$f":"'Main Page'!A4","v":"781 Total"}]
[{"$f":"'Main Page'!A5","v":"401 Total"},null,null,null,"Date Since Last Clear"]
[{"$f":"'Main Page'!A6","v":"487 Total"},null,null,null,{"$f":"TODAY()-1","v":"2010-04-12"}]
[{"$f":"'Main Page'!A7","v":"761 Total"}]
[{"$f":"'Main Page'!A8","v":"110 Total"}]
[{"$f":"'Main Page'!A9","v":"2 Total"}]
[{"$f":"'Main Page'!A10","v":"6 Total"}]
[{"$f":"'Main Page'!A11","v":"13 Total"}]
[{"$f":"'Main Page'!A12","v":"61 Total"}]
[{"$f":"'Main Page'!A13","v":"67 Total"}]
[{"$f":"'Main Page'!A14","v":"69 Total"}]
[{"$f":"'Main Page'!A15","v":"95 Total"}]
[{"$f":"'Main Page'!A16","v":"96 Total"}]
[{"$f":"'Main Page'!A17","v":"97 Total"}]
[{"$f":"'Main Page'!A18","v":"106 Total"}]
[{"$f":"'Main Page'!A19","v":"111 Total"}]
[{"$f":"'Main Page'!A20","v":"113 Total"}]
[{"$f":"'Main Page'!A21","v":"116 Total"}]
[{"$f":"'Main Page'!A22","v":"121 Total"}]
[{"$f":"'Main Page'!A23","v":"145 Total"}]
[{"$f":"'Main Page'!A24","v":"403 Total"}]
[{"$f":"'Main Page'!A25","v":"407 Total"}]
[{"$f":"'Main Page'!A26","v":"427 Total"}]
[{"$f":"'Main Page'!A27","v":"431 Total"}]
[{"$f":"'Main Page'!A28","v":"436 Total"}]
[{"$f":"'Main Page'!A29","v":"439 Total"}]
[{"$f":"'Main Page'!A30","v":"440 Total"}]
[{"$f":"'Main Page'!A31","v":"452 Total"}]
[{"$f":"'Main Page'!A32","v":"460 Total"}]
[{"$f":"'Main Page'!A33","v":"462 Total"}]
[{"$f":"'Main Page'!A34","v":"465 Total"}]
[{"$f":"'Main Page'!A35","v":"469 Total"}]
[{"$f":"'Main Page'!A36","v":"480 Total"}]
[{"$f":"'Main Page'!A37","v":"481 Total"}]
[{"$f":"'Main Page'!A38","v":"483 Total"}]
[{"$f":"'Main Page'!A39","v":"484 Total"}]
[{"$f":"'Main Page'!A40","v":"488 Total"}]
[{"$f":"'Main Page'!A41","v":"490 Total"}]
[{"$f":"'Main Page'!A42","v":"491 Total"}]
[{"$f":"'Main Page'!A43","v":"622 Total"}]
[{"$f":"'Main Page'!A44","v":"633 Total"}]
[{"$f":"'Main Page'!A45","v":"629 Total"}]
[{"$f":"'Main Page'!A46","v":"637 Total"}]
[{"$f":"'Main Page'!A47","v":"642 Total"}]
[{"$f":"'Main Page'!A48","v":"644 Total"}]
[{"$f":"'Main Page'!A49","v":"665 Total"}]
[{"$f":"'Main Page'!A50","v":"667 Total"}]
[{"$f":"'Main Page'!A51","v":"674 Total"}]
[{"$f":"'Main Page'!A52","v":"676 Total"}]
[{"$f":"'Main Page'!A53","v":"682 Total"}]
[{"$f":"'Main Page'!A54","v":"685 Total"}]
[{"$f":"'Main Page'!A55","v":"691 Total"}]
[{"$f":"'Main Page'!A56","v":"736 Total"}]
[{"$f":"'Main Page'!A57","v":"745 Total"}]
[{"$f":"'Main Page'!A58","v":"746 Total"}]
[{"$f":"'Main Page'!A59","v":"766 Total"}]
[{"$f":"'Main Page'!A60","v":"770 Total"}]
[{"$f":"'Main Page'!A61","v":"772 Total"}]
[{"$f":"'Main Page'!A62","v":"775 Total"}]
[{"$f":"'Main Page'!A63","v":"1014 Total"}]
[{"$f":"'Main Page'!A64","v":"1016 Total"}]
[{"$f":"'Main Page'!A65","v":"1022 Total"}]
[{"$f":"'Main Page'!A66","v":"1027 Total"}]
[{"$f":"'Main Page'!A67","v":"1029 Total"}]
[{"$f":"'Main Page'!A68","v":"1033 Total"}]
[{"$f":"'Main Page'!A69","v":0}]
[{"$f":"'Main Page'!A70","v":0}]
[{"$f":"'Main Page'!A71","v":0}]
[{"$f":"'Main Page'!A72","v":0}]
[{"$f":"'Main Page'!A73","v":0}]
[{"$f":"'Main Page'!A74","v":0}]
[{"$f":"'Main Page'!A75","v":0}]
[{"$f":"'Main Page'!A76","v":0}]
[{"$f":"'Main Page'!A77","v":0}]
[{"$f":"'Main Page'!A78","v":0}]
[{"$f":"'Main Page'!A79","v":0}]
[{"$f":"'Main Page'!A80","v":0}]
[{"$f":"'Main Page'!A81","v":0}]
[{"$f":"'Main Page'!A82","v":0}]
[{"$f":"'Main Page'!A83","v":0}]
[{"$f":"'Main Page'!A84","v":0}]
[{"$f":"'Main Page'!A85","v":0}]
[{"$f":"'Main Page'!A86","v":0}]
[{"$f":"'Main Page'!A87","v":0}]
[{"$f":"'Main Page'!A88","v":0}]
[{"$f":"'Main Page'!A89","v":0}]
[{"$f":"'Main Page'!A90","v":0}]
[{"$f":"'Main Page'!A91","v":0}]
[{"$f":"'Main Page'!A92","v":0}]
[{"$f":"'Main Page'!A93","v":0}]
[{"$f":"'Main Page'!A94","v":0}]
[{"$f":"'Main Page'!A95","v":0}]
[{"$f":"'Main Page'!A96","v":0}]
[{"$f":"'Main Page'!A97","v":0}]
[{"$f":"'Main Page'!A98","v":0}]
[{"$f":"'Main Page'!A99","v":0}]
[{"$f":"'Main Page'!A100","v":0}]
[{"$f":"'Main Page'!A101","v":0}]
[{"$f":"'Main Page'!A102","v":0}]
[{"$f":"'Main Page'!A103","v":0}]
[{"$f":"'Main Page'!A104","v":0}]
[{"$f":"'Main Page'!A105","v":0}]
[{"$f":"'Main Page'!A106","v":0}]
[{"$f":"'Main Page'!A107","v":0}]
[{"$f":"'Main Page'!A108","v":0}]
[{"$f":"'Main Page'!A109","v":0}]
[{"$f":"'Main Page'!A110","v":0}]
[{"$f":"'Main Page'!A111","v":0}]
[{"$f":"'Main Page'!A112","v":0}]
[{"$f":"'Main Page'!A113","v":0}]
[{"$f":"'Main Page'!A114","v":0}]
[{"$f":"'Main Page'!A115","v":0}]
[{"$f":"'Main Page'!A116","v":0}]
[{"$f":"'Main Page'!A117","v":0}]
[{"$f":"'Main Page'!A118","v":0}]
[{"$f":"'Main Page'!A119","v":0}]
[{"$f":"'Main Page'!A120","v":0}]
[{"$f":"'Main Page'!A121","v":0}]
[{"$f":"'Main Page'!A122","v":0}]
[{"$f":"'Main Page'!A123","v":0}]
[{"$f":"'Main Page'!A124","v":0}]
[{"$f":"'Main Page'!A125","v":0}]
[{"$f":"'Main Page'!A126","v":0}]
[{"$f":"'Main Page'!A127","v":0}]
[{"$f":"'Main Page'!A128","v":0}]
[{"$f":"'Main Page'!A129","v":0}]
[{"$f":"'Main Page'!A130","v":0}]
[{"$f":"'Main Page'!A131","v":0}]
[{"$f":"'Main Page'!A132","v":0}]
[{"$f":"'Main Page'!A133","v":0}]
[{"$f":"'Main Page'!A134","v":0}]
[{"$f":"'Main Page'!A135","v":0}]
[{"$f":"'Main Page'!A136","v":0}]
[{"$f":"'Main Page'!A137","v":0}]
[{"$f":"'Main Page'!A138","v":0}]
[{"$f":"'Main Page'!A139","v":0}]
[{"$f":"'Main Page'!A140","v":0}]
[{"$f":"'Main Page'!A141","v":0}]
[{"$f":"'Main Page'!A142","v":0}]
[{"$f":"'Main Page'!A143","v":0}]
[{"$f":"'Main Page'!A144","v":0}]
[{"$f":"'Main Page'!A145","v":0}]
[{"$f":"'Main Page'!A146","v":0}]

{"sheet":"Costco Data Per Day","index":6,"n_rows":147,"n_cols":20,"rows_kept":147,"cut":false,"hidden":false,"merged":[]}
["company","ap-vendor","ap-suffix","warehouse","sales-date","payment-summary","po-number","invoice-num","bba-vendor","bba-suffix","department","item","item-description","quanitity","unit-cost","extended-cost","QST","HST","GST","kiosk"]
[1,71247,0,110,"2010-04-11","2010-04-12",1100411888,1100411010,71247,44,44,451333,"LILAC DENIM- SCOOP POCKET",1,34.5,34.5,0,0,0,"CNRDS"]
[1,71247,0,110,"2010-04-11","2010-04-12",1100411888,1100411010,71247,44,44,451336,"JANE SKIRT- #501S        ",6,21.49,128.94,0,0,0,"CNRDS"]
[1,71247,0,110,"2010-04-11","2010-04-12",1100411888,1100411010,71247,44,44,501036,"LILAC DENIM - LIGHT FLAP ",6,34.5,207,0,0,0,"CNRDS"]
[1,71247,0,110,"2010-04-11","2010-04-12",1100411888,1100411010,71247,44,44,501039,"LILAC DENIM - DARK DOUBLE",23,34.5,793.5,0,0,0,"CNRDS"]
[1,71247,0,110,"2010-04-11","2010-04-12",1100411888,1100411010,71247,44,44,506653,"LILAC DENIM - DARK DOUBLE",3,34.5,103.5,0,0,0,"CNRDS"]
[1,71247,0,110,"2010-04-11","2010-04-12",1100411888,1100411010,71247,44,44,506654,"LILAC DENIM - DARK DOUBLE",5,34.5,172.5,0,0,0,"CNRDS"]
[1,71247,0,110,"2010-04-11","2010-04-12",1100411888,1100411010,71247,44,44,506655,"LILAC DENIM - DARK DOUBLE",4,34.5,138,0,0,0,"CNRDS"]
[1,71247,0,110,"2010-04-11","2010-04-12",1100411888,1100411010,71247,44,44,506657,"LILAC DENIM - DARK DOUBLE",1,34.5,34.5,0,0,0,"CNRDS"]
[1,71247,0,110,"2010-04-11","2010-04-12",1100411888,1100411010,71247,44,44,506992,"MAXI DRESS - S           ",1,33.53,33.53,0,0,0,"CNRDS"]
[1,71247,0,110,"2010-04-11","2010-04-12",1100411888,1100411010,71247,44,44,507004,"MAXI DRESS - XL          ",1,33.53,33.53,0,0,0,"CNRDS"]
[1,71247,0,110,"2010-04-11","2010-04-12",1100411888,1100411010,71247,44,44,507008,"BELLA TOP #106A - BLK: S ",4,24.93,99.72,0,0,0,"CNRDS"]
[1,71247,0,110,"2010-04-11","2010-04-12",1100411888,1100411010,71247,44,44,507010,"BELLA TOP #106A - BLK: M ",3,24.93,74.790000000000006,0,0,0,"CNRDS"]
[1,71247,0,110,"2010-04-11","2010-04-12",1100411888,1100411010,71247,44,44,507011,"BELLA TOP #106A - BLK: L ",3,24.93,74.790000000000006,0,0,0,"CNRDS"]
[1,71247,0,110,"2010-04-11","2010-04-12",1100411888,1100411010,71247,44,44,507013,"BELLA TOP #106A - BLK: XL",2,24.93,49.86,0,0,0,"CNRDS"]
[1,71247,0,110,"2010-04-11","2010-04-12",1100411888,1100411010,71247,44,44,507314,"BELLA TOP #106A- LILAC: S",1,24.93,24.93,0,0,0,"CNRDS"]
[1,71247,0,110,"2010-04-11","2010-04-12",1100411888,1100411010,71247,44,44,507317,"BELLA TOP #106A- LILAC: L",3,24.93,74.790000000000006,0,0,0,"CNRDS"]
[1,71247,0,110,"2010-04-11","2010-04-12",1100411888,1100411010,71247,44,44,507318,"BELLA TOP #106A-LILAC: XL",1,24.93,24.93,0,0,0,"CNRDS"]
[1,71247,0,110,"2010-04-11","2010-04-12",1100411888,1100411010,71247,44,44,507329,"TAYLOR TOP #099A- GREY: S",4,21.49,85.96,0,0,0,"CNRDS"]
[1,71247,0,110,"2010-04-11","2010-04-12",1100411888,1100411010,71247,44,44,507330,"TAYLOR TOP #099A- GREY: M",2,21.49,42.98,0,0,0,"CNRDS"]
[1,71247,0,110,"2010-04-11","2010-04-12",1100411888,1100411010,71247,44,44,507332,"TAYLOR TOP #099A- GREY: L",2,21.49,42.98,0,0,0,"CNRDS"]
[1,71247,0,110,"2010-04-11","2010-04-12",1100411888,1100411010,71247,44,44,507333,"TAYLOR TOP #099A-GREY: XL",2,21.49,42.98,0,0,0,"CNRDS"]
[1,71247,0,110,"2010-04-11","2010-04-12",1100411888,1100411010,71247,44,44,507334,"TAYLOR TOP #099A-GREY:XXL",2,21.49,42.98,0,0,0,"CNRDS"]
[1,71247,0,110,"2010-04-11","2010-04-12",1100411888,1100411010,71247,44,44,507573,"NINA TOP #102A- WHITE: S ",2,24.07,48.14,0,0,0,"CNRDS"]
[1,71247,0,110,"2010-04-11","2010-04-12",1100411888,1100411010,71247,44,44,507574,"NINA TOP #102A- WHITE: M ",2,24.07,48.14,0,0,0,"CNRDS"]
[1,71247,0,110,"2010-04-11","2010-04-12",1100411888,1100411010,71247,44,44,507583,"NINA TOP #102A-WHITE: XXL",2,24.07,48.14,0,0,0,"CNRDS"]
[1,71247,0,110,"2010-04-11","2010-04-12",1100411888,1100411010,71247,44,44,507584,"NINA TOP #102A - TURQUOIS",1,24.07,24.07,0,0,0,"CNRDS"]
[1,71247,0,110,"2010-04-11","2010-04-12",1100411888,1100411010,71247,44,44,507590,"NINA TOP #102A - TURQUOIS",2,24.07,48.14,0,0,0,"CNRDS"]
[1,71247,0,110,"2010-04-11","2010-04-12",1100411888,1100411010,71247,44,44,507592,"NINA TOP #102A - TURQUOIS",1,24.07,24.07,0,0,0,"CNRDS"]
[1,71247,0,110,"2010-04-11","2010-04-12",1100411888,1100411010,71247,44,44,507610,"HAILEY TOP #108A - GREEN ",2,21.49,42.98,0,0,0,"CNRDS"]
[1,71247,0,110,"2010-04-11","2010-04-12",1100411888,1100411010,71247,44,44,507612,"HAILEY TOP #108A - GREEN ",8,21.49,171.92,0,0,0,"CNRDS"]
[1,71247,0,110,"2010-04-11","2010-04-12",1100411888,1100411010,71247,44,44,507613,"HAILEY TOP #108A - GREEN ",2,21.49,42.98,0,0,0,"CNRDS"]
[1,71247,0,110,"2010-04-11","2010-04-12",1100411888,1100411010,71247,44,44,507616,"HAILEY TOP #108A - GREEN ",1,21.49,21.49,0,0,0,"CNRDS"]
[1,71247,0,110,"2010-04-11","2010-04-12",1100411888,1100411010,71247,44,44,507617,"HAILEY TOP #108A - PINK F",5,21.49,107.45,0,0,0,"CNRDS"]
[1,71247,0,110,"2010-04-11","2010-04-12",1100411888,1100411010,71247,44,44,507620,"HAILEY TOP #108A - PINK F",3,21.49,64.47,0,0,0,"CNRDS"]
[1,71247,0,110,"2010-04-11","2010-04-12",1100411888,1100411010,71247,44,44,507621,"HAILEY TOP #108A - PINK F",1,21.49,21.49,0,0,0,"CNRDS"]
[1,71247,0,110,"2010-04-11","2010-04-12",1100411888,1100411010,71247,44,44,507622,"HAILEY TOP #108A - PINK F",2,21.49,42.98,0,0,0,"CNRDS"]
[null,null,null,"110 Total",null,null,null,null,null,null,null,null,null,null,null,{"$f":"SUBTOTAL(9,P2:P37)","v":3117.6499999999992}]
[1,71247,0,401,"2010-04-11","2010-04-12",4010411888,4010411010,71247,44,44,451336,"JANE SKIRT- #501S        ",1,21.49,21.49,0,0,0,"CNRDS"]
[1,71247,0,401,"2010-04-11","2010-04-12",4010411888,4010411010,71247,44,44,501036,"LILAC DENIM - LIGHT FLAP ",1,34.5,34.5,0,0,0,"CNRDS"]
[1,71247,0,401,"2010-04-11","2010-04-12",4010411888,4010411010,71247,44,44,501039,"LILAC DENIM - DARK DOUBLE",-1,34.5,-34.5,0,0,0,"CNRDS"]
[1,71247,0,401,"2010-04-11","2010-04-12",4010411888,4010411010,71247,44,44,506653,"LILAC DENIM - DARK DOUBLE",-1,34.5,-34.5,0,0,0,"CNRDS"]
[1,71247,0,401,"2010-04-11","2010-04-12",4010411888,4010411010,71247,44,44,506654,"LILAC DENIM - DARK DOUBLE",1,34.5,34.5,0,0,0,"CNRDS"]
[1,71247,0,401,"2010-04-11","2010-04-12",4010411888,4010411010,71247,44,44,506655,"LILAC DENIM - DARK DOUBLE",2,34.5,69,0,0,0,"CNRDS"]
[1,71247,0,401,"2010-04-11","2010-04-12",4010411888,4010411010,71247,44,44,506937,"BELLA TOP #106A -BLK: XXL",1,24.93,24.93,0,0,0,"CNRDS"]
[1,71247,0,401,"2010-04-11","2010-04-12",4010411888,4010411010,71247,44,44,506992,"MAXI DRESS - S           ",-1,33.53,-33.53,0,0,0,"CNRDS"]
[1,71247,0,401,"2010-04-11","2010-04-12",4010411888,4010411010,71247,44,44,506993,"MAXI DRESS - M           ",1,33.53,33.53,0,0,0,"CNRDS"]
[1,71247,0,401,"2010-04-11","2010-04-12",4010411888,4010411010,71247,44,44,507008,"BELLA TOP #106A - BLK: S ",-1,24.93,-24.93,0,0,0,"CNRDS"]
[1,71247,0,401,"2010-04-11","2010-04-12",4010411888,4010411010,71247,44,44,507010,"BELLA TOP #106A - BLK: M ",3,24.93,74.790000000000006,0,0,0,"CNRDS"]
[1,71247,0,401,"2010-04-11","2010-04-12",4010411888,4010411010,71247,44,44,507011,"BELLA TOP #106A - BLK: L ",1,24.93,24.93,0,0,0,"CNRDS"]
[1,71247,0,401,"2010-04-11","2010-04-12",4010411888,4010411010,71247,44,44,507314,"BELLA TOP #106A- LILAC: S",3,24.93,74.790000000000006,0,0,0,"CNRDS"]
[1,71247,0,401,"2010-04-11","2010-04-12",4010411888,4010411010,71247,44,44,507316,"BELLA TOP #106A- LILAC: M",3,24.93,74.790000000000006,0,0,0,"CNRDS"]
[1,71247,0,401,"2010-04-11","2010-04-12",4010411888,4010411010,71247,44,44,507317,"BELLA TOP #106A- LILAC: L",1,24.93,24.93,0,0,0,"CNRDS"]
[1,71247,0,401,"2010-04-11","2010-04-12",4010411888,4010411010,71247,44,44,507319,"BELLA TOP #106A-LILAC:XXL",1,24.93,24.93,0,0,0,"CNRDS"]
[1,71247,0,401,"2010-04-11","2010-04-12",4010411888,4010411010,71247,44,44,507329,"TAYLOR TOP #099A- GREY: S",2,21.49,42.98,0,0,0,"CNRDS"]
[1,71247,0,401,"2010-04-11","2010-04-12",4010411888,4010411010,71247,44,44,507330,"TAYLOR TOP #099A- GREY: M",-1,21.49,-21.49,0,0,0,"CNRDS"]
[1,71247,0,401,"2010-04-11","2010-04-12",4010411888,4010411010,71247,44,44,507333,"TAYLOR TOP #099A-GREY: XL",-1,21.49,-21.49,0,0,0,"CNRDS"]
[1,71247,0,401,"2010-04-11","2010-04-12",4010411888,4010411010,71247,44,44,507334,"TAYLOR TOP #099A-GREY:XXL",1,21.49,21.49,0,0,0,"CNRDS"]
[1,71247,0,401,"2010-04-11","2010-04-12",4010411888,4010411010,71247,44,44,507335,"TAYLOR TOP #099A-OLIVE: S",-1,21.49,-21.49,0,0,0,"CNRDS"]
[1,71247,0,401,"2010-04-11","2010-04-12",4010411888,4010411010,71247,44,44,507340,"TAYLOR TOP #099A - OLIVE ",1,21.49,21.49,0,0,0,"CNRDS"]
[1,71247,0,401,"2010-04-11","2010-04-12",4010411888,4010411010,71247,44,44,507573,"NINA TOP #102A- WHITE: S ",1,24.07,24.07,0,0,0,"CNRDS"]
[1,71247,0,401,"2010-04-11","2010-04-12",4010411888,4010411010,71247,44,44,507583,"NINA TOP #102A-WHITE: XXL",1,24.07,24.07,0,0,0,"CNRDS"]
[1,71247,0,401,"2010-04-11","2010-04-12",4010411888,4010411010,71247,44,44,507584,"NINA TOP #102A - TURQUOIS",1,24.07,24.07,0,0,0,"CNRDS"]
[1,71247,0,401,"2010-04-11","2010-04-12",4010411888,4010411010,71247,44,44,507610,"HAILEY TOP #108A - GREEN ",1,21.49,21.49,0,0,0,"CNRDS"]
[1,71247,0,401,"2010-04-11","2010-04-12",4010411888,4010411010,71247,44,44,507612,"HAILEY TOP #108A - GREEN ",3,21.49,64.47,0,0,0,"CNRDS"]
[1,71247,0,401,"2010-04-11","2010-04-12",4010411888,4010411010,71247,44,44,507613,"HAILEY TOP #108A - GREEN ",5,21.49,107.45,0,0,0,"CNRDS"]
[1,71247,0,401,"2010-04-11","2010-04-12",4010411888,4010411010,71247,44,44,507614,"HAILEY TOP #108A - GREEN ",1,21.49,21.49,0,0,0,"CNRDS"]
[1,71247,0,401,"2010-04-11","2010-04-12",4010411888,4010411010,71247,44,44,507616,"HAILEY TOP #108A - GREEN ",1,21.49,21.49,0,0,0,"CNRDS"]
[1,71247,0,401,"2010-04-11","2010-04-12",4010411888,4010411010,71247,44,44,507620,"HAILEY TOP #108A - PINK F",-1,21.49,-21.49,0,0,0,"CNRDS"]
[1,71247,0,401,"2010-04-11","2010-04-12",4010411888,4010411010,71247,44,44,507621,"HAILEY TOP #108A - PINK F",1,21.49,21.49,0,0,0,"CNRDS"]
[1,71247,0,401,"2010-04-11","2010-04-12",4010411888,4010411010,71247,44,44,507622,"HAILEY TOP #108A - PINK F",4,21.49,85.96,0,0,0,"CNRDS"]
[1,71247,0,401,"2010-04-11","2010-04-12",4010411888,4010411010,71247,44,44,507623,"HAILEY TOP #108A - PINK F",1,21.49,21.49,0,0,0,"CNRDS"]
[1,71247,0,401,"2010-04-11","2010-04-12",4010411888,4010411010,71247,44,44,507644,"MEGAN TOP #100A- MOCHA: S",1,21.49,21.49,0,0,0,"CNRDS"]
[1,71247,0,401,"2010-04-11","2010-04-12",4010411888,4010411010,71247,44,44,507645,"MEGAN TOP #100A- MOCHA: M",1,21.49,21.49,0,0,0,"CNRDS"]
[1,71247,0,401,"2010-04-11","2010-04-12",4010411888,4010411010,71247,44,44,507651,"MEGAN TOP #100A- MOCHA: L",1,21.49,21.49,0,0,0,"CNRDS"]
[1,71247,0,401,"2010-04-11","2010-04-12",4010411888,4010411010,71247,44,44,507654,"MEGAN TOP #100A-MOCHA:XXL",1,21.49,21.49,0,0,0,"CNRDS"]
[null,null,null,"401 Total",null,null,null,null,null,null,null,null,null,null,null,{"$f":"SUBTOTAL(9,P39:P76)","v":913.1500000000002}]
[1,71247,0,487,"2010-04-11","2010-04-12",4870411888,4870411010,71247,44,44,451332,"LILAC DENIM- FLAP POCKET ",-1,34.5,-34.5,0,0,0,"CNRDS"]
[1,71247,0,487,"2010-04-11","2010-04-12",4870411888,4870411010,71247,44,44,451336,"JANE SKIRT- #501S        ",5,21.49,107.45,0,0,0,"CNRDS"]
[1,71247,0,487,"2010-04-11","2010-04-12",4870411888,4870411010,71247,44,44,501036,"LILAC DENIM - LIGHT FLAP ",3,34.5,103.5,0,0,0,"CNRDS"]
[1,71247,0,487,"2010-04-11","2010-04-12",4870411888,4870411010,71247,44,44,506653,"LILAC DENIM - DARK DOUBLE",2,34.5,69,0,0,0,"CNRDS"]
[1,71247,0,487,"2010-04-11","2010-04-12",4870411888,4870411010,71247,44,44,506654,"LILAC DENIM - DARK DOUBLE",1,34.5,34.5,0,0,0,"CNRDS"]
[1,71247,0,487,"2010-04-11","2010-04-12",4870411888,4870411010,71247,44,44,506657,"LILAC DENIM - DARK DOUBLE",2,34.5,69,0,0,0,"CNRDS"]
[1,71247,0,487,"2010-04-11","2010-04-12",4870411888,4870411010,71247,44,44,507011,"BELLA TOP #106A - BLK: L ",5,24.93,124.65,0,0,0,"CNRDS"]
[1,71247,0,487,"2010-04-11","2010-04-12",4870411888,4870411010,71247,44,44,507317,"BELLA TOP #106A- LILAC: L",2,24.93,49.86,0,0,0,"CNRDS"]
[1,71247,0,487,"2010-04-11","2010-04-12",4870411888,4870411010,71247,44,44,507330,"TAYLOR TOP #099A- GREY: M",2,21.49,42.98,0,0,0,"CNRDS"]
[1,71247,0,487,"2010-04-11","2010-04-12",4870411888,4870411010,71247,44,44,507337,"TAYLOR TOP #099A-OLIVE: M",1,21.49,21.49,0,0,0,"CNRDS"]
[1,71247,0,487,"2010-04-11","2010-04-12",4870411888,4870411010,71247,44,44,507338,"TAYLOR TOP #099A-OLIVE: L",1,21.49,21.49,0,0,0,"CNRDS"]
[1,71247,0,487,"2010-04-11","2010-04-12",4870411888,4870411010,71247,44,44,507573,"NINA TOP #102A- WHITE: S ",1,24.07,24.07,0,0,0,"CNRDS"]
[1,71247,0,487,"2010-04-11","2010-04-12",4870411888,4870411010,71247,44,44,507574,"NINA TOP #102A- WHITE: M ",1,24.07,24.07,0,0,0,"CNRDS"]
[1,71247,0,487,"2010-04-11","2010-04-12",4870411888,4870411010,71247,44,44,507588,"NINA TOP #102A - TURQUOIS",1,24.07,24.07,0,0,0,"CNRDS"]
[1,71247,0,487,"2010-04-11","2010-04-12",4870411888,4870411010,71247,44,44,507610,"HAILEY TOP #108A - GREEN ",1,21.49,21.49,0,0,0,"CNRDS"]
[1,71247,0,487,"2010-04-11","2010-04-12",4870411888,4870411010,71247,44,44,507612,"HAILEY TOP #108A - GREEN ",2,21.49,42.98,0,0,0,"CNRDS"]
[1,71247,0,487,"2010-04-11","2010-04-12",4870411888,4870411010,71247,44,44,507613,"HAILEY TOP #108A - GREEN ",1,21.49,21.49,0,0,0,"CNRDS"]
[1,71247,0,487,"2010-04-11","2010-04-12",4870411888,4870411010,71247,44,44,507614,"HAILEY TOP #108A - GREEN ",1,21.49,21.49,0,0,0,"CNRDS"]
[1,71247,0,487,"2010-04-11","2010-04-12",4870411888,4870411010,71247,44,44,507617,"HAILEY TOP #108A - PINK F",1,21.49,21.49,0,0,0,"CNRDS"]
[1,71247,0,487,"2010-04-11","2010-04-12",4870411888,4870411010,71247,44,44,507620,"HAILEY TOP #108A - PINK F",3,21.49,64.47,0,0,0,"CNRDS"]
[1,71247,0,487,"2010-04-11","2010-04-12",4870411888,4870411010,71247,44,44,507621,"HAILEY TOP #108A - PINK F",2,21.49,42.98,0,0,0,"CNRDS"]
[1,71247,0,487,"2010-04-11","2010-04-12",4870411888,4870411010,71247,44,44,507622,"HAILEY TOP #108A - PINK F",2,21.49,42.98,0,0,0,"CNRDS"]
[null,null,null,"487 Total",null,null,null,null,null,null,null,null,null,null,null,{"$f":"SUBTOTAL(9,P78:P99)","v":961.00000000000034}]
[1,71247,0,761,"2010-04-11","2010-04-12",7610411888,7610411010,71247,44,44,451336,"JANE SKIRT- #501S        ",3,21.49,64.47,0,0,0,"CNRDS"]
[1,71247,0,761,"2010-04-11","2010-04-12",7610411888,7610411010,71247,44,44,501036,"LILAC DENIM - LIGHT FLAP ",5,34.5,172.5,0,0,0,"CNRDS"]
[1,71247,0,761,"2010-04-11","2010-04-12",7610411888,7610411010,71247,44,44,506937,"BELLA TOP #106A -BLK: XXL",1,24.93,24.93,0,0,0,"CNRDS"]
[1,71247,0,761,"2010-04-11","2010-04-12",7610411888,7610411010,71247,44,44,506993,"MAXI DRESS - M           ",1,33.53,33.53,0,0,0,"CNRDS"]
[1,71247,0,761,"2010-04-11","2010-04-12",7610411888,7610411010,71247,44,44,507010,"BELLA TOP #106A - BLK: M ",3,24.93,74.790000000000006,0,0,0,"CNRDS"]
[1,71247,0,761,"2010-04-11","2010-04-12",7610411888,7610411010,71247,44,44,507011,"BELLA TOP #106A - BLK: L ",2,24.93,49.86,0,0,0,"CNRDS"]
[1,71247,0,761,"2010-04-11","2010-04-12",7610411888,7610411010,71247,44,44,507314,"BELLA TOP #106A- LILAC: S",2,24.93,49.86,0,0,0,"CNRDS"]
[1,71247,0,761,"2010-04-11","2010-04-12",7610411888,7610411010,71247,44,44,507316,"BELLA TOP #106A- LILAC: M",1,24.93,24.93,0,0,0,"CNRDS"]
[1,71247,0,761,"2010-04-11","2010-04-12",7610411888,7610411010,71247,44,44,507317,"BELLA TOP #106A- LILAC: L",2,24.93,49.86,0,0,0,"CNRDS"]
[1,71247,0,761,"2010-04-11","2010-04-12",7610411888,7610411010,71247,44,44,507318,"BELLA TOP #106A-LILAC: XL",1,24.93,24.93,0,0,0,"CNRDS"]
[1,71247,0,761,"2010-04-11","2010-04-12",7610411888,7610411010,71247,44,44,507335,"TAYLOR TOP #099A-OLIVE: S",2,21.49,42.98,0,0,0,"CNRDS"]
[1,71247,0,761,"2010-04-11","2010-04-12",7610411888,7610411010,71247,44,44,507337,"TAYLOR TOP #099A-OLIVE: M",6,21.49,128.94,0,0,0,"CNRDS"]
[1,71247,0,761,"2010-04-11","2010-04-12",7610411888,7610411010,71247,44,44,507338,"TAYLOR TOP #099A-OLIVE: L",-1,21.49,-21.49,0,0,0,"CNRDS"]
[1,71247,0,761,"2010-04-11","2010-04-12",7610411888,7610411010,71247,44,44,507580,"NINA TOP #102A- WHITE: XL",1,24.07,24.07,0,0,0,"CNRDS"]
[1,71247,0,761,"2010-04-11","2010-04-12",7610411888,7610411010,71247,44,44,507610,"HAILEY TOP #108A - GREEN ",1,21.49,21.49,0,0,0,"CNRDS"]
[1,71247,0,761,"2010-04-11","2010-04-12",7610411888,7610411010,71247,44,44,507612,"HAILEY TOP #108A - GREEN ",6,21.49,128.94,0,0,0,"CNRDS"]
[1,71247,0,761,"2010-04-11","2010-04-12",7610411888,7610411010,71247,44,44,507614,"HAILEY TOP #108A - GREEN ",1,21.49,21.49,0,0,0,"CNRDS"]
[1,71247,0,761,"2010-04-11","2010-04-12",7610411888,7610411010,71247,44,44,507617,"HAILEY TOP #108A - PINK F",6,21.49,128.94,0,0,0,"CNRDS"]
[1,71247,0,761,"2010-04-11","2010-04-12",7610411888,7610411010,71247,44,44,507620,"HAILEY TOP #108A - PINK F",2,21.49,42.98,0,0,0,"CNRDS"]
[1,71247,0,761,"2010-04-11","2010-04-12",7610411888,7610411010,71247,44,44,507621,"HAILEY TOP #108A - PINK F",3,21.49,64.47,0,0,0,"CNRDS"]
[1,71247,0,761,"2010-04-11","2010-04-12",7610411888,7610411010,71247,44,44,507622,"HAILEY TOP #108A - PINK F",2,21.49,42.98,0,0,0,"CNRDS"]
[1,71247,0,761,"2010-04-11","2010-04-12",7610411888,7610411010,71247,44,44,507623,"HAILEY TOP #108A - PINK F",2,21.49,42.98,0,0,0,"CNRDS"]
[1,71247,0,761,"2010-04-11","2010-04-12",7610411888,7610411010,71247,44,44,509642,"LILAC DENIM- FLAP POCKET ",-1,34.5,-34.5,0,0,0,"CNRDS"]
[1,71247,0,761,"2010-04-11","2010-04-12",7610411888,7610411010,71247,44,44,509645,"LILAC DENIM- FLAP POCKET ",-1,34.5,-34.5,0,0,0,"CNRDS"]
[1,71247,0,761,"2010-04-11","2010-04-12",7610411888,7610411010,71247,44,44,509646,"LILAC DENIM- FLAP POCKET ",1,34.5,34.5,0,0,0,"CNRDS"]
[1,71247,0,761,"2010-04-11","2010-04-12",7610411888,7610411010,71247,44,44,509648,"LILAC DENIM- SCOOP POCKET",-1,34.5,-34.5,0,0,0,"CNRDS"]
[1,71247,0,761,"2010-04-11","2010-04-12",7610411888,7610411010,71247,44,44,509649,"LILAC DENIM- SCOOP POCKET",2,34.5,69,0,0,0,"CNRDS"]
[1,71247,0,761,"2010-04-11","2010-04-12",7610411888,7610411010,71247,44,44,509650,"LILAC DENIM- SCOOP POCKET",-1,34.5,-34.5,0,0,0,"CNRDS"]
[1,71247,0,761,"2010-04-11","2010-04-12",7610411888,7610411010,71247,44,44,509652,"LILAC DENIM- SCOOP POCKET",2,34.5,69,0,0,0,"CNRDS"]
[1,71247,0,761,"2010-04-11","2010-04-12",7610411888,7610411010,71247,44,44,510757,"LILAC DENIM- FLAP POCKET ",1,34.5,34.5,0,0,0,"CNRDS"]
[1,71247,0,761,"2010-04-11","2010-04-12",7610411888,7610411010,71247,44,44,510758,"LILAC DENIM- SCOOP POCKET",2,34.5,69,0,0,0,"CNRDS"]
[null,null,null,"761 Total",null,null,null,null,null,null,null,null,null,null,null,{"$f":"SUBTOTAL(9,P101:P131)","v":1376.43}]
[1,71247,0,781,"2010-04-11","2010-04-12",7810411888,7810411010,71247,44,44,501036,"LILAC DENIM - LIGHT FLAP ",2,34.5,69,0,0,0,"CNRDS"]
[1,71247,0,781,"2010-04-11","2010-04-12",7810411888,7810411010,71247,44,44,501039,"LILAC DENIM - DARK DOUBLE",2,34.5,69,0,0,0,"CNRDS"]
[1,71247,0,781,"2010-04-11","2010-04-12",7810411888,7810411010,71247,44,44,506653,"LILAC DENIM - DARK DOUBLE",1,34.5,34.5,0,0,0,"CNRDS"]
[1,71247,0,781,"2010-04-11","2010-04-12",7810411888,7810411010,71247,44,44,506654,"LILAC DENIM - DARK DOUBLE",-1,34.5,-34.5,0,0,0,"CNRDS"]
[1,71247,0,781,"2010-04-11","2010-04-12",7810411888,7810411010,71247,44,44,506657,"LILAC DENIM - DARK DOUBLE",1,34.5,34.5,0,0,0,"CNRDS"]
[1,71247,0,781,"2010-04-11","2010-04-12",7810411888,7810411010,71247,44,44,507010,"BELLA TOP #106A - BLK: M ",1,24.93,24.93,0,0,0,"CNRDS"]
[1,71247,0,781,"2010-04-11","2010-04-12",7810411888,7810411010,71247,44,44,507013,"BELLA TOP #106A - BLK: XL",2,24.93,49.86,0,0,0,"CNRDS"]
[1,71247,0,781,"2010-04-11","2010-04-12",7810411888,7810411010,71247,44,44,507317,"BELLA TOP #106A- LILAC: L",1,24.93,24.93,0,0,0,"CNRDS"]
[1,71247,0,781,"2010-04-11","2010-04-12",7810411888,7810411010,71247,44,44,507337,"TAYLOR TOP #099A-OLIVE: M",1,21.49,21.49,0,0,0,"CNRDS"]
[1,71247,0,781,"2010-04-11","2010-04-12",7810411888,7810411010,71247,44,44,507338,"TAYLOR TOP #099A-OLIVE: L",-1,21.49,-21.49,0,0,0,"CNRDS"]
[1,71247,0,781,"2010-04-11","2010-04-12",7810411888,7810411010,71247,44,44,507612,"HAILEY TOP #108A - GREEN ",1,21.49,21.49,0,0,0,"CNRDS"]
[1,71247,0,781,"2010-04-11","2010-04-12",7810411888,7810411010,71247,44,44,507645,"MEGAN TOP #100A- MOCHA: M",1,21.49,21.49,0,0,0,"CNRDS"]
[1,71247,0,781,"2010-04-11","2010-04-12",7810411888,7810411010,71247,44,44,507653,"MEGAN TOP #100A-MOCHA: XL",2,21.49,42.98,0,0,0,"CNRDS"]
[null,null,null,"781 Total",null,null,null,null,null,null,null,null,null,null,null,{"$f":"SUBTOTAL(9,P133:P145)","v":358.18000000000006}]
[null,null,null,"Grand Total",null,null,null,null,null,null,null,null,null,null,null,{"$f":"SUBTOTAL(9,P2:P145)","v":6726.4099999999889}]

{"sheet":"Sales by UPC Codes","index":7,"n_rows":300,"n_cols":6,"rows_kept":300,"cut":false,"hidden":false,"merged":[]}
["Item #","Style","Color","Size","UPC Code","Note:  you can enter new info (items) in green boxes starting in A50."]
[506992,"Maxi Dress","Black","S",737566996187]
[506993,"Maxi Dress","Black","M",737566996170]
[507003,"Maxi Dress","Black","L",737566996163]
[507004,"Maxi Dress","Black","XL",737566996156]
[507008,"Bella Top","Black","S",737566996132]
[507010,"Bella Top","Black","M",737566996125]
[507011,"Bella Top","Black","L",737566996118]
[507013,"Bella Top","Black","XL",737566996101]
[506937,"Bella Top","Black","XXL",737566996095]
[507314,"Bella Top","Lilac","S",737566996033]
[507316,"Bella Top","Lilac","M",737566996026]
[507317,"Bella Top","Lilac","L",737566996019]
[507318,"Bella Top","Lilac","XL",737566996002]
[507319,"Bella Top","Lilac","XXL",737566995999]
[507335,"Taylor Top","Olive","S",737566995883]
[507337,"Taylor Top","Olive","M",737566995876]
[507338,"Taylor Top","Olive","L",737566995869]
[507339,"Taylor Top","Olive","XL",737566995852]
[507340,"Taylor Top","Olive","XXL",737566995845]
[507329,"Taylor Top","Silver","S",737566995937]
[507330,"Taylor Top","Silver","M",737566995920]
[507332,"Taylor Top","Silver","L",737566995913]
[507333,"Taylor Top","Silver","XL",737566995906]
[507334,"Taylor Top","Silver","XXL",737566995890]
[507573,"Nina Top","White","S",737566995739]
[507574,"Nina Top","White","M",737566995722]
[507579,"Nina Top","White","L",737566995715]
[507580,"Nina Top","White","XL",737566995708]
[507583,"Nina Top","White","XXL",737566995692]
[507584,"Nina Top","Turquoise","S",737566995685]
[507588,"Nina Top","Turquoise","M",737566995678]
[507590,"Nina Top","Turquoise","L",737566995661]
[507591,"Nina Top","Turquoise","XL",737566995654]
[507592,"Nina Top","Turquoise","XXL",737566995647]
[507610,"Hailey Top","Green Dot","S",737566995531]
[507612,"Hailey Top","Green Dot","M",737566995524]
[507613,"Hailey Top","Green Dot","L",737566995517]
[507614,"Hailey Top","Green Dot","XL",737566995500]
[507616,"Hailey Top","Green Dot","XXL",737566995494]
[507617,"Hailey Top","Pink Flower","S",737566995487]
[507620,"Hailey Top","Pink Flower","M",737566995470]
[507621,"Hailey Top","Pink Flower","L",737566995463]
[507622,"Hailey Top","Pink Flower","XL",737566995456]
[507623,"Hailey Top","Pink Flower","XXL",737566995449]
[507637,"Megan Top","Green","S",737566995333]
[507638,"Megan Top","Green","M",737566995326]
[507639,"Megan Top","Green","L",737566995319]
[507641,"Megan Top","Green","XL",737566995302]
[null,"Ruffle Skirt","Black","S"]
[null,"Ruffle Skirt","Black","M","waiting for numbers"]
[null,"Ruffle Skirt","Black","L"]
[null,"Ruffle Skirt","Black","XL"]
[null,"Future Item"]
[null,"Future Item"]
[null,"Future Item"]
[null,"Future Item"]
[null,"Future Item"]
[null,"Future Item"]
[null,"Future Item"]
[null,"Future Item"]
[null,"Future Item"]
[null,"Future Item"]
[null,"Future Item"]
[null,"Future Item"]
[null,"Future Item"]
[null,"Future Item"]
[null,"Future Item"]
[null,"Future Item"]
[null,"Future Item"]
[null,"Future Item"]
[null,"Future Item"]
[null,"Future Item"]
[null,"Future Item"]
[null,"Future Item"]
[null,"Future Item"]
[null,"Future Item"]
[null,"Future Item"]
[null,"Future Item"]
[null,"Future Item"]
[null,"Future Item"]
[null,"Future Item"]
[null,"Future Item"]
[null,"Future Item"]
[null,"Future Item"]
[null,"Future Item"]
[null,"Future Item"]
[null,"Future Item"]
[null,"Future Item"]
[null,"Future Item"]
[null,"Future Item"]
[null,"Future Item"]
[null,"Future Item"]
[null,"Future Item"]
[null,"Future Item"]
[null,"Future Item"]
[null,"Future Item"]
[null,"Future Item"]
[null,"Future Item"]
[null,"Future Item"]
[null,"Future Item"]
[null,"Future Item"]
[null,"Future Item"]
[null,"Future Item"]
[null,"Future Item"]
[null,"Future Item"]
[null,"Future Item"]
[null,"Future Item"]
[null,"Future Item"]
[null,"Future Item"]
[null,"Future Item"]
[null,"Future Item"]
[null,"Future Item"]
[null,"Future Item"]
[null,"Future Item"]
[null,"Future Item"]
[null,"Future Item"]
[null,"Future Item"]
[null,"Future Item"]
[null,"Future Item"]
[null,"Future Item"]
[null,"Future Item"]
[null,"Future Item"]
[null,"Future Item"]
[null,"Future Item"]
[null,"Future Item"]
[null,"Future Item"]
[null,"Future Item"]
[null,"Future Item"]
[null,"Future Item"]
[null,"Future Item"]
[null,"Future Item"]
[null,"Future Item"]
[null,"Future Item"]
[null,"Future Item"]
[null,"Future Item"]
[null,"Future Item"]
[null,"Future Item"]
[null,"Future Item"]
[null,"Future Item"]
[null,"Future Item"]
[null,"Future Item"]
[null,"Future Item"]
[null,"Future Item"]
[null,"Future Item"]
[null,"Future Item"]
[null,"Future Item"]
[null,"Future Item"]
[null,"Future Item"]
[null,"Future Item"]
[null,"Future Item"]
[null,"Future Item"]
[null,"Future Item"]
[null,"Future Item"]
[null,"Future Item"]
[null,"Future Item"]
[null,"Future Item"]
[null,"Future Item"]
[null,"Future Item"]
[null,"Future Item"]
[null,"Future Item"]
[null,"Future Item"]
[null,"Future Item"]
[null,"Future Item"]
[null,"Future Item"]
[null,"Future Item"]
[null,"Future Item"]
[null,"Future Item"]
[null,"Future Item"]
[null,"Future Item"]
[null,"Future Item"]
[null,"Future Item"]
[null,"Future Item"]
[null,"Future Item"]
[null,"Future Item"]
[null,"Future Item"]
[null,"Future Item"]
[null,"Future Item"]
[null,"Future Item"]
[null,"Future Item"]
[null,"Future Item"]
[null,"Future Item"]
[null,"Future Item"]
[null,"Future Item"]
[null,"Future Item"]
[null,"Future Item"]
[null,"Future Item"]
[null,"Future Item"]
[null,"Future Item"]
[null,"Future Item"]
[null,"Future Item"]
[null,"Future Item"]
[null,"Future Item"]
[null,"Future Item"]
[null,"Future Item"]
[null,"Future Item"]
[null,"Future Item"]
[null,"Future Item"]
[null,"Future Item"]
[null,"Future Item"]
[null,"Future Item"]
[null,"Future Item"]
[null,"Future Item"]
[null,"Future Item"]
[null,"Future Item"]
[null,"Future Item"]
[null,"Future Item"]
[null,"Future Item"]
[null,"Future Item"]
[null,"Future Item"]
[null,"Future Item"]
[null,"Future Item"]
[null,"Future Item"]
[null,"Future Item"]
[null,"Future Item"]
[null,"Future Item"]
[null,"Future Item"]
[null,"Future Item"]
[null,"Future Item"]
[null,"Future Item"]
[null,"Future Item"]
[null,"Future Item"]
[null,"Future Item"]
[null,"Future Item"]
[null,"Future Item"]
[null,"Future Item"]
[null,"Future Item"]
[null,"Future Item"]
[null,"Future Item"]
[null,"Future Item"]
[null,"Future Item"]
[null,"Future Item"]
[null,"Future Item"]
[null,"Future Item"]
[null,"Future Item"]
[null,"Future Item"]
[null,"Future Item"]
[null,"Future Item"]
[null,"Future Item"]
[null,"Future Item"]
[null,"Future Item"]
[null,"Future Item"]
[null,"Future Item"]
[null,"Future Item"]
[null,"Future Item"]
[null,"Future Item"]
[null,"Future Item"]
[null,"Future Item"]
[null,"Future Item"]
[null,"Future Item"]
[null,"Future Item"]
[null,"Future Item"]
[null,"Future Item"]
[null,"Future Item"]
[null,"Future Item"]
[null,"Future Item"]
[null,"Future Item"]
[null,"Future Item"]
[null,"Future Item"]
[null,"Future Item"]
[null,"Future Item"]
[null,"Future Item"]
[null,"Future Item"]
[null,"Future Item"]
[null,"Future Item"]
[null,"Future Item"]
[null,"Future Item"]
[null,"Future Item"]
[null,"Future Item"]
[null,"Future Item"]
[null,"Future Item"]
[null,"Future Item"]
[null,"Future Item"]
[null,"Future Item"]
[null,"Future Item"]
[null,"Future Item"]
[null,"Future Item"]
[null,"Future Item"]
[null,"Future Item"]
[null,"Future Item"]
[null,"Future Item"]
[null,"Future Item"]
[null,"Future Item"]
[null,"Future Item"]
[null,"Future Item"]
[null,"Future Item"]
[null,"Future Item"]
[null,"Future Item"]
[null,"Future Item"]
[null,"Future Item"]
[null,"Future Item"]
[null,"Future Item"]
[null,"Future Item"]
[null,"Future Item"]
[null,"Future Item"]
[null,"Future Item"]
[null,"Future Item"]
[null,"Future Item"]
[null,"Future Item"]
[null,"Future Item"]

{"sheet":"Testing Puposes Costco Data","index":8,"n_rows":141,"n_cols":20,"rows_kept":141,"cut":false,"hidden":false,"merged":[]}
["company","ap-vendor","ap-suffix","warehouse","sales-date","payment-summary","po-number","invoice-num","bba-vendor","bba-suffix","department","item","item-description","quanitity","unit-cost","extended-cost","QST","HST","GST","kiosk"]
[1,71247,0,110,"2010-04-11","2010-04-12",1100411888,1100411010,71247,44,44,451333,"LILAC DENIM- SCOOP POCKET",1,34.5,34.5,0,0,0,"CNRDS"]
[1,71247,0,110,"2010-04-11","2010-04-12",1100411888,1100411010,71247,44,44,451336,"JANE SKIRT- #501S        ",6,21.49,128.94,0,0,0,"CNRDS"]
[1,71247,0,110,"2010-04-11","2010-04-12",1100411888,1100411010,71247,44,44,501036,"LILAC DENIM - LIGHT FLAP ",6,34.5,207,0,0,0,"CNRDS"]
[1,71247,0,110,"2010-04-11","2010-04-12",1100411888,1100411010,71247,44,44,501039,"LILAC DENIM - DARK DOUBLE",23,34.5,793.5,0,0,0,"CNRDS"]
[1,71247,0,110,"2010-04-11","2010-04-12",1100411888,1100411010,71247,44,44,506653,"LILAC DENIM - DARK DOUBLE",3,34.5,103.5,0,0,0,"CNRDS"]
[1,71247,0,110,"2010-04-11","2010-04-12",1100411888,1100411010,71247,44,44,506654,"LILAC DENIM - DARK DOUBLE",5,34.5,172.5,0,0,0,"CNRDS"]
[1,71247,0,110,"2010-04-11","2010-04-12",1100411888,1100411010,71247,44,44,506655,"LILAC DENIM - DARK DOUBLE",4,34.5,138,0,0,0,"CNRDS"]
[1,71247,0,110,"2010-04-11","2010-04-12",1100411888,1100411010,71247,44,44,506657,"LILAC DENIM - DARK DOUBLE",1,34.5,34.5,0,0,0,"CNRDS"]
[1,71247,0,110,"2010-04-11","2010-04-12",1100411888,1100411010,71247,44,44,506992,"MAXI DRESS - S           ",1,33.53,33.53,0,0,0,"CNRDS"]
[1,71247,0,110,"2010-04-11","2010-04-12",1100411888,1100411010,71247,44,44,507004,"MAXI DRESS - XL          ",1,33.53,33.53,0,0,0,"CNRDS"]
[1,71247,0,110,"2010-04-11","2010-04-12",1100411888,1100411010,71247,44,44,507008,"BELLA TOP #106A - BLK: S ",4,24.93,99.72,0,0,0,"CNRDS"]
[1,71247,0,110,"2010-04-11","2010-04-12",1100411888,1100411010,71247,44,44,507010,"BELLA TOP #106A - BLK: M ",3,24.93,74.790000000000006,0,0,0,"CNRDS"]
[1,71247,0,110,"2010-04-11","2010-04-12",1100411888,1100411010,71247,44,44,507011,"BELLA TOP #106A - BLK: L ",3,24.93,74.790000000000006,0,0,0,"CNRDS"]
[1,71247,0,110,"2010-04-11","2010-04-12",1100411888,1100411010,71247,44,44,507013,"BELLA TOP #106A - BLK: XL",2,24.93,49.86,0,0,0,"CNRDS"]
[1,71247,0,110,"2010-04-11","2010-04-12",1100411888,1100411010,71247,44,44,507314,"BELLA TOP #106A- LILAC: S",1,24.93,24.93,0,0,0,"CNRDS"]
[1,71247,0,110,"2010-04-11","2010-04-12",1100411888,1100411010,71247,44,44,507317,"BELLA TOP #106A- LILAC: L",3,24.93,74.790000000000006,0,0,0,"CNRDS"]
[1,71247,0,110,"2010-04-11","2010-04-12",1100411888,1100411010,71247,44,44,507318,"BELLA TOP #106A-LILAC: XL",1,24.93,24.93,0,0,0,"CNRDS"]
[1,71247,0,110,"2010-04-11","2010-04-12",1100411888,1100411010,71247,44,44,507329,"TAYLOR TOP #099A- GREY: S",4,21.49,85.96,0,0,0,"CNRDS"]
[1,71247,0,110,"2010-04-11","2010-04-12",1100411888,1100411010,71247,44,44,507330,"TAYLOR TOP #099A- GREY: M",2,21.49,42.98,0,0,0,"CNRDS"]
[1,71247,0,110,"2010-04-11","2010-04-12",1100411888,1100411010,71247,44,44,507332,"TAYLOR TOP #099A- GREY: L",2,21.49,42.98,0,0,0,"CNRDS"]
[1,71247,0,110,"2010-04-11","2010-04-12",1100411888,1100411010,71247,44,44,507333,"TAYLOR TOP #099A-GREY: XL",2,21.49,42.98,0,0,0,"CNRDS"]
[1,71247,0,110,"2010-04-11","2010-04-12",1100411888,1100411010,71247,44,44,507334,"TAYLOR TOP #099A-GREY:XXL",2,21.49,42.98,0,0,0,"CNRDS"]
[1,71247,0,110,"2010-04-11","2010-04-12",1100411888,1100411010,71247,44,44,507573,"NINA TOP #102A- WHITE: S ",2,24.07,48.14,0,0,0,"CNRDS"]
[1,71247,0,110,"2010-04-11","2010-04-12",1100411888,1100411010,71247,44,44,507574,"NINA TOP #102A- WHITE: M ",2,24.07,48.14,0,0,0,"CNRDS"]
[1,71247,0,110,"2010-04-11","2010-04-12",1100411888,1100411010,71247,44,44,507583,"NINA TOP #102A-WHITE: XXL",2,24.07,48.14,0,0,0,"CNRDS"]
[1,71247,0,110,"2010-04-11","2010-04-12",1100411888,1100411010,71247,44,44,507584,"NINA TOP #102A - TURQUOIS",1,24.07,24.07,0,0,0,"CNRDS"]
[1,71247,0,110,"2010-04-11","2010-04-12",1100411888,1100411010,71247,44,44,507590,"NINA TOP #102A - TURQUOIS",2,24.07,48.14,0,0,0,"CNRDS"]
[1,71247,0,110,"2010-04-11","2010-04-12",1100411888,1100411010,71247,44,44,507592,"NINA TOP #102A - TURQUOIS",1,24.07,24.07,0,0,0,"CNRDS"]
[1,71247,0,110,"2010-04-11","2010-04-12",1100411888,1100411010,71247,44,44,507610,"HAILEY TOP #108A - GREEN ",2,21.49,42.98,0,0,0,"CNRDS"]
[1,71247,0,110,"2010-04-11","2010-04-12",1100411888,1100411010,71247,44,44,507612,"HAILEY TOP #108A - GREEN ",8,21.49,171.92,0,0,0,"CNRDS"]
[1,71247,0,110,"2010-04-11","2010-04-12",1100411888,1100411010,71247,44,44,507613,"HAILEY TOP #108A - GREEN ",2,21.49,42.98,0,0,0,"CNRDS"]
[1,71247,0,110,"2010-04-11","2010-04-12",1100411888,1100411010,71247,44,44,507616,"HAILEY TOP #108A - GREEN ",1,21.49,21.49,0,0,0,"CNRDS"]
[1,71247,0,110,"2010-04-11","2010-04-12",1100411888,1100411010,71247,44,44,507617,"HAILEY TOP #108A - PINK F",5,21.49,107.45,0,0,0,"CNRDS"]
[1,71247,0,110,"2010-04-11","2010-04-12",1100411888,1100411010,71247,44,44,507620,"HAILEY TOP #108A - PINK F",3,21.49,64.47,0,0,0,"CNRDS"]
[1,71247,0,110,"2010-04-11","2010-04-12",1100411888,1100411010,71247,44,44,507621,"HAILEY TOP #108A - PINK F",1,21.49,21.49,0,0,0,"CNRDS"]
[1,71247,0,110,"2010-04-11","2010-04-12",1100411888,1100411010,71247,44,44,507622,"HAILEY TOP #108A - PINK F",2,21.49,42.98,0,0,0,"CNRDS"]
[1,71247,0,401,"2010-04-11","2010-04-12",4010411888,4010411010,71247,44,44,451336,"JANE SKIRT- #501S        ",1,21.49,21.49,0,0,0,"CNRDS"]
[1,71247,0,401,"2010-04-11","2010-04-12",4010411888,4010411010,71247,44,44,501036,"LILAC DENIM - LIGHT FLAP ",1,34.5,34.5,0,0,0,"CNRDS"]
[1,71247,0,401,"2010-04-11","2010-04-12",4010411888,4010411010,71247,44,44,501039,"LILAC DENIM - DARK DOUBLE",-1,34.5,-34.5,0,0,0,"CNRDS"]
[1,71247,0,401,"2010-04-11","2010-04-12",4010411888,4010411010,71247,44,44,506653,"LILAC DENIM - DARK DOUBLE",-1,34.5,-34.5,0,0,0,"CNRDS"]
[1,71247,0,401,"2010-04-11","2010-04-12",4010411888,4010411010,71247,44,44,506654,"LILAC DENIM - DARK DOUBLE",1,34.5,34.5,0,0,0,"CNRDS"]
[1,71247,0,401,"2010-04-11","2010-04-12",4010411888,4010411010,71247,44,44,506655,"LILAC DENIM - DARK DOUBLE",2,34.5,69,0,0,0,"CNRDS"]
[1,71247,0,401,"2010-04-11","2010-04-12",4010411888,4010411010,71247,44,44,506937,"BELLA TOP #106A -BLK: XXL",1,24.93,24.93,0,0,0,"CNRDS"]
[1,71247,0,401,"2010-04-11","2010-04-12",4010411888,4010411010,71247,44,44,506992,"MAXI DRESS - S           ",-1,33.53,-33.53,0,0,0,"CNRDS"]
[1,71247,0,401,"2010-04-11","2010-04-12",4010411888,4010411010,71247,44,44,506993,"MAXI DRESS - M           ",1,33.53,33.53,0,0,0,"CNRDS"]
[1,71247,0,401,"2010-04-11","2010-04-12",4010411888,4010411010,71247,44,44,507008,"BELLA TOP #106A - BLK: S ",-1,24.93,-24.93,0,0,0,"CNRDS"]
[1,71247,0,401,"2010-04-11","2010-04-12",4010411888,4010411010,71247,44,44,507010,"BELLA TOP #106A - BLK: M ",3,24.93,74.790000000000006,0,0,0,"CNRDS"]
[1,71247,0,401,"2010-04-11","2010-04-12",4010411888,4010411010,71247,44,44,507011,"BELLA TOP #106A - BLK: L ",1,24.93,24.93,0,0,0,"CNRDS"]
[1,71247,0,401,"2010-04-11","2010-04-12",4010411888,4010411010,71247,44,44,507314,"BELLA TOP #106A- LILAC: S",3,24.93,74.790000000000006,0,0,0,"CNRDS"]
[1,71247,0,401,"2010-04-11","2010-04-12",4010411888,4010411010,71247,44,44,507316,"BELLA TOP #106A- LILAC: M",3,24.93,74.790000000000006,0,0,0,"CNRDS"]
[1,71247,0,401,"2010-04-11","2010-04-12",4010411888,4010411010,71247,44,44,507317,"BELLA TOP #106A- LILAC: L",1,24.93,24.93,0,0,0,"CNRDS"]
[1,71247,0,401,"2010-04-11","2010-04-12",4010411888,4010411010,71247,44,44,507319,"BELLA TOP #106A-LILAC:XXL",1,24.93,24.93,0,0,0,"CNRDS"]
[1,71247,0,401,"2010-04-11","2010-04-12",4010411888,4010411010,71247,44,44,507329,"TAYLOR TOP #099A- GREY: S",2,21.49,42.98,0,0,0,"CNRDS"]
[1,71247,0,401,"2010-04-11","2010-04-12",4010411888,4010411010,71247,44,44,507330,"TAYLOR TOP #099A- GREY: M",-1,21.49,-21.49,0,0,0,"CNRDS"]
[1,71247,0,401,"2010-04-11","2010-04-12",4010411888,4010411010,71247,44,44,507333,"TAYLOR TOP #099A-GREY: XL",-1,21.49,-21.49,0,0,0,"CNRDS"]
[1,71247,0,401,"2010-04-11","2010-04-12",4010411888,4010411010,71247,44,44,507334,"TAYLOR TOP #099A-GREY:XXL",1,21.49,21.49,0,0,0,"CNRDS"]
[1,71247,0,401,"2010-04-11","2010-04-12",4010411888,4010411010,71247,44,44,507335,"TAYLOR TOP #099A-OLIVE: S",-1,21.49,-21.49,0,0,0,"CNRDS"]
[1,71247,0,401,"2010-04-11","2010-04-12",4010411888,4010411010,71247,44,44,507340,"TAYLOR TOP #099A - OLIVE ",1,21.49,21.49,0,0,0,"CNRDS"]
[1,71247,0,401,"2010-04-11","2010-04-12",4010411888,4010411010,71247,44,44,507573,"NINA TOP #102A- WHITE: S ",1,24.07,24.07,0,0,0,"CNRDS"]
[1,71247,0,401,"2010-04-11","2010-04-12",4010411888,4010411010,71247,44,44,507583,"NINA TOP #102A-WHITE: XXL",1,24.07,24.07,0,0,0,"CNRDS"]
[1,71247,0,401,"2010-04-11","2010-04-12",4010411888,4010411010,71247,44,44,507584,"NINA TOP #102A - TURQUOIS",1,24.07,24.07,0,0,0,"CNRDS"]
[1,71247,0,401,"2010-04-11","2010-04-12",4010411888,4010411010,71247,44,44,507610,"HAILEY TOP #108A - GREEN ",1,21.49,21.49,0,0,0,"CNRDS"]
[1,71247,0,401,"2010-04-11","2010-04-12",4010411888,4010411010,71247,44,44,507612,"HAILEY TOP #108A - GREEN ",3,21.49,64.47,0,0,0,"CNRDS"]
[1,71247,0,401,"2010-04-11","2010-04-12",4010411888,4010411010,71247,44,44,507613,"HAILEY TOP #108A - GREEN ",5,21.49,107.45,0,0,0,"CNRDS"]
[1,71247,0,401,"2010-04-11","2010-04-12",4010411888,4010411010,71247,44,44,507614,"HAILEY TOP #108A - GREEN ",1,21.49,21.49,0,0,0,"CNRDS"]
[1,71247,0,401,"2010-04-11","2010-04-12",4010411888,4010411010,71247,44,44,507616,"HAILEY TOP #108A - GREEN ",1,21.49,21.49,0,0,0,"CNRDS"]
[1,71247,0,401,"2010-04-11","2010-04-12",4010411888,4010411010,71247,44,44,507620,"HAILEY TOP #108A - PINK F",-1,21.49,-21.49,0,0,0,"CNRDS"]
[1,71247,0,401,"2010-04-11","2010-04-12",4010411888,4010411010,71247,44,44,507621,"HAILEY TOP #108A - PINK F",1,21.49,21.49,0,0,0,"CNRDS"]
[1,71247,0,401,"2010-04-11","2010-04-12",4010411888,4010411010,71247,44,44,507622,"HAILEY TOP #108A - PINK F",4,21.49,85.96,0,0,0,"CNRDS"]
[1,71247,0,401,"2010-04-11","2010-04-12",4010411888,4010411010,71247,44,44,507623,"HAILEY TOP #108A - PINK F",1,21.49,21.49,0,0,0,"CNRDS"]
[1,71247,0,401,"2010-04-11","2010-04-12",4010411888,4010411010,71247,44,44,507644,"MEGAN TOP #100A- MOCHA: S",1,21.49,21.49,0,0,0,"CNRDS"]
[1,71247,0,401,"2010-04-11","2010-04-12",4010411888,4010411010,71247,44,44,507645,"MEGAN TOP #100A- MOCHA: M",1,21.49,21.49,0,0,0,"CNRDS"]
[1,71247,0,401,"2010-04-11","2010-04-12",4010411888,4010411010,71247,44,44,507651,"MEGAN TOP #100A- MOCHA: L",1,21.49,21.49,0,0,0,"CNRDS"]
[1,71247,0,401,"2010-04-11","2010-04-12",4010411888,4010411010,71247,44,44,507654,"MEGAN TOP #100A-MOCHA:XXL",1,21.49,21.49,0,0,0,"CNRDS"]
[1,71247,0,487,"2010-04-11","2010-04-12",4870411888,4870411010,71247,44,44,451332,"LILAC DENIM- FLAP POCKET ",-1,34.5,-34.5,0,0,0,"CNRDS"]
[1,71247,0,487,"2010-04-11","2010-04-12",4870411888,4870411010,71247,44,44,451336,"JANE SKIRT- #501S        ",5,21.49,107.45,0,0,0,"CNRDS"]
[1,71247,0,487,"2010-04-11","2010-04-12",4870411888,4870411010,71247,44,44,501036,"LILAC DENIM - LIGHT FLAP ",3,34.5,103.5,0,0,0,"CNRDS"]
[1,71247,0,487,"2010-04-11","2010-04-12",4870411888,4870411010,71247,44,44,506653,"LILAC DENIM - DARK DOUBLE",2,34.5,69,0,0,0,"CNRDS"]
[1,71247,0,487,"2010-04-11","2010-04-12",4870411888,4870411010,71247,44,44,506654,"LILAC DENIM - DARK DOUBLE",1,34.5,34.5,0,0,0,"CNRDS"]
[1,71247,0,487,"2010-04-11","2010-04-12",4870411888,4870411010,71247,44,44,506657,"LILAC DENIM - DARK DOUBLE",2,34.5,69,0,0,0,"CNRDS"]
[1,71247,0,487,"2010-04-11","2010-04-12",4870411888,4870411010,71247,44,44,507011,"BELLA TOP #106A - BLK: L ",5,24.93,124.65,0,0,0,"CNRDS"]
[1,71247,0,487,"2010-04-11","2010-04-12",4870411888,4870411010,71247,44,44,507317,"BELLA TOP #106A- LILAC: L",2,24.93,49.86,0,0,0,"CNRDS"]
[1,71247,0,487,"2010-04-11","2010-04-12",4870411888,4870411010,71247,44,44,507330,"TAYLOR TOP #099A- GREY: M",2,21.49,42.98,0,0,0,"CNRDS"]
[1,71247,0,487,"2010-04-11","2010-04-12",4870411888,4870411010,71247,44,44,507337,"TAYLOR TOP #099A-OLIVE: M",1,21.49,21.49,0,0,0,"CNRDS"]
[1,71247,0,487,"2010-04-11","2010-04-12",4870411888,4870411010,71247,44,44,507338,"TAYLOR TOP #099A-OLIVE: L",1,21.49,21.49,0,0,0,"CNRDS"]
[1,71247,0,487,"2010-04-11","2010-04-12",4870411888,4870411010,71247,44,44,507573,"NINA TOP #102A- WHITE: S ",1,24.07,24.07,0,0,0,"CNRDS"]
[1,71247,0,487,"2010-04-11","2010-04-12",4870411888,4870411010,71247,44,44,507574,"NINA TOP #102A- WHITE: M ",1,24.07,24.07,0,0,0,"CNRDS"]
[1,71247,0,487,"2010-04-11","2010-04-12",4870411888,4870411010,71247,44,44,507588,"NINA TOP #102A - TURQUOIS",1,24.07,24.07,0,0,0,"CNRDS"]
[1,71247,0,487,"2010-04-11","2010-04-12",4870411888,4870411010,71247,44,44,507610,"HAILEY TOP #108A - GREEN ",1,21.49,21.49,0,0,0,"CNRDS"]
[1,71247,0,487,"2010-04-11","2010-04-12",4870411888,4870411010,71247,44,44,507612,"HAILEY TOP #108A - GREEN ",2,21.49,42.98,0,0,0,"CNRDS"]
[1,71247,0,487,"2010-04-11","2010-04-12",4870411888,4870411010,71247,44,44,507613,"HAILEY TOP #108A - GREEN ",1,21.49,21.49,0,0,0,"CNRDS"]
[1,71247,0,487,"2010-04-11","2010-04-12",4870411888,4870411010,71247,44,44,507614,"HAILEY TOP #108A - GREEN ",1,21.49,21.49,0,0,0,"CNRDS"]
[1,71247,0,487,"2010-04-11","2010-04-12",4870411888,4870411010,71247,44,44,507617,"HAILEY TOP #108A - PINK F",1,21.49,21.49,0,0,0,"CNRDS"]
[1,71247,0,487,"2010-04-11","2010-04-12",4870411888,4870411010,71247,44,44,507620,"HAILEY TOP #108A - PINK F",3,21.49,64.47,0,0,0,"CNRDS"]
[1,71247,0,487,"2010-04-11","2010-04-12",4870411888,4870411010,71247,44,44,507621,"HAILEY TOP #108A - PINK F",2,21.49,42.98,0,0,0,"CNRDS"]
[1,71247,0,487,"2010-04-11","2010-04-12",4870411888,4870411010,71247,44,44,507622,"HAILEY TOP #108A - PINK F",2,21.49,42.98,0,0,0,"CNRDS"]
[1,71247,0,761,"2010-04-11","2010-04-12",7610411888,7610411010,71247,44,44,451336,"JANE SKIRT- #501S        ",3,21.49,64.47,0,0,0,"CNRDS"]
[1,71247,0,761,"2010-04-11","2010-04-12",7610411888,7610411010,71247,44,44,501036,"LILAC DENIM - LIGHT FLAP ",5,34.5,172.5,0,0,0,"CNRDS"]
[1,71247,0,761,"2010-04-11","2010-04-12",7610411888,7610411010,71247,44,44,506937,"BELLA TOP #106A -BLK: XXL",1,24.93,24.93,0,0,0,"CNRDS"]
[1,71247,0,761,"2010-04-11","2010-04-12",7610411888,7610411010,71247,44,44,506993,"MAXI DRESS - M           ",1,33.53,33.53,0,0,0,"CNRDS"]
[1,71247,0,761,"2010-04-11","2010-04-12",7610411888,7610411010,71247,44,44,507010,"BELLA TOP #106A - BLK: M ",3,24.93,74.790000000000006,0,0,0,"CNRDS"]
[1,71247,0,761,"2010-04-11","2010-04-12",7610411888,7610411010,71247,44,44,507011,"BELLA TOP #106A - BLK: L ",2,24.93,49.86,0,0,0,"CNRDS"]
[1,71247,0,761,"2010-04-11","2010-04-12",7610411888,7610411010,71247,44,44,507314,"BELLA TOP #106A- LILAC: S",2,24.93,49.86,0,0,0,"CNRDS"]
[1,71247,0,761,"2010-04-11","2010-04-12",7610411888,7610411010,71247,44,44,507316,"BELLA TOP #106A- LILAC: M",1,24.93,24.93,0,0,0,"CNRDS"]
[1,71247,0,761,"2010-04-11","2010-04-12",7610411888,7610411010,71247,44,44,507317,"BELLA TOP #106A- LILAC: L",2,24.93,49.86,0,0,0,"CNRDS"]
[1,71247,0,761,"2010-04-11","2010-04-12",7610411888,7610411010,71247,44,44,507318,"BELLA TOP #106A-LILAC: XL",1,24.93,24.93,0,0,0,"CNRDS"]
[1,71247,0,761,"2010-04-11","2010-04-12",7610411888,7610411010,71247,44,44,507335,"TAYLOR TOP #099A-OLIVE: S",2,21.49,42.98,0,0,0,"CNRDS"]
[1,71247,0,761,"2010-04-11","2010-04-12",7610411888,7610411010,71247,44,44,507337,"TAYLOR TOP #099A-OLIVE: M",6,21.49,128.94,0,0,0,"CNRDS"]
[1,71247,0,761,"2010-04-11","2010-04-12",7610411888,7610411010,71247,44,44,507338,"TAYLOR TOP #099A-OLIVE: L",-1,21.49,-21.49,0,0,0,"CNRDS"]
[1,71247,0,761,"2010-04-11","2010-04-12",7610411888,7610411010,71247,44,44,507580,"NINA TOP #102A- WHITE: XL",1,24.07,24.07,0,0,0,"CNRDS"]
[1,71247,0,761,"2010-04-11","2010-04-12",7610411888,7610411010,71247,44,44,507610,"HAILEY TOP #108A - GREEN ",1,21.49,21.49,0,0,0,"CNRDS"]
[1,71247,0,761,"2010-04-11","2010-04-12",7610411888,7610411010,71247,44,44,507612,"HAILEY TOP #108A - GREEN ",6,21.49,128.94,0,0,0,"CNRDS"]
[1,71247,0,761,"2010-04-11","2010-04-12",7610411888,7610411010,71247,44,44,507614,"HAILEY TOP #108A - GREEN ",1,21.49,21.49,0,0,0,"CNRDS"]
[1,71247,0,761,"2010-04-11","2010-04-12",7610411888,7610411010,71247,44,44,507617,"HAILEY TOP #108A - PINK F",6,21.49,128.94,0,0,0,"CNRDS"]
[1,71247,0,761,"2010-04-11","2010-04-12",7610411888,7610411010,71247,44,44,507620,"HAILEY TOP #108A - PINK F",2,21.49,42.98,0,0,0,"CNRDS"]
[1,71247,0,761,"2010-04-11","2010-04-12",7610411888,7610411010,71247,44,44,507621,"HAILEY TOP #108A - PINK F",3,21.49,64.47,0,0,0,"CNRDS"]
[1,71247,0,761,"2010-04-11","2010-04-12",7610411888,7610411010,71247,44,44,507622,"HAILEY TOP #108A - PINK F",2,21.49,42.98,0,0,0,"CNRDS"]
[1,71247,0,761,"2010-04-11","2010-04-12",7610411888,7610411010,71247,44,44,507623,"HAILEY TOP #108A - PINK F",2,21.49,42.98,0,0,0,"CNRDS"]
[1,71247,0,761,"2010-04-11","2010-04-12",7610411888,7610411010,71247,44,44,509642,"LILAC DENIM- FLAP POCKET ",-1,34.5,-34.5,0,0,0,"CNRDS"]
[1,71247,0,761,"2010-04-11","2010-04-12",7610411888,7610411010,71247,44,44,509645,"LILAC DENIM- FLAP POCKET ",-1,34.5,-34.5,0,0,0,"CNRDS"]
[1,71247,0,761,"2010-04-11","2010-04-12",7610411888,7610411010,71247,44,44,509646,"LILAC DENIM- FLAP POCKET ",1,34.5,34.5,0,0,0,"CNRDS"]
[1,71247,0,761,"2010-04-11","2010-04-12",7610411888,7610411010,71247,44,44,509648,"LILAC DENIM- SCOOP POCKET",-1,34.5,-34.5,0,0,0,"CNRDS"]
[1,71247,0,761,"2010-04-11","2010-04-12",7610411888,7610411010,71247,44,44,509649,"LILAC DENIM- SCOOP POCKET",2,34.5,69,0,0,0,"CNRDS"]
[1,71247,0,761,"2010-04-11","2010-04-12",7610411888,7610411010,71247,44,44,509650,"LILAC DENIM- SCOOP POCKET",-1,34.5,-34.5,0,0,0,"CNRDS"]
[1,71247,0,761,"2010-04-11","2010-04-12",7610411888,7610411010,71247,44,44,509652,"LILAC DENIM- SCOOP POCKET",2,34.5,69,0,0,0,"CNRDS"]
[1,71247,0,761,"2010-04-11","2010-04-12",7610411888,7610411010,71247,44,44,510757,"LILAC DENIM- FLAP POCKET ",1,34.5,34.5,0,0,0,"CNRDS"]
[1,71247,0,761,"2010-04-11","2010-04-12",7610411888,7610411010,71247,44,44,510758,"LILAC DENIM- SCOOP POCKET",2,34.5,69,0,0,0,"CNRDS"]
[1,71247,0,781,"2010-04-11","2010-04-12",7810411888,7810411010,71247,44,44,501036,"LILAC DENIM - LIGHT FLAP ",2,34.5,69,0,0,0,"CNRDS"]
[1,71247,0,781,"2010-04-11","2010-04-12",7810411888,7810411010,71247,44,44,501039,"LILAC DENIM - DARK DOUBLE",2,34.5,69,0,0,0,"CNRDS"]
[1,71247,0,781,"2010-04-11","2010-04-12",7810411888,7810411010,71247,44,44,506653,"LILAC DENIM - DARK DOUBLE",1,34.5,34.5,0,0,0,"CNRDS"]
[1,71247,0,781,"2010-04-11","2010-04-12",7810411888,7810411010,71247,44,44,506654,"LILAC DENIM - DARK DOUBLE",-1,34.5,-34.5,0,0,0,"CNRDS"]
[1,71247,0,781,"2010-04-11","2010-04-12",7810411888,7810411010,71247,44,44,506657,"LILAC DENIM - DARK DOUBLE",1,34.5,34.5,0,0,0,"CNRDS"]
[1,71247,0,781,"2010-04-11","2010-04-12",7810411888,7810411010,71247,44,44,507010,"BELLA TOP #106A - BLK: M ",1,24.93,24.93,0,0,0,"CNRDS"]
[1,71247,0,781,"2010-04-11","2010-04-12",7810411888,7810411010,71247,44,44,507013,"BELLA TOP #106A - BLK: XL",2,24.93,49.86,0,0,0,"CNRDS"]
[1,71247,0,781,"2010-04-11","2010-04-12",7810411888,7810411010,71247,44,44,507317,"BELLA TOP #106A- LILAC: L",1,24.93,24.93,0,0,0,"CNRDS"]
[1,71247,0,781,"2010-04-11","2010-04-12",7810411888,7810411010,71247,44,44,507337,"TAYLOR TOP #099A-OLIVE: M",1,21.49,21.49,0,0,0,"CNRDS"]
[1,71247,0,781,"2010-04-11","2010-04-12",7810411888,7810411010,71247,44,44,507338,"TAYLOR TOP #099A-OLIVE: L",-1,21.49,-21.49,0,0,0,"CNRDS"]
[1,71247,0,781,"2010-04-11","2010-04-12",7810411888,7810411010,71247,44,44,507612,"HAILEY TOP #108A - GREEN ",1,21.49,21.49,0,0,0,"CNRDS"]
[1,71247,0,781,"2010-04-11","2010-04-12",7810411888,7810411010,71247,44,44,507645,"MEGAN TOP #100A- MOCHA: M",1,21.49,21.49,0,0,0,"CNRDS"]
[1,71247,0,781,"2010-04-11","2010-04-12",7810411888,7810411010,71247,44,44,507653,"MEGAN TOP #100A-MOCHA: XL",2,21.49,42.98,0,0,0,"CNRDS"]