{"text_format":"1","workbook":"xlsx","n_sheets":9,"sheets":["Main Page","Item Breakdown","Breakdown","PivotTable","Input New Data Here","Running Total","Costco Data Per Day","Sales by UPC Codes","Testing Puposes Costco Data"],"not_rendered":{"charts":0,"images":0,"macros":1,"external_links":2,"defined_names":9,"comments":0,"pivot_tables":1},"unopened":[],"bounds":{"document_bytes":16777216,"sheet_cells":100000,"rows_first":2000,"rows_last":500,"rows_between":2000,"halvings":0,"cell_chars":16384,"cell_head_chars":4096},"cells_cut":0,"cells_raw":0,"read":"whole","date_system":"1900"}

{"sheet":"Main Page","index":0,"n_rows":146,"n_cols":5,"rows_kept":146,"cut":false,"hidden":false,"merged":[[0,0,0,7]]}
["Main Purpose:  to allow Lilac to determine the total sales for each day along with totals for each Costco location.  In addition, the complete breakdown of each item can be found on the following tab, \"Item Breakdown.\""]
["Warehouse","Total for the Day"]
["Grand Total",{"$f":"SUMIF(C4:C146,\"TRUE\",B4:B146)","v":0},{"$f":"ISNUMBER(B3)","v":true},null,"Sales Date:"]
["781 Total",null,{"$f":"ISNUMBER(B4)","v":false},null,{"$f":"TODAY()-1","v":"2010-04-12"}]
["401 Total",null,{"$f":"ISNUMBER(B5)","v":false}]
["487 Total",null,{"$f":"ISNUMBER(B6)","v":false}]
["761 Total",null,{"$f":"ISNUMBER(B7)","v":false},null,"For testing purposes, just use "]
["110 Total",null,{"$f":"ISNUMBER(B8)","v":false},null,"the button to the right because it"]
["2 Total",null,{"$f":"ISNUMBER(B9)","v":false},null,"pulls data from \"Testing Purposes"]
["6 Total",null,{"$f":"ISNUMBER(B10)","v":false},null,"Costco Data\" sheet and uses"]
["13 Total",null,{"$f":"ISNUMBER(B11)","v":false},null,"that data in sheet \"Input New"]
["61 Total",null,{"$f":"ISNUMBER(B12)","v":false},null,"Data Here.\"  Normally, the user"]
["67 Total",null,{"$f":"ISNUMBER(B13)","v":false},null,"will get the data from Costco; "]
["69 Total",null,{"$f":"ISNUMBER(B14)","v":false},null,"however, you do not have the"]
["95 Total",null,{"$f":"ISNUMBER(B15)","v":false},null,"password or have downloaded"]
["96 Total",null,{"$f":"ISNUMBER(B16)","v":false},null,"the certificate to make it work."]
["97 Total",null,{"$f":"ISNUMBER(B17)","v":false},null,"Note:  Allow it to delete Data - I "]
["106 Total",null,{"$f":"ISNUMBER(B18)","v":false},null,"couldn't figure out how to create"]
["111 Total",null,{"$f":"ISNUMBER(B19)","v":false},null,"a new pivot table within the sheet"]
["113 Total",null,{"$f":"ISNUMBER(B20)","v":false},null,"so I have to delete it out each time."]
["116 Total",null,{"$f":"ISNUMBER(B21)","v":false}]
["121 Total",null,{"$f":"ISNUMBER(B22)","v":false}]
["145 Total",null,{"$f":"ISNUMBER(B23)","v":false}]
["403 Total",null,{"$f":"ISNUMBER(B24)","v":false}]
["407 Total",null,{"$f":"ISNUMBER(B25)","v":false}]
["427 Total",null,{"$f":"ISNUMBER(B26)","v":false}]
["431 Total",null,{"$f":"ISNUMBER(B27)","v":false}]
["436 Total",null,{"$f":"ISNUMBER(B28)","v":false}]
["439 Total",null,{"$f":"ISNUMBER(B29)","v":false}]
["440 Total",null,{"$f":"ISNUMBER(B30)","v":false}]
{"$rows_left_out":117}
{"sheet":"Item Breakdown","index":1,"n_rows":67,"n_cols":12,"rows_kept":67,"cut":false,"hidden":false,"merged":[]}
[]
[]
["Style","Color","Size","item",110,401,487,761,781,"Grand Total",null,"Note:  some of the items do not have additional info"]
[{"$f":"VLOOKUP(D4,'Sales by UPC Codes'!$A$1:$E$300,2,FALSE)","v":{"$error":"#N/A"}},{"$f":"VLOOKUP(D4,'Sales by UPC Codes'!$A$1:$E$300,3,FALSE)","v":{"$error":"#N/A"}},{"$f":"VLOOKUP(D4,'Sales by UPC Codes'!$A$1:$E$300,4,FALSE)","v":{"$error":"#N/A"}},451332,null,null,-1,null,null,-1,null,"and appear as an error."]
[{"$f":"VLOOKUP(D5,'Sales by UPC Codes'!$A$1:$E$300,2,FALSE)","v":{"$error":"#N/A"}},{"$f":"VLOOKUP(D5,'Sales by UPC Codes'!$A$1:$E$300,3,FALSE)","v":{"$error":"#N/A"}},{"$f":"VLOOKUP(D5,'Sales by UPC Codes'!$A$1:$E$300,4,FALSE)","v":{"$error":"#N/A"}},451333,1,null,null,null,null,1]
[{"$f":"VLOOKUP(D6,'Sales by UPC Codes'!$A$1:$E$300,2,FALSE)","v":{"$error":"#N/A"}},{"$f":"VLOOKUP(D6,'Sales by UPC Codes'!$A$1:$E$300,3,FALSE)","v":{"$error":"#N/A"}},{"$f":"VLOOKUP(D6,'Sales by UPC Codes'!$A$1:$E$300,4,FALSE)","v":{"$error":"#N/A"}},451336,6,1,5,3,null,15]
[{"$f":"VLOOKUP(D7,'Sales by UPC Codes'!$A$1:$E$300,2,FALSE)","v":{"$error":"#N/A"}},{"$f":"VLOOKUP(D7,'Sales by UPC Codes'!$A$1:$E$300,3,FALSE)","v":{"$error":"#N/A"}},{"$f":"VLOOKUP(D7,'Sales by UPC Codes'!$A$1:$E$300,4,FALSE)","v":{"$error":"#N/A"}},501036,6,1,3,5,2,17]
[{"$f":"VLOOKUP(D8,'Sales by UPC Codes'!$A$1:$E$300,2,FALSE)","v":{"$error":"#N/A"}},{"$f":"VLOOKUP(D8,'Sales by UPC Codes'!$A$1:$E$300,3,FALSE)","v":{"$error":"#N/A"}},{"$f":"VLOOKUP(D8,'Sales by UPC Codes'!$A$1:$E$300,4,FALSE)","v":{"$error":"#N/A"}},501039,23,-1,null,null,2,24]
[{"$f":"VLOOKUP(D9,'Sales by UPC Codes'!$A$1:$E$300,2,FALSE)","v":{"$error":"#N/A"}},{"$f":"VLOOKUP(D9,'Sales by UPC Codes'!$A$1:$E$300,3,FALSE)","v":{"$error":"#N/A"}},{"$f":"VLOOKUP(D9,'Sales by UPC Codes'!$A$1:$E$300,4,FALSE)","v":{"$error":"#N/A"}},506653,3,-1,2,null,1,5]
[{"$f":"VLOOKUP(D10,'Sales by UPC Codes'!$A$1:$E$300,2,FALSE)","v":{"$error":"#N/A"}},{"$f":"VLOOKUP(D10,'Sales by UPC Codes'!$A$1:$E$300,3,FALSE)","v":{"$error":"#N/A"}},{"$f":"VLOOKUP(D10,'Sales by UPC Codes'!$A$1:$E$300,4,FALSE)","v":{"$error":"#N/A"}},506654,5,1,1,null,-1,6]
[{"$f":"VLOOKUP(D11,'Sales by UPC Codes'!$A$1:$E$300,2,FALSE)","v":{"$error":"#N/A"}},{"$f":"VLOOKUP(D11,'Sales by UPC Codes'!$A$1:$E$300,3,FALSE)","v":{"$error":"#N/A"}},{"$f":"VLOOKUP(D11,'Sales by UPC Codes'!$A$1:$E$300,4,FALSE)","v":{"$error":"#N/A"}},506655,4,2,null,null,null,6]
[{"$f":"VLOOKUP(D12,'Sales by UPC Codes'!$A$1:$E$300,2,FALSE)","v":{"$error":"#N/A"}},{"$f":"VLOOKUP(D12,'Sales by UPC Codes'!$A$1:$E$300,3,FALSE)","v":{"$error":"#N/A"}},{"$f":"VLOOKUP(D12,'Sales by UPC Codes'!$A$1:$E$300,4,FALSE)","v":{"$error":"#N/A"}},506657,1,null,2,null,1,4]
[{"$f":"VLOOKUP(D13,'Sales by UPC Codes'!$A$1:$E$300,2,FALSE)","v":"Bella Top"},{"$f":"VLOOKUP(D13,'Sales by UPC Codes'!$A$1:$E$300,3,FALSE)","v":"Black"},{"$f":"VLOOKUP(D13,'Sales by UPC Codes'!$A$1:$E$300,4,FALSE)","v":"XXL"},506937,null,1,null,1,null,2]
[{"$f":"VLOOKUP(D14,'Sales by UPC Codes'!$A$1:$E$300,2,FALSE)","v":"Maxi Dress"},{"$f":"VLOOKUP(D14,'Sales by UPC Codes'!$A$1:$E$300,3,FALSE)","v":"Black"},{"$f":"VLOOKUP(D14,'Sales by UPC Codes'!$A$1:$E$300,4,FALSE)","v":"S"},506992,1,-1,null,null,null,0]
[{"$f":"VLOOKUP(D15,'Sales by UPC Codes'!$A$1:$E$300,2,FALSE)","v":"Maxi Dress"},{"$f":"VLOOKUP(D15,'Sales by UPC Codes'!$A$1:$E$300,3,FALSE)","v":"Black"},{"$f":"VLOOKUP(D15,'Sales by UPC Codes'!$A$1:$E$300,4,FALSE)","v":"M"},506993,null,1,null,1,null,2]
[{"$f":"VLOOKUP(D16,'Sales by UPC Codes'!$A$1:$E$300,2,FALSE)","v":"Maxi Dress"},{"$f":"VLOOKUP(D16,'Sales by UPC Codes'!$A$1:$E$300,3,FALSE)","v":"Black"},{"$f":"VLOOKUP(D16,'Sales by UPC Codes'!$A$1:$E$300,4,FALSE)","v":"XL"},507004,1,null,null,null,null,1]
[{"$f":"VLOOKUP(D17,'Sales by UPC Codes'!$A$1:$E$300,2,FALSE)","v":"Bella Top"},{"$f":"VLOOKUP(D17,'Sales by UPC Codes'!$A$1:$E$300,3,FALSE)","v":"Black"},{"$f":"VLOOKUP(D17,'Sales by UPC Codes'!$A$1:$E$300,4,FALSE)","v":"S"},507008,4,-1,null,null,null,3]
[{"$f":"VLOOKUP(D18,'Sales by UPC Codes'!$A$1:$E$300,2,FALSE)","v":"Bella Top"},{"$f":"VLOOKUP(D18,'Sales by UPC Codes'!$A$1:$E$300,3,FALSE)","v":"Black"},{"$f":"VLOOKUP(D18,'Sales by UPC Codes'!$A$1:$E$300,4,FALSE)","v":"M"},507010,3,3,null,3,1,10]
[{"$f":"VLOOKUP(D19,'Sales by UPC Codes'!$A$1:$E$300,2,FALSE)","v":"Bella Top"},{"$f":"VLOOKUP(D19,'Sales by UPC Codes'!$A$1:$E$300,3,FALSE)","v":"Black"},{"$f":"VLOOKUP(D19,'Sales by UPC Codes'!$A$1:$E$300,4,FALSE)","v":"L"},507011,3,1,5,2,null,11]
[{"$f":"VLOOKUP(D20,'Sales by UPC Codes'!$A$1:$E$300,2,FALSE)","v":"Bella Top"},{"$f":"VLOOKUP(D20,'Sales by UPC Codes'!$A$1:$E$300,3,FALSE)","v":"Black"},{"$f":"VLOOKUP(D20,'Sales by UPC Codes'!$A$1:$E$300,4,FALSE)","v":"XL"},507013,2,null,null,null,2,4]
[{"$f":"VLOOKUP(D21,'Sales by UPC Codes'!$A$1:$E$300,2,FALSE)","v":"Bella Top"},{"$f":"VLOOKUP(D21,'Sales by UPC Codes'!$A$1:$E$300,3,FALSE)","v":"Lilac"},{"$f":"VLOOKUP(D21,'Sales by UPC Codes'!$A$1:$E$300,4,FALSE)","v":"S"},507314,1,3,null,2,null,6]
[{"$f":"VLOOKUP(D22,'Sales by UPC Codes'!$A$1:$E$300,2,FALSE)","v":"Bella Top"},{"$f":"VLOOKUP(D22,'Sales by UPC Codes'!$A$1:$E$300,3,FALSE)","v":"Lilac"},{"$f":"VLOOKUP(D22,'Sales by UPC Codes'!$A$1:$E$300,4,FALSE)","v":"M"},507316,null,3,null,1,null,4]
[{"$f":"VLOOKUP(D23,'Sales by UPC Codes'!$A$1:$E$300,2,FALSE)","v":"Bella Top"},{"$f":"VLOOKUP(D23,'Sales by UPC Codes'!$A$1:$E$300,3,FALSE)","v":"Lilac"},{"$f":"VLOOKUP(D23,'Sales by UPC Codes'!$A$1:$E$300,4,FALSE)","v":"L"},507317,3,1,2,2,1,9]
[{"$f":"VLOOKUP(D24,'Sales by UPC Codes'!$A$1:$E$300,2,FALSE)","v":"Bella Top"},{"$f":"VLOOKUP(D24,'Sales by UPC Codes'!$A$1:$E$300,3,FALSE)","v":"Lilac"},{"$f":"VLOOKUP(D24,'Sales by UPC Codes'!$A$1:$E$300,4,FALSE)","v":"XL"},507318,1,null,null,1,null,2]
[{"$f":"VLOOKUP(D25,'Sales by UPC Codes'!$A$1:$E$300,2,FALSE)","v":"Bella Top"},{"$f":"VLOOKUP(D25,'Sales by UPC Codes'!$A$1:$E$300,3,FALSE)","v":"Lilac"},{"$f":"VLOOKUP(D25,'Sales by UPC Codes'!$A$1:$E$300,4,FALSE)","v":"XXL"},507319,null,1,null,null,null,1]
[{"$f":"VLOOKUP(D26,'Sales by UPC Codes'!$A$1:$E$300,2,FALSE)","v":"Taylor Top"},{"$f":"VLOOKUP(D26,'Sales by UPC Codes'!$A$1:$E$300,3,FALSE)","v":"Silver"},{"$f":"VLOOKUP(D26,'Sales by UPC Codes'!$A$1:$E$300,4,FALSE)","v":"S"},507329,4,2,null,null,null,6]
[{"$f":"VLOOKUP(D27,'Sales by UPC Codes'!$A$1:$E$300,2,FALSE)","v":"Taylor Top"},{"$f":"VLOOKUP(D27,'Sales by UPC Codes'!$A$1:$E$300,3,FALSE)","v":"Silver"},{"$f":"VLOOKUP(D27,'Sales by UPC Codes'!$A$1:$E$300,4,FALSE)","v":"M"},507330,2,-1,2,null,null,3]
[{"$f":"VLOOKUP(D28,'Sales by UPC Codes'!$A$1:$E$300,2,FALSE)","v":"Taylor Top"},{"$f":"VLOOKUP(D28,'Sales by UPC Codes'!$A$1:$E$300,3,FALSE)","v":"Silver"},{"$f":"VLOOKUP(D28,'Sales by UPC Codes'!$A$1:$E$300,4,FALSE)","v":"L"},507332,2,null,null,null,null,2]
[{"$f":"VLOOKUP(D29,'Sales by UPC Codes'!$A$1:$E$300,2,FALSE)","v":"Taylor Top"},{"$f":"VLOOKUP(D29,'Sales by UPC Codes'!$A$1:$E$300,3,FALSE)","v":"Silver"},{"$f":"VLOOKUP(D29,'Sales by UPC Codes'!$A$1:$E$300,4,FALSE)","v":"XL"},507333,2,-1,null,null,null,1]
[{"$f":"VLOOKUP(D30,'Sales by UPC Codes'!$A$1:$E$300,2,FALSE)","v":"Taylor Top"},{"$f":"VLOOKUP(D30,'Sales by UPC Codes'!$A$1:$E$300,3,FALSE)","v":"Silver"},{"$f":"VLOOKUP(D30,'Sales by UPC Codes'!$A$1:$E$300,4,FALSE)","v":"XXL"},507334,2,1,null,null,null,3]
{"$rows_left_out":38}
{"sheet":"Breakdown","index":2,"n_rows":7,"n_cols":73,"rows_kept":7,"cut":false,"hidden":false,"merged":[]}
[]
[null,"Store Number",506992,506993,507003,507004,507008,507010,507011,507013,506937,507314,507316,507317,507318,507319,507335,507337,507338,507339,507340,507329,507330,507332,507333,507334,507573,507574,507579,507580,507583,507584,507588,507590,507591,507592,507610,507612,507613,507614,507616,507617,507620,507621,507622,507623,507637,507638,507639,507641,451332,451333,451336,501036,501039,506653,506654,506655,506657,507644,507645,507651,507653,507654,509642,509645,509646,509648,509649,509650,509652,510757,510758]
[null,110,1,null,null,1,4,3,3,2,null,1,null,3,1,null,null,null,null,null,null,4,2,2,2,2,2,2,null,null,2,1,null,2,null,1,2,8,2,null,1,5,3,1,2,null,null,null,null,null,null,1,6,6,23,3,5,4,1]
[null,401,-1,1,null,null,-1,3,1,null,1,3,3,1,null,1,-1,null,null,null,1,2,-1,null,-1,1,1,null,null,null,1,1,null,null,null,null,1,3,5,1,1,null,-1,1,4,1,null,null,null,null,null,null,1,1,-1,-1,1,2,null,1,1,1,null,1]
[null,487,null,null,null,null,null,null,5,null,null,null,null,2,null,null,null,1,1,null,null,null,2,null,null,null,1,1,null,null,null,null,1,null,null,null,1,2,1,1,null,1,3,2,2,null,null,null,null,null,-1,1,5,3,null,2,1,null,2]
[null,761,null,1,null,null,null,3,2,null,1,2,1,2,1,null,2,6,-1,null,null,null,null,null,null,null,null,null,null,1,null,null,null,null,null,null,1,6,null,1,null,6,2,3,2,2,null,null,null,null,null,null,3,5,null,null,null,null,null,null,null,null,null,null,-1,-1,1,-1,2,-1,2,1,2]
[null,781,null,null,null,null,null,1,null,2,null,null,null,1,null,null,null,1,-1,null,null,null,null,null,null,null,null,null,null,null,null,null,null,null,null,null,null,1,null,null,null,null,null,null,null,null,null,null,null,null,null,null,null,2,2,1,-1,null,1,null,1,null,2]

{"sheet":"PivotTable","index":3,"n_rows":66,"n_cols":7,"rows_kept":66,"cut":false,"hidden":false,"merged":[]}
["Sum of quanitity","warehouse"]
["item",110,401,487,761,781,"Grand Total"]
[451332,null,null,-1,null,null,-1]
[451333,1,null,null,null,null,1]
[451336,6,1,5,3,null,15]
[501036,6,1,3,5,2,17]
[501039,23,-1,null,null,2,24]
[506653,3,-1,2,null,1,5]
[506654,5,1,1,null,-1,6]
[506655,4,2,null,null,null,6]
[506657,1,null,2,null,1,4]
[506937,null,1,null,1,null,2]
[506992,1,-1,null,null,null,0]
[506993,null,1,null,1,null,2]
[507004,1,null,null,null,null,1]
[507008,4,-1,null,null,null,3]
[507010,3,3,null,3,1,10]
[507011,3,1,5,2,null,11]
[507013,2,null,null,null,2,4]
[507314,1,3,null,2,null,6]
[507316,null,3,null,1,null,4]
[507317,3,1,2,2,1,9]
[507318,1,null,null,1,null,2]
[507319,null,1,null,null,null,1]
[507329,4,2,null,null,null,6]
[507330,2,-1,2,null,null,3]
[507332,2,null,null,null,null,2]
[507333,2,-1,null,null,null,1]
[507334,2,1,null,null,null,3]
[507335,null,-1,null,2,null,1]
{"$rows_left_out":37}
{"sheet":"Input New Data Here","index":4,"n_rows":2,"n_cols":1,"rows_kept":2,"cut":false,"hidden":false,"merged":[]}
[]
["Click this button in yellow and then paste new data here"]

{"sheet":"Running Total","index":5,"n_rows":146,"n_cols":5,"rows_kept":146,"cut":false,"hidden":false,"merged":[[0,0,0,7]]}
["Directions:  Click the button to start over the totals of each area.  Once you click the button, each box will began to add up the values each day and include a running total.  You don't need to change anything else on this page (the warehouses will automatically sink up to what you have on the main page."]
["Warehouse","Total Since Last Clear"]
[{"$f":"'Main Page'!A3","v":"Grand Total"}]
[{"$f":"'Main Page'!A4","v":"781 Total"}]
[{"$f":"'Main Page'!A5","v":"401 Total"},null,null,null,"Date Since Last Clear"]
[{"$f":"'Main Page'!A6","v":"487 Total"},null,null,null,{"$f":"TODAY()-1","v":"2010-04-12"}]
[{"$f":"'Main Page'!A7","v":"761 Total"}]
[{"$f":"'Main Page'!A8","v":"110 Total"}]
[{"$f":"'Main Page'!A9","v":"2 Total"}]
[{"$f":"'Main Page'!A10","v":"6 Total"}]
[{"$f":"'Main Page'!A11","v":"13 Total"}]
[{"$f":"'Main Page'!A12","v":"61 Total"}]
[{"$f":"'Main Page'!A13","v":"67 Total"}]
[{"$f":"'Main Page'!A14","v":"69 Total"}]
[{"$f":"'Main Page'!A15","v":"95 Total"}]
[{"$f":"'Main Page'!A16","v":"96 Total"}]
[{"$f":"'Main Page'!A17","v":"97 Total"}]
[{"$f":"'Main Page'!A18","v":"106 Total"}]
[{"$f":"'Main Page'!A19","v":"111 Total"}]
[{"$f":"'Main Page'!A20","v":"113 Total"}]
[{"$f":"'Main Page'!A21","v":"116 Total"}]
[{"$f":"'Main Page'!A22","v":"121 Total"}]
[{"$f":"'Main Page'!A23","v":"145 Total"}]
[{"$f":"'Main Page'!A24","v":"403 Total"}]
[{"$f":"'Main Page'!A25","v":"407 Total"}]
[{"$f":"'Main Page'!A26","v":"427 Total"}]
[{"$f":"'Main Page'!A27","v":"431 Total"}]
[{"$f":"'Main Page'!A28","v":"436 Total"}]
[{"$f":"'Main Page'!A29","v":"439 Total"}]
[{"$f":"'Main Page'!A30","v":"440 Total"}]
{"$rows_left_out":117}
{"sheet":"Costco Data Per Day","index":6,"n_rows":147,"n_cols":20,"rows_kept":147,"cut":false,"hidden":false,"merged":[]}
["company","ap-vendor","ap-suffix","warehouse","sales-date","payment-summary","po-number","invoice-num","bba-vendor","bba-suffix","department","item","item-description","quanitity","unit-cost","extended-cost","QST","HST","GST","kiosk"]
[1,71247,0,110,"2010-04-11","2010-04-12",1100411888,1100411010,71247,44,44,451333,"LILAC DENIM- SCOOP POCKET",1,34.5,34.5,0,0,0,"CNRDS"]
[1,71247,0,110,"2010-04-11","2010-04-12",1100411888,1100411010,71247,44,44,451336,"JANE SKIRT- #501S        ",6,21.49,128.94,0,0,0,"CNRDS"]
[1,71247,0,110,"2010-04-11","2010-04-12",1100411888,1100411010,71247,44,44,501036,"LILAC DENIM - LIGHT FLAP ",6,34.5,207,0,0,0,"CNRDS"]
[1,71247,0,110,"2010-04-11","2010-04-12",1100411888,1100411010,71247,44,44,501039,"LILAC DENIM - DARK DOUBLE",23,34.5,793.5,0,0,0,"CNRDS"]
[1,71247,0,110,"2010-04-11","2010-04-12",1100411888,1100411010,71247,44,44,506653,"LILAC DENIM - DARK DOUBLE",3,34.5,103.5,0,0,0,"CNRDS"]
[1,71247,0,110,"2010-04-11","2010-04-12",1100411888,1100411010,71247,44,44,506654,"LILAC DENIM - DARK DOUBLE",5,34.5,172.5,0,0,0,"CNRDS"]
[1,71247,0,110,"2010-04-11","2010-04-12",1100411888,1100411010,71247,44,44,506655,"LILAC DENIM - DARK DOUBLE",4,34.5,138,0,0,0,"CNRDS"]
[1,71247,0,110,"2010-04-11","2010-04-12",1100411888,1100411010,71247,44,44,506657,"LILAC DENIM - DARK DOUBLE",1,34.5,34.5,0,0,0,"CNRDS"]
[1,71247,0,110,"2010-04-11","2010-04-12",1100411888,1100411010,71247,44,44,506992,"MAXI DRESS - S           ",1,33.53,33.53,0,0,0,"CNRDS"]
[1,71247,0,110,"2010-04-11","2010-04-12",1100411888,1100411010,71247,44,44,507004,"MAXI DRESS - XL          ",1,33.53,33.53,0,0,0,"CNRDS"]
[1,71247,0,110,"2010-04-11","2010-04-12",1100411888,1100411010,71247,44,44,507008,"BELLA TOP #106A - BLK: S ",4,24.93,99.72,0,0,0,"CNRDS"]
[1,71247,0,110,"2010-04-11","2010-04-12",1100411888,1100411010,71247,44,44,507010,"BELLA TOP #106A - BLK: M ",3,24.93,74.790000000000006,0,0,0,"CNRDS"]
[1,71247,0,110,"2010-04-11","2010-04-12",1100411888,1100411010,71247,44,44,507011,"BELLA TOP #106A - BLK: L ",3,24.93,74.790000000000006,0,0,0,"CNRDS"]
[1,71247,0,110,"2010-04-11","2010-04-12",1100411888,1100411010,71247,44,44,507013,"BELLA TOP #106A - BLK: XL",2,24.93,49.86,0,0,0,"CNRDS"]
[1,71247,0,110,"2010-04-11","2010-04-12",1100411888,1100411010,71247,44,44,507314,"BELLA TOP #106A- LILAC: S",1,24.93,24.93,0,0,0,"CNRDS"]
[1,71247,0,110,"2010-04-11","2010-04-12",1100411888,1100411010,71247,44,44,507317,"BELLA TOP #106A- LILAC: L",3,24.93,74.790000000000006,0,0,0,"CNRDS"]
[1,71247,0,110,"2010-04-11","2010-04-12",1100411888,1100411010,71247,44,44,507318,"BELLA TOP #106A-LILAC: XL",1,24.93,24.93,0,0,0,"CNRDS"]
[1,71247,0,110,"2010-04-11","2010-04-12",1100411888,1100411010,71247,44,44,507329,"TAYLOR TOP #099A- GREY: S",4,21.49,85.96,0,0,0,"CNRDS"]
[1,71247,0,110,"2010-04-11","2010-04-12",1100411888,1100411010,71247,44,44,507330,"TAYLOR TOP #099A- GREY: M",2,21.49,42.98,0,0,0,"CNRDS"]
[1,71247,0,110,"2010-04-11","2010-04-12",1100411888,1100411010,71247,44,44,507332,"TAYLOR TOP #099A- GREY: L",2,21.49,42.98,0,0,0,"CNRDS"]
[1,71247,0,110,"2010-04-11","2010-04-12",1100411888,1100411010,71247,44,44,507333,"TAYLOR TOP #099A-GREY: XL",2,21.49,42.98,0,0,0,"CNRDS"]
[1,71247,0,110,"2010-04-11","2010-04-12",1100411888,1100411010,71247,44,44,507334,"TAYLOR TOP #099A-GREY:XXL",2,21.49,42.98,0,0,0,"CNRDS"]
[1,71247,0,110,"2010-04-11","2010-04-12",1100411888,1100411010,71247,44,44,507573,"NINA TOP #102A- WHITE: S ",2,24.07,48.14,0,0,0,"CNRDS"]
[1,71247,0,110,"2010-04-11","2010-04-12",1100411888,1100411010,71247,44,44,507574,"NINA TOP #102A- WHITE: M ",2,24.07,48.14,0,0,0,"CNRDS"]
[1,71247,0,110,"2010-04-11","2010-04-12",1100411888,1100411010,71247,44,44,507583,"NINA TOP #102A-WHITE: XXL",2,24.07,48.14,0,0,0,"CNRDS"]
[1,71247,0,110,"2010-04-11","2010-04-12",1100411888,1100411010,71247,44,44,507584,"NINA TOP #102A - TURQUOIS",1,24.07,24.07,0,0,0,"CNRDS"]
[1,71247,0,110,"2010-04-11","2010-04-12",1100411888,1100411010,71247,44,44,507590,"NINA TOP #102A - TURQUOIS",2,24.07,48.14,0,0,0,"CNRDS"]
[1,71247,0,110,"2010-04-11","2010-04-12",1100411888,1100411010,71247,44,44,507592,"NINA TOP #102A - TURQUOIS",1,24.07,24.07,0,0,0,"CNRDS"]
[1,71247,0,110,"2010-04-11","2010-04-12",1100411888,1100411010,71247,44,44,507610,"HAILEY TOP #108A - GREEN ",2,21.49,42.98,0,0,0,"CNRDS"]
{"$rows_left_out":118}
{"sheet":"Sales by UPC Codes","index":7,"n_rows":300,"n_cols":6,"rows_kept":300,"cut":false,"hidden":false,"merged":[]}
["Item #","Style","Color","Size","UPC Code","Note:  you can enter new info (items) in green boxes starting in A50."]
[506992,"Maxi Dress","Black","S",737566996187]
[506993,"Maxi Dress","Black","M",737566996170]
[507003,"Maxi Dress","Black","L",737566996163]
[507004,"Maxi Dress","Black","XL",737566996156]
[507008,"Bella Top","Black","S",737566996132]
[507010,"Bella Top","Black","M",737566996125]
[507011,"Bella Top","Black","L",737566996118]
[507013,"Bella Top","Black","XL",737566996101]
[506937,"Bella Top","Black","XXL",737566996095]
[507314,"Bella Top","Lilac","S",737566996033]
[507316,"Bella Top","Lilac","M",737566996026]
[507317,"Bella Top","Lilac","L",737566996019]
[507318,"Bella Top","Lilac","XL",737566996002]
[507319,"Bella Top","Lilac","XXL",737566995999]
[507335,"Taylor Top","Olive","S",737566995883]
[507337,"Taylor Top","Olive","M",737566995876]
[507338,"Taylor Top","Olive","L",737566995869]
[507339,"Taylor Top","Olive","XL",737566995852]
[507340,"Taylor Top","Olive","XXL",737566995845]
[507329,"Taylor Top","Silver","S",737566995937]
[507330,"Taylor Top","Silver","M",737566995920]
[507332,"Taylor Top","Silver","L",737566995913]
[507333,"Taylor Top","Silver","XL",737566995906]
[507334,"Taylor Top","Silver","XXL",737566995890]
[507573,"Nina Top","White","S",737566995739]
[507574,"Nina Top","White","M",737566995722]
[507579,"Nina Top","White","L",737566995715]
[507580,"Nina Top","White","XL",737566995708]
[507583,"Nina Top","White","XXL",737566995692]
{"$rows_left_out":271}
{"sheet":"Testing Puposes Costco Data","index":8,"n_rows":141,"n_cols":20,"rows_kept":141,"cut":false,"hidden":false,"merged":[]}
["company","ap-vendor","ap-suffix","warehouse","sales-date","payment-summary","po-number","invoice-num","bba-vendor","bba-suffix","department","item","item-description","quanitity","unit-cost","extended-cost","QST","HST","GST","kiosk"]
[1,71247,0,110,"2010-04-11","2010-04-12",1100411888,1100411010,71247,44,44,451333,"LILAC DENIM- SCOOP POCKET",1,34.5,34.5,0,0,0,"CNRDS"]
[1,71247,0,110,"2010-04-11","2010-04-12",1100411888,1100411010,71247,44,44,451336,"JANE SKIRT- #501S        ",6,21.49,128.94,0,0,0,"CNRDS"]
[1,71247,0,110,"2010-04-11","2010-04-12",1100411888,1100411010,71247,44,44,501036,"LILAC DENIM - LIGHT FLAP ",6,34.5,207,0,0,0,"CNRDS"]
[1,71247,0,110,"2010-04-11","2010-04-12",1100411888,1100411010,71247,44,44,501039,"LILAC DENIM - DARK DOUBLE",23,34.5,793.5,0,0,0,"CNRDS"]
[1,71247,0,110,"2010-04-11","2010-04-12",1100411888,1100411010,71247,44,44,506653,"LILAC DENIM - DARK DOUBLE",3,34.5,103.5,0,0,0,"CNRDS"]
[1,71247,0,110,"2010-04-11","2010-04-12",1100411888,1100411010,71247,44,44,506654,"LILAC DENIM - DARK DOUBLE",5,34.5,172.5,0,0,0,"CNRDS"]
[1,71247,0,110,"2010-04-11","2010-04-12",1100411888,1100411010,71247,44,44,506655,"LILAC DENIM - DARK DOUBLE",4,34.5,138,0,0,0,"CNRDS"]
[1,71247,0,110,"2010-04-11","2010-04-12",1100411888,1100411010,71247,44,44,506657,"LILAC DENIM - DARK DOUBLE",1,34.5,34.5,0,0,0,"CNRDS"]
[1,71247,0,110,"2010-04-11","2010-04-12",1100411888,1100411010,71247,44,44,506992,"MAXI DRESS - S           ",1,33.53,33.53,0,0,0,"CNRDS"]
[1,71247,0,110,"2010-04-11","2010-04-12",1100411888,1100411010,71247,44,44,507004,"MAXI DRESS - XL          ",1,33.53,33.53,0,0,0,"CNRDS"]
[1,71247,0,110,"2010-04-11","2010-04-12",1100411888,1100411010,71247,44,44,507008,"BELLA TOP #106A - BLK: S ",4,24.93,99.72,0,0,0,"CNRDS"]
[1,71247,0,110,"2010-04-11","2010-04-12",1100411888,1100411010,71247,44,44,507010,"BELLA TOP #106A - BLK: M ",3,24.93,74.790000000000006,0,0,0,"CNRDS"]
[1,71247,0,110,"2010-04-11","2010-04-12",1100411888,1100411010,71247,44,44,507011,"BELLA TOP #106A - BLK: L ",3,24.93,74.790000000000006,0,0,0,"CNRDS"]
[1,71247,0,110,"2010-04-11","2010-04-12",1100411888,1100411010,71247,44,44,507013,"BELLA TOP #106A - BLK: XL",2,24.93,49.86,0,0,0,"CNRDS"]
[1,71247,0,110,"2010-04-11","2010-04-12",1100411888,1100411010,71247,44,44,507314,"BELLA TOP #106A- LILAC: S",1,24.93,24.93,0,0,0,"CNRDS"]
[1,71247,0,110,"2010-04-11","2010-04-12",1100411888,1100411010,71247,44,44,507317,"BELLA TOP #106A- LILAC: L",3,24.93,74.790000000000006,0,0,0,"CNRDS"]
[1,71247,0,110,"2010-04-11","2010-04-12",1100411888,1100411010,71247,44,44,507318,"BELLA TOP #106A-LILAC: XL",1,24.93,24.93,0,0,0,"CNRDS"]
[1,71247,0,110,"2010-04-11","2010-04-12",1100411888,1100411010,71247,44,44,507329,"TAYLOR TOP #099A- GREY: S",4,21.49,85.96,0,0,0,"CNRDS"]
[1,71247,0,110,"2010-04-11","2010-04-12",1100411888,1100411010,71247,44,44,507330,"TAYLOR TOP #099A- GREY: M",2,21.49,42.98,0,0,0,"CNRDS"]
[1,71247,0,110,"2010-04-11","2010-04-12",1100411888,1100411010,71247,44,44,507332,"TAYLOR TOP #099A- GREY: L",2,21.49,42.98,0,0,0,"CNRDS"]
[1,71247,0,110,"2010-04-11","2010-04-12",1100411888,1100411010,71247,44,44,507333,"TAYLOR TOP #099A-GREY: XL",2,21.49,42.98,0,0,0,"CNRDS"]
[1,71247,0,110,"2010-04-11","2010-04-12",1100411888,1100411010,71247,44,44,507334,"TAYLOR TOP #099A-GREY:XXL",2,21.49,42.98,0,0,0,"CNRDS"]
[1,71247,0,110,"2010-04-11","2010-04-12",1100411888,1100411010,71247,44,44,507573,"NINA TOP #102A- WHITE: S ",2,24.07,48.14,0,0,0,"CNRDS"]
[1,71247,0,110,"2010-04-11","2010-04-12",1100411888,1100411010,71247,44,44,507574,"NINA TOP #102A- WHITE: M ",2,24.07,48.14,0,0,0,"CNRDS"]
[1,71247,0,110,"2010-04-11","2010-04-12",1100411888,1100411010,71247,44,44,507583,"NINA TOP #102A-WHITE: XXL",2,24.07,48.14,0,0,0,"CNRDS"]
[1,71247,0,110,"2010-04-11","2010-04-12",1100411888,1100411010,71247,44,44,507584,"NINA TOP #102A - TURQUOIS",1,24.07,24.07,0,0,0,"CNRDS"]
[1,71247,0,110,"2010-04-11","2010-04-12",1100411888,1100411010,71247,44,44,507590,"NINA TOP #102A - TURQUOIS",2,24.07,48.14,0,0,0,"CNRDS"]
[1,71247,0,110,"2010-04-11","2010-04-12",1100411888,1100411010,71247,44,44,507592,"NINA TOP #102A - TURQUOIS",1,24.07,24.07,0,0,0,"CNRDS"]
[1,71247,0,110,"2010-04-11","2010-04-12",1100411888,1100411010,71247,44,44,507610,"HAILEY TOP #108A - GREEN ",2,21.49,42.98,0,0,0,"CNRDS"]
{"$rows_left_out":111}