{"text_format":"1","workbook":"xlsx","n_sheets":8,"sheets":["MainRaw","Main","offeringsRaw","Password","Offerings","Selected","Home","DONT CLOSE"],"not_rendered":{"charts":0,"images":1,"macros":1,"external_links":0,"defined_names":0,"comments":0,"pivot_tables":0},"unopened":[],"bounds":{"document_bytes":16777216,"sheet_cells":100000,"rows_first":2000,"rows_last":500,"rows_between":2000,"halvings":0,"cell_chars":16384,"cell_head_chars":4096},"cells_cut":0,"cells_raw":0,"read":"whole","date_system":"1900"}

{"sheet":"MainRaw","index":0,"n_rows":5,"n_cols":22,"rows_kept":5,"cut":false,"hidden":true,"merged":[]}
["ACC 241",1," ",null,8966,1," ",3,null,"12:30p - 1:45p","TTh",151,"TNRB",null,null,null,1,"Business Law","Romney, Vernon F 'Ri"," "," "," "]
["BUS M 581",2," ",null,882,4," ",3,null,"3:30p - 4:45p","TTh","W242","TNRB",null,null,null,2,"Strategic Management","Jensen, Robert J"," "," "," "]
["I SYS 540",1," ",null,11653,0," ",3,null,"3:30p - 4:45p","MW","W240","TNRB",null,null,null,1,"Spreadsheet Programming","Allen, Gove Nathanie"," "," "," "]
["M B A 511",1," ",null,11012,1," ",3,null,"11:00a - 12:15p","MW",130,"TNRB",null,null,null,1,"Project Management","Nielsen, Ernest John"," "," "," "]
["M B A 529",1," ",null,11224,0," ",3,null,"12:30p - 1:45p","MW","W210","TNRB",null,null,null,1,"Strategic Logistics Management","Webb, Gregory Scott"," "," "," "]

{"sheet":"Main","index":1,"n_rows":307,"n_cols":17,"rows_kept":307,"cut":false,"hidden":true,"merged":[]}
["Course","Section","Cirriculum ID","Credits","Time","Day","Room","Building","Description","Instructor"]
[{"$f":"IF(MainRaw!A1=\"\", \"\", MainRaw!A1)","v":"ACC 241"},{"$f":"IF(MainRaw!B1=\"\", \"\", MainRaw!B1)","v":1},{"$f":"IF(MainRaw!E1=\"\", \"\", MainRaw!E1)","v":8966},{"$f":"IF(MainRaw!H1=\"\", \"\", MainRaw!H1)","v":3},{"$f":"IF(MainRaw!J1=\"\", \"\", MainRaw!J1)","v":"12:30p - 1:45p"},{"$f":"IF(MainRaw!K1=\"\", \"\", MainRaw!K1)","v":"TTh"},{"$f":"IF(MainRaw!L1=\"\", \"\", MainRaw!L1)","v":151},{"$f":"IF(MainRaw!M1=\"\", \"\", MainRaw!M1)","v":"TNRB"},{"$f":"IF(MainRaw!R1=\"\", \"\", MainRaw!R1)","v":"Business Law"},{"$f":"IF(MainRaw!S1=\"\", \"\", MainRaw!S1)","v":"Romney, Vernon F 'Ri"},{"$f":"A2 & \" - \" & B2 & \" - \" & I2","v":"ACC 241 - 1 - Business Law"}]
[{"$f":"IF(MainRaw!A2=\"\", \"\", MainRaw!A2)","v":"BUS M 581"},{"$f":"IF(MainRaw!B2=\"\", \"\", MainRaw!B2)","v":2},{"$f":"IF(MainRaw!E2=\"\", \"\", MainRaw!E2)","v":882},{"$f":"IF(MainRaw!H2=\"\", \"\", MainRaw!H2)","v":3},{"$f":"IF(MainRaw!J2=\"\", \"\", MainRaw!J2)","v":"3:30p - 4:45p"},{"$f":"IF(MainRaw!K2=\"\", \"\", MainRaw!K2)","v":"TTh"},{"$f":"IF(MainRaw!L2=\"\", \"\", MainRaw!L2)","v":"W242"},{"$f":"IF(MainRaw!M2=\"\", \"\", MainRaw!M2)","v":"TNRB"},{"$f":"IF(MainRaw!R2=\"\", \"\", MainRaw!R2)","v":"Strategic Management"},{"$f":"IF(MainRaw!S2=\"\", \"\", MainRaw!S2)","v":"Jensen, Robert J"},{"$f":"A3 & \" - \" & B3 & \" - \" & I3","v":"BUS M 581 - 2 - Strategic Management"}]
[{"$f":"IF(MainRaw!A3=\"\", \"\", MainRaw!A3)","v":"I SYS 540"},{"$f":"IF(MainRaw!B3=\"\", \"\", MainRaw!B3)","v":1},{"$f":"IF(MainRaw!E3=\"\", \"\", MainRaw!E3)","v":11653},{"$f":"IF(MainRaw!H3=\"\", \"\", MainRaw!H3)","v":3},{"$f":"IF(MainRaw!J3=\"\", \"\", MainRaw!J3)","v":"3:30p - 4:45p"},{"$f":"IF(MainRaw!K3=\"\", \"\", MainRaw!K3)","v":"MW"},{"$f":"IF(MainRaw!L3=\"\", \"\", MainRaw!L3)","v":"W240"},{"$f":"IF(MainRaw!M3=\"\", \"\", MainRaw!M3)","v":"TNRB"},{"$f":"IF(MainRaw!R3=\"\", \"\", MainRaw!R3)","v":"Spreadsheet Programming"},{"$f":"IF(MainRaw!S3=\"\", \"\", MainRaw!S3)","v":"Allen, Gove Nathanie"},"I SYS 540 - 1 - Spreadsheet Programming"]
[{"$f":"IF(MainRaw!A4=\"\", \"\", MainRaw!A4)","v":"M B A 511"},{"$f":"IF(MainRaw!B4=\"\", \"\", MainRaw!B4)","v":1},{"$f":"IF(MainRaw!E4=\"\", \"\", MainRaw!E4)","v":11012},{"$f":"IF(MainRaw!H4=\"\", \"\", MainRaw!H4)","v":3},{"$f":"IF(MainRaw!J4=\"\", \"\", MainRaw!J4)","v":"11:00a - 12:15p"},{"$f":"IF(MainRaw!K4=\"\", \"\", MainRaw!K4)","v":"MW"},{"$f":"IF(MainRaw!L4=\"\", \"\", MainRaw!L4)","v":130},{"$f":"IF(MainRaw!M4=\"\", \"\", MainRaw!M4)","v":"TNRB"},{"$f":"IF(MainRaw!R4=\"\", \"\", MainRaw!R4)","v":"Project Management"},{"$f":"IF(MainRaw!S4=\"\", \"\", MainRaw!S4)","v":"Nielsen, Ernest John"},"M B A 511 - 1 - Project Management"]
[{"$f":"IF(MainRaw!A5=\"\", \"\", MainRaw!A5)","v":"M B A 529"},{"$f":"IF(MainRaw!B5=\"\", \"\", MainRaw!B5)","v":1},{"$f":"IF(MainRaw!E5=\"\", \"\", MainRaw!E5)","v":11224},{"$f":"IF(MainRaw!H5=\"\", \"\", MainRaw!H5)","v":3},{"$f":"IF(MainRaw!J5=\"\", \"\", MainRaw!J5)","v":"12:30p - 1:45p"},{"$f":"IF(MainRaw!K5=\"\", \"\", MainRaw!K5)","v":"MW"},{"$f":"IF(MainRaw!L5=\"\", \"\", MainRaw!L5)","v":"W210"},{"$f":"IF(MainRaw!M5=\"\", \"\", MainRaw!M5)","v":"TNRB"},{"$f":"IF(MainRaw!R5=\"\", \"\", MainRaw!R5)","v":"Strategic Logistics Management"},{"$f":"IF(MainRaw!S5=\"\", \"\", MainRaw!S5)","v":"Webb, Gregory Scott"},"M B A 529 - 1 - Strategic Logistics Management"]
[{"$f":"IF(MainRaw!A6=\"\", \"\", MainRaw!A6)","v":""},{"$f":"IF(MainRaw!B6=\"\", \"\", MainRaw!B6)","v":""},{"$f":"IF(MainRaw!E6=\"\", \"\", MainRaw!E6)","v":""},{"$f":"IF(MainRaw!H6=\"\", \"\", MainRaw!H6)","v":""},{"$f":"IF(MainRaw!J6=\"\", \"\", MainRaw!J6)","v":""},{"$f":"IF(MainRaw!K6=\"\", \"\", MainRaw!K6)","v":""},{"$f":"IF(MainRaw!L6=\"\", \"\", MainRaw!L6)","v":""},{"$f":"IF(MainRaw!M6=\"\", \"\", MainRaw!M6)","v":""},{"$f":"IF(MainRaw!R6=\"\", \"\", MainRaw!R6)","v":""},{"$f":"IF(MainRaw!S6=\"\", \"\", MainRaw!S6)","v":""}," -  - ",{"$f":"IF(MainRaw!L6=\"\", \"\", MainRaw!L6)","v":""},{"$f":"IF(MainRaw!M6=\"\", \"\", MainRaw!M6)","v":""},{"$f":"IF(MainRaw!N6=\"\", \"\", MainRaw!N6)","v":""},{"$f":"IF(MainRaw!O6=\"\", \"\", MainRaw!O6)","v":""},{"$f":"IF(MainRaw!P6=\"\", \"\", MainRaw!P6)","v":""},{"$f":"IF(MainRaw!Q6=\"\", \"\", MainRaw!Q6)","v":""}]
[{"$f":"IF(MainRaw!A7=\"\", \"\", MainRaw!A7)","v":""},{"$f":"IF(MainRaw!B7=\"\", \"\", MainRaw!B7)","v":""},{"$f":"IF(MainRaw!E7=\"\", \"\", MainRaw!E7)","v":""},{"$f":"IF(MainRaw!H7=\"\", \"\", MainRaw!H7)","v":""},{"$f":"IF(MainRaw!J7=\"\", \"\", MainRaw!J7)","v":""},{"$f":"IF(MainRaw!K7=\"\", \"\", MainRaw!K7)","v":""},{"$f":"IF(MainRaw!L7=\"\", \"\", MainRaw!L7)","v":""},{"$f":"IF(MainRaw!M7=\"\", \"\", MainRaw!M7)","v":""},{"$f":"IF(MainRaw!R7=\"\", \"\", MainRaw!R7)","v":""},{"$f":"IF(MainRaw!S7=\"\", \"\", MainRaw!S7)","v":""}," -  - ",{"$f":"IF(MainRaw!L7=\"\", \"\", MainRaw!L7)","v":""},{"$f":"IF(MainRaw!M7=\"\", \"\", MainRaw!M7)","v":""},{"$f":"IF(MainRaw!N7=\"\", \"\", MainRaw!N7)","v":""},{"$f":"IF(MainRaw!O7=\"\", \"\", MainRaw!O7)","v":""},{"$f":"IF(MainRaw!P7=\"\", \"\", MainRaw!P7)","v":""},{"$f":"IF(MainRaw!Q7=\"\", \"\", MainRaw!Q7)","v":""}]
[{"$f":"IF(MainRaw!A8=\"\", \"\", MainRaw!A8)","v":""},{"$f":"IF(MainRaw!B8=\"\", \"\", MainRaw!B8)","v":""},{"$f":"IF(MainRaw!E8=\"\", \"\", MainRaw!E8)","v":""},{"$f":"IF(MainRaw!H8=\"\", \"\", MainRaw!H8)","v":""},{"$f":"IF(MainRaw!J8=\"\", \"\", MainRaw!J8)","v":""},{"$f":"IF(MainRaw!K8=\"\", \"\", MainRaw!K8)","v":""},{"$f":"IF(MainRaw!L8=\"\", \"\", MainRaw!L8)","v":""},{"$f":"IF(MainRaw!M8=\"\", \"\", MainRaw!M8)","v":""},{"$f":"IF(MainRaw!R8=\"\", \"\", MainRaw!R8)","v":""},{"$f":"IF(MainRaw!S8=\"\", \"\", MainRaw!S8)","v":""},{"$f":"A9 & \" - \" & B9 & \" - \" & I9","v":" -  - "},{"$f":"IF(MainRaw!L8=\"\", \"\", MainRaw!L8)","v":""},{"$f":"IF(MainRaw!M8=\"\", \"\", MainRaw!M8)","v":""},{"$f":"IF(MainRaw!N8=\"\", \"\", MainRaw!N8)","v":""},{"$f":"IF(MainRaw!O8=\"\", \"\", MainRaw!O8)","v":""},{"$f":"IF(MainRaw!P8=\"\", \"\", MainRaw!P8)","v":""},{"$f":"IF(MainRaw!Q8=\"\", \"\", MainRaw!Q8)","v":""}]
[{"$f":"IF(MainRaw!A9=\"\", \"\", MainRaw!A9)","v":""},{"$f":"IF(MainRaw!B9=\"\", \"\", MainRaw!B9)","v":""},{"$f":"IF(MainRaw!E9=\"\", \"\", MainRaw!E9)","v":""},{"$f":"IF(MainRaw!H9=\"\", \"\", MainRaw!H9)","v":""},{"$f":"IF(MainRaw!J9=\"\", \"\", MainRaw!J9)","v":""},{"$f":"IF(MainRaw!K9=\"\", \"\", MainRaw!K9)","v":""},{"$f":"IF(MainRaw!L9=\"\", \"\", MainRaw!L9)","v":""},{"$f":"IF(MainRaw!M9=\"\", \"\", MainRaw!M9)","v":""},{"$f":"IF(MainRaw!R9=\"\", \"\", MainRaw!R9)","v":""},{"$f":"IF(MainRaw!S9=\"\", \"\", MainRaw!S9)","v":""}," -  - ",{"$f":"IF(MainRaw!L9=\"\", \"\", MainRaw!L9)","v":""},{"$f":"IF(MainRaw!M9=\"\", \"\", MainRaw!M9)","v":""},{"$f":"IF(MainRaw!N9=\"\", \"\", MainRaw!N9)","v":""},{"$f":"IF(MainRaw!O9=\"\", \"\", MainRaw!O9)","v":""},{"$f":"IF(MainRaw!P9=\"\", \"\", MainRaw!P9)","v":""},{"$f":"IF(MainRaw!Q9=\"\", \"\", MainRaw!Q9)","v":""}]
[{"$f":"IF(MainRaw!A10=\"\", \"\", MainRaw!A10)","v":""},{"$f":"IF(MainRaw!B10=\"\", \"\", MainRaw!B10)","v":""},{"$f":"IF(MainRaw!E10=\"\", \"\", MainRaw!E10)","v":""},{"$f":"IF(MainRaw!H10=\"\", \"\", MainRaw!H10)","v":""},{"$f":"IF(MainRaw!J10=\"\", \"\", MainRaw!J10)","v":""},{"$f":"IF(MainRaw!K10=\"\", \"\", MainRaw!K10)","v":""},{"$f":"IF(MainRaw!L10=\"\", \"\", MainRaw!L10)","v":""},{"$f":"IF(MainRaw!M10=\"\", \"\", MainRaw!M10)","v":""},{"$f":"IF(MainRaw!R10=\"\", \"\", MainRaw!R10)","v":""},{"$f":"IF(MainRaw!S10=\"\", \"\", MainRaw!S10)","v":""}," -  - ",{"$f":"IF(MainRaw!L10=\"\", \"\", MainRaw!L10)","v":""},{"$f":"IF(MainRaw!M10=\"\", \"\", MainRaw!M10)","v":""},{"$f":"IF(MainRaw!N10=\"\", \"\", MainRaw!N10)","v":""},{"$f":"IF(MainRaw!O10=\"\", \"\", MainRaw!O10)","v":""},{"$f":"IF(MainRaw!P10=\"\", \"\", MainRaw!P10)","v":""},{"$f":"IF(MainRaw!Q10=\"\", \"\", MainRaw!Q10)","v":""}]
[{"$f":"IF(MainRaw!A11=\"\", \"\", MainRaw!A11)","v":""},{"$f":"IF(MainRaw!B11=\"\", \"\", MainRaw!B11)","v":""},{"$f":"IF(MainRaw!E11=\"\", \"\", MainRaw!E11)","v":""},{"$f":"IF(MainRaw!H11=\"\", \"\", MainRaw!H11)","v":""},{"$f":"IF(MainRaw!J11=\"\", \"\", MainRaw!J11)","v":""},{"$f":"IF(MainRaw!K11=\"\", \"\", MainRaw!K11)","v":""},{"$f":"IF(MainRaw!L11=\"\", \"\", MainRaw!L11)","v":""},{"$f":"IF(MainRaw!M11=\"\", \"\", MainRaw!M11)","v":""},{"$f":"IF(MainRaw!R11=\"\", \"\", MainRaw!R11)","v":""},{"$f":"IF(MainRaw!S11=\"\", \"\", MainRaw!S11)","v":""}," -  - ",{"$f":"IF(MainRaw!L11=\"\", \"\", MainRaw!L11)","v":""},{"$f":"IF(MainRaw!M11=\"\", \"\", MainRaw!M11)","v":""},{"$f":"IF(MainRaw!N11=\"\", \"\", MainRaw!N11)","v":""},{"$f":"IF(MainRaw!O11=\"\", \"\", MainRaw!O11)","v":""},{"$f":"IF(MainRaw!P11=\"\", \"\", MainRaw!P11)","v":""},{"$f":"IF(MainRaw!Q11=\"\", \"\", MainRaw!Q11)","v":""}]
[{"$f":"IF(MainRaw!A12=\"\", \"\", MainRaw!A12)","v":""},{"$f":"IF(MainRaw!B12=\"\", \"\", MainRaw!B12)","v":""},{"$f":"IF(MainRaw!E12=\"\", \"\", MainRaw!E12)","v":""},{"$f":"IF(MainRaw!H12=\"\", \"\", MainRaw!H12)","v":""},{"$f":"IF(MainRaw!J12=\"\", \"\", MainRaw!J12)","v":""},{"$f":"IF(MainRaw!K12=\"\", \"\", MainRaw!K12)","v":""},{"$f":"IF(MainRaw!L12=\"\", \"\", MainRaw!L12)","v":""},{"$f":"IF(MainRaw!M12=\"\", \"\", MainRaw!M12)","v":""},{"$f":"IF(MainRaw!R12=\"\", \"\", MainRaw!R12)","v":""},{"$f":"IF(MainRaw!S12=\"\", \"\", MainRaw!S12)","v":""}," -  - ",{"$f":"IF(MainRaw!L12=\"\", \"\", MainRaw!L12)","v":""},{"$f":"IF(MainRaw!M12=\"\", \"\", MainRaw!M12)","v":""},{"$f":"IF(MainRaw!N12=\"\", \"\", MainRaw!N12)","v":""},{"$f":"IF(MainRaw!O12=\"\", \"\", MainRaw!O12)","v":""},{"$f":"IF(MainRaw!P12=\"\", \"\", MainRaw!P12)","v":""},{"$f":"IF(MainRaw!Q12=\"\", \"\", MainRaw!Q12)","v":""}]
[{"$f":"IF(MainRaw!A13=\"\", \"\", MainRaw!A13)","v":""},{"$f":"IF(MainRaw!B13=\"\", \"\", MainRaw!B13)","v":""},{"$f":"IF(MainRaw!E13=\"\", \"\", MainRaw!E13)","v":""},{"$f":"IF(MainRaw!H13=\"\", \"\", MainRaw!H13)","v":""},{"$f":"IF(MainRaw!J13=\"\", \"\", MainRaw!J13)","v":""},{"$f":"IF(MainRaw!K13=\"\", \"\", MainRaw!K13)","v":""},{"$f":"IF(MainRaw!L13=\"\", \"\", MainRaw!L13)","v":""},{"$f":"IF(MainRaw!M13=\"\", \"\", MainRaw!M13)","v":""},{"$f":"IF(MainRaw!R13=\"\", \"\", MainRaw!R13)","v":""},{"$f":"IF(MainRaw!S13=\"\", \"\", MainRaw!S13)","v":""}," -  - ",{"$f":"IF(MainRaw!L13=\"\", \"\", MainRaw!L13)","v":""},{"$f":"IF(MainRaw!M13=\"\", \"\", MainRaw!M13)","v":""},{"$f":"IF(MainRaw!N13=\"\", \"\", MainRaw!N13)","v":""},{"$f":"IF(MainRaw!O13=\"\", \"\", MainRaw!O13)","v":""},{"$f":"IF(MainRaw!P13=\"\", \"\", MainRaw!P13)","v":""},{"$f":"IF(MainRaw!Q13=\"\", \"\", MainRaw!Q13)","v":""}]
[{"$f":"IF(MainRaw!A14=\"\", \"\", MainRaw!A14)","v":""},{"$f":"IF(MainRaw!B14=\"\", \"\", MainRaw!B14)","v":""},{"$f":"IF(MainRaw!E14=\"\", \"\", MainRaw!E14)","v":""},{"$f":"IF(MainRaw!H14=\"\", \"\", MainRaw!H14)","v":""},{"$f":"IF(MainRaw!J14=\"\", \"\", MainRaw!J14)","v":""},{"$f":"IF(MainRaw!K14=\"\", \"\", MainRaw!K14)","v":""},{"$f":"IF(MainRaw!L14=\"\", \"\", MainRaw!L14)","v":""},{"$f":"IF(MainRaw!M14=\"\", \"\", MainRaw!M14)","v":""},{"$f":"IF(MainRaw!R14=\"\", \"\", MainRaw!R14)","v":""},{"$f":"IF(MainRaw!S14=\"\", \"\", MainRaw!S14)","v":""}," -  - ",{"$f":"IF(MainRaw!L14=\"\", \"\", MainRaw!L14)","v":""},{"$f":"IF(MainRaw!M14=\"\", \"\", MainRaw!M14)","v":""},{"$f":"IF(MainRaw!N14=\"\", \"\", MainRaw!N14)","v":""},{"$f":"IF(MainRaw!O14=\"\", \"\", MainRaw!O14)","v":""},{"$f":"IF(MainRaw!P14=\"\", \"\", MainRaw!P14)","v":""},{"$f":"IF(MainRaw!Q14=\"\", \"\", MainRaw!Q14)","v":""}]
[{"$f":"IF(MainRaw!A15=\"\", \"\", MainRaw!A15)","v":""},{"$f":"IF(MainRaw!B15=\"\", \"\", MainRaw!B15)","v":""},{"$f":"IF(MainRaw!E15=\"\", \"\", MainRaw!E15)","v":""},{"$f":"IF(MainRaw!H15=\"\", \"\", MainRaw!H15)","v":""},{"$f":"IF(MainRaw!J15=\"\", \"\", MainRaw!J15)","v":""},{"$f":"IF(MainRaw!K15=\"\", \"\", MainRaw!K15)","v":""},{"$f":"IF(MainRaw!L15=\"\", \"\", MainRaw!L15)","v":""},{"$f":"IF(MainRaw!M15=\"\", \"\", MainRaw!M15)","v":""},{"$f":"IF(MainRaw!R15=\"\", \"\", MainRaw!R15)","v":""},{"$f":"IF(MainRaw!S15=\"\", \"\", MainRaw!S15)","v":""}," -  - ",{"$f":"IF(MainRaw!L15=\"\", \"\", MainRaw!L15)","v":""},{"$f":"IF(MainRaw!M15=\"\", \"\", MainRaw!M15)","v":""},{"$f":"IF(MainRaw!N15=\"\", \"\", MainRaw!N15)","v":""},{"$f":"IF(MainRaw!O15=\"\", \"\", MainRaw!O15)","v":""},{"$f":"IF(MainRaw!P15=\"\", \"\", MainRaw!P15)","v":""},{"$f":"IF(MainRaw!Q15=\"\", \"\", MainRaw!Q15)","v":""}]
[{"$f":"IF(MainRaw!A16=\"\", \"\", MainRaw!A16)","v":""},{"$f":"IF(MainRaw!B16=\"\", \"\", MainRaw!B16)","v":""},{"$f":"IF(MainRaw!E16=\"\", \"\", MainRaw!E16)","v":""},{"$f":"IF(MainRaw!H16=\"\", \"\", MainRaw!H16)","v":""},{"$f":"IF(MainRaw!J16=\"\", \"\", MainRaw!J16)","v":""},{"$f":"IF(MainRaw!K16=\"\", \"\", MainRaw!K16)","v":""},{"$f":"IF(MainRaw!L16=\"\", \"\", MainRaw!L16)","v":""},{"$f":"IF(MainRaw!M16=\"\", \"\", MainRaw!M16)","v":""},{"$f":"IF(MainRaw!R16=\"\", \"\", MainRaw!R16)","v":""},{"$f":"IF(MainRaw!S16=\"\", \"\", MainRaw!S16)","v":""}," -  - ",{"$f":"IF(MainRaw!L16=\"\", \"\", MainRaw!L16)","v":""},{"$f":"IF(MainRaw!M16=\"\", \"\", MainRaw!M16)","v":""},{"$f":"IF(MainRaw!N16=\"\", \"\", MainRaw!N16)","v":""},{"$f":"IF(MainRaw!O16=\"\", \"\", MainRaw!O16)","v":""},{"$f":"IF(MainRaw!P16=\"\", \"\", MainRaw!P16)","v":""},{"$f":"IF(MainRaw!Q16=\"\", \"\", MainRaw!Q16)","v":""}]
[{"$f":"IF(MainRaw!A17=\"\", \"\", MainRaw!A17)","v":""},{"$f":"IF(MainRaw!B17=\"\", \"\", MainRaw!B17)","v":""},{"$f":"IF(MainRaw!E17=\"\", \"\", MainRaw!E17)","v":""},{"$f":"IF(MainRaw!H17=\"\", \"\", MainRaw!H17)","v":""},{"$f":"IF(MainRaw!J17=\"\", \"\", MainRaw!J17)","v":""},{"$f":"IF(MainRaw!K17=\"\", \"\", MainRaw!K17)","v":""},{"$f":"IF(MainRaw!L17=\"\", \"\", MainRaw!L17)","v":""},{"$f":"IF(MainRaw!M17=\"\", \"\", MainRaw!M17)","v":""},{"$f":"IF(MainRaw!R17=\"\", \"\", MainRaw!R17)","v":""},{"$f":"IF(MainRaw!S17=\"\", \"\", MainRaw!S17)","v":""}," -  - ",{"$f":"IF(MainRaw!L17=\"\", \"\", MainRaw!L17)","v":""},{"$f":"IF(MainRaw!M17=\"\", \"\", MainRaw!M17)","v":""},{"$f":"IF(MainRaw!N17=\"\", \"\", MainRaw!N17)","v":""},{"$f":"IF(MainRaw!O17=\"\", \"\", MainRaw!O17)","v":""},{"$f":"IF(MainRaw!P17=\"\", \"\", MainRaw!P17)","v":""},{"$f":"IF(MainRaw!Q17=\"\", \"\", MainRaw!Q17)","v":""}]
[{"$f":"IF(MainRaw!A18=\"\", \"\", MainRaw!A18)","v":""},{"$f":"IF(MainRaw!B18=\"\", \"\", MainRaw!B18)","v":""},{"$f":"IF(MainRaw!E18=\"\", \"\", MainRaw!E18)","v":""},{"$f":"IF(MainRaw!H18=\"\", \"\", MainRaw!H18)","v":""},{"$f":"IF(MainRaw!J18=\"\", \"\", MainRaw!J18)","v":""},{"$f":"IF(MainRaw!K18=\"\", \"\", MainRaw!K18)","v":""},{"$f":"IF(MainRaw!L18=\"\", \"\", MainRaw!L18)","v":""},{"$f":"IF(MainRaw!M18=\"\", \"\", MainRaw!M18)","v":""},{"$f":"IF(MainRaw!R18=\"\", \"\", MainRaw!R18)","v":""},{"$f":"IF(MainRaw!S18=\"\", \"\", MainRaw!S18)","v":""}," -  - ",{"$f":"IF(MainRaw!L18=\"\", \"\", MainRaw!L18)","v":""},{"$f":"IF(MainRaw!M18=\"\", \"\", MainRaw!M18)","v":""},{"$f":"IF(MainRaw!N18=\"\", \"\", MainRaw!N18)","v":""},{"$f":"IF(MainRaw!O18=\"\", \"\", MainRaw!O18)","v":""},{"$f":"IF(MainRaw!P18=\"\", \"\", MainRaw!P18)","v":""},{"$f":"IF(MainRaw!Q18=\"\", \"\", MainRaw!Q18)","v":""}]
[{"$f":"IF(MainRaw!A19=\"\", \"\", MainRaw!A19)","v":""},{"$f":"IF(MainRaw!B19=\"\", \"\", MainRaw!B19)","v":""},{"$f":"IF(MainRaw!E19=\"\", \"\", MainRaw!E19)","v":""},{"$f":"IF(MainRaw!H19=\"\", \"\", MainRaw!H19)","v":""},{"$f":"IF(MainRaw!J19=\"\", \"\", MainRaw!J19)","v":""},{"$f":"IF(MainRaw!K19=\"\", \"\", MainRaw!K19)","v":""},{"$f":"IF(MainRaw!L19=\"\", \"\", MainRaw!L19)","v":""},{"$f":"IF(MainRaw!M19=\"\", \"\", MainRaw!M19)","v":""},{"$f":"IF(MainRaw!R19=\"\", \"\", MainRaw!R19)","v":""},{"$f":"IF(MainRaw!S19=\"\", \"\", MainRaw!S19)","v":""}," -  - ",{"$f":"IF(MainRaw!L19=\"\", \"\", MainRaw!L19)","v":""},{"$f":"IF(MainRaw!M19=\"\", \"\", MainRaw!M19)","v":""},{"$f":"IF(MainRaw!N19=\"\", \"\", MainRaw!N19)","v":""},{"$f":"IF(MainRaw!O19=\"\", \"\", MainRaw!O19)","v":""},{"$f":"IF(MainRaw!P19=\"\", \"\", MainRaw!P19)","v":""},{"$f":"IF(MainRaw!Q19=\"\", \"\", MainRaw!Q19)","v":""}]
[{"$f":"IF(MainRaw!A20=\"\", \"\", MainRaw!A20)","v":""},{"$f":"IF(MainRaw!B20=\"\", \"\", MainRaw!B20)","v":""},{"$f":"IF(MainRaw!E20=\"\", \"\", MainRaw!E20)","v":""},{"$f":"IF(MainRaw!H20=\"\", \"\", MainRaw!H20)","v":""},{"$f":"IF(MainRaw!J20=\"\", \"\", MainRaw!J20)","v":""},{"$f":"IF(MainRaw!K20=\"\", \"\", MainRaw!K20)","v":""},{"$f":"IF(MainRaw!L20=\"\", \"\", MainRaw!L20)","v":""},{"$f":"IF(MainRaw!M20=\"\", \"\", MainRaw!M20)","v":""},{"$f":"IF(MainRaw!R20=\"\", \"\", MainRaw!R20)","v":""},{"$f":"IF(MainRaw!S20=\"\", \"\", MainRaw!S20)","v":""}," -  - ",{"$f":"IF(MainRaw!L20=\"\", \"\", MainRaw!L20)","v":""},{"$f":"IF(MainRaw!M20=\"\", \"\", MainRaw!M20)","v":""},{"$f":"IF(MainRaw!N20=\"\", \"\", MainRaw!N20)","v":""},{"$f":"IF(MainRaw!O20=\"\", \"\", MainRaw!O20)","v":""},{"$f":"IF(MainRaw!P20=\"\", \"\", MainRaw!P20)","v":""},{"$f":"IF(MainRaw!Q20=\"\", \"\", MainRaw!Q20)","v":""}]
[{"$f":"IF(MainRaw!A21=\"\", \"\", MainRaw!A21)","v":""},{"$f":"IF(MainRaw!B21=\"\", \"\", MainRaw!B21)","v":""},{"$f":"IF(MainRaw!E21=\"\", \"\", MainRaw!E21)","v":""},{"$f":"IF(MainRaw!H21=\"\", \"\", MainRaw!H21)","v":""},{"$f":"IF(MainRaw!J21=\"\", \"\", MainRaw!J21)","v":""},{"$f":"IF(MainRaw!K21=\"\", \"\", MainRaw!K21)","v":""},{"$f":"IF(MainRaw!L21=\"\", \"\", MainRaw!L21)","v":""},{"$f":"IF(MainRaw!M21=\"\", \"\", MainRaw!M21)","v":""},{"$f":"IF(MainRaw!R21=\"\", \"\", MainRaw!R21)","v":""},{"$f":"IF(MainRaw!S21=\"\", \"\", MainRaw!S21)","v":""}," -  - ",{"$f":"IF(MainRaw!L21=\"\", \"\", MainRaw!L21)","v":""},{"$f":"IF(MainRaw!M21=\"\", \"\", MainRaw!M21)","v":""},{"$f":"IF(MainRaw!N21=\"\", \"\", MainRaw!N21)","v":""},{"$f":"IF(MainRaw!O21=\"\", \"\", MainRaw!O21)","v":""},{"$f":"IF(MainRaw!P21=\"\", \"\", MainRaw!P21)","v":""},{"$f":"IF(MainRaw!Q21=\"\", \"\", MainRaw!Q21)","v":""}]
[{"$f":"IF(MainRaw!A22=\"\", \"\", MainRaw!A22)","v":""},{"$f":"IF(MainRaw!B22=\"\", \"\", MainRaw!B22)","v":""},{"$f":"IF(MainRaw!E22=\"\", \"\", MainRaw!E22)","v":""},{"$f":"IF(MainRaw!H22=\"\", \"\", MainRaw!H22)","v":""},{"$f":"IF(MainRaw!J22=\"\", \"\", MainRaw!J22)","v":""},{"$f":"IF(MainRaw!K22=\"\", \"\", MainRaw!K22)","v":""},{"$f":"IF(MainRaw!L22=\"\", \"\", MainRaw!L22)","v":""},{"$f":"IF(MainRaw!M22=\"\", \"\", MainRaw!M22)","v":""},{"$f":"IF(MainRaw!R22=\"\", \"\", MainRaw!R22)","v":""},{"$f":"IF(MainRaw!S22=\"\", \"\", MainRaw!S22)","v":""}," -  - ",{"$f":"IF(MainRaw!L22=\"\", \"\", MainRaw!L22)","v":""},{"$f":"IF(MainRaw!M22=\"\", \"\", MainRaw!M22)","v":""},{"$f":"IF(MainRaw!N22=\"\", \"\", MainRaw!N22)","v":""},{"$f":"IF(MainRaw!O22=\"\", \"\", MainRaw!O22)","v":""},{"$f":"IF(MainRaw!P22=\"\", \"\", MainRaw!P22)","v":""},{"$f":"IF(MainRaw!Q22=\"\", \"\", MainRaw!Q22)","v":""}]
[{"$f":"IF(MainRaw!A23=\"\", \"\", MainRaw!A23)","v":""},{"$f":"IF(MainRaw!B23=\"\", \"\", MainRaw!B23)","v":""},{"$f":"IF(MainRaw!E23=\"\", \"\", MainRaw!E23)","v":""},{"$f":"IF(MainRaw!H23=\"\", \"\", MainRaw!H23)","v":""},{"$f":"IF(MainRaw!J23=\"\", \"\", MainRaw!J23)","v":""},{"$f":"IF(MainRaw!K23=\"\", \"\", MainRaw!K23)","v":""},{"$f":"IF(MainRaw!L23=\"\", \"\", MainRaw!L23)","v":""},{"$f":"IF(MainRaw!M23=\"\", \"\", MainRaw!M23)","v":""},{"$f":"IF(MainRaw!R23=\"\", \"\", MainRaw!R23)","v":""},{"$f":"IF(MainRaw!S23=\"\", \"\", MainRaw!S23)","v":""}," -  - ",{"$f":"IF(MainRaw!L23=\"\", \"\", MainRaw!L23)","v":""},{"$f":"IF(MainRaw!M23=\"\", \"\", MainRaw!M23)","v":""},{"$f":"IF(MainRaw!N23=\"\", \"\", MainRaw!N23)","v":""},{"$f":"IF(MainRaw!O23=\"\", \"\", MainRaw!O23)","v":""},{"$f":"IF(MainRaw!P23=\"\", \"\", MainRaw!P23)","v":""},{"$f":"IF(MainRaw!Q23=\"\", \"\", MainRaw!Q23)","v":""}]
[{"$f":"IF(MainRaw!A24=\"\", \"\", MainRaw!A24)","v":""},{"$f":"IF(MainRaw!B24=\"\", \"\", MainRaw!B24)","v":""},{"$f":"IF(MainRaw!E24=\"\", \"\", MainRaw!E24)","v":""},{"$f":"IF(MainRaw!H24=\"\", \"\", MainRaw!H24)","v":""},{"$f":"IF(MainRaw!J24=\"\", \"\", MainRaw!J24)","v":""},{"$f":"IF(MainRaw!K24=\"\", \"\", MainRaw!K24)","v":""},{"$f":"IF(MainRaw!L24=\"\", \"\", MainRaw!L24)","v":""},{"$f":"IF(MainRaw!M24=\"\", \"\", MainRaw!M24)","v":""},{"$f":"IF(MainRaw!R24=\"\", \"\", MainRaw!R24)","v":""},{"$f":"IF(MainRaw!S24=\"\", \"\", MainRaw!S24)","v":""}," -  - ",{"$f":"IF(MainRaw!L24=\"\", \"\", MainRaw!L24)","v":""},{"$f":"IF(MainRaw!M24=\"\", \"\", MainRaw!M24)","v":""},{"$f":"IF(MainRaw!N24=\"\", \"\", MainRaw!N24)","v":""},{"$f":"IF(MainRaw!O24=\"\", \"\", MainRaw!O24)","v":""},{"$f":"IF(MainRaw!P24=\"\", \"\", MainRaw!P24)","v":""},{"$f":"IF(MainRaw!Q24=\"\", \"\", MainRaw!Q24)","v":""}]
[{"$f":"IF(MainRaw!A25=\"\", \"\", MainRaw!A25)","v":""},{"$f":"IF(MainRaw!B25=\"\", \"\", MainRaw!B25)","v":""},{"$f":"IF(MainRaw!E25=\"\", \"\", MainRaw!E25)","v":""},{"$f":"IF(MainRaw!H25=\"\", \"\", MainRaw!H25)","v":""},{"$f":"IF(MainRaw!J25=\"\", \"\", MainRaw!J25)","v":""},{"$f":"IF(MainRaw!K25=\"\", \"\", MainRaw!K25)","v":""},{"$f":"IF(MainRaw!L25=\"\", \"\", MainRaw!L25)","v":""},{"$f":"IF(MainRaw!M25=\"\", \"\", MainRaw!M25)","v":""},{"$f":"IF(MainRaw!R25=\"\", \"\", MainRaw!R25)","v":""},{"$f":"IF(MainRaw!S25=\"\", \"\", MainRaw!S25)","v":""}," -  - ",{"$f":"IF(MainRaw!L25=\"\", \"\", MainRaw!L25)","v":""},{"$f":"IF(MainRaw!M25=\"\", \"\", MainRaw!M25)","v":""},{"$f":"IF(MainRaw!N25=\"\", \"\", MainRaw!N25)","v":""},{"$f":"IF(MainRaw!O25=\"\", \"\", MainRaw!O25)","v":""},{"$f":"IF(MainRaw!P25=\"\", \"\", MainRaw!P25)","v":""},{"$f":"IF(MainRaw!Q25=\"\", \"\", MainRaw!Q25)","v":""}]
[{"$f":"IF(MainRaw!A26=\"\", \"\", MainRaw!A26)","v":""},{"$f":"IF(MainRaw!B26=\"\", \"\", MainRaw!B26)","v":""},{"$f":"IF(MainRaw!E26=\"\", \"\", MainRaw!E26)","v":""},{"$f":"IF(MainRaw!H26=\"\", \"\", MainRaw!H26)","v":""},{"$f":"IF(MainRaw!J26=\"\", \"\", MainRaw!J26)","v":""},{"$f":"IF(MainRaw!K26=\"\", \"\", MainRaw!K26)","v":""},{"$f":"IF(MainRaw!L26=\"\", \"\", MainRaw!L26)","v":""},{"$f":"IF(MainRaw!M26=\"\", \"\", MainRaw!M26)","v":""},{"$f":"IF(MainRaw!R26=\"\", \"\", MainRaw!R26)","v":""},{"$f":"IF(MainRaw!S26=\"\", \"\", MainRaw!S26)","v":""}," -  - ",{"$f":"IF(MainRaw!L26=\"\", \"\", MainRaw!L26)","v":""},{"$f":"IF(MainRaw!M26=\"\", \"\", MainRaw!M26)","v":""},{"$f":"IF(MainRaw!N26=\"\", \"\", MainRaw!N26)","v":""},{"$f":"IF(MainRaw!O26=\"\", \"\", MainRaw!O26)","v":""},{"$f":"IF(MainRaw!P26=\"\", \"\", MainRaw!P26)","v":""},{"$f":"IF(MainRaw!Q26=\"\", \"\", MainRaw!Q26)","v":""}]
[{"$f":"IF(MainRaw!A27=\"\", \"\", MainRaw!A27)","v":""},{"$f":"IF(MainRaw!B27=\"\", \"\", MainRaw!B27)","v":""},{"$f":"IF(MainRaw!E27=\"\", \"\", MainRaw!E27)","v":""},{"$f":"IF(MainRaw!H27=\"\", \"\", MainRaw!H27)","v":""},{"$f":"IF(MainRaw!J27=\"\", \"\", MainRaw!J27)","v":""},{"$f":"IF(MainRaw!K27=\"\", \"\", MainRaw!K27)","v":""},{"$f":"IF(MainRaw!L27=\"\", \"\", MainRaw!L27)","v":""},{"$f":"IF(MainRaw!M27=\"\", \"\", MainRaw!M27)","v":""},{"$f":"IF(MainRaw!R27=\"\", \"\", MainRaw!R27)","v":""},{"$f":"IF(MainRaw!S27=\"\", \"\", MainRaw!S27)","v":""}," -  - ",{"$f":"IF(MainRaw!L27=\"\", \"\", MainRaw!L27)","v":""},{"$f":"IF(MainRaw!M27=\"\", \"\", MainRaw!M27)","v":""},{"$f":"IF(MainRaw!N27=\"\", \"\", MainRaw!N27)","v":""},{"$f":"IF(MainRaw!O27=\"\", \"\", MainRaw!O27)","v":""},{"$f":"IF(MainRaw!P27=\"\", \"\", MainRaw!P27)","v":""},{"$f":"IF(MainRaw!Q27=\"\", \"\", MainRaw!Q27)","v":""}]
[{"$f":"IF(MainRaw!A28=\"\", \"\", MainRaw!A28)","v":""},{"$f":"IF(MainRaw!B28=\"\", \"\", MainRaw!B28)","v":""},{"$f":"IF(MainRaw!E28=\"\", \"\", MainRaw!E28)","v":""},{"$f":"IF(MainRaw!H28=\"\", \"\", MainRaw!H28)","v":""},{"$f":"IF(MainRaw!J28=\"\", \"\", MainRaw!J28)","v":""},{"$f":"IF(MainRaw!K28=\"\", \"\", MainRaw!K28)","v":""},{"$f":"IF(MainRaw!L28=\"\", \"\", MainRaw!L28)","v":""},{"$f":"IF(MainRaw!M28=\"\", \"\", MainRaw!M28)","v":""},{"$f":"IF(MainRaw!R28=\"\", \"\", MainRaw!R28)","v":""},{"$f":"IF(MainRaw!S28=\"\", \"\", MainRaw!S28)","v":""}," -  - ",{"$f":"IF(MainRaw!L28=\"\", \"\", MainRaw!L28)","v":""},{"$f":"IF(MainRaw!M28=\"\", \"\", MainRaw!M28)","v":""},{"$f":"IF(MainRaw!N28=\"\", \"\", MainRaw!N28)","v":""},{"$f":"IF(MainRaw!O28=\"\", \"\", MainRaw!O28)","v":""},{"$f":"IF(MainRaw!P28=\"\", \"\", MainRaw!P28)","v":""},{"$f":"IF(MainRaw!Q28=\"\", \"\", MainRaw!Q28)","v":""}]
[{"$f":"IF(MainRaw!A29=\"\", \"\", MainRaw!A29)","v":""},{"$f":"IF(MainRaw!B29=\"\", \"\", MainRaw!B29)","v":""},{"$f":"IF(MainRaw!E29=\"\", \"\", MainRaw!E29)","v":""},{"$f":"IF(MainRaw!H29=\"\", \"\", MainRaw!H29)","v":""},{"$f":"IF(MainRaw!J29=\"\", \"\", MainRaw!J29)","v":""},{"$f":"IF(MainRaw!K29=\"\", \"\", MainRaw!K29)","v":""},{"$f":"IF(MainRaw!L29=\"\", \"\", MainRaw!L29)","v":""},{"$f":"IF(MainRaw!M29=\"\", \"\", MainRaw!M29)","v":""},{"$f":"IF(MainRaw!R29=\"\", \"\", MainRaw!R29)","v":""},{"$f":"IF(MainRaw!S29=\"\", \"\", MainRaw!S29)","v":""}," -  - ",{"$f":"IF(MainRaw!L29=\"\", \"\", MainRaw!L29)","v":""},{"$f":"IF(MainRaw!M29=\"\", \"\", MainRaw!M29)","v":""},{"$f":"IF(MainRaw!N29=\"\", \"\", MainRaw!N29)","v":""},{"$f":"IF(MainRaw!O29=\"\", \"\", MainRaw!O29)","v":""},{"$f":"IF(MainRaw!P29=\"\", \"\", MainRaw!P29)","v":""},{"$f":"IF(MainRaw!Q29=\"\", \"\", MainRaw!Q29)","v":""}]
[{"$f":"IF(MainRaw!A30=\"\", \"\", MainRaw!A30)","v":""},{"$f":"IF(MainRaw!B30=\"\", \"\", MainRaw!B30)","v":""},{"$f":"IF(MainRaw!E30=\"\", \"\", MainRaw!E30)","v":""},{"$f":"IF(MainRaw!H30=\"\", \"\", MainRaw!H30)","v":""},{"$f":"IF(MainRaw!J30=\"\", \"\", MainRaw!J30)","v":""},{"$f":"IF(MainRaw!K30=\"\", \"\", MainRaw!K30)","v":""},{"$f":"IF(MainRaw!L30=\"\", \"\", MainRaw!L30)","v":""},{"$f":"IF(MainRaw!M30=\"\", \"\", MainRaw!M30)","v":""},{"$f":"IF(MainRaw!R30=\"\", \"\", MainRaw!R30)","v":""},{"$f":"IF(MainRaw!S30=\"\", \"\", MainRaw!S30)","v":""}," -  - ",{"$f":"IF(MainRaw!L30=\"\", \"\", MainRaw!L30)","v":""},{"$f":"IF(MainRaw!M30=\"\", \"\", MainRaw!M30)","v":""},{"$f":"IF(MainRaw!N30=\"\", \"\", MainRaw!N30)","v":""},{"$f":"IF(MainRaw!O30=\"\", \"\", MainRaw!O30)","v":""},{"$f":"IF(MainRaw!P30=\"\", \"\", MainRaw!P30)","v":""},{"$f":"IF(MainRaw!Q30=\"\", \"\", MainRaw!Q30)","v":""}]
[{"$f":"IF(MainRaw!A31=\"\", \"\", MainRaw!A31)","v":""},{"$f":"IF(MainRaw!B31=\"\", \"\", MainRaw!B31)","v":""},{"$f":"IF(MainRaw!E31=\"\", \"\", MainRaw!E31)","v":""},{"$f":"IF(MainRaw!H31=\"\", \"\", MainRaw!H31)","v":""},{"$f":"IF(MainRaw!J31=\"\", \"\", MainRaw!J31)","v":""},{"$f":"IF(MainRaw!K31=\"\", \"\", MainRaw!K31)","v":""},{"$f":"IF(MainRaw!L31=\"\", \"\", MainRaw!L31)","v":""},{"$f":"IF(MainRaw!M31=\"\", \"\", MainRaw!M31)","v":""},{"$f":"IF(MainRaw!R31=\"\", \"\", MainRaw!R31)","v":""},{"$f":"IF(MainRaw!S31=\"\", \"\", MainRaw!S31)","v":""}," -  - ",{"$f":"IF(MainRaw!L31=\"\", \"\", MainRaw!L31)","v":""},{"$f":"IF(MainRaw!M31=\"\", \"\", MainRaw!M31)","v":""},{"$f":"IF(MainRaw!N31=\"\", \"\", MainRaw!N31)","v":""},{"$f":"IF(MainRaw!O31=\"\", \"\", MainRaw!O31)","v":""},{"$f":"IF(MainRaw!P31=\"\", \"\", MainRaw!P31)","v":""},{"$f":"IF(MainRaw!Q31=\"\", \"\", MainRaw!Q31)","v":""}]
[{"$f":"IF(MainRaw!A32=\"\", \"\", MainRaw!A32)","v":""},{"$f":"IF(MainRaw!B32=\"\", \"\", MainRaw!B32)","v":""},{"$f":"IF(MainRaw!E32=\"\", \"\", MainRaw!E32)","v":""},{"$f":"IF(MainRaw!H32=\"\", \"\", MainRaw!H32)","v":""},{"$f":"IF(MainRaw!J32=\"\", \"\", MainRaw!J32)","v":""},{"$f":"IF(MainRaw!K32=\"\", \"\", MainRaw!K32)","v":""},{"$f":"IF(MainRaw!L32=\"\", \"\", MainRaw!L32)","v":""},{"$f":"IF(MainRaw!M32=\"\", \"\", MainRaw!M32)","v":""},{"$f":"IF(MainRaw!R32=\"\", \"\", MainRaw!R32)","v":""},{"$f":"IF(MainRaw!S32=\"\", \"\", MainRaw!S32)","v":""}," -  - ",{"$f":"IF(MainRaw!L32=\"\", \"\", MainRaw!L32)","v":""},{"$f":"IF(MainRaw!M32=\"\", \"\", MainRaw!M32)","v":""},{"$f":"IF(MainRaw!N32=\"\", \"\", MainRaw!N32)","v":""},{"$f":"IF(MainRaw!O32=\"\", \"\", MainRaw!O32)","v":""},{"$f":"IF(MainRaw!P32=\"\", \"\", MainRaw!P32)","v":""},{"$f":"IF(MainRaw!Q32=\"\", \"\", MainRaw!Q32)","v":""}]
[{"$f":"IF(MainRaw!A33=\"\", \"\", MainRaw!A33)","v":""},{"$f":"IF(MainRaw!B33=\"\", \"\", MainRaw!B33)","v":""},{"$f":"IF(MainRaw!E33=\"\", \"\", MainRaw!E33)","v":""},{"$f":"IF(MainRaw!H33=\"\", \"\", MainRaw!H33)","v":""},{"$f":"IF(MainRaw!J33=\"\", \"\", MainRaw!J33)","v":""},{"$f":"IF(MainRaw!K33=\"\", \"\", MainRaw!K33)","v":""},{"$f":"IF(MainRaw!L33=\"\", \"\", MainRaw!L33)","v":""},{"$f":"IF(MainRaw!M33=\"\", \"\", MainRaw!M33)","v":""},{"$f":"IF(MainRaw!R33=\"\", \"\", MainRaw!R33)","v":""},{"$f":"IF(MainRaw!S33=\"\", \"\", MainRaw!S33)","v":""}," -  - ",{"$f":"IF(MainRaw!L33=\"\", \"\", MainRaw!L33)","v":""},{"$f":"IF(MainRaw!M33=\"\", \"\", MainRaw!M33)","v":""},{"$f":"IF(MainRaw!N33=\"\", \"\", MainRaw!N33)","v":""},{"$f":"IF(MainRaw!O33=\"\", \"\", MainRaw!O33)","v":""},{"$f":"IF(MainRaw!P33=\"\", \"\", MainRaw!P33)","v":""},{"$f":"IF(MainRaw!Q33=\"\", \"\", MainRaw!Q33)","v":""}]
[{"$f":"IF(MainRaw!A34=\"\", \"\", MainRaw!A34)","v":""},{"$f":"IF(MainRaw!B34=\"\", \"\", MainRaw!B34)","v":""},{"$f":"IF(MainRaw!E34=\"\", \"\", MainRaw!E34)","v":""},{"$f":"IF(MainRaw!H34=\"\", \"\", MainRaw!H34)","v":""},{"$f":"IF(MainRaw!J34=\"\", \"\", MainRaw!J34)","v":""},{"$f":"IF(MainRaw!K34=\"\", \"\", MainRaw!K34)","v":""},{"$f":"IF(MainRaw!L34=\"\", \"\", MainRaw!L34)","v":""},{"$f":"IF(MainRaw!M34=\"\", \"\", MainRaw!M34)","v":""},{"$f":"IF(MainRaw!R34=\"\", \"\", MainRaw!R34)","v":""},{"$f":"IF(MainRaw!S34=\"\", \"\", MainRaw!S34)","v":""}," -  - ",{"$f":"IF(MainRaw!L34=\"\", \"\", MainRaw!L34)","v":""},{"$f":"IF(MainRaw!M34=\"\", \"\", MainRaw!M34)","v":""},{"$f":"IF(MainRaw!N34=\"\", \"\", MainRaw!N34)","v":""},{"$f":"IF(MainRaw!O34=\"\", \"\", MainRaw!O34)","v":""},{"$f":"IF(MainRaw!P34=\"\", \"\", MainRaw!P34)","v":""},{"$f":"IF(MainRaw!Q34=\"\", \"\", MainRaw!Q34)","v":""}]
[{"$f":"IF(MainRaw!A35=\"\", \"\", MainRaw!A35)","v":""},{"$f":"IF(MainRaw!B35=\"\", \"\", MainRaw!B35)","v":""},{"$f":"IF(MainRaw!E35=\"\", \"\", MainRaw!E35)","v":""},{"$f":"IF(MainRaw!H35=\"\", \"\", MainRaw!H35)","v":""},{"$f":"IF(MainRaw!J35=\"\", \"\", MainRaw!J35)","v":""},{"$f":"IF(MainRaw!K35=\"\", \"\", MainRaw!K35)","v":""},{"$f":"IF(MainRaw!L35=\"\", \"\", MainRaw!L35)","v":""},{"$f":"IF(MainRaw!M35=\"\", \"\", MainRaw!M35)","v":""},{"$f":"IF(MainRaw!R35=\"\", \"\", MainRaw!R35)","v":""},{"$f":"IF(MainRaw!S35=\"\", \"\", MainRaw!S35)","v":""}," -  - ",{"$f":"IF(MainRaw!L35=\"\", \"\", MainRaw!L35)","v":""},{"$f":"IF(MainRaw!M35=\"\", \"\", MainRaw!M35)","v":""},{"$f":"IF(MainRaw!N35=\"\", \"\", MainRaw!N35)","v":""},{"$f":"IF(MainRaw!O35=\"\", \"\", MainRaw!O35)","v":""},{"$f":"IF(MainRaw!P35=\"\", \"\", MainRaw!P35)","v":""},{"$f":"IF(MainRaw!Q35=\"\", \"\", MainRaw!Q35)","v":""}]
[{"$f":"IF(MainRaw!A36=\"\", \"\", MainRaw!A36)","v":""},{"$f":"IF(MainRaw!B36=\"\", \"\", MainRaw!B36)","v":""},{"$f":"IF(MainRaw!E36=\"\", \"\", MainRaw!E36)","v":""},{"$f":"IF(MainRaw!H36=\"\", \"\", MainRaw!H36)","v":""},{"$f":"IF(MainRaw!J36=\"\", \"\", MainRaw!J36)","v":""},{"$f":"IF(MainRaw!K36=\"\", \"\", MainRaw!K36)","v":""},{"$f":"IF(MainRaw!L36=\"\", \"\", MainRaw!L36)","v":""},{"$f":"IF(MainRaw!M36=\"\", \"\", MainRaw!M36)","v":""},{"$f":"IF(MainRaw!R36=\"\", \"\", MainRaw!R36)","v":""},{"$f":"IF(MainRaw!S36=\"\", \"\", MainRaw!S36)","v":""}," -  - ",{"$f":"IF(MainRaw!L36=\"\", \"\", MainRaw!L36)","v":""},{"$f":"IF(MainRaw!M36=\"\", \"\", MainRaw!M36)","v":""},{"$f":"IF(MainRaw!N36=\"\", \"\", MainRaw!N36)","v":""},{"$f":"IF(MainRaw!O36=\"\", \"\", MainRaw!O36)","v":""},{"$f":"IF(MainRaw!P36=\"\", \"\", MainRaw!P36)","v":""},{"$f":"IF(MainRaw!Q36=\"\", \"\", MainRaw!Q36)","v":""}]
[{"$f":"IF(MainRaw!A37=\"\", \"\", MainRaw!A37)","v":""},{"$f":"IF(MainRaw!B37=\"\", \"\", MainRaw!B37)","v":""},{"$f":"IF(MainRaw!E37=\"\", \"\", MainRaw!E37)","v":""},{"$f":"IF(MainRaw!H37=\"\", \"\", MainRaw!H37)","v":""},{"$f":"IF(MainRaw!J37=\"\", \"\", MainRaw!J37)","v":""},{"$f":"IF(MainRaw!K37=\"\", \"\", MainRaw!K37)","v":""},{"$f":"IF(MainRaw!L37=\"\", \"\", MainRaw!L37)","v":""},{"$f":"IF(MainRaw!M37=\"\", \"\", MainRaw!M37)","v":""},{"$f":"IF(MainRaw!R37=\"\", \"\", MainRaw!R37)","v":""},{"$f":"IF(MainRaw!S37=\"\", \"\", MainRaw!S37)","v":""}," -  - ",{"$f":"IF(MainRaw!L37=\"\", \"\", MainRaw!L37)","v":""},{"$f":"IF(MainRaw!M37=\"\", \"\", MainRaw!M37)","v":""},{"$f":"IF(MainRaw!N37=\"\", \"\", MainRaw!N37)","v":""},{"$f":"IF(MainRaw!O37=\"\", \"\", MainRaw!O37)","v":""},{"$f":"IF(MainRaw!P37=\"\", \"\", MainRaw!P37)","v":""},{"$f":"IF(MainRaw!Q37=\"\", \"\", MainRaw!Q37)","v":""}]
[{"$f":"IF(MainRaw!A38=\"\", \"\", MainRaw!A38)","v":""},{"$f":"IF(MainRaw!B38=\"\", \"\", MainRaw!B38)","v":""},{"$f":"IF(MainRaw!E38=\"\", \"\", MainRaw!E38)","v":""},{"$f":"IF(MainRaw!H38=\"\", \"\", MainRaw!H38)","v":""},{"$f":"IF(MainRaw!J38=\"\", \"\", MainRaw!J38)","v":""},{"$f":"IF(MainRaw!K38=\"\", \"\", MainRaw!K38)","v":""},{"$f":"IF(MainRaw!L38=\"\", \"\", MainRaw!L38)","v":""},{"$f":"IF(MainRaw!M38=\"\", \"\", MainRaw!M38)","v":""},{"$f":"IF(MainRaw!R38=\"\", \"\", MainRaw!R38)","v":""},{"$f":"IF(MainRaw!S38=\"\", \"\", MainRaw!S38)","v":""}," -  - ",{"$f":"IF(MainRaw!L38=\"\", \"\", MainRaw!L38)","v":""},{"$f":"IF(MainRaw!M38=\"\", \"\", MainRaw!M38)","v":""},{"$f":"IF(MainRaw!N38=\"\", \"\", MainRaw!N38)","v":""},{"$f":"IF(MainRaw!O38=\"\", \"\", MainRaw!O38)","v":""},{"$f":"IF(MainRaw!P38=\"\", \"\", MainRaw!P38)","v":""},{"$f":"IF(MainRaw!Q38=\"\", \"\", MainRaw!Q38)","v":""}]
[{"$f":"IF(MainRaw!A39=\"\", \"\", MainRaw!A39)","v":""},{"$f":"IF(MainRaw!B39=\"\", \"\", MainRaw!B39)","v":""},{"$f":"IF(MainRaw!E39=\"\", \"\", MainRaw!E39)","v":""},{"$f":"IF(MainRaw!H39=\"\", \"\", MainRaw!H39)","v":""},{"$f":"IF(MainRaw!J39=\"\", \"\", MainRaw!J39)","v":""},{"$f":"IF(MainRaw!K39=\"\", \"\", MainRaw!K39)","v":""},{"$f":"IF(MainRaw!L39=\"\", \"\", MainRaw!L39)","v":""},{"$f":"IF(MainRaw!M39=\"\", \"\", MainRaw!M39)","v":""},{"$f":"IF(MainRaw!R39=\"\", \"\", MainRaw!R39)","v":""},{"$f":"IF(MainRaw!S39=\"\", \"\", MainRaw!S39)","v":""}," -  - ",{"$f":"IF(MainRaw!L39=\"\", \"\", MainRaw!L39)","v":""},{"$f":"IF(MainRaw!M39=\"\", \"\", MainRaw!M39)","v":""},{"$f":"IF(MainRaw!N39=\"\", \"\", MainRaw!N39)","v":""},{"$f":"IF(MainRaw!O39=\"\", \"\", MainRaw!O39)","v":""},{"$f":"IF(MainRaw!P39=\"\", \"\", MainRaw!P39)","v":""},{"$f":"IF(MainRaw!Q39=\"\", \"\", MainRaw!Q39)","v":""}]
[{"$f":"IF(MainRaw!A40=\"\", \"\", MainRaw!A40)","v":""},{"$f":"IF(MainRaw!B40=\"\", \"\", MainRaw!B40)","v":""},{"$f":"IF(MainRaw!E40=\"\", \"\", MainRaw!E40)","v":""},{"$f":"IF(MainRaw!H40=\"\", \"\", MainRaw!H40)","v":""},{"$f":"IF(MainRaw!J40=\"\", \"\", MainRaw!J40)","v":""},{"$f":"IF(MainRaw!K40=\"\", \"\", MainRaw!K40)","v":""},{"$f":"IF(MainRaw!L40=\"\", \"\", MainRaw!L40)","v":""},{"$f":"IF(MainRaw!M40=\"\", \"\", MainRaw!M40)","v":""},{"$f":"IF(MainRaw!R40=\"\", \"\", MainRaw!R40)","v":""},{"$f":"IF(MainRaw!S40=\"\", \"\", MainRaw!S40)","v":""}," -  - ",{"$f":"IF(MainRaw!L40=\"\", \"\", MainRaw!L40)","v":""},{"$f":"IF(MainRaw!M40=\"\", \"\", MainRaw!M40)","v":""},{"$f":"IF(MainRaw!N40=\"\", \"\", MainRaw!N40)","v":""},{"$f":"IF(MainRaw!O40=\"\", \"\", MainRaw!O40)","v":""},{"$f":"IF(MainRaw!P40=\"\", \"\", MainRaw!P40)","v":""},{"$f":"IF(MainRaw!Q40=\"\", \"\", MainRaw!Q40)","v":""}]
[{"$f":"IF(MainRaw!A41=\"\", \"\", MainRaw!A41)","v":""},{"$f":"IF(MainRaw!B41=\"\", \"\", MainRaw!B41)","v":""},{"$f":"IF(MainRaw!E41=\"\", \"\", MainRaw!E41)","v":""},{"$f":"IF(MainRaw!H41=\"\", \"\", MainRaw!H41)","v":""},{"$f":"IF(MainRaw!J41=\"\", \"\", MainRaw!J41)","v":""},{"$f":"IF(MainRaw!K41=\"\", \"\", MainRaw!K41)","v":""},{"$f":"IF(MainRaw!L41=\"\", \"\", MainRaw!L41)","v":""},{"$f":"IF(MainRaw!M41=\"\", \"\", MainRaw!M41)","v":""},{"$f":"IF(MainRaw!R41=\"\", \"\", MainRaw!R41)","v":""},{"$f":"IF(MainRaw!S41=\"\", \"\", MainRaw!S41)","v":""}," -  - ",{"$f":"IF(MainRaw!L41=\"\", \"\", MainRaw!L41)","v":""},{"$f":"IF(MainRaw!M41=\"\", \"\", MainRaw!M41)","v":""},{"$f":"IF(MainRaw!N41=\"\", \"\", MainRaw!N41)","v":""},{"$f":"IF(MainRaw!O41=\"\", \"\", MainRaw!O41)","v":""},{"$f":"IF(MainRaw!P41=\"\", \"\", MainRaw!P41)","v":""},{"$f":"IF(MainRaw!Q41=\"\", \"\", MainRaw!Q41)","v":""}]
[{"$f":"IF(MainRaw!A42=\"\", \"\", MainRaw!A42)","v":""},{"$f":"IF(MainRaw!B42=\"\", \"\", MainRaw!B42)","v":""},{"$f":"IF(MainRaw!E42=\"\", \"\", MainRaw!E42)","v":""},{"$f":"IF(MainRaw!H42=\"\", \"\", MainRaw!H42)","v":""},{"$f":"IF(MainRaw!J42=\"\", \"\", MainRaw!J42)","v":""},{"$f":"IF(MainRaw!K42=\"\", \"\", MainRaw!K42)","v":""},{"$f":"IF(MainRaw!L42=\"\", \"\", MainRaw!L42)","v":""},{"$f":"IF(MainRaw!M42=\"\", \"\", MainRaw!M42)","v":""},{"$f":"IF(MainRaw!R42=\"\", \"\", MainRaw!R42)","v":""},{"$f":"IF(MainRaw!S42=\"\", \"\", MainRaw!S42)","v":""}," -  - ",{"$f":"IF(MainRaw!L42=\"\", \"\", MainRaw!L42)","v":""},{"$f":"IF(MainRaw!M42=\"\", \"\", MainRaw!M42)","v":""},{"$f":"IF(MainRaw!N42=\"\", \"\", MainRaw!N42)","v":""},{"$f":"IF(MainRaw!O42=\"\", \"\", MainRaw!O42)","v":""},{"$f":"IF(MainRaw!P42=\"\", \"\", MainRaw!P42)","v":""},{"$f":"IF(MainRaw!Q42=\"\", \"\", MainRaw!Q42)","v":""}]
[{"$f":"IF(MainRaw!A43=\"\", \"\", MainRaw!A43)","v":""},{"$f":"IF(MainRaw!B43=\"\", \"\", MainRaw!B43)","v":""},{"$f":"IF(MainRaw!E43=\"\", \"\", MainRaw!E43)","v":""},{"$f":"IF(MainRaw!H43=\"\", \"\", MainRaw!H43)","v":""},{"$f":"IF(MainRaw!J43=\"\", \"\", MainRaw!J43)","v":""},{"$f":"IF(MainRaw!K43=\"\", \"\", MainRaw!K43)","v":""},{"$f":"IF(MainRaw!L43=\"\", \"\", MainRaw!L43)","v":""},{"$f":"IF(MainRaw!M43=\"\", \"\", MainRaw!M43)","v":""},{"$f":"IF(MainRaw!R43=\"\", \"\", MainRaw!R43)","v":""},{"$f":"IF(MainRaw!S43=\"\", \"\", MainRaw!S43)","v":""}," -  - ",{"$f":"IF(MainRaw!L43=\"\", \"\", MainRaw!L43)","v":""},{"$f":"IF(MainRaw!M43=\"\", \"\", MainRaw!M43)","v":""},{"$f":"IF(MainRaw!N43=\"\", \"\", MainRaw!N43)","v":""},{"$f":"IF(MainRaw!O43=\"\", \"\", MainRaw!O43)","v":""},{"$f":"IF(MainRaw!P43=\"\", \"\", MainRaw!P43)","v":""},{"$f":"IF(MainRaw!Q43=\"\", \"\", MainRaw!Q43)","v":""}]
[{"$f":"IF(MainRaw!A44=\"\", \"\", MainRaw!A44)","v":""},{"$f":"IF(MainRaw!B44=\"\", \"\", MainRaw!B44)","v":""},{"$f":"IF(MainRaw!E44=\"\", \"\", MainRaw!E44)","v":""},{"$f":"IF(MainRaw!H44=\"\", \"\", MainRaw!H44)","v":""},{"$f":"IF(MainRaw!J44=\"\", \"\", MainRaw!J44)","v":""},{"$f":"IF(MainRaw!K44=\"\", \"\", MainRaw!K44)","v":""},{"$f":"IF(MainRaw!L44=\"\", \"\", MainRaw!L44)","v":""},{"$f":"IF(MainRaw!M44=\"\", \"\", MainRaw!M44)","v":""},{"$f":"IF(MainRaw!R44=\"\", \"\", MainRaw!R44)","v":""},{"$f":"IF(MainRaw!S44=\"\", \"\", MainRaw!S44)","v":""}," -  - ",{"$f":"IF(MainRaw!L44=\"\", \"\", MainRaw!L44)","v":""},{"$f":"IF(MainRaw!M44=\"\", \"\", MainRaw!M44)","v":""},{"$f":"IF(MainRaw!N44=\"\", \"\", MainRaw!N44)","v":""},{"$f":"IF(MainRaw!O44=\"\", \"\", MainRaw!O44)","v":""},{"$f":"IF(MainRaw!P44=\"\", \"\", MainRaw!P44)","v":""},{"$f":"IF(MainRaw!Q44=\"\", \"\", MainRaw!Q44)","v":""}]
[{"$f":"IF(MainRaw!A45=\"\", \"\", MainRaw!A45)","v":""},{"$f":"IF(MainRaw!B45=\"\", \"\", MainRaw!B45)","v":""},{"$f":"IF(MainRaw!E45=\"\", \"\", MainRaw!E45)","v":""},{"$f":"IF(MainRaw!H45=\"\", \"\", MainRaw!H45)","v":""},{"$f":"IF(MainRaw!J45=\"\", \"\", MainRaw!J45)","v":""},{"$f":"IF(MainRaw!K45=\"\", \"\", MainRaw!K45)","v":""},{"$f":"IF(MainRaw!L45=\"\", \"\", MainRaw!L45)","v":""},{"$f":"IF(MainRaw!M45=\"\", \"\", MainRaw!M45)","v":""},{"$f":"IF(MainRaw!R45=\"\", \"\", MainRaw!R45)","v":""},{"$f":"IF(MainRaw!S45=\"\", \"\", MainRaw!S45)","v":""}," -  - ",{"$f":"IF(MainRaw!L45=\"\", \"\", MainRaw!L45)","v":""},{"$f":"IF(MainRaw!M45=\"\", \"\", MainRaw!M45)","v":""},{"$f":"IF(MainRaw!N45=\"\", \"\", MainRaw!N45)","v":""},{"$f":"IF(MainRaw!O45=\"\", \"\", MainRaw!O45)","v":""},{"$f":"IF(MainRaw!P45=\"\", \"\", MainRaw!P45)","v":""},{"$f":"IF(MainRaw!Q45=\"\", \"\", MainRaw!Q45)","v":""}]
[{"$f":"IF(MainRaw!A46=\"\", \"\", MainRaw!A46)","v":""},{"$f":"IF(MainRaw!B46=\"\", \"\", MainRaw!B46)","v":""},{"$f":"IF(MainRaw!E46=\"\", \"\", MainRaw!E46)","v":""},{"$f":"IF(MainRaw!H46=\"\", \"\", MainRaw!H46)","v":""},{"$f":"IF(MainRaw!J46=\"\", \"\", MainRaw!J46)","v":""},{"$f":"IF(MainRaw!K46=\"\", \"\", MainRaw!K46)","v":""},{"$f":"IF(MainRaw!L46=\"\", \"\", MainRaw!L46)","v":""},{"$f":"IF(MainRaw!M46=\"\", \"\", MainRaw!M46)","v":""},{"$f":"IF(MainRaw!R46=\"\", \"\", MainRaw!R46)","v":""},{"$f":"IF(MainRaw!S46=\"\", \"\", MainRaw!S46)","v":""}," -  - ",{"$f":"IF(MainRaw!L46=\"\", \"\", MainRaw!L46)","v":""},{"$f":"IF(MainRaw!M46=\"\", \"\", MainRaw!M46)","v":""},{"$f":"IF(MainRaw!N46=\"\", \"\", MainRaw!N46)","v":""},{"$f":"IF(MainRaw!O46=\"\", \"\", MainRaw!O46)","v":""},{"$f":"IF(MainRaw!P46=\"\", \"\", MainRaw!P46)","v":""},{"$f":"IF(MainRaw!Q46=\"\", \"\", MainRaw!Q46)","v":""}]
[{"$f":"IF(MainRaw!A47=\"\", \"\", MainRaw!A47)","v":""},{"$f":"IF(MainRaw!B47=\"\", \"\", MainRaw!B47)","v":""},{"$f":"IF(MainRaw!E47=\"\", \"\", MainRaw!E47)","v":""},{"$f":"IF(MainRaw!H47=\"\", \"\", MainRaw!H47)","v":""},{"$f":"IF(MainRaw!J47=\"\", \"\", MainRaw!J47)","v":""},{"$f":"IF(MainRaw!K47=\"\", \"\", MainRaw!K47)","v":""},{"$f":"IF(MainRaw!L47=\"\", \"\", MainRaw!L47)","v":""},{"$f":"IF(MainRaw!M47=\"\", \"\", MainRaw!M47)","v":""},{"$f":"IF(MainRaw!R47=\"\", \"\", MainRaw!R47)","v":""},{"$f":"IF(MainRaw!S47=\"\", \"\", MainRaw!S47)","v":""}," -  - ",{"$f":"IF(MainRaw!L47=\"\", \"\", MainRaw!L47)","v":""},{"$f":"IF(MainRaw!M47=\"\", \"\", MainRaw!M47)","v":""},{"$f":"IF(MainRaw!N47=\"\", \"\", MainRaw!N47)","v":""},{"$f":"IF(MainRaw!O47=\"\", \"\", MainRaw!O47)","v":""},{"$f":"IF(MainRaw!P47=\"\", \"\", MainRaw!P47)","v":""},{"$f":"IF(MainRaw!Q47=\"\", \"\", MainRaw!Q47)","v":""}]
[{"$f":"IF(MainRaw!A48=\"\", \"\", MainRaw!A48)","v":""},{"$f":"IF(MainRaw!B48=\"\", \"\", MainRaw!B48)","v":""},{"$f":"IF(MainRaw!E48=\"\", \"\", MainRaw!E48)","v":""},{"$f":"IF(MainRaw!H48=\"\", \"\", MainRaw!H48)","v":""},{"$f":"IF(MainRaw!J48=\"\", \"\", MainRaw!J48)","v":""},{"$f":"IF(MainRaw!K48=\"\", \"\", MainRaw!K48)","v":""},{"$f":"IF(MainRaw!L48=\"\", \"\", MainRaw!L48)","v":""},{"$f":"IF(MainRaw!M48=\"\", \"\", MainRaw!M48)","v":""},{"$f":"IF(MainRaw!R48=\"\", \"\", MainRaw!R48)","v":""},{"$f":"IF(MainRaw!S48=\"\", \"\", MainRaw!S48)","v":""}," -  - ",{"$f":"IF(MainRaw!L48=\"\", \"\", MainRaw!L48)","v":""},{"$f":"IF(MainRaw!M48=\"\", \"\", MainRaw!M48)","v":""},{"$f":"IF(MainRaw!N48=\"\", \"\", MainRaw!N48)","v":""},{"$f":"IF(MainRaw!O48=\"\", \"\", MainRaw!O48)","v":""},{"$f":"IF(MainRaw!P48=\"\", \"\", MainRaw!P48)","v":""},{"$f":"IF(MainRaw!Q48=\"\", \"\", MainRaw!Q48)","v":""}]
[{"$f":"IF(MainRaw!A49=\"\", \"\", MainRaw!A49)","v":""},{"$f":"IF(MainRaw!B49=\"\", \"\", MainRaw!B49)","v":""},{"$f":"IF(MainRaw!E49=\"\", \"\", MainRaw!E49)","v":""},{"$f":"IF(MainRaw!H49=\"\", \"\", MainRaw!H49)","v":""},{"$f":"IF(MainRaw!J49=\"\", \"\", MainRaw!J49)","v":""},{"$f":"IF(MainRaw!K49=\"\", \"\", MainRaw!K49)","v":""},{"$f":"IF(MainRaw!L49=\"\", \"\", MainRaw!L49)","v":""},{"$f":"IF(MainRaw!M49=\"\", \"\", MainRaw!M49)","v":""},{"$f":"IF(MainRaw!R49=\"\", \"\", MainRaw!R49)","v":""},{"$f":"IF(MainRaw!S49=\"\", \"\", MainRaw!S49)","v":""}," -  - ",{"$f":"IF(MainRaw!L49=\"\", \"\", MainRaw!L49)","v":""},{"$f":"IF(MainRaw!M49=\"\", \"\", MainRaw!M49)","v":""},{"$f":"IF(MainRaw!N49=\"\", \"\", MainRaw!N49)","v":""},{"$f":"IF(MainRaw!O49=\"\", \"\", MainRaw!O49)","v":""},{"$f":"IF(MainRaw!P49=\"\", \"\", MainRaw!P49)","v":""},{"$f":"IF(MainRaw!Q49=\"\", \"\", MainRaw!Q49)","v":""}]
[{"$f":"IF(MainRaw!A50=\"\", \"\", MainRaw!A50)","v":""},{"$f":"IF(MainRaw!B50=\"\", \"\", MainRaw!B50)","v":""},{"$f":"IF(MainRaw!E50=\"\", \"\", MainRaw!E50)","v":""},{"$f":"IF(MainRaw!H50=\"\", \"\", MainRaw!H50)","v":""},{"$f":"IF(MainRaw!J50=\"\", \"\", MainRaw!J50)","v":""},{"$f":"IF(MainRaw!K50=\"\", \"\", MainRaw!K50)","v":""},{"$f":"IF(MainRaw!L50=\"\", \"\", MainRaw!L50)","v":""},{"$f":"IF(MainRaw!M50=\"\", \"\", MainRaw!M50)","v":""},{"$f":"IF(MainRaw!R50=\"\", \"\", MainRaw!R50)","v":""},{"$f":"IF(MainRaw!S50=\"\", \"\", MainRaw!S50)","v":""}," -  - ",{"$f":"IF(MainRaw!L50=\"\", \"\", MainRaw!L50)","v":""},{"$f":"IF(MainRaw!M50=\"\", \"\", MainRaw!M50)","v":""},{"$f":"IF(MainRaw!N50=\"\", \"\", MainRaw!N50)","v":""},{"$f":"IF(MainRaw!O50=\"\", \"\", MainRaw!O50)","v":""},{"$f":"IF(MainRaw!P50=\"\", \"\", MainRaw!P50)","v":""},{"$f":"IF(MainRaw!Q50=\"\", \"\", MainRaw!Q50)","v":""}]
[{"$f":"IF(MainRaw!A51=\"\", \"\", MainRaw!A51)","v":""},{"$f":"IF(MainRaw!B51=\"\", \"\", MainRaw!B51)","v":""},{"$f":"IF(MainRaw!E51=\"\", \"\", MainRaw!E51)","v":""},{"$f":"IF(MainRaw!H51=\"\", \"\", MainRaw!H51)","v":""},{"$f":"IF(MainRaw!J51=\"\", \"\", MainRaw!J51)","v":""},{"$f":"IF(MainRaw!K51=\"\", \"\", MainRaw!K51)","v":""},{"$f":"IF(MainRaw!L51=\"\", \"\", MainRaw!L51)","v":""},{"$f":"IF(MainRaw!M51=\"\", \"\", MainRaw!M51)","v":""},{"$f":"IF(MainRaw!R51=\"\", \"\", MainRaw!R51)","v":""},{"$f":"IF(MainRaw!S51=\"\", \"\", MainRaw!S51)","v":""}," -  - ",{"$f":"IF(MainRaw!L51=\"\", \"\", MainRaw!L51)","v":""},{"$f":"IF(MainRaw!M51=\"\", \"\", MainRaw!M51)","v":""},{"$f":"IF(MainRaw!N51=\"\", \"\", MainRaw!N51)","v":""},{"$f":"IF(MainRaw!O51=\"\", \"\", MainRaw!O51)","v":""},{"$f":"IF(MainRaw!P51=\"\", \"\", MainRaw!P51)","v":""},{"$f":"IF(MainRaw!Q51=\"\", \"\", MainRaw!Q51)","v":""}]
[{"$f":"IF(MainRaw!A52=\"\", \"\", MainRaw!A52)","v":""},{"$f":"IF(MainRaw!B52=\"\", \"\", MainRaw!B52)","v":""},{"$f":"IF(MainRaw!E52=\"\", \"\", MainRaw!E52)","v":""},{"$f":"IF(MainRaw!H52=\"\", \"\", MainRaw!H52)","v":""},{"$f":"IF(MainRaw!J52=\"\", \"\", MainRaw!J52)","v":""},{"$f":"IF(MainRaw!K52=\"\", \"\", MainRaw!K52)","v":""},{"$f":"IF(MainRaw!L52=\"\", \"\", MainRaw!L52)","v":""},{"$f":"IF(MainRaw!M52=\"\", \"\", MainRaw!M52)","v":""},{"$f":"IF(MainRaw!R52=\"\", \"\", MainRaw!R52)","v":""},{"$f":"IF(MainRaw!S52=\"\", \"\", MainRaw!S52)","v":""}," -  - ",{"$f":"IF(MainRaw!L52=\"\", \"\", MainRaw!L52)","v":""},{"$f":"IF(MainRaw!M52=\"\", \"\", MainRaw!M52)","v":""},{"$f":"IF(MainRaw!N52=\"\", \"\", MainRaw!N52)","v":""},{"$f":"IF(MainRaw!O52=\"\", \"\", MainRaw!O52)","v":""},{"$f":"IF(MainRaw!P52=\"\", \"\", MainRaw!P52)","v":""},{"$f":"IF(MainRaw!Q52=\"\", \"\", MainRaw!Q52)","v":""}]
[{"$f":"IF(MainRaw!A53=\"\", \"\", MainRaw!A53)","v":""},{"$f":"IF(MainRaw!B53=\"\", \"\", MainRaw!B53)","v":""},{"$f":"IF(MainRaw!E53=\"\", \"\", MainRaw!E53)","v":""},{"$f":"IF(MainRaw!H53=\"\", \"\", MainRaw!H53)","v":""},{"$f":"IF(MainRaw!J53=\"\", \"\", MainRaw!J53)","v":""},{"$f":"IF(MainRaw!K53=\"\", \"\", MainRaw!K53)","v":""},{"$f":"IF(MainRaw!L53=\"\", \"\", MainRaw!L53)","v":""},{"$f":"IF(MainRaw!M53=\"\", \"\", MainRaw!M53)","v":""},{"$f":"IF(MainRaw!R53=\"\", \"\", MainRaw!R53)","v":""},{"$f":"IF(MainRaw!S53=\"\", \"\", MainRaw!S53)","v":""}," -  - ",{"$f":"IF(MainRaw!L53=\"\", \"\", MainRaw!L53)","v":""},{"$f":"IF(MainRaw!M53=\"\", \"\", MainRaw!M53)","v":""},{"$f":"IF(MainRaw!N53=\"\", \"\", MainRaw!N53)","v":""},{"$f":"IF(MainRaw!O53=\"\", \"\", MainRaw!O53)","v":""},{"$f":"IF(MainRaw!P53=\"\", \"\", MainRaw!P53)","v":""},{"$f":"IF(MainRaw!Q53=\"\", \"\", MainRaw!Q53)","v":""}]
[{"$f":"IF(MainRaw!A54=\"\", \"\", MainRaw!A54)","v":""},{"$f":"IF(MainRaw!B54=\"\", \"\", MainRaw!B54)","v":""},{"$f":"IF(MainRaw!E54=\"\", \"\", MainRaw!E54)","v":""},{"$f":"IF(MainRaw!H54=\"\", \"\", MainRaw!H54)","v":""},{"$f":"IF(MainRaw!J54=\"\", \"\", MainRaw!J54)","v":""},{"$f":"IF(MainRaw!K54=\"\", \"\", MainRaw!K54)","v":""},{"$f":"IF(MainRaw!L54=\"\", \"\", MainRaw!L54)","v":""},{"$f":"IF(MainRaw!M54=\"\", \"\", MainRaw!M54)","v":""},{"$f":"IF(MainRaw!R54=\"\", \"\", MainRaw!R54)","v":""},{"$f":"IF(MainRaw!S54=\"\", \"\", MainRaw!S54)","v":""}," -  - ",{"$f":"IF(MainRaw!L54=\"\", \"\", MainRaw!L54)","v":""},{"$f":"IF(MainRaw!M54=\"\", \"\", MainRaw!M54)","v":""},{"$f":"IF(MainRaw!N54=\"\", \"\", MainRaw!N54)","v":""},{"$f":"IF(MainRaw!O54=\"\", \"\", MainRaw!O54)","v":""},{"$f":"IF(MainRaw!P54=\"\", \"\", MainRaw!P54)","v":""},{"$f":"IF(MainRaw!Q54=\"\", \"\", MainRaw!Q54)","v":""}]
[{"$f":"IF(MainRaw!A55=\"\", \"\", MainRaw!A55)","v":""},{"$f":"IF(MainRaw!B55=\"\", \"\", MainRaw!B55)","v":""},{"$f":"IF(MainRaw!E55=\"\", \"\", MainRaw!E55)","v":""},{"$f":"IF(MainRaw!H55=\"\", \"\", MainRaw!H55)","v":""},{"$f":"IF(MainRaw!J55=\"\", \"\", MainRaw!J55)","v":""},{"$f":"IF(MainRaw!K55=\"\", \"\", MainRaw!K55)","v":""},{"$f":"IF(MainRaw!L55=\"\", \"\", MainRaw!L55)","v":""},{"$f":"IF(MainRaw!M55=\"\", \"\", MainRaw!M55)","v":""},{"$f":"IF(MainRaw!R55=\"\", \"\", MainRaw!R55)","v":""},{"$f":"IF(MainRaw!S55=\"\", \"\", MainRaw!S55)","v":""}," -  - ",{"$f":"IF(MainRaw!L55=\"\", \"\", MainRaw!L55)","v":""},{"$f":"IF(MainRaw!M55=\"\", \"\", MainRaw!M55)","v":""},{"$f":"IF(MainRaw!N55=\"\", \"\", MainRaw!N55)","v":""},{"$f":"IF(MainRaw!O55=\"\", \"\", MainRaw!O55)","v":""},{"$f":"IF(MainRaw!P55=\"\", \"\", MainRaw!P55)","v":""},{"$f":"IF(MainRaw!Q55=\"\", \"\", MainRaw!Q55)","v":""}]
[{"$f":"IF(MainRaw!A56=\"\", \"\", MainRaw!A56)","v":""},{"$f":"IF(MainRaw!B56=\"\", \"\", MainRaw!B56)","v":""},{"$f":"IF(MainRaw!E56=\"\", \"\", MainRaw!E56)","v":""},{"$f":"IF(MainRaw!H56=\"\", \"\", MainRaw!H56)","v":""},{"$f":"IF(MainRaw!J56=\"\", \"\", MainRaw!J56)","v":""},{"$f":"IF(MainRaw!K56=\"\", \"\", MainRaw!K56)","v":""},{"$f":"IF(MainRaw!L56=\"\", \"\", MainRaw!L56)","v":""},{"$f":"IF(MainRaw!M56=\"\", \"\", MainRaw!M56)","v":""},{"$f":"IF(MainRaw!R56=\"\", \"\", MainRaw!R56)","v":""},{"$f":"IF(MainRaw!S56=\"\", \"\", MainRaw!S56)","v":""}," -  - ",{"$f":"IF(MainRaw!L56=\"\", \"\", MainRaw!L56)","v":""},{"$f":"IF(MainRaw!M56=\"\", \"\", MainRaw!M56)","v":""},{"$f":"IF(MainRaw!N56=\"\", \"\", MainRaw!N56)","v":""},{"$f":"IF(MainRaw!O56=\"\", \"\", MainRaw!O56)","v":""},{"$f":"IF(MainRaw!P56=\"\", \"\", MainRaw!P56)","v":""},{"$f":"IF(MainRaw!Q56=\"\", \"\", MainRaw!Q56)","v":""}]
[{"$f":"IF(MainRaw!A57=\"\", \"\", MainRaw!A57)","v":""},{"$f":"IF(MainRaw!B57=\"\", \"\", MainRaw!B57)","v":""},{"$f":"IF(MainRaw!E57=\"\", \"\", MainRaw!E57)","v":""},{"$f":"IF(MainRaw!H57=\"\", \"\", MainRaw!H57)","v":""},{"$f":"IF(MainRaw!J57=\"\", \"\", MainRaw!J57)","v":""},{"$f":"IF(MainRaw!K57=\"\", \"\", MainRaw!K57)","v":""},{"$f":"IF(MainRaw!L57=\"\", \"\", MainRaw!L57)","v":""},{"$f":"IF(MainRaw!M57=\"\", \"\", MainRaw!M57)","v":""},{"$f":"IF(MainRaw!R57=\"\", \"\", MainRaw!R57)","v":""},{"$f":"IF(MainRaw!S57=\"\", \"\", MainRaw!S57)","v":""}," -  - ",{"$f":"IF(MainRaw!L57=\"\", \"\", MainRaw!L57)","v":""},{"$f":"IF(MainRaw!M57=\"\", \"\", MainRaw!M57)","v":""},{"$f":"IF(MainRaw!N57=\"\", \"\", MainRaw!N57)","v":""},{"$f":"IF(MainRaw!O57=\"\", \"\", MainRaw!O57)","v":""},{"$f":"IF(MainRaw!P57=\"\", \"\", MainRaw!P57)","v":""},{"$f":"IF(MainRaw!Q57=\"\", \"\", MainRaw!Q57)","v":""}]
[{"$f":"IF(MainRaw!A58=\"\", \"\", MainRaw!A58)","v":""},{"$f":"IF(MainRaw!B58=\"\", \"\", MainRaw!B58)","v":""},{"$f":"IF(MainRaw!E58=\"\", \"\", MainRaw!E58)","v":""},{"$f":"IF(MainRaw!H58=\"\", \"\", MainRaw!H58)","v":""},{"$f":"IF(MainRaw!J58=\"\", \"\", MainRaw!J58)","v":""},{"$f":"IF(MainRaw!K58=\"\", \"\", MainRaw!K58)","v":""},{"$f":"IF(MainRaw!L58=\"\", \"\", MainRaw!L58)","v":""},{"$f":"IF(MainRaw!M58=\"\", \"\", MainRaw!M58)","v":""},{"$f":"IF(MainRaw!R58=\"\", \"\", MainRaw!R58)","v":""},{"$f":"IF(MainRaw!S58=\"\", \"\", MainRaw!S58)","v":""}," -  - ",{"$f":"IF(MainRaw!L58=\"\", \"\", MainRaw!L58)","v":""},{"$f":"IF(MainRaw!M58=\"\", \"\", MainRaw!M58)","v":""},{"$f":"IF(MainRaw!N58=\"\", \"\", MainRaw!N58)","v":""},{"$f":"IF(MainRaw!O58=\"\", \"\", MainRaw!O58)","v":""},{"$f":"IF(MainRaw!P58=\"\", \"\", MainRaw!P58)","v":""},{"$f":"IF(MainRaw!Q58=\"\", \"\", MainRaw!Q58)","v":""}]
[{"$f":"IF(MainRaw!A59=\"\", \"\", MainRaw!A59)","v":""},{"$f":"IF(MainRaw!B59=\"\", \"\", MainRaw!B59)","v":""},{"$f":"IF(MainRaw!E59=\"\", \"\", MainRaw!E59)","v":""},{"$f":"IF(MainRaw!H59=\"\", \"\", MainRaw!H59)","v":""},{"$f":"IF(MainRaw!J59=\"\", \"\", MainRaw!J59)","v":""},{"$f":"IF(MainRaw!K59=\"\", \"\", MainRaw!K59)","v":""},{"$f":"IF(MainRaw!L59=\"\", \"\", MainRaw!L59)","v":""},{"$f":"IF(MainRaw!M59=\"\", \"\", MainRaw!M59)","v":""},{"$f":"IF(MainRaw!R59=\"\", \"\", MainRaw!R59)","v":""},{"$f":"IF(MainRaw!S59=\"\", \"\", MainRaw!S59)","v":""}," -  - ",{"$f":"IF(MainRaw!L59=\"\", \"\", MainRaw!L59)","v":""},{"$f":"IF(MainRaw!M59=\"\", \"\", MainRaw!M59)","v":""},{"$f":"IF(MainRaw!N59=\"\", \"\", MainRaw!N59)","v":""},{"$f":"IF(MainRaw!O59=\"\", \"\", MainRaw!O59)","v":""},{"$f":"IF(MainRaw!P59=\"\", \"\", MainRaw!P59)","v":""},{"$f":"IF(MainRaw!Q59=\"\", \"\", MainRaw!Q59)","v":""}]
[{"$f":"IF(MainRaw!A60=\"\", \"\", MainRaw!A60)","v":""},{"$f":"IF(MainRaw!B60=\"\", \"\", MainRaw!B60)","v":""},{"$f":"IF(MainRaw!E60=\"\", \"\", MainRaw!E60)","v":""},{"$f":"IF(MainRaw!H60=\"\", \"\", MainRaw!H60)","v":""},{"$f":"IF(MainRaw!J60=\"\", \"\", MainRaw!J60)","v":""},{"$f":"IF(MainRaw!K60=\"\", \"\", MainRaw!K60)","v":""},{"$f":"IF(MainRaw!L60=\"\", \"\", MainRaw!L60)","v":""},{"$f":"IF(MainRaw!M60=\"\", \"\", MainRaw!M60)","v":""},{"$f":"IF(MainRaw!R60=\"\", \"\", MainRaw!R60)","v":""},{"$f":"IF(MainRaw!S60=\"\", \"\", MainRaw!S60)","v":""}," -  - ",{"$f":"IF(MainRaw!L60=\"\", \"\", MainRaw!L60)","v":""},{"$f":"IF(MainRaw!M60=\"\", \"\", MainRaw!M60)","v":""},{"$f":"IF(MainRaw!N60=\"\", \"\", MainRaw!N60)","v":""},{"$f":"IF(MainRaw!O60=\"\", \"\", MainRaw!O60)","v":""},{"$f":"IF(MainRaw!P60=\"\", \"\", MainRaw!P60)","v":""},{"$f":"IF(MainRaw!Q60=\"\", \"\", MainRaw!Q60)","v":""}]
[{"$f":"IF(MainRaw!A61=\"\", \"\", MainRaw!A61)","v":""},{"$f":"IF(MainRaw!B61=\"\", \"\", MainRaw!B61)","v":""},{"$f":"IF(MainRaw!E61=\"\", \"\", MainRaw!E61)","v":""},{"$f":"IF(MainRaw!H61=\"\", \"\", MainRaw!H61)","v":""},{"$f":"IF(MainRaw!J61=\"\", \"\", MainRaw!J61)","v":""},{"$f":"IF(MainRaw!K61=\"\", \"\", MainRaw!K61)","v":""},{"$f":"IF(MainRaw!L61=\"\", \"\", MainRaw!L61)","v":""},{"$f":"IF(MainRaw!M61=\"\", \"\", MainRaw!M61)","v":""},{"$f":"IF(MainRaw!R61=\"\", \"\", MainRaw!R61)","v":""},{"$f":"IF(MainRaw!S61=\"\", \"\", MainRaw!S61)","v":""}," -  - ",{"$f":"IF(MainRaw!L61=\"\", \"\", MainRaw!L61)","v":""},{"$f":"IF(MainRaw!M61=\"\", \"\", MainRaw!M61)","v":""},{"$f":"IF(MainRaw!N61=\"\", \"\", MainRaw!N61)","v":""},{"$f":"IF(MainRaw!O61=\"\", \"\", MainRaw!O61)","v":""},{"$f":"IF(MainRaw!P61=\"\", \"\", MainRaw!P61)","v":""},{"$f":"IF(MainRaw!Q61=\"\", \"\", MainRaw!Q61)","v":""}]
[{"$f":"IF(MainRaw!A62=\"\", \"\", MainRaw!A62)","v":""},{"$f":"IF(MainRaw!B62=\"\", \"\", MainRaw!B62)","v":""},{"$f":"IF(MainRaw!E62=\"\", \"\", MainRaw!E62)","v":""},{"$f":"IF(MainRaw!H62=\"\", \"\", MainRaw!H62)","v":""},{"$f":"IF(MainRaw!J62=\"\", \"\", MainRaw!J62)","v":""},{"$f":"IF(MainRaw!K62=\"\", \"\", MainRaw!K62)","v":""},{"$f":"IF(MainRaw!L62=\"\", \"\", MainRaw!L62)","v":""},{"$f":"IF(MainRaw!M62=\"\", \"\", MainRaw!M62)","v":""},{"$f":"IF(MainRaw!R62=\"\", \"\", MainRaw!R62)","v":""},{"$f":"IF(MainRaw!S62=\"\", \"\", MainRaw!S62)","v":""}," -  - ",{"$f":"IF(MainRaw!L62=\"\", \"\", MainRaw!L62)","v":""},{"$f":"IF(MainRaw!M62=\"\", \"\", MainRaw!M62)","v":""},{"$f":"IF(MainRaw!N62=\"\", \"\", MainRaw!N62)","v":""},{"$f":"IF(MainRaw!O62=\"\", \"\", MainRaw!O62)","v":""},{"$f":"IF(MainRaw!P62=\"\", \"\", MainRaw!P62)","v":""},{"$f":"IF(MainRaw!Q62=\"\", \"\", MainRaw!Q62)","v":""}]
[{"$f":"IF(MainRaw!A63=\"\", \"\", MainRaw!A63)","v":""},{"$f":"IF(MainRaw!B63=\"\", \"\", MainRaw!B63)","v":""},{"$f":"IF(MainRaw!E63=\"\", \"\", MainRaw!E63)","v":""},{"$f":"IF(MainRaw!H63=\"\", \"\", MainRaw!H63)","v":""},{"$f":"IF(MainRaw!J63=\"\", \"\", MainRaw!J63)","v":""},{"$f":"IF(MainRaw!K63=\"\", \"\", MainRaw!K63)","v":""},{"$f":"IF(MainRaw!L63=\"\", \"\", MainRaw!L63)","v":""},{"$f":"IF(MainRaw!M63=\"\", \"\", MainRaw!M63)","v":""},{"$f":"IF(MainRaw!R63=\"\", \"\", MainRaw!R63)","v":""},{"$f":"IF(MainRaw!S63=\"\", \"\", MainRaw!S63)","v":""}," -  - ",{"$f":"IF(MainRaw!L63=\"\", \"\", MainRaw!L63)","v":""},{"$f":"IF(MainRaw!M63=\"\", \"\", MainRaw!M63)","v":""},{"$f":"IF(MainRaw!N63=\"\", \"\", MainRaw!N63)","v":""},{"$f":"IF(MainRaw!O63=\"\", \"\", MainRaw!O63)","v":""},{"$f":"IF(MainRaw!P63=\"\", \"\", MainRaw!P63)","v":""},{"$f":"IF(MainRaw!Q63=\"\", \"\", MainRaw!Q63)","v":""}]
[{"$f":"IF(MainRaw!A64=\"\", \"\", MainRaw!A64)","v":""},{"$f":"IF(MainRaw!B64=\"\", \"\", MainRaw!B64)","v":""},{"$f":"IF(MainRaw!E64=\"\", \"\", MainRaw!E64)","v":""},{"$f":"IF(MainRaw!H64=\"\", \"\", MainRaw!H64)","v":""},{"$f":"IF(MainRaw!J64=\"\", \"\", MainRaw!J64)","v":""},{"$f":"IF(MainRaw!K64=\"\", \"\", MainRaw!K64)","v":""},{"$f":"IF(MainRaw!L64=\"\", \"\", MainRaw!L64)","v":""},{"$f":"IF(MainRaw!M64=\"\", \"\", MainRaw!M64)","v":""},{"$f":"IF(MainRaw!R64=\"\", \"\", MainRaw!R64)","v":""},{"$f":"IF(MainRaw!S64=\"\", \"\", MainRaw!S64)","v":""}," -  - ",{"$f":"IF(MainRaw!L64=\"\", \"\", MainRaw!L64)","v":""},{"$f":"IF(MainRaw!M64=\"\", \"\", MainRaw!M64)","v":""},{"$f":"IF(MainRaw!N64=\"\", \"\", MainRaw!N64)","v":""},{"$f":"IF(MainRaw!O64=\"\", \"\", MainRaw!O64)","v":""},{"$f":"IF(MainRaw!P64=\"\", \"\", MainRaw!P64)","v":""},{"$f":"IF(MainRaw!Q64=\"\", \"\", MainRaw!Q64)","v":""}]
[{"$f":"IF(MainRaw!A65=\"\", \"\", MainRaw!A65)","v":""},{"$f":"IF(MainRaw!B65=\"\", \"\", MainRaw!B65)","v":""},{"$f":"IF(MainRaw!E65=\"\", \"\", MainRaw!E65)","v":""},{"$f":"IF(MainRaw!H65=\"\", \"\", MainRaw!H65)","v":""},{"$f":"IF(MainRaw!J65=\"\", \"\", MainRaw!J65)","v":""},{"$f":"IF(MainRaw!K65=\"\", \"\", MainRaw!K65)","v":""},{"$f":"IF(MainRaw!L65=\"\", \"\", MainRaw!L65)","v":""},{"$f":"IF(MainRaw!M65=\"\", \"\", MainRaw!M65)","v":""},{"$f":"IF(MainRaw!R65=\"\", \"\", MainRaw!R65)","v":""},{"$f":"IF(MainRaw!S65=\"\", \"\", MainRaw!S65)","v":""}," -  - ",{"$f":"IF(MainRaw!L65=\"\", \"\", MainRaw!L65)","v":""},{"$f":"IF(MainRaw!M65=\"\", \"\", MainRaw!M65)","v":""},{"$f":"IF(MainRaw!N65=\"\", \"\", MainRaw!N65)","v":""},{"$f":"IF(MainRaw!O65=\"\", \"\", MainRaw!O65)","v":""},{"$f":"IF(MainRaw!P65=\"\", \"\", MainRaw!P65)","v":""},{"$f":"IF(MainRaw!Q65=\"\", \"\", MainRaw!Q65)","v":""}]
[{"$f":"IF(MainRaw!A66=\"\", \"\", MainRaw!A66)","v":""},{"$f":"IF(MainRaw!B66=\"\", \"\", MainRaw!B66)","v":""},{"$f":"IF(MainRaw!E66=\"\", \"\", MainRaw!E66)","v":""},{"$f":"IF(MainRaw!H66=\"\", \"\", MainRaw!H66)","v":""},{"$f":"IF(MainRaw!J66=\"\", \"\", MainRaw!J66)","v":""},{"$f":"IF(MainRaw!K66=\"\", \"\", MainRaw!K66)","v":""},{"$f":"IF(MainRaw!L66=\"\", \"\", MainRaw!L66)","v":""},{"$f":"IF(MainRaw!M66=\"\", \"\", MainRaw!M66)","v":""},{"$f":"IF(MainRaw!R66=\"\", \"\", MainRaw!R66)","v":""},{"$f":"IF(MainRaw!S66=\"\", \"\", MainRaw!S66)","v":""}," -  - ",{"$f":"IF(MainRaw!L66=\"\", \"\", MainRaw!L66)","v":""},{"$f":"IF(MainRaw!M66=\"\", \"\", MainRaw!M66)","v":""},{"$f":"IF(MainRaw!N66=\"\", \"\", MainRaw!N66)","v":""},{"$f":"IF(MainRaw!O66=\"\", \"\", MainRaw!O66)","v":""},{"$f":"IF(MainRaw!P66=\"\", \"\", MainRaw!P66)","v":""},{"$f":"IF(MainRaw!Q66=\"\", \"\", MainRaw!Q66)","v":""}]
[{"$f":"IF(MainRaw!A67=\"\", \"\", MainRaw!A67)","v":""},{"$f":"IF(MainRaw!B67=\"\", \"\", MainRaw!B67)","v":""},{"$f":"IF(MainRaw!E67=\"\", \"\", MainRaw!E67)","v":""},{"$f":"IF(MainRaw!H67=\"\", \"\", MainRaw!H67)","v":""},{"$f":"IF(MainRaw!J67=\"\", \"\", MainRaw!J67)","v":""},{"$f":"IF(MainRaw!K67=\"\", \"\", MainRaw!K67)","v":""},{"$f":"IF(MainRaw!L67=\"\", \"\", MainRaw!L67)","v":""},{"$f":"IF(MainRaw!M67=\"\", \"\", MainRaw!M67)","v":""},{"$f":"IF(MainRaw!R67=\"\", \"\", MainRaw!R67)","v":""},{"$f":"IF(MainRaw!S67=\"\", \"\", MainRaw!S67)","v":""}," -  - ",{"$f":"IF(MainRaw!L67=\"\", \"\", MainRaw!L67)","v":""},{"$f":"IF(MainRaw!M67=\"\", \"\", MainRaw!M67)","v":""},{"$f":"IF(MainRaw!N67=\"\", \"\", MainRaw!N67)","v":""},{"$f":"IF(MainRaw!O67=\"\", \"\", MainRaw!O67)","v":""},{"$f":"IF(MainRaw!P67=\"\", \"\", MainRaw!P67)","v":""},{"$f":"IF(MainRaw!Q67=\"\", \"\", MainRaw!Q67)","v":""}]
[{"$f":"IF(MainRaw!A68=\"\", \"\", MainRaw!A68)","v":""},{"$f":"IF(MainRaw!B68=\"\", \"\", MainRaw!B68)","v":""},{"$f":"IF(MainRaw!E68=\"\", \"\", MainRaw!E68)","v":""},{"$f":"IF(MainRaw!H68=\"\", \"\", MainRaw!H68)","v":""},{"$f":"IF(MainRaw!J68=\"\", \"\", MainRaw!J68)","v":""},{"$f":"IF(MainRaw!K68=\"\", \"\", MainRaw!K68)","v":""},{"$f":"IF(MainRaw!L68=\"\", \"\", MainRaw!L68)","v":""},{"$f":"IF(MainRaw!M68=\"\", \"\", MainRaw!M68)","v":""},{"$f":"IF(MainRaw!R68=\"\", \"\", MainRaw!R68)","v":""},{"$f":"IF(MainRaw!S68=\"\", \"\", MainRaw!S68)","v":""}," -  - ",{"$f":"IF(MainRaw!L68=\"\", \"\", MainRaw!L68)","v":""},{"$f":"IF(MainRaw!M68=\"\", \"\", MainRaw!M68)","v":""},{"$f":"IF(MainRaw!N68=\"\", \"\", MainRaw!N68)","v":""},{"$f":"IF(MainRaw!O68=\"\", \"\", MainRaw!O68)","v":""},{"$f":"IF(MainRaw!P68=\"\", \"\", MainRaw!P68)","v":""},{"$f":"IF(MainRaw!Q68=\"\", \"\", MainRaw!Q68)","v":""}]
[{"$f":"IF(MainRaw!A69=\"\", \"\", MainRaw!A69)","v":""},{"$f":"IF(MainRaw!B69=\"\", \"\", MainRaw!B69)","v":""},{"$f":"IF(MainRaw!E69=\"\", \"\", MainRaw!E69)","v":""},{"$f":"IF(MainRaw!H69=\"\", \"\", MainRaw!H69)","v":""},{"$f":"IF(MainRaw!J69=\"\", \"\", MainRaw!J69)","v":""},{"$f":"IF(MainRaw!K69=\"\", \"\", MainRaw!K69)","v":""},{"$f":"IF(MainRaw!L69=\"\", \"\", MainRaw!L69)","v":""},{"$f":"IF(MainRaw!M69=\"\", \"\", MainRaw!M69)","v":""},{"$f":"IF(MainRaw!R69=\"\", \"\", MainRaw!R69)","v":""},{"$f":"IF(MainRaw!S69=\"\", \"\", MainRaw!S69)","v":""}," -  - ",{"$f":"IF(MainRaw!L69=\"\", \"\", MainRaw!L69)","v":""},{"$f":"IF(MainRaw!M69=\"\", \"\", MainRaw!M69)","v":""},{"$f":"IF(MainRaw!N69=\"\", \"\", MainRaw!N69)","v":""},{"$f":"IF(MainRaw!O69=\"\", \"\", MainRaw!O69)","v":""},{"$f":"IF(MainRaw!P69=\"\", \"\", MainRaw!P69)","v":""},{"$f":"IF(MainRaw!Q69=\"\", \"\", MainRaw!Q69)","v":""}]
[{"$f":"IF(MainRaw!A70=\"\", \"\", MainRaw!A70)","v":""},{"$f":"IF(MainRaw!B70=\"\", \"\", MainRaw!B70)","v":""},{"$f":"IF(MainRaw!E70=\"\", \"\", MainRaw!E70)","v":""},{"$f":"IF(MainRaw!H70=\"\", \"\", MainRaw!H70)","v":""},{"$f":"IF(MainRaw!J70=\"\", \"\", MainRaw!J70)","v":""},{"$f":"IF(MainRaw!K70=\"\", \"\", MainRaw!K70)","v":""},{"$f":"IF(MainRaw!L70=\"\", \"\", MainRaw!L70)","v":""},{"$f":"IF(MainRaw!M70=\"\", \"\", MainRaw!M70)","v":""},{"$f":"IF(MainRaw!R70=\"\", \"\", MainRaw!R70)","v":""},{"$f":"IF(MainRaw!S70=\"\", \"\", MainRaw!S70)","v":""}," -  - ",{"$f":"IF(MainRaw!L70=\"\", \"\", MainRaw!L70)","v":""},{"$f":"IF(MainRaw!M70=\"\", \"\", MainRaw!M70)","v":""},{"$f":"IF(MainRaw!N70=\"\", \"\", MainRaw!N70)","v":""},{"$f":"IF(MainRaw!O70=\"\", \"\", MainRaw!O70)","v":""},{"$f":"IF(MainRaw!P70=\"\", \"\", MainRaw!P70)","v":""},{"$f":"IF(MainRaw!Q70=\"\", \"\", MainRaw!Q70)","v":""}]
[{"$f":"IF(MainRaw!A71=\"\", \"\", MainRaw!A71)","v":""},{"$f":"IF(MainRaw!B71=\"\", \"\", MainRaw!B71)","v":""},{"$f":"IF(MainRaw!E71=\"\", \"\", MainRaw!E71)","v":""},{"$f":"IF(MainRaw!H71=\"\", \"\", MainRaw!H71)","v":""},{"$f":"IF(MainRaw!J71=\"\", \"\", MainRaw!J71)","v":""},{"$f":"IF(MainRaw!K71=\"\", \"\", MainRaw!K71)","v":""},{"$f":"IF(MainRaw!L71=\"\", \"\", MainRaw!L71)","v":""},{"$f":"IF(MainRaw!M71=\"\", \"\", MainRaw!M71)","v":""},{"$f":"IF(MainRaw!R71=\"\", \"\", MainRaw!R71)","v":""},{"$f":"IF(MainRaw!S71=\"\", \"\", MainRaw!S71)","v":""}," -  - ",{"$f":"IF(MainRaw!L71=\"\", \"\", MainRaw!L71)","v":""},{"$f":"IF(MainRaw!M71=\"\", \"\", MainRaw!M71)","v":""},{"$f":"IF(MainRaw!N71=\"\", \"\", MainRaw!N71)","v":""},{"$f":"IF(MainRaw!O71=\"\", \"\", MainRaw!O71)","v":""},{"$f":"IF(MainRaw!P71=\"\", \"\", MainRaw!P71)","v":""},{"$f":"IF(MainRaw!Q71=\"\", \"\", MainRaw!Q71)","v":""}]
[{"$f":"IF(MainRaw!A72=\"\", \"\", MainRaw!A72)","v":""},{"$f":"IF(MainRaw!B72=\"\", \"\", MainRaw!B72)","v":""},{"$f":"IF(MainRaw!E72=\"\", \"\", MainRaw!E72)","v":""},{"$f":"IF(MainRaw!H72=\"\", \"\", MainRaw!H72)","v":""},{"$f":"IF(MainRaw!J72=\"\", \"\", MainRaw!J72)","v":""},{"$f":"IF(MainRaw!K72=\"\", \"\", MainRaw!K72)","v":""},{"$f":"IF(MainRaw!L72=\"\", \"\", MainRaw!L72)","v":""},{"$f":"IF(MainRaw!M72=\"\", \"\", MainRaw!M72)","v":""},{"$f":"IF(MainRaw!R72=\"\", \"\", MainRaw!R72)","v":""},{"$f":"IF(MainRaw!S72=\"\", \"\", MainRaw!S72)","v":""},{"$f":"A73 & \" - \" & B73 & \" - \" & I73","v":" -  - "},{"$f":"IF(MainRaw!L72=\"\", \"\", MainRaw!L72)","v":""},{"$f":"IF(MainRaw!M72=\"\", \"\", MainRaw!M72)","v":""},{"$f":"IF(MainRaw!N72=\"\", \"\", MainRaw!N72)","v":""},{"$f":"IF(MainRaw!O72=\"\", \"\", MainRaw!O72)","v":""},{"$f":"IF(MainRaw!P72=\"\", \"\", MainRaw!P72)","v":""},{"$f":"IF(MainRaw!Q72=\"\", \"\", MainRaw!Q72)","v":""}]
[{"$f":"IF(MainRaw!A73=\"\", \"\", MainRaw!A73)","v":""},{"$f":"IF(MainRaw!B73=\"\", \"\", MainRaw!B73)","v":""},{"$f":"IF(MainRaw!E73=\"\", \"\", MainRaw!E73)","v":""},{"$f":"IF(MainRaw!H73=\"\", \"\", MainRaw!H73)","v":""},{"$f":"IF(MainRaw!J73=\"\", \"\", MainRaw!J73)","v":""},{"$f":"IF(MainRaw!K73=\"\", \"\", MainRaw!K73)","v":""},{"$f":"IF(MainRaw!L73=\"\", \"\", MainRaw!L73)","v":""},{"$f":"IF(MainRaw!M73=\"\", \"\", MainRaw!M73)","v":""},{"$f":"IF(MainRaw!R73=\"\", \"\", MainRaw!R73)","v":""},{"$f":"IF(MainRaw!S73=\"\", \"\", MainRaw!S73)","v":""}," -  - ",{"$f":"IF(MainRaw!L73=\"\", \"\", MainRaw!L73)","v":""},{"$f":"IF(MainRaw!M73=\"\", \"\", MainRaw!M73)","v":""},{"$f":"IF(MainRaw!N73=\"\", \"\", MainRaw!N73)","v":""},{"$f":"IF(MainRaw!O73=\"\", \"\", MainRaw!O73)","v":""},{"$f":"IF(MainRaw!P73=\"\", \"\", MainRaw!P73)","v":""},{"$f":"IF(MainRaw!Q73=\"\", \"\", MainRaw!Q73)","v":""}]
[{"$f":"IF(MainRaw!A74=\"\", \"\", MainRaw!A74)","v":""},{"$f":"IF(MainRaw!B74=\"\", \"\", MainRaw!B74)","v":""},{"$f":"IF(MainRaw!E74=\"\", \"\", MainRaw!E74)","v":""},{"$f":"IF(MainRaw!H74=\"\", \"\", MainRaw!H74)","v":""},{"$f":"IF(MainRaw!J74=\"\", \"\", MainRaw!J74)","v":""},{"$f":"IF(MainRaw!K74=\"\", \"\", MainRaw!K74)","v":""},{"$f":"IF(MainRaw!L74=\"\", \"\", MainRaw!L74)","v":""},{"$f":"IF(MainRaw!M74=\"\", \"\", MainRaw!M74)","v":""},{"$f":"IF(MainRaw!R74=\"\", \"\", MainRaw!R74)","v":""},{"$f":"IF(MainRaw!S74=\"\", \"\", MainRaw!S74)","v":""}," -  - ",{"$f":"IF(MainRaw!L74=\"\", \"\", MainRaw!L74)","v":""},{"$f":"IF(MainRaw!M74=\"\", \"\", MainRaw!M74)","v":""},{"$f":"IF(MainRaw!N74=\"\", \"\", MainRaw!N74)","v":""},{"$f":"IF(MainRaw!O74=\"\", \"\", MainRaw!O74)","v":""},{"$f":"IF(MainRaw!P74=\"\", \"\", MainRaw!P74)","v":""},{"$f":"IF(MainRaw!Q74=\"\", \"\", MainRaw!Q74)","v":""}]
[{"$f":"IF(MainRaw!A75=\"\", \"\", MainRaw!A75)","v":""},{"$f":"IF(MainRaw!B75=\"\", \"\", MainRaw!B75)","v":""},{"$f":"IF(MainRaw!E75=\"\", \"\", MainRaw!E75)","v":""},{"$f":"IF(MainRaw!H75=\"\", \"\", MainRaw!H75)","v":""},{"$f":"IF(MainRaw!J75=\"\", \"\", MainRaw!J75)","v":""},{"$f":"IF(MainRaw!K75=\"\", \"\", MainRaw!K75)","v":""},{"$f":"IF(MainRaw!L75=\"\", \"\", MainRaw!L75)","v":""},{"$f":"IF(MainRaw!M75=\"\", \"\", MainRaw!M75)","v":""},{"$f":"IF(MainRaw!R75=\"\", \"\", MainRaw!R75)","v":""},{"$f":"IF(MainRaw!S75=\"\", \"\", MainRaw!S75)","v":""}," -  - ",{"$f":"IF(MainRaw!L75=\"\", \"\", MainRaw!L75)","v":""},{"$f":"IF(MainRaw!M75=\"\", \"\", MainRaw!M75)","v":""},{"$f":"IF(MainRaw!N75=\"\", \"\", MainRaw!N75)","v":""},{"$f":"IF(MainRaw!O75=\"\", \"\", MainRaw!O75)","v":""},{"$f":"IF(MainRaw!P75=\"\", \"\", MainRaw!P75)","v":""},{"$f":"IF(MainRaw!Q75=\"\", \"\", MainRaw!Q75)","v":""}]
[{"$f":"IF(MainRaw!A76=\"\", \"\", MainRaw!A76)","v":""},{"$f":"IF(MainRaw!B76=\"\", \"\", MainRaw!B76)","v":""},{"$f":"IF(MainRaw!E76=\"\", \"\", MainRaw!E76)","v":""},{"$f":"IF(MainRaw!H76=\"\", \"\", MainRaw!H76)","v":""},{"$f":"IF(MainRaw!J76=\"\", \"\", MainRaw!J76)","v":""},{"$f":"IF(MainRaw!K76=\"\", \"\", MainRaw!K76)","v":""},{"$f":"IF(MainRaw!L76=\"\", \"\", MainRaw!L76)","v":""},{"$f":"IF(MainRaw!M76=\"\", \"\", MainRaw!M76)","v":""},{"$f":"IF(MainRaw!R76=\"\", \"\", MainRaw!R76)","v":""},{"$f":"IF(MainRaw!S76=\"\", \"\", MainRaw!S76)","v":""}," -  - ",{"$f":"IF(MainRaw!L76=\"\", \"\", MainRaw!L76)","v":""},{"$f":"IF(MainRaw!M76=\"\", \"\", MainRaw!M76)","v":""},{"$f":"IF(MainRaw!N76=\"\", \"\", MainRaw!N76)","v":""},{"$f":"IF(MainRaw!O76=\"\", \"\", MainRaw!O76)","v":""},{"$f":"IF(MainRaw!P76=\"\", \"\", MainRaw!P76)","v":""},{"$f":"IF(MainRaw!Q76=\"\", \"\", MainRaw!Q76)","v":""}]
[{"$f":"IF(MainRaw!A77=\"\", \"\", MainRaw!A77)","v":""},{"$f":"IF(MainRaw!B77=\"\", \"\", MainRaw!B77)","v":""},{"$f":"IF(MainRaw!E77=\"\", \"\", MainRaw!E77)","v":""},{"$f":"IF(MainRaw!H77=\"\", \"\", MainRaw!H77)","v":""},{"$f":"IF(MainRaw!J77=\"\", \"\", MainRaw!J77)","v":""},{"$f":"IF(MainRaw!K77=\"\", \"\", MainRaw!K77)","v":""},{"$f":"IF(MainRaw!L77=\"\", \"\", MainRaw!L77)","v":""},{"$f":"IF(MainRaw!M77=\"\", \"\", MainRaw!M77)","v":""},{"$f":"IF(MainRaw!R77=\"\", \"\", MainRaw!R77)","v":""},{"$f":"IF(MainRaw!S77=\"\", \"\", MainRaw!S77)","v":""}," -  - ",{"$f":"IF(MainRaw!L77=\"\", \"\", MainRaw!L77)","v":""},{"$f":"IF(MainRaw!M77=\"\", \"\", MainRaw!M77)","v":""},{"$f":"IF(MainRaw!N77=\"\", \"\", MainRaw!N77)","v":""},{"$f":"IF(MainRaw!O77=\"\", \"\", MainRaw!O77)","v":""},{"$f":"IF(MainRaw!P77=\"\", \"\", MainRaw!P77)","v":""},{"$f":"IF(MainRaw!Q77=\"\", \"\", MainRaw!Q77)","v":""}]
[{"$f":"IF(MainRaw!A78=\"\", \"\", MainRaw!A78)","v":""},{"$f":"IF(MainRaw!B78=\"\", \"\", MainRaw!B78)","v":""},{"$f":"IF(MainRaw!E78=\"\", \"\", MainRaw!E78)","v":""},{"$f":"IF(MainRaw!H78=\"\", \"\", MainRaw!H78)","v":""},{"$f":"IF(MainRaw!J78=\"\", \"\", MainRaw!J78)","v":""},{"$f":"IF(MainRaw!K78=\"\", \"\", MainRaw!K78)","v":""},{"$f":"IF(MainRaw!L78=\"\", \"\", MainRaw!L78)","v":""},{"$f":"IF(MainRaw!M78=\"\", \"\", MainRaw!M78)","v":""},{"$f":"IF(MainRaw!R78=\"\", \"\", MainRaw!R78)","v":""},{"$f":"IF(MainRaw!S78=\"\", \"\", MainRaw!S78)","v":""}," -  - ",{"$f":"IF(MainRaw!L78=\"\", \"\", MainRaw!L78)","v":""},{"$f":"IF(MainRaw!M78=\"\", \"\", MainRaw!M78)","v":""},{"$f":"IF(MainRaw!N78=\"\", \"\", MainRaw!N78)","v":""},{"$f":"IF(MainRaw!O78=\"\", \"\", MainRaw!O78)","v":""},{"$f":"IF(MainRaw!P78=\"\", \"\", MainRaw!P78)","v":""},{"$f":"IF(MainRaw!Q78=\"\", \"\", MainRaw!Q78)","v":""}]
[{"$f":"IF(MainRaw!A79=\"\", \"\", MainRaw!A79)","v":""},{"$f":"IF(MainRaw!B79=\"\", \"\", MainRaw!B79)","v":""},{"$f":"IF(MainRaw!E79=\"\", \"\", MainRaw!E79)","v":""},{"$f":"IF(MainRaw!H79=\"\", \"\", MainRaw!H79)","v":""},{"$f":"IF(MainRaw!J79=\"\", \"\", MainRaw!J79)","v":""},{"$f":"IF(MainRaw!K79=\"\", \"\", MainRaw!K79)","v":""},{"$f":"IF(MainRaw!L79=\"\", \"\", MainRaw!L79)","v":""},{"$f":"IF(MainRaw!M79=\"\", \"\", MainRaw!M79)","v":""},{"$f":"IF(MainRaw!R79=\"\", \"\", MainRaw!R79)","v":""},{"$f":"IF(MainRaw!S79=\"\", \"\", MainRaw!S79)","v":""}," -  - ",{"$f":"IF(MainRaw!L79=\"\", \"\", MainRaw!L79)","v":""},{"$f":"IF(MainRaw!M79=\"\", \"\", MainRaw!M79)","v":""},{"$f":"IF(MainRaw!N79=\"\", \"\", MainRaw!N79)","v":""},{"$f":"IF(MainRaw!O79=\"\", \"\", MainRaw!O79)","v":""},{"$f":"IF(MainRaw!P79=\"\", \"\", MainRaw!P79)","v":""},{"$f":"IF(MainRaw!Q79=\"\", \"\", MainRaw!Q79)","v":""}]
[{"$f":"IF(MainRaw!A80=\"\", \"\", MainRaw!A80)","v":""},{"$f":"IF(MainRaw!B80=\"\", \"\", MainRaw!B80)","v":""},{"$f":"IF(MainRaw!E80=\"\", \"\", MainRaw!E80)","v":""},{"$f":"IF(MainRaw!H80=\"\", \"\", MainRaw!H80)","v":""},{"$f":"IF(MainRaw!J80=\"\", \"\", MainRaw!J80)","v":""},{"$f":"IF(MainRaw!K80=\"\", \"\", MainRaw!K80)","v":""},{"$f":"IF(MainRaw!L80=\"\", \"\", MainRaw!L80)","v":""},{"$f":"IF(MainRaw!M80=\"\", \"\", MainRaw!M80)","v":""},{"$f":"IF(MainRaw!R80=\"\", \"\", MainRaw!R80)","v":""},{"$f":"IF(MainRaw!S80=\"\", \"\", MainRaw!S80)","v":""}," -  - ",{"$f":"IF(MainRaw!L80=\"\", \"\", MainRaw!L80)","v":""},{"$f":"IF(MainRaw!M80=\"\", \"\", MainRaw!M80)","v":""},{"$f":"IF(MainRaw!N80=\"\", \"\", MainRaw!N80)","v":""},{"$f":"IF(MainRaw!O80=\"\", \"\", MainRaw!O80)","v":""},{"$f":"IF(MainRaw!P80=\"\", \"\", MainRaw!P80)","v":""},{"$f":"IF(MainRaw!Q80=\"\", \"\", MainRaw!Q80)","v":""}]
[{"$f":"IF(MainRaw!A81=\"\", \"\", MainRaw!A81)","v":""},{"$f":"IF(MainRaw!B81=\"\", \"\", MainRaw!B81)","v":""},{"$f":"IF(MainRaw!E81=\"\", \"\", MainRaw!E81)","v":""},{"$f":"IF(MainRaw!H81=\"\", \"\", MainRaw!H81)","v":""},{"$f":"IF(MainRaw!J81=\"\", \"\", MainRaw!J81)","v":""},{"$f":"IF(MainRaw!K81=\"\", \"\", MainRaw!K81)","v":""},{"$f":"IF(MainRaw!L81=\"\", \"\", MainRaw!L81)","v":""},{"$f":"IF(MainRaw!M81=\"\", \"\", MainRaw!M81)","v":""},{"$f":"IF(MainRaw!R81=\"\", \"\", MainRaw!R81)","v":""},{"$f":"IF(MainRaw!S81=\"\", \"\", MainRaw!S81)","v":""}," -  - ",{"$f":"IF(MainRaw!L81=\"\", \"\", MainRaw!L81)","v":""},{"$f":"IF(MainRaw!M81=\"\", \"\", MainRaw!M81)","v":""},{"$f":"IF(MainRaw!N81=\"\", \"\", MainRaw!N81)","v":""},{"$f":"IF(MainRaw!O81=\"\", \"\", MainRaw!O81)","v":""},{"$f":"IF(MainRaw!P81=\"\", \"\", MainRaw!P81)","v":""},{"$f":"IF(MainRaw!Q81=\"\", \"\", MainRaw!Q81)","v":""}]
[{"$f":"IF(MainRaw!A82=\"\", \"\", MainRaw!A82)","v":""},{"$f":"IF(MainRaw!B82=\"\", \"\", MainRaw!B82)","v":""},{"$f":"IF(MainRaw!E82=\"\", \"\", MainRaw!E82)","v":""},{"$f":"IF(MainRaw!H82=\"\", \"\", MainRaw!H82)","v":""},{"$f":"IF(MainRaw!J82=\"\", \"\", MainRaw!J82)","v":""},{"$f":"IF(MainRaw!K82=\"\", \"\", MainRaw!K82)","v":""},{"$f":"IF(MainRaw!L82=\"\", \"\", MainRaw!L82)","v":""},{"$f":"IF(MainRaw!M82=\"\", \"\", MainRaw!M82)","v":""},{"$f":"IF(MainRaw!R82=\"\", \"\", MainRaw!R82)","v":""},{"$f":"IF(MainRaw!S82=\"\", \"\", MainRaw!S82)","v":""}," -  - ",{"$f":"IF(MainRaw!L82=\"\", \"\", MainRaw!L82)","v":""},{"$f":"IF(MainRaw!M82=\"\", \"\", MainRaw!M82)","v":""},{"$f":"IF(MainRaw!N82=\"\", \"\", MainRaw!N82)","v":""},{"$f":"IF(MainRaw!O82=\"\", \"\", MainRaw!O82)","v":""},{"$f":"IF(MainRaw!P82=\"\", \"\", MainRaw!P82)","v":""},{"$f":"IF(MainRaw!Q82=\"\", \"\", MainRaw!Q82)","v":""}]
[{"$f":"IF(MainRaw!A83=\"\", \"\", MainRaw!A83)","v":""},{"$f":"IF(MainRaw!B83=\"\", \"\", MainRaw!B83)","v":""},{"$f":"IF(MainRaw!E83=\"\", \"\", MainRaw!E83)","v":""},{"$f":"IF(MainRaw!H83=\"\", \"\", MainRaw!H83)","v":""},{"$f":"IF(MainRaw!J83=\"\", \"\", MainRaw!J83)","v":""},{"$f":"IF(MainRaw!K83=\"\", \"\", MainRaw!K83)","v":""},{"$f":"IF(MainRaw!L83=\"\", \"\", MainRaw!L83)","v":""},{"$f":"IF(MainRaw!M83=\"\", \"\", MainRaw!M83)","v":""},{"$f":"IF(MainRaw!R83=\"\", \"\", MainRaw!R83)","v":""},{"$f":"IF(MainRaw!S83=\"\", \"\", MainRaw!S83)","v":""}," -  - ",{"$f":"IF(MainRaw!L83=\"\", \"\", MainRaw!L83)","v":""},{"$f":"IF(MainRaw!M83=\"\", \"\", MainRaw!M83)","v":""},{"$f":"IF(MainRaw!N83=\"\", \"\", MainRaw!N83)","v":""},{"$f":"IF(MainRaw!O83=\"\", \"\", MainRaw!O83)","v":""},{"$f":"IF(MainRaw!P83=\"\", \"\", MainRaw!P83)","v":""},{"$f":"IF(MainRaw!Q83=\"\", \"\", MainRaw!Q83)","v":""}]
[{"$f":"IF(MainRaw!A84=\"\", \"\", MainRaw!A84)","v":""},{"$f":"IF(MainRaw!B84=\"\", \"\", MainRaw!B84)","v":""},{"$f":"IF(MainRaw!E84=\"\", \"\", MainRaw!E84)","v":""},{"$f":"IF(MainRaw!H84=\"\", \"\", MainRaw!H84)","v":""},{"$f":"IF(MainRaw!J84=\"\", \"\", MainRaw!J84)","v":""},{"$f":"IF(MainRaw!K84=\"\", \"\", MainRaw!K84)","v":""},{"$f":"IF(MainRaw!L84=\"\", \"\", MainRaw!L84)","v":""},{"$f":"IF(MainRaw!M84=\"\", \"\", MainRaw!M84)","v":""},{"$f":"IF(MainRaw!R84=\"\", \"\", MainRaw!R84)","v":""},{"$f":"IF(MainRaw!S84=\"\", \"\", MainRaw!S84)","v":""}," -  - ",{"$f":"IF(MainRaw!L84=\"\", \"\", MainRaw!L84)","v":""},{"$f":"IF(MainRaw!M84=\"\", \"\", MainRaw!M84)","v":""},{"$f":"IF(MainRaw!N84=\"\", \"\", MainRaw!N84)","v":""},{"$f":"IF(MainRaw!O84=\"\", \"\", MainRaw!O84)","v":""},{"$f":"IF(MainRaw!P84=\"\", \"\", MainRaw!P84)","v":""},{"$f":"IF(MainRaw!Q84=\"\", \"\", MainRaw!Q84)","v":""}]
[{"$f":"IF(MainRaw!A85=\"\", \"\", MainRaw!A85)","v":""},{"$f":"IF(MainRaw!B85=\"\", \"\", MainRaw!B85)","v":""},{"$f":"IF(MainRaw!E85=\"\", \"\", MainRaw!E85)","v":""},{"$f":"IF(MainRaw!H85=\"\", \"\", MainRaw!H85)","v":""},{"$f":"IF(MainRaw!J85=\"\", \"\", MainRaw!J85)","v":""},{"$f":"IF(MainRaw!K85=\"\", \"\", MainRaw!K85)","v":""},{"$f":"IF(MainRaw!L85=\"\", \"\", MainRaw!L85)","v":""},{"$f":"IF(MainRaw!M85=\"\", \"\", MainRaw!M85)","v":""},{"$f":"IF(MainRaw!R85=\"\", \"\", MainRaw!R85)","v":""},{"$f":"IF(MainRaw!S85=\"\", \"\", MainRaw!S85)","v":""}," -  - ",{"$f":"IF(MainRaw!L85=\"\", \"\", MainRaw!L85)","v":""},{"$f":"IF(MainRaw!M85=\"\", \"\", MainRaw!M85)","v":""},{"$f":"IF(MainRaw!N85=\"\", \"\", MainRaw!N85)","v":""},{"$f":"IF(MainRaw!O85=\"\", \"\", MainRaw!O85)","v":""},{"$f":"IF(MainRaw!P85=\"\", \"\", MainRaw!P85)","v":""},{"$f":"IF(MainRaw!Q85=\"\", \"\", MainRaw!Q85)","v":""}]
[{"$f":"IF(MainRaw!A86=\"\", \"\", MainRaw!A86)","v":""},{"$f":"IF(MainRaw!B86=\"\", \"\", MainRaw!B86)","v":""},{"$f":"IF(MainRaw!E86=\"\", \"\", MainRaw!E86)","v":""},{"$f":"IF(MainRaw!H86=\"\", \"\", MainRaw!H86)","v":""},{"$f":"IF(MainRaw!J86=\"\", \"\", MainRaw!J86)","v":""},{"$f":"IF(MainRaw!K86=\"\", \"\", MainRaw!K86)","v":""},{"$f":"IF(MainRaw!L86=\"\", \"\", MainRaw!L86)","v":""},{"$f":"IF(MainRaw!M86=\"\", \"\", MainRaw!M86)","v":""},{"$f":"IF(MainRaw!R86=\"\", \"\", MainRaw!R86)","v":""},{"$f":"IF(MainRaw!S86=\"\", \"\", MainRaw!S86)","v":""}," -  - ",{"$f":"IF(MainRaw!L86=\"\", \"\", MainRaw!L86)","v":""},{"$f":"IF(MainRaw!M86=\"\", \"\", MainRaw!M86)","v":""},{"$f":"IF(MainRaw!N86=\"\", \"\", MainRaw!N86)","v":""},{"$f":"IF(MainRaw!O86=\"\", \"\", MainRaw!O86)","v":""},{"$f":"IF(MainRaw!P86=\"\", \"\", MainRaw!P86)","v":""},{"$f":"IF(MainRaw!Q86=\"\", \"\", MainRaw!Q86)","v":""}]
[{"$f":"IF(MainRaw!A87=\"\", \"\", MainRaw!A87)","v":""},{"$f":"IF(MainRaw!B87=\"\", \"\", MainRaw!B87)","v":""},{"$f":"IF(MainRaw!E87=\"\", \"\", MainRaw!E87)","v":""},{"$f":"IF(MainRaw!H87=\"\", \"\", MainRaw!H87)","v":""},{"$f":"IF(MainRaw!J87=\"\", \"\", MainRaw!J87)","v":""},{"$f":"IF(MainRaw!K87=\"\", \"\", MainRaw!K87)","v":""},{"$f":"IF(MainRaw!L87=\"\", \"\", MainRaw!L87)","v":""},{"$f":"IF(MainRaw!M87=\"\", \"\", MainRaw!M87)","v":""},{"$f":"IF(MainRaw!R87=\"\", \"\", MainRaw!R87)","v":""},{"$f":"IF(MainRaw!S87=\"\", \"\", MainRaw!S87)","v":""}," -  - ",{"$f":"IF(MainRaw!L87=\"\", \"\", MainRaw!L87)","v":""},{"$f":"IF(MainRaw!M87=\"\", \"\", MainRaw!M87)","v":""},{"$f":"IF(MainRaw!N87=\"\", \"\", MainRaw!N87)","v":""},{"$f":"IF(MainRaw!O87=\"\", \"\", MainRaw!O87)","v":""},{"$f":"IF(MainRaw!P87=\"\", \"\", MainRaw!P87)","v":""},{"$f":"IF(MainRaw!Q87=\"\", \"\", MainRaw!Q87)","v":""}]
[{"$f":"IF(MainRaw!A88=\"\", \"\", MainRaw!A88)","v":""},{"$f":"IF(MainRaw!B88=\"\", \"\", MainRaw!B88)","v":""},{"$f":"IF(MainRaw!E88=\"\", \"\", MainRaw!E88)","v":""},{"$f":"IF(MainRaw!H88=\"\", \"\", MainRaw!H88)","v":""},{"$f":"IF(MainRaw!J88=\"\", \"\", MainRaw!J88)","v":""},{"$f":"IF(MainRaw!K88=\"\", \"\", MainRaw!K88)","v":""},{"$f":"IF(MainRaw!L88=\"\", \"\", MainRaw!L88)","v":""},{"$f":"IF(MainRaw!M88=\"\", \"\", MainRaw!M88)","v":""},{"$f":"IF(MainRaw!R88=\"\", \"\", MainRaw!R88)","v":""},{"$f":"IF(MainRaw!S88=\"\", \"\", MainRaw!S88)","v":""}," -  - ",{"$f":"IF(MainRaw!L88=\"\", \"\", MainRaw!L88)","v":""},{"$f":"IF(MainRaw!M88=\"\", \"\", MainRaw!M88)","v":""},{"$f":"IF(MainRaw!N88=\"\", \"\", MainRaw!N88)","v":""},{"$f":"IF(MainRaw!O88=\"\", \"\", MainRaw!O88)","v":""},{"$f":"IF(MainRaw!P88=\"\", \"\", MainRaw!P88)","v":""},{"$f":"IF(MainRaw!Q88=\"\", \"\", MainRaw!Q88)","v":""}]
[{"$f":"IF(MainRaw!A89=\"\", \"\", MainRaw!A89)","v":""},{"$f":"IF(MainRaw!B89=\"\", \"\", MainRaw!B89)","v":""},{"$f":"IF(MainRaw!E89=\"\", \"\", MainRaw!E89)","v":""},{"$f":"IF(MainRaw!H89=\"\", \"\", MainRaw!H89)","v":""},{"$f":"IF(MainRaw!J89=\"\", \"\", MainRaw!J89)","v":""},{"$f":"IF(MainRaw!K89=\"\", \"\", MainRaw!K89)","v":""},{"$f":"IF(MainRaw!L89=\"\", \"\", MainRaw!L89)","v":""},{"$f":"IF(MainRaw!M89=\"\", \"\", MainRaw!M89)","v":""},{"$f":"IF(MainRaw!R89=\"\", \"\", MainRaw!R89)","v":""},{"$f":"IF(MainRaw!S89=\"\", \"\", MainRaw!S89)","v":""}," -  - ",{"$f":"IF(MainRaw!L89=\"\", \"\", MainRaw!L89)","v":""},{"$f":"IF(MainRaw!M89=\"\", \"\", MainRaw!M89)","v":""},{"$f":"IF(MainRaw!N89=\"\", \"\", MainRaw!N89)","v":""},{"$f":"IF(MainRaw!O89=\"\", \"\", MainRaw!O89)","v":""},{"$f":"IF(MainRaw!P89=\"\", \"\", MainRaw!P89)","v":""},{"$f":"IF(MainRaw!Q89=\"\", \"\", MainRaw!Q89)","v":""}]
[{"$f":"IF(MainRaw!A90=\"\", \"\", MainRaw!A90)","v":""},{"$f":"IF(MainRaw!B90=\"\", \"\", MainRaw!B90)","v":""},{"$f":"IF(MainRaw!E90=\"\", \"\", MainRaw!E90)","v":""},{"$f":"IF(MainRaw!H90=\"\", \"\", MainRaw!H90)","v":""},{"$f":"IF(MainRaw!J90=\"\", \"\", MainRaw!J90)","v":""},{"$f":"IF(MainRaw!K90=\"\", \"\", MainRaw!K90)","v":""},{"$f":"IF(MainRaw!L90=\"\", \"\", MainRaw!L90)","v":""},{"$f":"IF(MainRaw!M90=\"\", \"\", MainRaw!M90)","v":""},{"$f":"IF(MainRaw!R90=\"\", \"\", MainRaw!R90)","v":""},{"$f":"IF(MainRaw!S90=\"\", \"\", MainRaw!S90)","v":""}," -  - ",{"$f":"IF(MainRaw!L90=\"\", \"\", MainRaw!L90)","v":""},{"$f":"IF(MainRaw!M90=\"\", \"\", MainRaw!M90)","v":""},{"$f":"IF(MainRaw!N90=\"\", \"\", MainRaw!N90)","v":""},{"$f":"IF(MainRaw!O90=\"\", \"\", MainRaw!O90)","v":""},{"$f":"IF(MainRaw!P90=\"\", \"\", MainRaw!P90)","v":""},{"$f":"IF(MainRaw!Q90=\"\", \"\", MainRaw!Q90)","v":""}]
[{"$f":"IF(MainRaw!A91=\"\", \"\", MainRaw!A91)","v":""},{"$f":"IF(MainRaw!B91=\"\", \"\", MainRaw!B91)","v":""},{"$f":"IF(MainRaw!E91=\"\", \"\", MainRaw!E91)","v":""},{"$f":"IF(MainRaw!H91=\"\", \"\", MainRaw!H91)","v":""},{"$f":"IF(MainRaw!J91=\"\", \"\", MainRaw!J91)","v":""},{"$f":"IF(MainRaw!K91=\"\", \"\", MainRaw!K91)","v":""},{"$f":"IF(MainRaw!L91=\"\", \"\", MainRaw!L91)","v":""},{"$f":"IF(MainRaw!M91=\"\", \"\", MainRaw!M91)","v":""},{"$f":"IF(MainRaw!R91=\"\", \"\", MainRaw!R91)","v":""},{"$f":"IF(MainRaw!S91=\"\", \"\", MainRaw!S91)","v":""}," -  - ",{"$f":"IF(MainRaw!L91=\"\", \"\", MainRaw!L91)","v":""},{"$f":"IF(MainRaw!M91=\"\", \"\", MainRaw!M91)","v":""},{"$f":"IF(MainRaw!N91=\"\", \"\", MainRaw!N91)","v":""},{"$f":"IF(MainRaw!O91=\"\", \"\", MainRaw!O91)","v":""},{"$f":"IF(MainRaw!P91=\"\", \"\", MainRaw!P91)","v":""},{"$f":"IF(MainRaw!Q91=\"\", \"\", MainRaw!Q91)","v":""}]
[{"$f":"IF(MainRaw!A92=\"\", \"\", MainRaw!A92)","v":""},{"$f":"IF(MainRaw!B92=\"\", \"\", MainRaw!B92)","v":""},{"$f":"IF(MainRaw!E92=\"\", \"\", MainRaw!E92)","v":""},{"$f":"IF(MainRaw!H92=\"\", \"\", MainRaw!H92)","v":""},{"$f":"IF(MainRaw!J92=\"\", \"\", MainRaw!J92)","v":""},{"$f":"IF(MainRaw!K92=\"\", \"\", MainRaw!K92)","v":""},{"$f":"IF(MainRaw!L92=\"\", \"\", MainRaw!L92)","v":""},{"$f":"IF(MainRaw!M92=\"\", \"\", MainRaw!M92)","v":""},{"$f":"IF(MainRaw!R92=\"\", \"\", MainRaw!R92)","v":""},{"$f":"IF(MainRaw!S92=\"\", \"\", MainRaw!S92)","v":""}," -  - ",{"$f":"IF(MainRaw!L92=\"\", \"\", MainRaw!L92)","v":""},{"$f":"IF(MainRaw!M92=\"\", \"\", MainRaw!M92)","v":""},{"$f":"IF(MainRaw!N92=\"\", \"\", MainRaw!N92)","v":""},{"$f":"IF(MainRaw!O92=\"\", \"\", MainRaw!O92)","v":""},{"$f":"IF(MainRaw!P92=\"\", \"\", MainRaw!P92)","v":""},{"$f":"IF(MainRaw!Q92=\"\", \"\", MainRaw!Q92)","v":""}]
[{"$f":"IF(MainRaw!A93=\"\", \"\", MainRaw!A93)","v":""},{"$f":"IF(MainRaw!B93=\"\", \"\", MainRaw!B93)","v":""},{"$f":"IF(MainRaw!E93=\"\", \"\", MainRaw!E93)","v":""},{"$f":"IF(MainRaw!H93=\"\", \"\", MainRaw!H93)","v":""},{"$f":"IF(MainRaw!J93=\"\", \"\", MainRaw!J93)","v":""},{"$f":"IF(MainRaw!K93=\"\", \"\", MainRaw!K93)","v":""},{"$f":"IF(MainRaw!L93=\"\", \"\", MainRaw!L93)","v":""},{"$f":"IF(MainRaw!M93=\"\", \"\", MainRaw!M93)","v":""},{"$f":"IF(MainRaw!R93=\"\", \"\", MainRaw!R93)","v":""},{"$f":"IF(MainRaw!S93=\"\", \"\", MainRaw!S93)","v":""}," -  - ",{"$f":"IF(MainRaw!L93=\"\", \"\", MainRaw!L93)","v":""},{"$f":"IF(MainRaw!M93=\"\", \"\", MainRaw!M93)","v":""},{"$f":"IF(MainRaw!N93=\"\", \"\", MainRaw!N93)","v":""},{"$f":"IF(MainRaw!O93=\"\", \"\", MainRaw!O93)","v":""},{"$f":"IF(MainRaw!P93=\"\", \"\", MainRaw!P93)","v":""},{"$f":"IF(MainRaw!Q93=\"\", \"\", MainRaw!Q93)","v":""}]
[{"$f":"IF(MainRaw!A94=\"\", \"\", MainRaw!A94)","v":""},{"$f":"IF(MainRaw!B94=\"\", \"\", MainRaw!B94)","v":""},{"$f":"IF(MainRaw!E94=\"\", \"\", MainRaw!E94)","v":""},{"$f":"IF(MainRaw!H94=\"\", \"\", MainRaw!H94)","v":""},{"$f":"IF(MainRaw!J94=\"\", \"\", MainRaw!J94)","v":""},{"$f":"IF(MainRaw!K94=\"\", \"\", MainRaw!K94)","v":""},{"$f":"IF(MainRaw!L94=\"\", \"\", MainRaw!L94)","v":""},{"$f":"IF(MainRaw!M94=\"\", \"\", MainRaw!M94)","v":""},{"$f":"IF(MainRaw!R94=\"\", \"\", MainRaw!R94)","v":""},{"$f":"IF(MainRaw!S94=\"\", \"\", MainRaw!S94)","v":""}," -  - ",{"$f":"IF(MainRaw!L94=\"\", \"\", MainRaw!L94)","v":""},{"$f":"IF(MainRaw!M94=\"\", \"\", MainRaw!M94)","v":""},{"$f":"IF(MainRaw!N94=\"\", \"\", MainRaw!N94)","v":""},{"$f":"IF(MainRaw!O94=\"\", \"\", MainRaw!O94)","v":""},{"$f":"IF(MainRaw!P94=\"\", \"\", MainRaw!P94)","v":""},{"$f":"IF(MainRaw!Q94=\"\", \"\", MainRaw!Q94)","v":""}]
[{"$f":"IF(MainRaw!A95=\"\", \"\", MainRaw!A95)","v":""},{"$f":"IF(MainRaw!B95=\"\", \"\", MainRaw!B95)","v":""},{"$f":"IF(MainRaw!E95=\"\", \"\", MainRaw!E95)","v":""},{"$f":"IF(MainRaw!H95=\"\", \"\", MainRaw!H95)","v":""},{"$f":"IF(MainRaw!J95=\"\", \"\", MainRaw!J95)","v":""},{"$f":"IF(MainRaw!K95=\"\", \"\", MainRaw!K95)","v":""},{"$f":"IF(MainRaw!L95=\"\", \"\", MainRaw!L95)","v":""},{"$f":"IF(MainRaw!M95=\"\", \"\", MainRaw!M95)","v":""},{"$f":"IF(MainRaw!R95=\"\", \"\", MainRaw!R95)","v":""},{"$f":"IF(MainRaw!S95=\"\", \"\", MainRaw!S95)","v":""}," -  - ",{"$f":"IF(MainRaw!L95=\"\", \"\", MainRaw!L95)","v":""},{"$f":"IF(MainRaw!M95=\"\", \"\", MainRaw!M95)","v":""},{"$f":"IF(MainRaw!N95=\"\", \"\", MainRaw!N95)","v":""},{"$f":"IF(MainRaw!O95=\"\", \"\", MainRaw!O95)","v":""},{"$f":"IF(MainRaw!P95=\"\", \"\", MainRaw!P95)","v":""},{"$f":"IF(MainRaw!Q95=\"\", \"\", MainRaw!Q95)","v":""}]
[{"$f":"IF(MainRaw!A96=\"\", \"\", MainRaw!A96)","v":""},{"$f":"IF(MainRaw!B96=\"\", \"\", MainRaw!B96)","v":""},{"$f":"IF(MainRaw!E96=\"\", \"\", MainRaw!E96)","v":""},{"$f":"IF(MainRaw!H96=\"\", \"\", MainRaw!H96)","v":""},{"$f":"IF(MainRaw!J96=\"\", \"\", MainRaw!J96)","v":""},{"$f":"IF(MainRaw!K96=\"\", \"\", MainRaw!K96)","v":""},{"$f":"IF(MainRaw!L96=\"\", \"\", MainRaw!L96)","v":""},{"$f":"IF(MainRaw!M96=\"\", \"\", MainRaw!M96)","v":""},{"$f":"IF(MainRaw!R96=\"\", \"\", MainRaw!R96)","v":""},{"$f":"IF(MainRaw!S96=\"\", \"\", MainRaw!S96)","v":""}," -  - ",{"$f":"IF(MainRaw!L96=\"\", \"\", MainRaw!L96)","v":""},{"$f":"IF(MainRaw!M96=\"\", \"\", MainRaw!M96)","v":""},{"$f":"IF(MainRaw!N96=\"\", \"\", MainRaw!N96)","v":""},{"$f":"IF(MainRaw!O96=\"\", \"\", MainRaw!O96)","v":""},{"$f":"IF(MainRaw!P96=\"\", \"\", MainRaw!P96)","v":""},{"$f":"IF(MainRaw!Q96=\"\", \"\", MainRaw!Q96)","v":""}]
[{"$f":"IF(MainRaw!A97=\"\", \"\", MainRaw!A97)","v":""},{"$f":"IF(MainRaw!B97=\"\", \"\", MainRaw!B97)","v":""},{"$f":"IF(MainRaw!E97=\"\", \"\", MainRaw!E97)","v":""},{"$f":"IF(MainRaw!H97=\"\", \"\", MainRaw!H97)","v":""},{"$f":"IF(MainRaw!J97=\"\", \"\", MainRaw!J97)","v":""},{"$f":"IF(MainRaw!K97=\"\", \"\", MainRaw!K97)","v":""},{"$f":"IF(MainRaw!L97=\"\", \"\", MainRaw!L97)","v":""},{"$f":"IF(MainRaw!M97=\"\", \"\", MainRaw!M97)","v":""},{"$f":"IF(MainRaw!R97=\"\", \"\", MainRaw!R97)","v":""},{"$f":"IF(MainRaw!S97=\"\", \"\", MainRaw!S97)","v":""}," -  - ",{"$f":"IF(MainRaw!L97=\"\", \"\", MainRaw!L97)","v":""},{"$f":"IF(MainRaw!M97=\"\", \"\", MainRaw!M97)","v":""},{"$f":"IF(MainRaw!N97=\"\", \"\", MainRaw!N97)","v":""},{"$f":"IF(MainRaw!O97=\"\", \"\", MainRaw!O97)","v":""},{"$f":"IF(MainRaw!P97=\"\", \"\", MainRaw!P97)","v":""},{"$f":"IF(MainRaw!Q97=\"\", \"\", MainRaw!Q97)","v":""}]
[{"$f":"IF(MainRaw!A98=\"\", \"\", MainRaw!A98)","v":""},{"$f":"IF(MainRaw!B98=\"\", \"\", MainRaw!B98)","v":""},{"$f":"IF(MainRaw!E98=\"\", \"\", MainRaw!E98)","v":""},{"$f":"IF(MainRaw!H98=\"\", \"\", MainRaw!H98)","v":""},{"$f":"IF(MainRaw!J98=\"\", \"\", MainRaw!J98)","v":""},{"$f":"IF(MainRaw!K98=\"\", \"\", MainRaw!K98)","v":""},{"$f":"IF(MainRaw!L98=\"\", \"\", MainRaw!L98)","v":""},{"$f":"IF(MainRaw!M98=\"\", \"\", MainRaw!M98)","v":""},{"$f":"IF(MainRaw!R98=\"\", \"\", MainRaw!R98)","v":""},{"$f":"IF(MainRaw!S98=\"\", \"\", MainRaw!S98)","v":""}," -  - ",{"$f":"IF(MainRaw!L98=\"\", \"\", MainRaw!L98)","v":""},{"$f":"IF(MainRaw!M98=\"\", \"\", MainRaw!M98)","v":""},{"$f":"IF(MainRaw!N98=\"\", \"\", MainRaw!N98)","v":""},{"$f":"IF(MainRaw!O98=\"\", \"\", MainRaw!O98)","v":""},{"$f":"IF(MainRaw!P98=\"\", \"\", MainRaw!P98)","v":""},{"$f":"IF(MainRaw!Q98=\"\", \"\", MainRaw!Q98)","v":""}]
[{"$f":"IF(MainRaw!A99=\"\", \"\", MainRaw!A99)","v":""},{"$f":"IF(MainRaw!B99=\"\", \"\", MainRaw!B99)","v":""},{"$f":"IF(MainRaw!E99=\"\", \"\", MainRaw!E99)","v":""},{"$f":"IF(MainRaw!H99=\"\", \"\", MainRaw!H99)","v":""},{"$f":"IF(MainRaw!J99=\"\", \"\", MainRaw!J99)","v":""},{"$f":"IF(MainRaw!K99=\"\", \"\", MainRaw!K99)","v":""},{"$f":"IF(MainRaw!L99=\"\", \"\", MainRaw!L99)","v":""},{"$f":"IF(MainRaw!M99=\"\", \"\", MainRaw!M99)","v":""},{"$f":"IF(MainRaw!R99=\"\", \"\", MainRaw!R99)","v":""},{"$f":"IF(MainRaw!S99=\"\", \"\", MainRaw!S99)","v":""}," -  - ",{"$f":"IF(MainRaw!L99=\"\", \"\", MainRaw!L99)","v":""},{"$f":"IF(MainRaw!M99=\"\", \"\", MainRaw!M99)","v":""},{"$f":"IF(MainRaw!N99=\"\", \"\", MainRaw!N99)","v":""},{"$f":"IF(MainRaw!O99=\"\", \"\", MainRaw!O99)","v":""},{"$f":"IF(MainRaw!P99=\"\", \"\", MainRaw!P99)","v":""},{"$f":"IF(MainRaw!Q99=\"\", \"\", MainRaw!Q99)","v":""}]
[{"$f":"IF(MainRaw!A100=\"\", \"\", MainRaw!A100)","v":""},{"$f":"IF(MainRaw!B100=\"\", \"\", MainRaw!B100)","v":""},{"$f":"IF(MainRaw!E100=\"\", \"\", MainRaw!E100)","v":""},{"$f":"IF(MainRaw!H100=\"\", \"\", MainRaw!H100)","v":""},{"$f":"IF(MainRaw!J100=\"\", \"\", MainRaw!J100)","v":""},{"$f":"IF(MainRaw!K100=\"\", \"\", MainRaw!K100)","v":""},{"$f":"IF(MainRaw!L100=\"\", \"\", MainRaw!L100)","v":""},{"$f":"IF(MainRaw!M100=\"\", \"\", MainRaw!M100)","v":""},{"$f":"IF(MainRaw!R100=\"\", \"\", MainRaw!R100)","v":""},{"$f":"IF(MainRaw!S100=\"\", \"\", MainRaw!S100)","v":""}," -  - ",{"$f":"IF(MainRaw!L100=\"\", \"\", MainRaw!L100)","v":""},{"$f":"IF(MainRaw!M100=\"\", \"\", MainRaw!M100)","v":""},{"$f":"IF(MainRaw!N100=\"\", \"\", MainRaw!N100)","v":""},{"$f":"IF(MainRaw!O100=\"\", \"\", MainRaw!O100)","v":""},{"$f":"IF(MainRaw!P100=\"\", \"\", MainRaw!P100)","v":""},{"$f":"IF(MainRaw!Q100=\"\", \"\", MainRaw!Q100)","v":""}]
[{"$f":"IF(MainRaw!A101=\"\", \"\", MainRaw!A101)","v":""},{"$f":"IF(MainRaw!B101=\"\", \"\", MainRaw!B101)","v":""},{"$f":"IF(MainRaw!E101=\"\", \"\", MainRaw!E101)","v":""},{"$f":"IF(MainRaw!H101=\"\", \"\", MainRaw!H101)","v":""},{"$f":"IF(MainRaw!J101=\"\", \"\", MainRaw!J101)","v":""},{"$f":"IF(MainRaw!K101=\"\", \"\", MainRaw!K101)","v":""},{"$f":"IF(MainRaw!L101=\"\", \"\", MainRaw!L101)","v":""},{"$f":"IF(MainRaw!M101=\"\", \"\", MainRaw!M101)","v":""},{"$f":"IF(MainRaw!R101=\"\", \"\", MainRaw!R101)","v":""},{"$f":"IF(MainRaw!S101=\"\", \"\", MainRaw!S101)","v":""}," -  - ",{"$f":"IF(MainRaw!L101=\"\", \"\", MainRaw!L101)","v":""},{"$f":"IF(MainRaw!M101=\"\", \"\", MainRaw!M101)","v":""},{"$f":"IF(MainRaw!N101=\"\", \"\", MainRaw!N101)","v":""},{"$f":"IF(MainRaw!O101=\"\", \"\", MainRaw!O101)","v":""},{"$f":"IF(MainRaw!P101=\"\", \"\", MainRaw!P101)","v":""},{"$f":"IF(MainRaw!Q101=\"\", \"\", MainRaw!Q101)","v":""}]
[{"$f":"IF(MainRaw!A102=\"\", \"\", MainRaw!A102)","v":""},{"$f":"IF(MainRaw!B102=\"\", \"\", MainRaw!B102)","v":""},{"$f":"IF(MainRaw!E102=\"\", \"\", MainRaw!E102)","v":""},{"$f":"IF(MainRaw!H102=\"\", \"\", MainRaw!H102)","v":""},{"$f":"IF(MainRaw!J102=\"\", \"\", MainRaw!J102)","v":""},{"$f":"IF(MainRaw!K102=\"\", \"\", MainRaw!K102)","v":""},{"$f":"IF(MainRaw!L102=\"\", \"\", MainRaw!L102)","v":""},{"$f":"IF(MainRaw!M102=\"\", \"\", MainRaw!M102)","v":""},{"$f":"IF(MainRaw!R102=\"\", \"\", MainRaw!R102)","v":""},{"$f":"IF(MainRaw!S102=\"\", \"\", MainRaw!S102)","v":""}," -  - ",{"$f":"IF(MainRaw!L102=\"\", \"\", MainRaw!L102)","v":""},{"$f":"IF(MainRaw!M102=\"\", \"\", MainRaw!M102)","v":""},{"$f":"IF(MainRaw!N102=\"\", \"\", MainRaw!N102)","v":""},{"$f":"IF(MainRaw!O102=\"\", \"\", MainRaw!O102)","v":""},{"$f":"IF(MainRaw!P102=\"\", \"\", MainRaw!P102)","v":""},{"$f":"IF(MainRaw!Q102=\"\", \"\", MainRaw!Q102)","v":""}]
[{"$f":"IF(MainRaw!A103=\"\", \"\", MainRaw!A103)","v":""},{"$f":"IF(MainRaw!B103=\"\", \"\", MainRaw!B103)","v":""},{"$f":"IF(MainRaw!E103=\"\", \"\", MainRaw!E103)","v":""},{"$f":"IF(MainRaw!H103=\"\", \"\", MainRaw!H103)","v":""},{"$f":"IF(MainRaw!J103=\"\", \"\", MainRaw!J103)","v":""},{"$f":"IF(MainRaw!K103=\"\", \"\", MainRaw!K103)","v":""},{"$f":"IF(MainRaw!L103=\"\", \"\", MainRaw!L103)","v":""},{"$f":"IF(MainRaw!M103=\"\", \"\", MainRaw!M103)","v":""},{"$f":"IF(MainRaw!R103=\"\", \"\", MainRaw!R103)","v":""},{"$f":"IF(MainRaw!S103=\"\", \"\", MainRaw!S103)","v":""}," -  - ",{"$f":"IF(MainRaw!L103=\"\", \"\", MainRaw!L103)","v":""},{"$f":"IF(MainRaw!M103=\"\", \"\", MainRaw!M103)","v":""},{"$f":"IF(MainRaw!N103=\"\", \"\", MainRaw!N103)","v":""},{"$f":"IF(MainRaw!O103=\"\", \"\", MainRaw!O103)","v":""},{"$f":"IF(MainRaw!P103=\"\", \"\", MainRaw!P103)","v":""},{"$f":"IF(MainRaw!Q103=\"\", \"\", MainRaw!Q103)","v":""}]
[{"$f":"IF(MainRaw!A104=\"\", \"\", MainRaw!A104)","v":""},{"$f":"IF(MainRaw!B104=\"\", \"\", MainRaw!B104)","v":""},{"$f":"IF(MainRaw!E104=\"\", \"\", MainRaw!E104)","v":""},{"$f":"IF(MainRaw!H104=\"\", \"\", MainRaw!H104)","v":""},{"$f":"IF(MainRaw!J104=\"\", \"\", MainRaw!J104)","v":""},{"$f":"IF(MainRaw!K104=\"\", \"\", MainRaw!K104)","v":""},{"$f":"IF(MainRaw!L104=\"\", \"\", MainRaw!L104)","v":""},{"$f":"IF(MainRaw!M104=\"\", \"\", MainRaw!M104)","v":""},{"$f":"IF(MainRaw!R104=\"\", \"\", MainRaw!R104)","v":""},{"$f":"IF(MainRaw!S104=\"\", \"\", MainRaw!S104)","v":""}," -  - ",{"$f":"IF(MainRaw!L104=\"\", \"\", MainRaw!L104)","v":""},{"$f":"IF(MainRaw!M104=\"\", \"\", MainRaw!M104)","v":""},{"$f":"IF(MainRaw!N104=\"\", \"\", MainRaw!N104)","v":""},{"$f":"IF(MainRaw!O104=\"\", \"\", MainRaw!O104)","v":""},{"$f":"IF(MainRaw!P104=\"\", \"\", MainRaw!P104)","v":""},{"$f":"IF(MainRaw!Q104=\"\", \"\", MainRaw!Q104)","v":""}]
[{"$f":"IF(MainRaw!A105=\"\", \"\", MainRaw!A105)","v":""},{"$f":"IF(MainRaw!B105=\"\", \"\", MainRaw!B105)","v":""},{"$f":"IF(MainRaw!E105=\"\", \"\", MainRaw!E105)","v":""},{"$f":"IF(MainRaw!H105=\"\", \"\", MainRaw!H105)","v":""},{"$f":"IF(MainRaw!J105=\"\", \"\", MainRaw!J105)","v":""},{"$f":"IF(MainRaw!K105=\"\", \"\", MainRaw!K105)","v":""},{"$f":"IF(MainRaw!L105=\"\", \"\", MainRaw!L105)","v":""},{"$f":"IF(MainRaw!M105=\"\", \"\", MainRaw!M105)","v":""},{"$f":"IF(MainRaw!R105=\"\", \"\", MainRaw!R105)","v":""},{"$f":"IF(MainRaw!S105=\"\", \"\", MainRaw!S105)","v":""}," -  - ",{"$f":"IF(MainRaw!L105=\"\", \"\", MainRaw!L105)","v":""},{"$f":"IF(MainRaw!M105=\"\", \"\", MainRaw!M105)","v":""},{"$f":"IF(MainRaw!N105=\"\", \"\", MainRaw!N105)","v":""},{"$f":"IF(MainRaw!O105=\"\", \"\", MainRaw!O105)","v":""},{"$f":"IF(MainRaw!P105=\"\", \"\", MainRaw!P105)","v":""},{"$f":"IF(MainRaw!Q105=\"\", \"\", MainRaw!Q105)","v":""}]
[{"$f":"IF(MainRaw!A106=\"\", \"\", MainRaw!A106)","v":""},{"$f":"IF(MainRaw!B106=\"\", \"\", MainRaw!B106)","v":""},{"$f":"IF(MainRaw!E106=\"\", \"\", MainRaw!E106)","v":""},{"$f":"IF(MainRaw!H106=\"\", \"\", MainRaw!H106)","v":""},{"$f":"IF(MainRaw!J106=\"\", \"\", MainRaw!J106)","v":""},{"$f":"IF(MainRaw!K106=\"\", \"\", MainRaw!K106)","v":""},{"$f":"IF(MainRaw!L106=\"\", \"\", MainRaw!L106)","v":""},{"$f":"IF(MainRaw!M106=\"\", \"\", MainRaw!M106)","v":""},{"$f":"IF(MainRaw!R106=\"\", \"\", MainRaw!R106)","v":""},{"$f":"IF(MainRaw!S106=\"\", \"\", MainRaw!S106)","v":""}," -  - ",{"$f":"IF(MainRaw!L106=\"\", \"\", MainRaw!L106)","v":""},{"$f":"IF(MainRaw!M106=\"\", \"\", MainRaw!M106)","v":""},{"$f":"IF(MainRaw!N106=\"\", \"\", MainRaw!N106)","v":""},{"$f":"IF(MainRaw!O106=\"\", \"\", MainRaw!O106)","v":""},{"$f":"IF(MainRaw!P106=\"\", \"\", MainRaw!P106)","v":""},{"$f":"IF(MainRaw!Q106=\"\", \"\", MainRaw!Q106)","v":""}]
[{"$f":"IF(MainRaw!A107=\"\", \"\", MainRaw!A107)","v":""},{"$f":"IF(MainRaw!B107=\"\", \"\", MainRaw!B107)","v":""},{"$f":"IF(MainRaw!E107=\"\", \"\", MainRaw!E107)","v":""},{"$f":"IF(MainRaw!H107=\"\", \"\", MainRaw!H107)","v":""},{"$f":"IF(MainRaw!J107=\"\", \"\", MainRaw!J107)","v":""},{"$f":"IF(MainRaw!K107=\"\", \"\", MainRaw!K107)","v":""},{"$f":"IF(MainRaw!L107=\"\", \"\", MainRaw!L107)","v":""},{"$f":"IF(MainRaw!M107=\"\", \"\", MainRaw!M107)","v":""},{"$f":"IF(MainRaw!R107=\"\", \"\", MainRaw!R107)","v":""},{"$f":"IF(MainRaw!S107=\"\", \"\", MainRaw!S107)","v":""}," -  - ",{"$f":"IF(MainRaw!L107=\"\", \"\", MainRaw!L107)","v":""},{"$f":"IF(MainRaw!M107=\"\", \"\", MainRaw!M107)","v":""},{"$f":"IF(MainRaw!N107=\"\", \"\", MainRaw!N107)","v":""},{"$f":"IF(MainRaw!O107=\"\", \"\", MainRaw!O107)","v":""},{"$f":"IF(MainRaw!P107=\"\", \"\", MainRaw!P107)","v":""},{"$f":"IF(MainRaw!Q107=\"\", \"\", MainRaw!Q107)","v":""}]
[{"$f":"IF(MainRaw!A108=\"\", \"\", MainRaw!A108)","v":""},{"$f":"IF(MainRaw!B108=\"\", \"\", MainRaw!B108)","v":""},{"$f":"IF(MainRaw!E108=\"\", \"\", MainRaw!E108)","v":""},{"$f":"IF(MainRaw!H108=\"\", \"\", MainRaw!H108)","v":""},{"$f":"IF(MainRaw!J108=\"\", \"\", MainRaw!J108)","v":""},{"$f":"IF(MainRaw!K108=\"\", \"\", MainRaw!K108)","v":""},{"$f":"IF(MainRaw!L108=\"\", \"\", MainRaw!L108)","v":""},{"$f":"IF(MainRaw!M108=\"\", \"\", MainRaw!M108)","v":""},{"$f":"IF(MainRaw!R108=\"\", \"\", MainRaw!R108)","v":""},{"$f":"IF(MainRaw!S108=\"\", \"\", MainRaw!S108)","v":""}," -  - ",{"$f":"IF(MainRaw!L108=\"\", \"\", MainRaw!L108)","v":""},{"$f":"IF(MainRaw!M108=\"\", \"\", MainRaw!M108)","v":""},{"$f":"IF(MainRaw!N108=\"\", \"\", MainRaw!N108)","v":""},{"$f":"IF(MainRaw!O108=\"\", \"\", MainRaw!O108)","v":""},{"$f":"IF(MainRaw!P108=\"\", \"\", MainRaw!P108)","v":""},{"$f":"IF(MainRaw!Q108=\"\", \"\", MainRaw!Q108)","v":""}]
[{"$f":"IF(MainRaw!A109=\"\", \"\", MainRaw!A109)","v":""},{"$f":"IF(MainRaw!B109=\"\", \"\", MainRaw!B109)","v":""},{"$f":"IF(MainRaw!E109=\"\", \"\", MainRaw!E109)","v":""},{"$f":"IF(MainRaw!H109=\"\", \"\", MainRaw!H109)","v":""},{"$f":"IF(MainRaw!J109=\"\", \"\", MainRaw!J109)","v":""},{"$f":"IF(MainRaw!K109=\"\", \"\", MainRaw!K109)","v":""},{"$f":"IF(MainRaw!L109=\"\", \"\", MainRaw!L109)","v":""},{"$f":"IF(MainRaw!M109=\"\", \"\", MainRaw!M109)","v":""},{"$f":"IF(MainRaw!R109=\"\", \"\", MainRaw!R109)","v":""},{"$f":"IF(MainRaw!S109=\"\", \"\", MainRaw!S109)","v":""}," -  - ",{"$f":"IF(MainRaw!L109=\"\", \"\", MainRaw!L109)","v":""},{"$f":"IF(MainRaw!M109=\"\", \"\", MainRaw!M109)","v":""},{"$f":"IF(MainRaw!N109=\"\", \"\", MainRaw!N109)","v":""},{"$f":"IF(MainRaw!O109=\"\", \"\", MainRaw!O109)","v":""},{"$f":"IF(MainRaw!P109=\"\", \"\", MainRaw!P109)","v":""},{"$f":"IF(MainRaw!Q109=\"\", \"\", MainRaw!Q109)","v":""}]
[{"$f":"IF(MainRaw!A110=\"\", \"\", MainRaw!A110)","v":""},{"$f":"IF(MainRaw!B110=\"\", \"\", MainRaw!B110)","v":""},{"$f":"IF(MainRaw!E110=\"\", \"\", MainRaw!E110)","v":""},{"$f":"IF(MainRaw!H110=\"\", \"\", MainRaw!H110)","v":""},{"$f":"IF(MainRaw!J110=\"\", \"\", MainRaw!J110)","v":""},{"$f":"IF(MainRaw!K110=\"\", \"\", MainRaw!K110)","v":""},{"$f":"IF(MainRaw!L110=\"\", \"\", MainRaw!L110)","v":""},{"$f":"IF(MainRaw!M110=\"\", \"\", MainRaw!M110)","v":""},{"$f":"IF(MainRaw!R110=\"\", \"\", MainRaw!R110)","v":""},{"$f":"IF(MainRaw!S110=\"\", \"\", MainRaw!S110)","v":""}," -  - ",{"$f":"IF(MainRaw!L110=\"\", \"\", MainRaw!L110)","v":""},{"$f":"IF(MainRaw!M110=\"\", \"\", MainRaw!M110)","v":""},{"$f":"IF(MainRaw!N110=\"\", \"\", MainRaw!N110)","v":""},{"$f":"IF(MainRaw!O110=\"\", \"\", MainRaw!O110)","v":""},{"$f":"IF(MainRaw!P110=\"\", \"\", MainRaw!P110)","v":""},{"$f":"IF(MainRaw!Q110=\"\", \"\", MainRaw!Q110)","v":""}]
[{"$f":"IF(MainRaw!A111=\"\", \"\", MainRaw!A111)","v":""},{"$f":"IF(MainRaw!B111=\"\", \"\", MainRaw!B111)","v":""},{"$f":"IF(MainRaw!E111=\"\", \"\", MainRaw!E111)","v":""},{"$f":"IF(MainRaw!H111=\"\", \"\", MainRaw!H111)","v":""},{"$f":"IF(MainRaw!J111=\"\", \"\", MainRaw!J111)","v":""},{"$f":"IF(MainRaw!K111=\"\", \"\", MainRaw!K111)","v":""},{"$f":"IF(MainRaw!L111=\"\", \"\", MainRaw!L111)","v":""},{"$f":"IF(MainRaw!M111=\"\", \"\", MainRaw!M111)","v":""},{"$f":"IF(MainRaw!R111=\"\", \"\", MainRaw!R111)","v":""},{"$f":"IF(MainRaw!S111=\"\", \"\", MainRaw!S111)","v":""}," -  - ",{"$f":"IF(MainRaw!L111=\"\", \"\", MainRaw!L111)","v":""},{"$f":"IF(MainRaw!M111=\"\", \"\", MainRaw!M111)","v":""},{"$f":"IF(MainRaw!N111=\"\", \"\", MainRaw!N111)","v":""},{"$f":"IF(MainRaw!O111=\"\", \"\", MainRaw!O111)","v":""},{"$f":"IF(MainRaw!P111=\"\", \"\", MainRaw!P111)","v":""},{"$f":"IF(MainRaw!Q111=\"\", \"\", MainRaw!Q111)","v":""}]
[{"$f":"IF(MainRaw!A112=\"\", \"\", MainRaw!A112)","v":""},{"$f":"IF(MainRaw!B112=\"\", \"\", MainRaw!B112)","v":""},{"$f":"IF(MainRaw!E112=\"\", \"\", MainRaw!E112)","v":""},{"$f":"IF(MainRaw!H112=\"\", \"\", MainRaw!H112)","v":""},{"$f":"IF(MainRaw!J112=\"\", \"\", MainRaw!J112)","v":""},{"$f":"IF(MainRaw!K112=\"\", \"\", MainRaw!K112)","v":""},{"$f":"IF(MainRaw!L112=\"\", \"\", MainRaw!L112)","v":""},{"$f":"IF(MainRaw!M112=\"\", \"\", MainRaw!M112)","v":""},{"$f":"IF(MainRaw!R112=\"\", \"\", MainRaw!R112)","v":""},{"$f":"IF(MainRaw!S112=\"\", \"\", MainRaw!S112)","v":""}," -  - ",{"$f":"IF(MainRaw!L112=\"\", \"\", MainRaw!L112)","v":""},{"$f":"IF(MainRaw!M112=\"\", \"\", MainRaw!M112)","v":""},{"$f":"IF(MainRaw!N112=\"\", \"\", MainRaw!N112)","v":""},{"$f":"IF(MainRaw!O112=\"\", \"\", MainRaw!O112)","v":""},{"$f":"IF(MainRaw!P112=\"\", \"\", MainRaw!P112)","v":""},{"$f":"IF(MainRaw!Q112=\"\", \"\", MainRaw!Q112)","v":""}]
[{"$f":"IF(MainRaw!A113=\"\", \"\", MainRaw!A113)","v":""},{"$f":"IF(MainRaw!B113=\"\", \"\", MainRaw!B113)","v":""},{"$f":"IF(MainRaw!E113=\"\", \"\", MainRaw!E113)","v":""},{"$f":"IF(MainRaw!H113=\"\", \"\", MainRaw!H113)","v":""},{"$f":"IF(MainRaw!J113=\"\", \"\", MainRaw!J113)","v":""},{"$f":"IF(MainRaw!K113=\"\", \"\", MainRaw!K113)","v":""},{"$f":"IF(MainRaw!L113=\"\", \"\", MainRaw!L113)","v":""},{"$f":"IF(MainRaw!M113=\"\", \"\", MainRaw!M113)","v":""},{"$f":"IF(MainRaw!R113=\"\", \"\", MainRaw!R113)","v":""},{"$f":"IF(MainRaw!S113=\"\", \"\", MainRaw!S113)","v":""}," -  - ",{"$f":"IF(MainRaw!L113=\"\", \"\", MainRaw!L113)","v":""},{"$f":"IF(MainRaw!M113=\"\", \"\", MainRaw!M113)","v":""},{"$f":"IF(MainRaw!N113=\"\", \"\", MainRaw!N113)","v":""},{"$f":"IF(MainRaw!O113=\"\", \"\", MainRaw!O113)","v":""},{"$f":"IF(MainRaw!P113=\"\", \"\", MainRaw!P113)","v":""},{"$f":"IF(MainRaw!Q113=\"\", \"\", MainRaw!Q113)","v":""}]
[{"$f":"IF(MainRaw!A114=\"\", \"\", MainRaw!A114)","v":""},{"$f":"IF(MainRaw!B114=\"\", \"\", MainRaw!B114)","v":""},{"$f":"IF(MainRaw!E114=\"\", \"\", MainRaw!E114)","v":""},{"$f":"IF(MainRaw!H114=\"\", \"\", MainRaw!H114)","v":""},{"$f":"IF(MainRaw!J114=\"\", \"\", MainRaw!J114)","v":""},{"$f":"IF(MainRaw!K114=\"\", \"\", MainRaw!K114)","v":""},{"$f":"IF(MainRaw!L114=\"\", \"\", MainRaw!L114)","v":""},{"$f":"IF(MainRaw!M114=\"\", \"\", MainRaw!M114)","v":""},{"$f":"IF(MainRaw!R114=\"\", \"\", MainRaw!R114)","v":""},{"$f":"IF(MainRaw!S114=\"\", \"\", MainRaw!S114)","v":""}," -  - ",{"$f":"IF(MainRaw!L114=\"\", \"\", MainRaw!L114)","v":""},{"$f":"IF(MainRaw!M114=\"\", \"\", MainRaw!M114)","v":""},{"$f":"IF(MainRaw!N114=\"\", \"\", MainRaw!N114)","v":""},{"$f":"IF(MainRaw!O114=\"\", \"\", MainRaw!O114)","v":""},{"$f":"IF(MainRaw!P114=\"\", \"\", MainRaw!P114)","v":""},{"$f":"IF(MainRaw!Q114=\"\", \"\", MainRaw!Q114)","v":""}]
[{"$f":"IF(MainRaw!A115=\"\", \"\", MainRaw!A115)","v":""},{"$f":"IF(MainRaw!B115=\"\", \"\", MainRaw!B115)","v":""},{"$f":"IF(MainRaw!E115=\"\", \"\", MainRaw!E115)","v":""},{"$f":"IF(MainRaw!H115=\"\", \"\", MainRaw!H115)","v":""},{"$f":"IF(MainRaw!J115=\"\", \"\", MainRaw!J115)","v":""},{"$f":"IF(MainRaw!K115=\"\", \"\", MainRaw!K115)","v":""},{"$f":"IF(MainRaw!L115=\"\", \"\", MainRaw!L115)","v":""},{"$f":"IF(MainRaw!M115=\"\", \"\", MainRaw!M115)","v":""},{"$f":"IF(MainRaw!R115=\"\", \"\", MainRaw!R115)","v":""},{"$f":"IF(MainRaw!S115=\"\", \"\", MainRaw!S115)","v":""}," -  - ",{"$f":"IF(MainRaw!L115=\"\", \"\", MainRaw!L115)","v":""},{"$f":"IF(MainRaw!M115=\"\", \"\", MainRaw!M115)","v":""},{"$f":"IF(MainRaw!N115=\"\", \"\", MainRaw!N115)","v":""},{"$f":"IF(MainRaw!O115=\"\", \"\", MainRaw!O115)","v":""},{"$f":"IF(MainRaw!P115=\"\", \"\", MainRaw!P115)","v":""},{"$f":"IF(MainRaw!Q115=\"\", \"\", MainRaw!Q115)","v":""}]
[{"$f":"IF(MainRaw!A116=\"\", \"\", MainRaw!A116)","v":""},{"$f":"IF(MainRaw!B116=\"\", \"\", MainRaw!B116)","v":""},{"$f":"IF(MainRaw!E116=\"\", \"\", MainRaw!E116)","v":""},{"$f":"IF(MainRaw!H116=\"\", \"\", MainRaw!H116)","v":""},{"$f":"IF(MainRaw!J116=\"\", \"\", MainRaw!J116)","v":""},{"$f":"IF(MainRaw!K116=\"\", \"\", MainRaw!K116)","v":""},{"$f":"IF(MainRaw!L116=\"\", \"\", MainRaw!L116)","v":""},{"$f":"IF(MainRaw!M116=\"\", \"\", MainRaw!M116)","v":""},{"$f":"IF(MainRaw!R116=\"\", \"\", MainRaw!R116)","v":""},{"$f":"IF(MainRaw!S116=\"\", \"\", MainRaw!S116)","v":""}," -  - ",{"$f":"IF(MainRaw!L116=\"\", \"\", MainRaw!L116)","v":""},{"$f":"IF(MainRaw!M116=\"\", \"\", MainRaw!M116)","v":""},{"$f":"IF(MainRaw!N116=\"\", \"\", MainRaw!N116)","v":""},{"$f":"IF(MainRaw!O116=\"\", \"\", MainRaw!O116)","v":""},{"$f":"IF(MainRaw!P116=\"\", \"\", MainRaw!P116)","v":""},{"$f":"IF(MainRaw!Q116=\"\", \"\", MainRaw!Q116)","v":""}]
[{"$f":"IF(MainRaw!A117=\"\", \"\", MainRaw!A117)","v":""},{"$f":"IF(MainRaw!B117=\"\", \"\", MainRaw!B117)","v":""},{"$f":"IF(MainRaw!E117=\"\", \"\", MainRaw!E117)","v":""},{"$f":"IF(MainRaw!H117=\"\", \"\", MainRaw!H117)","v":""},{"$f":"IF(MainRaw!J117=\"\", \"\", MainRaw!J117)","v":""},{"$f":"IF(MainRaw!K117=\"\", \"\", MainRaw!K117)","v":""},{"$f":"IF(MainRaw!L117=\"\", \"\", MainRaw!L117)","v":""},{"$f":"IF(MainRaw!M117=\"\", \"\", MainRaw!M117)","v":""},{"$f":"IF(MainRaw!R117=\"\", \"\", MainRaw!R117)","v":""},{"$f":"IF(MainRaw!S117=\"\", \"\", MainRaw!S117)","v":""}," -  - ",{"$f":"IF(MainRaw!L117=\"\", \"\", MainRaw!L117)","v":""},{"$f":"IF(MainRaw!M117=\"\", \"\", MainRaw!M117)","v":""},{"$f":"IF(MainRaw!N117=\"\", \"\", MainRaw!N117)","v":""},{"$f":"IF(MainRaw!O117=\"\", \"\", MainRaw!O117)","v":""},{"$f":"IF(MainRaw!P117=\"\", \"\", MainRaw!P117)","v":""},{"$f":"IF(MainRaw!Q117=\"\", \"\", MainRaw!Q117)","v":""}]
[{"$f":"IF(MainRaw!A118=\"\", \"\", MainRaw!A118)","v":""},{"$f":"IF(MainRaw!B118=\"\", \"\", MainRaw!B118)","v":""},{"$f":"IF(MainRaw!E118=\"\", \"\", MainRaw!E118)","v":""},{"$f":"IF(MainRaw!H118=\"\", \"\", MainRaw!H118)","v":""},{"$f":"IF(MainRaw!J118=\"\", \"\", MainRaw!J118)","v":""},{"$f":"IF(MainRaw!K118=\"\", \"\", MainRaw!K118)","v":""},{"$f":"IF(MainRaw!L118=\"\", \"\", MainRaw!L118)","v":""},{"$f":"IF(MainRaw!M118=\"\", \"\", MainRaw!M118)","v":""},{"$f":"IF(MainRaw!R118=\"\", \"\", MainRaw!R118)","v":""},{"$f":"IF(MainRaw!S118=\"\", \"\", MainRaw!S118)","v":""}," -  - ",{"$f":"IF(MainRaw!L118=\"\", \"\", MainRaw!L118)","v":""},{"$f":"IF(MainRaw!M118=\"\", \"\", MainRaw!M118)","v":""},{"$f":"IF(MainRaw!N118=\"\", \"\", MainRaw!N118)","v":""},{"$f":"IF(MainRaw!O118=\"\", \"\", MainRaw!O118)","v":""},{"$f":"IF(MainRaw!P118=\"\", \"\", MainRaw!P118)","v":""},{"$f":"IF(MainRaw!Q118=\"\", \"\", MainRaw!Q118)","v":""}]
[{"$f":"IF(MainRaw!A119=\"\", \"\", MainRaw!A119)","v":""},{"$f":"IF(MainRaw!B119=\"\", \"\", MainRaw!B119)","v":""},{"$f":"IF(MainRaw!E119=\"\", \"\", MainRaw!E119)","v":""},{"$f":"IF(MainRaw!H119=\"\", \"\", MainRaw!H119)","v":""},{"$f":"IF(MainRaw!J119=\"\", \"\", MainRaw!J119)","v":""},{"$f":"IF(MainRaw!K119=\"\", \"\", MainRaw!K119)","v":""},{"$f":"IF(MainRaw!L119=\"\", \"\", MainRaw!L119)","v":""},{"$f":"IF(MainRaw!M119=\"\", \"\", MainRaw!M119)","v":""},{"$f":"IF(MainRaw!R119=\"\", \"\", MainRaw!R119)","v":""},{"$f":"IF(MainRaw!S119=\"\", \"\", MainRaw!S119)","v":""}," -  - ",{"$f":"IF(MainRaw!L119=\"\", \"\", MainRaw!L119)","v":""},{"$f":"IF(MainRaw!M119=\"\", \"\", MainRaw!M119)","v":""},{"$f":"IF(MainRaw!N119=\"\", \"\", MainRaw!N119)","v":""},{"$f":"IF(MainRaw!O119=\"\", \"\", MainRaw!O119)","v":""},{"$f":"IF(MainRaw!P119=\"\", \"\", MainRaw!P119)","v":""},{"$f":"IF(MainRaw!Q119=\"\", \"\", MainRaw!Q119)","v":""}]
[{"$f":"IF(MainRaw!A120=\"\", \"\", MainRaw!A120)","v":""},{"$f":"IF(MainRaw!B120=\"\", \"\", MainRaw!B120)","v":""},{"$f":"IF(MainRaw!E120=\"\", \"\", MainRaw!E120)","v":""},{"$f":"IF(MainRaw!H120=\"\", \"\", MainRaw!H120)","v":""},{"$f":"IF(MainRaw!J120=\"\", \"\", MainRaw!J120)","v":""},{"$f":"IF(MainRaw!K120=\"\", \"\", MainRaw!K120)","v":""},{"$f":"IF(MainRaw!L120=\"\", \"\", MainRaw!L120)","v":""},{"$f":"IF(MainRaw!M120=\"\", \"\", MainRaw!M120)","v":""},{"$f":"IF(MainRaw!R120=\"\", \"\", MainRaw!R120)","v":""},{"$f":"IF(MainRaw!S120=\"\", \"\", MainRaw!S120)","v":""}," -  - ",{"$f":"IF(MainRaw!L120=\"\", \"\", MainRaw!L120)","v":""},{"$f":"IF(MainRaw!M120=\"\", \"\", MainRaw!M120)","v":""},{"$f":"IF(MainRaw!N120=\"\", \"\", MainRaw!N120)","v":""},{"$f":"IF(MainRaw!O120=\"\", \"\", MainRaw!O120)","v":""},{"$f":"IF(MainRaw!P120=\"\", \"\", MainRaw!P120)","v":""},{"$f":"IF(MainRaw!Q120=\"\", \"\", MainRaw!Q120)","v":""}]
[{"$f":"IF(MainRaw!A121=\"\", \"\", MainRaw!A121)","v":""},{"$f":"IF(MainRaw!B121=\"\", \"\", MainRaw!B121)","v":""},{"$f":"IF(MainRaw!E121=\"\", \"\", MainRaw!E121)","v":""},{"$f":"IF(MainRaw!H121=\"\", \"\", MainRaw!H121)","v":""},{"$f":"IF(MainRaw!J121=\"\", \"\", MainRaw!J121)","v":""},{"$f":"IF(MainRaw!K121=\"\", \"\", MainRaw!K121)","v":""},{"$f":"IF(MainRaw!L121=\"\", \"\", MainRaw!L121)","v":""},{"$f":"IF(MainRaw!M121=\"\", \"\", MainRaw!M121)","v":""},{"$f":"IF(MainRaw!R121=\"\", \"\", MainRaw!R121)","v":""},{"$f":"IF(MainRaw!S121=\"\", \"\", MainRaw!S121)","v":""}," -  - ",{"$f":"IF(MainRaw!L121=\"\", \"\", MainRaw!L121)","v":""},{"$f":"IF(MainRaw!M121=\"\", \"\", MainRaw!M121)","v":""},{"$f":"IF(MainRaw!N121=\"\", \"\", MainRaw!N121)","v":""},{"$f":"IF(MainRaw!O121=\"\", \"\", MainRaw!O121)","v":""},{"$f":"IF(MainRaw!P121=\"\", \"\", MainRaw!P121)","v":""},{"$f":"IF(MainRaw!Q121=\"\", \"\", MainRaw!Q121)","v":""}]
[{"$f":"IF(MainRaw!A122=\"\", \"\", MainRaw!A122)","v":""},{"$f":"IF(MainRaw!B122=\"\", \"\", MainRaw!B122)","v":""},{"$f":"IF(MainRaw!E122=\"\", \"\", MainRaw!E122)","v":""},{"$f":"IF(MainRaw!H122=\"\", \"\", MainRaw!H122)","v":""},{"$f":"IF(MainRaw!J122=\"\", \"\", MainRaw!J122)","v":""},{"$f":"IF(MainRaw!K122=\"\", \"\", MainRaw!K122)","v":""},{"$f":"IF(MainRaw!L122=\"\", \"\", MainRaw!L122)","v":""},{"$f":"IF(MainRaw!M122=\"\", \"\", MainRaw!M122)","v":""},{"$f":"IF(MainRaw!R122=\"\", \"\", MainRaw!R122)","v":""},{"$f":"IF(MainRaw!S122=\"\", \"\", MainRaw!S122)","v":""}," -  - ",{"$f":"IF(MainRaw!L122=\"\", \"\", MainRaw!L122)","v":""},{"$f":"IF(MainRaw!M122=\"\", \"\", MainRaw!M122)","v":""},{"$f":"IF(MainRaw!N122=\"\", \"\", MainRaw!N122)","v":""},{"$f":"IF(MainRaw!O122=\"\", \"\", MainRaw!O122)","v":""},{"$f":"IF(MainRaw!P122=\"\", \"\", MainRaw!P122)","v":""},{"$f":"IF(MainRaw!Q122=\"\", \"\", MainRaw!Q122)","v":""}]
[{"$f":"IF(MainRaw!A123=\"\", \"\", MainRaw!A123)","v":""},{"$f":"IF(MainRaw!B123=\"\", \"\", MainRaw!B123)","v":""},{"$f":"IF(MainRaw!E123=\"\", \"\", MainRaw!E123)","v":""},{"$f":"IF(MainRaw!H123=\"\", \"\", MainRaw!H123)","v":""},{"$f":"IF(MainRaw!J123=\"\", \"\", MainRaw!J123)","v":""},{"$f":"IF(MainRaw!K123=\"\", \"\", MainRaw!K123)","v":""},{"$f":"IF(MainRaw!L123=\"\", \"\", MainRaw!L123)","v":""},{"$f":"IF(MainRaw!M123=\"\", \"\", MainRaw!M123)","v":""},{"$f":"IF(MainRaw!R123=\"\", \"\", MainRaw!R123)","v":""},{"$f":"IF(MainRaw!S123=\"\", \"\", MainRaw!S123)","v":""}," -  - ",{"$f":"IF(MainRaw!L123=\"\", \"\", MainRaw!L123)","v":""},{"$f":"IF(MainRaw!M123=\"\", \"\", MainRaw!M123)","v":""},{"$f":"IF(MainRaw!N123=\"\", \"\", MainRaw!N123)","v":""},{"$f":"IF(MainRaw!O123=\"\", \"\", MainRaw!O123)","v":""},{"$f":"IF(MainRaw!P123=\"\", \"\", MainRaw!P123)","v":""},{"$f":"IF(MainRaw!Q123=\"\", \"\", MainRaw!Q123)","v":""}]
[{"$f":"IF(MainRaw!A124=\"\", \"\", MainRaw!A124)","v":""},{"$f":"IF(MainRaw!B124=\"\", \"\", MainRaw!B124)","v":""},{"$f":"IF(MainRaw!E124=\"\", \"\", MainRaw!E124)","v":""},{"$f":"IF(MainRaw!H124=\"\", \"\", MainRaw!H124)","v":""},{"$f":"IF(MainRaw!J124=\"\", \"\", MainRaw!J124)","v":""},{"$f":"IF(MainRaw!K124=\"\", \"\", MainRaw!K124)","v":""},{"$f":"IF(MainRaw!L124=\"\", \"\", MainRaw!L124)","v":""},{"$f":"IF(MainRaw!M124=\"\", \"\", MainRaw!M124)","v":""},{"$f":"IF(MainRaw!R124=\"\", \"\", MainRaw!R124)","v":""},{"$f":"IF(MainRaw!S124=\"\", \"\", MainRaw!S124)","v":""}," -  - ",{"$f":"IF(MainRaw!L124=\"\", \"\", MainRaw!L124)","v":""},{"$f":"IF(MainRaw!M124=\"\", \"\", MainRaw!M124)","v":""},{"$f":"IF(MainRaw!N124=\"\", \"\", MainRaw!N124)","v":""},{"$f":"IF(MainRaw!O124=\"\", \"\", MainRaw!O124)","v":""},{"$f":"IF(MainRaw!P124=\"\", \"\", MainRaw!P124)","v":""},{"$f":"IF(MainRaw!Q124=\"\", \"\", MainRaw!Q124)","v":""}]
[{"$f":"IF(MainRaw!A125=\"\", \"\", MainRaw!A125)","v":""},{"$f":"IF(MainRaw!B125=\"\", \"\", MainRaw!B125)","v":""},{"$f":"IF(MainRaw!E125=\"\", \"\", MainRaw!E125)","v":""},{"$f":"IF(MainRaw!H125=\"\", \"\", MainRaw!H125)","v":""},{"$f":"IF(MainRaw!J125=\"\", \"\", MainRaw!J125)","v":""},{"$f":"IF(MainRaw!K125=\"\", \"\", MainRaw!K125)","v":""},{"$f":"IF(MainRaw!L125=\"\", \"\", MainRaw!L125)","v":""},{"$f":"IF(MainRaw!M125=\"\", \"\", MainRaw!M125)","v":""},{"$f":"IF(MainRaw!R125=\"\", \"\", MainRaw!R125)","v":""},{"$f":"IF(MainRaw!S125=\"\", \"\", MainRaw!S125)","v":""}," -  - ",{"$f":"IF(MainRaw!L125=\"\", \"\", MainRaw!L125)","v":""},{"$f":"IF(MainRaw!M125=\"\", \"\", MainRaw!M125)","v":""},{"$f":"IF(MainRaw!N125=\"\", \"\", MainRaw!N125)","v":""},{"$f":"IF(MainRaw!O125=\"\", \"\", MainRaw!O125)","v":""},{"$f":"IF(MainRaw!P125=\"\", \"\", MainRaw!P125)","v":""},{"$f":"IF(MainRaw!Q125=\"\", \"\", MainRaw!Q125)","v":""}]
[{"$f":"IF(MainRaw!A126=\"\", \"\", MainRaw!A126)","v":""},{"$f":"IF(MainRaw!B126=\"\", \"\", MainRaw!B126)","v":""},{"$f":"IF(MainRaw!E126=\"\", \"\", MainRaw!E126)","v":""},{"$f":"IF(MainRaw!H126=\"\", \"\", MainRaw!H126)","v":""},{"$f":"IF(MainRaw!J126=\"\", \"\", MainRaw!J126)","v":""},{"$f":"IF(MainRaw!K126=\"\", \"\", MainRaw!K126)","v":""},{"$f":"IF(MainRaw!L126=\"\", \"\", MainRaw!L126)","v":""},{"$f":"IF(MainRaw!M126=\"\", \"\", MainRaw!M126)","v":""},{"$f":"IF(MainRaw!R126=\"\", \"\", MainRaw!R126)","v":""},{"$f":"IF(MainRaw!S126=\"\", \"\", MainRaw!S126)","v":""}," -  - ",{"$f":"IF(MainRaw!L126=\"\", \"\", MainRaw!L126)","v":""},{"$f":"IF(MainRaw!M126=\"\", \"\", MainRaw!M126)","v":""},{"$f":"IF(MainRaw!N126=\"\", \"\", MainRaw!N126)","v":""},{"$f":"IF(MainRaw!O126=\"\", \"\", MainRaw!O126)","v":""},{"$f":"IF(MainRaw!P126=\"\", \"\", MainRaw!P126)","v":""},{"$f":"IF(MainRaw!Q126=\"\", \"\", MainRaw!Q126)","v":""}]
[{"$f":"IF(MainRaw!A127=\"\", \"\", MainRaw!A127)","v":""},{"$f":"IF(MainRaw!B127=\"\", \"\", MainRaw!B127)","v":""},{"$f":"IF(MainRaw!E127=\"\", \"\", MainRaw!E127)","v":""},{"$f":"IF(MainRaw!H127=\"\", \"\", MainRaw!H127)","v":""},{"$f":"IF(MainRaw!J127=\"\", \"\", MainRaw!J127)","v":""},{"$f":"IF(MainRaw!K127=\"\", \"\", MainRaw!K127)","v":""},{"$f":"IF(MainRaw!L127=\"\", \"\", MainRaw!L127)","v":""},{"$f":"IF(MainRaw!M127=\"\", \"\", MainRaw!M127)","v":""},{"$f":"IF(MainRaw!R127=\"\", \"\", MainRaw!R127)","v":""},{"$f":"IF(MainRaw!S127=\"\", \"\", MainRaw!S127)","v":""}," -  - ",{"$f":"IF(MainRaw!L127=\"\", \"\", MainRaw!L127)","v":""},{"$f":"IF(MainRaw!M127=\"\", \"\", MainRaw!M127)","v":""},{"$f":"IF(MainRaw!N127=\"\", \"\", MainRaw!N127)","v":""},{"$f":"IF(MainRaw!O127=\"\", \"\", MainRaw!O127)","v":""},{"$f":"IF(MainRaw!P127=\"\", \"\", MainRaw!P127)","v":""},{"$f":"IF(MainRaw!Q127=\"\", \"\", MainRaw!Q127)","v":""}]
[{"$f":"IF(MainRaw!A128=\"\", \"\", MainRaw!A128)","v":""},{"$f":"IF(MainRaw!B128=\"\", \"\", MainRaw!B128)","v":""},{"$f":"IF(MainRaw!E128=\"\", \"\", MainRaw!E128)","v":""},{"$f":"IF(MainRaw!H128=\"\", \"\", MainRaw!H128)","v":""},{"$f":"IF(MainRaw!J128=\"\", \"\", MainRaw!J128)","v":""},{"$f":"IF(MainRaw!K128=\"\", \"\", MainRaw!K128)","v":""},{"$f":"IF(MainRaw!L128=\"\", \"\", MainRaw!L128)","v":""},{"$f":"IF(MainRaw!M128=\"\", \"\", MainRaw!M128)","v":""},{"$f":"IF(MainRaw!R128=\"\", \"\", MainRaw!R128)","v":""},{"$f":"IF(MainRaw!S128=\"\", \"\", MainRaw!S128)","v":""}," -  - ",{"$f":"IF(MainRaw!L128=\"\", \"\", MainRaw!L128)","v":""},{"$f":"IF(MainRaw!M128=\"\", \"\", MainRaw!M128)","v":""},{"$f":"IF(MainRaw!N128=\"\", \"\", MainRaw!N128)","v":""},{"$f":"IF(MainRaw!O128=\"\", \"\", MainRaw!O128)","v":""},{"$f":"IF(MainRaw!P128=\"\", \"\", MainRaw!P128)","v":""},{"$f":"IF(MainRaw!Q128=\"\", \"\", MainRaw!Q128)","v":""}]
[{"$f":"IF(MainRaw!A129=\"\", \"\", MainRaw!A129)","v":""},{"$f":"IF(MainRaw!B129=\"\", \"\", MainRaw!B129)","v":""},{"$f":"IF(MainRaw!E129=\"\", \"\", MainRaw!E129)","v":""},{"$f":"IF(MainRaw!H129=\"\", \"\", MainRaw!H129)","v":""},{"$f":"IF(MainRaw!J129=\"\", \"\", MainRaw!J129)","v":""},{"$f":"IF(MainRaw!K129=\"\", \"\", MainRaw!K129)","v":""},{"$f":"IF(MainRaw!L129=\"\", \"\", MainRaw!L129)","v":""},{"$f":"IF(MainRaw!M129=\"\", \"\", MainRaw!M129)","v":""},{"$f":"IF(MainRaw!R129=\"\", \"\", MainRaw!R129)","v":""},{"$f":"IF(MainRaw!S129=\"\", \"\", MainRaw!S129)","v":""}," -  - ",{"$f":"IF(MainRaw!L129=\"\", \"\", MainRaw!L129)","v":""},{"$f":"IF(MainRaw!M129=\"\", \"\", MainRaw!M129)","v":""},{"$f":"IF(MainRaw!N129=\"\", \"\", MainRaw!N129)","v":""},{"$f":"IF(MainRaw!O129=\"\", \"\", MainRaw!O129)","v":""},{"$f":"IF(MainRaw!P129=\"\", \"\", MainRaw!P129)","v":""},{"$f":"IF(MainRaw!Q129=\"\", \"\", MainRaw!Q129)","v":""}]
[{"$f":"IF(MainRaw!A130=\"\", \"\", MainRaw!A130)","v":""},{"$f":"IF(MainRaw!B130=\"\", \"\", MainRaw!B130)","v":""},{"$f":"IF(MainRaw!E130=\"\", \"\", MainRaw!E130)","v":""},{"$f":"IF(MainRaw!H130=\"\", \"\", MainRaw!H130)","v":""},{"$f":"IF(MainRaw!J130=\"\", \"\", MainRaw!J130)","v":""},{"$f":"IF(MainRaw!K130=\"\", \"\", MainRaw!K130)","v":""},{"$f":"IF(MainRaw!L130=\"\", \"\", MainRaw!L130)","v":""},{"$f":"IF(MainRaw!M130=\"\", \"\", MainRaw!M130)","v":""},{"$f":"IF(MainRaw!R130=\"\", \"\", MainRaw!R130)","v":""},{"$f":"IF(MainRaw!S130=\"\", \"\", MainRaw!S130)","v":""}," -  - ",{"$f":"IF(MainRaw!L130=\"\", \"\", MainRaw!L130)","v":""},{"$f":"IF(MainRaw!M130=\"\", \"\", MainRaw!M130)","v":""},{"$f":"IF(MainRaw!N130=\"\", \"\", MainRaw!N130)","v":""},{"$f":"IF(MainRaw!O130=\"\", \"\", MainRaw!O130)","v":""},{"$f":"IF(MainRaw!P130=\"\", \"\", MainRaw!P130)","v":""},{"$f":"IF(MainRaw!Q130=\"\", \"\", MainRaw!Q130)","v":""}]
[{"$f":"IF(MainRaw!A131=\"\", \"\", MainRaw!A131)","v":""},{"$f":"IF(MainRaw!B131=\"\", \"\", MainRaw!B131)","v":""},{"$f":"IF(MainRaw!E131=\"\", \"\", MainRaw!E131)","v":""},{"$f":"IF(MainRaw!H131=\"\", \"\", MainRaw!H131)","v":""},{"$f":"IF(MainRaw!J131=\"\", \"\", MainRaw!J131)","v":""},{"$f":"IF(MainRaw!K131=\"\", \"\", MainRaw!K131)","v":""},{"$f":"IF(MainRaw!L131=\"\", \"\", MainRaw!L131)","v":""},{"$f":"IF(MainRaw!M131=\"\", \"\", MainRaw!M131)","v":""},{"$f":"IF(MainRaw!R131=\"\", \"\", MainRaw!R131)","v":""},{"$f":"IF(MainRaw!S131=\"\", \"\", MainRaw!S131)","v":""}," -  - ",{"$f":"IF(MainRaw!L131=\"\", \"\", MainRaw!L131)","v":""},{"$f":"IF(MainRaw!M131=\"\", \"\", MainRaw!M131)","v":""},{"$f":"IF(MainRaw!N131=\"\", \"\", MainRaw!N131)","v":""},{"$f":"IF(MainRaw!O131=\"\", \"\", MainRaw!O131)","v":""},{"$f":"IF(MainRaw!P131=\"\", \"\", MainRaw!P131)","v":""},{"$f":"IF(MainRaw!Q131=\"\", \"\", MainRaw!Q131)","v":""}]
[{"$f":"IF(MainRaw!A132=\"\", \"\", MainRaw!A132)","v":""},{"$f":"IF(MainRaw!B132=\"\", \"\", MainRaw!B132)","v":""},{"$f":"IF(MainRaw!E132=\"\", \"\", MainRaw!E132)","v":""},{"$f":"IF(MainRaw!H132=\"\", \"\", MainRaw!H132)","v":""},{"$f":"IF(MainRaw!J132=\"\", \"\", MainRaw!J132)","v":""},{"$f":"IF(MainRaw!K132=\"\", \"\", MainRaw!K132)","v":""},{"$f":"IF(MainRaw!L132=\"\", \"\", MainRaw!L132)","v":""},{"$f":"IF(MainRaw!M132=\"\", \"\", MainRaw!M132)","v":""},{"$f":"IF(MainRaw!R132=\"\", \"\", MainRaw!R132)","v":""},{"$f":"IF(MainRaw!S132=\"\", \"\", MainRaw!S132)","v":""}," -  - ",{"$f":"IF(MainRaw!L132=\"\", \"\", MainRaw!L132)","v":""},{"$f":"IF(MainRaw!M132=\"\", \"\", MainRaw!M132)","v":""},{"$f":"IF(MainRaw!N132=\"\", \"\", MainRaw!N132)","v":""},{"$f":"IF(MainRaw!O132=\"\", \"\", MainRaw!O132)","v":""},{"$f":"IF(MainRaw!P132=\"\", \"\", MainRaw!P132)","v":""},{"$f":"IF(MainRaw!Q132=\"\", \"\", MainRaw!Q132)","v":""}]
[{"$f":"IF(MainRaw!A133=\"\", \"\", MainRaw!A133)","v":""},{"$f":"IF(MainRaw!B133=\"\", \"\", MainRaw!B133)","v":""},{"$f":"IF(MainRaw!E133=\"\", \"\", MainRaw!E133)","v":""},{"$f":"IF(MainRaw!H133=\"\", \"\", MainRaw!H133)","v":""},{"$f":"IF(MainRaw!J133=\"\", \"\", MainRaw!J133)","v":""},{"$f":"IF(MainRaw!K133=\"\", \"\", MainRaw!K133)","v":""},{"$f":"IF(MainRaw!L133=\"\", \"\", MainRaw!L133)","v":""},{"$f":"IF(MainRaw!M133=\"\", \"\", MainRaw!M133)","v":""},{"$f":"IF(MainRaw!R133=\"\", \"\", MainRaw!R133)","v":""},{"$f":"IF(MainRaw!S133=\"\", \"\", MainRaw!S133)","v":""}," -  - ",{"$f":"IF(MainRaw!L133=\"\", \"\", MainRaw!L133)","v":""},{"$f":"IF(MainRaw!M133=\"\", \"\", MainRaw!M133)","v":""},{"$f":"IF(MainRaw!N133=\"\", \"\", MainRaw!N133)","v":""},{"$f":"IF(MainRaw!O133=\"\", \"\", MainRaw!O133)","v":""},{"$f":"IF(MainRaw!P133=\"\", \"\", MainRaw!P133)","v":""},{"$f":"IF(MainRaw!Q133=\"\", \"\", MainRaw!Q133)","v":""}]
[{"$f":"IF(MainRaw!A134=\"\", \"\", MainRaw!A134)","v":""},{"$f":"IF(MainRaw!B134=\"\", \"\", MainRaw!B134)","v":""},{"$f":"IF(MainRaw!E134=\"\", \"\", MainRaw!E134)","v":""},{"$f":"IF(MainRaw!H134=\"\", \"\", MainRaw!H134)","v":""},{"$f":"IF(MainRaw!J134=\"\", \"\", MainRaw!J134)","v":""},{"$f":"IF(MainRaw!K134=\"\", \"\", MainRaw!K134)","v":""},{"$f":"IF(MainRaw!L134=\"\", \"\", MainRaw!L134)","v":""},{"$f":"IF(MainRaw!M134=\"\", \"\", MainRaw!M134)","v":""},{"$f":"IF(MainRaw!R134=\"\", \"\", MainRaw!R134)","v":""},{"$f":"IF(MainRaw!S134=\"\", \"\", MainRaw!S134)","v":""}," -  - ",{"$f":"IF(MainRaw!L134=\"\", \"\", MainRaw!L134)","v":""},{"$f":"IF(MainRaw!M134=\"\", \"\", MainRaw!M134)","v":""},{"$f":"IF(MainRaw!N134=\"\", \"\", MainRaw!N134)","v":""},{"$f":"IF(MainRaw!O134=\"\", \"\", MainRaw!O134)","v":""},{"$f":"IF(MainRaw!P134=\"\", \"\", MainRaw!P134)","v":""},{"$f":"IF(MainRaw!Q134=\"\", \"\", MainRaw!Q134)","v":""}]
[{"$f":"IF(MainRaw!A135=\"\", \"\", MainRaw!A135)","v":""},{"$f":"IF(MainRaw!B135=\"\", \"\", MainRaw!B135)","v":""},{"$f":"IF(MainRaw!E135=\"\", \"\", MainRaw!E135)","v":""},{"$f":"IF(MainRaw!H135=\"\", \"\", MainRaw!H135)","v":""},{"$f":"IF(MainRaw!J135=\"\", \"\", MainRaw!J135)","v":""},{"$f":"IF(MainRaw!K135=\"\", \"\", MainRaw!K135)","v":""},{"$f":"IF(MainRaw!L135=\"\", \"\", MainRaw!L135)","v":""},{"$f":"IF(MainRaw!M135=\"\", \"\", MainRaw!M135)","v":""},{"$f":"IF(MainRaw!R135=\"\", \"\", MainRaw!R135)","v":""},{"$f":"IF(MainRaw!S135=\"\", \"\", MainRaw!S135)","v":""}," -  - ",{"$f":"IF(MainRaw!L135=\"\", \"\", MainRaw!L135)","v":""},{"$f":"IF(MainRaw!M135=\"\", \"\", MainRaw!M135)","v":""},{"$f":"IF(MainRaw!N135=\"\", \"\", MainRaw!N135)","v":""},{"$f":"IF(MainRaw!O135=\"\", \"\", MainRaw!O135)","v":""},{"$f":"IF(MainRaw!P135=\"\", \"\", MainRaw!P135)","v":""},{"$f":"IF(MainRaw!Q135=\"\", \"\", MainRaw!Q135)","v":""}]
[{"$f":"IF(MainRaw!A136=\"\", \"\", MainRaw!A136)","v":""},{"$f":"IF(MainRaw!B136=\"\", \"\", MainRaw!B136)","v":""},{"$f":"IF(MainRaw!E136=\"\", \"\", MainRaw!E136)","v":""},{"$f":"IF(MainRaw!H136=\"\", \"\", MainRaw!H136)","v":""},{"$f":"IF(MainRaw!J136=\"\", \"\", MainRaw!J136)","v":""},{"$f":"IF(MainRaw!K136=\"\", \"\", MainRaw!K136)","v":""},{"$f":"IF(MainRaw!L136=\"\", \"\", MainRaw!L136)","v":""},{"$f":"IF(MainRaw!M136=\"\", \"\", MainRaw!M136)","v":""},{"$f":"IF(MainRaw!R136=\"\", \"\", MainRaw!R136)","v":""},{"$f":"IF(MainRaw!S136=\"\", \"\", MainRaw!S136)","v":""},{"$f":"A137 & \" - \" & B137 & \" - \" & I137","v":" -  - "},{"$f":"IF(MainRaw!L136=\"\", \"\", MainRaw!L136)","v":""},{"$f":"IF(MainRaw!M136=\"\", \"\", MainRaw!M136)","v":""},{"$f":"IF(MainRaw!N136=\"\", \"\", MainRaw!N136)","v":""},{"$f":"IF(MainRaw!O136=\"\", \"\", MainRaw!O136)","v":""},{"$f":"IF(MainRaw!P136=\"\", \"\", MainRaw!P136)","v":""},{"$f":"IF(MainRaw!Q136=\"\", \"\", MainRaw!Q136)","v":""}]
[{"$f":"IF(MainRaw!A137=\"\", \"\", MainRaw!A137)","v":""},{"$f":"IF(MainRaw!B137=\"\", \"\", MainRaw!B137)","v":""},{"$f":"IF(MainRaw!E137=\"\", \"\", MainRaw!E137)","v":""},{"$f":"IF(MainRaw!H137=\"\", \"\", MainRaw!H137)","v":""},{"$f":"IF(MainRaw!J137=\"\", \"\", MainRaw!J137)","v":""},{"$f":"IF(MainRaw!K137=\"\", \"\", MainRaw!K137)","v":""},{"$f":"IF(MainRaw!L137=\"\", \"\", MainRaw!L137)","v":""},{"$f":"IF(MainRaw!M137=\"\", \"\", MainRaw!M137)","v":""},{"$f":"IF(MainRaw!R137=\"\", \"\", MainRaw!R137)","v":""},{"$f":"IF(MainRaw!S137=\"\", \"\", MainRaw!S137)","v":""}," -  - ",{"$f":"IF(MainRaw!L137=\"\", \"\", MainRaw!L137)","v":""},{"$f":"IF(MainRaw!M137=\"\", \"\", MainRaw!M137)","v":""},{"$f":"IF(MainRaw!N137=\"\", \"\", MainRaw!N137)","v":""},{"$f":"IF(MainRaw!O137=\"\", \"\", MainRaw!O137)","v":""},{"$f":"IF(MainRaw!P137=\"\", \"\", MainRaw!P137)","v":""},{"$f":"IF(MainRaw!Q137=\"\", \"\", MainRaw!Q137)","v":""}]
[{"$f":"IF(MainRaw!A138=\"\", \"\", MainRaw!A138)","v":""},{"$f":"IF(MainRaw!B138=\"\", \"\", MainRaw!B138)","v":""},{"$f":"IF(MainRaw!E138=\"\", \"\", MainRaw!E138)","v":""},{"$f":"IF(MainRaw!H138=\"\", \"\", MainRaw!H138)","v":""},{"$f":"IF(MainRaw!J138=\"\", \"\", MainRaw!J138)","v":""},{"$f":"IF(MainRaw!K138=\"\", \"\", MainRaw!K138)","v":""},{"$f":"IF(MainRaw!L138=\"\", \"\", MainRaw!L138)","v":""},{"$f":"IF(MainRaw!M138=\"\", \"\", MainRaw!M138)","v":""},{"$f":"IF(MainRaw!R138=\"\", \"\", MainRaw!R138)","v":""},{"$f":"IF(MainRaw!S138=\"\", \"\", MainRaw!S138)","v":""}," -  - ",{"$f":"IF(MainRaw!L138=\"\", \"\", MainRaw!L138)","v":""},{"$f":"IF(MainRaw!M138=\"\", \"\", MainRaw!M138)","v":""},{"$f":"IF(MainRaw!N138=\"\", \"\", MainRaw!N138)","v":""},{"$f":"IF(MainRaw!O138=\"\", \"\", MainRaw!O138)","v":""},{"$f":"IF(MainRaw!P138=\"\", \"\", MainRaw!P138)","v":""},{"$f":"IF(MainRaw!Q138=\"\", \"\", MainRaw!Q138)","v":""}]
[{"$f":"IF(MainRaw!A139=\"\", \"\", MainRaw!A139)","v":""},{"$f":"IF(MainRaw!B139=\"\", \"\", MainRaw!B139)","v":""},{"$f":"IF(MainRaw!E139=\"\", \"\", MainRaw!E139)","v":""},{"$f":"IF(MainRaw!H139=\"\", \"\", MainRaw!H139)","v":""},{"$f":"IF(MainRaw!J139=\"\", \"\", MainRaw!J139)","v":""},{"$f":"IF(MainRaw!K139=\"\", \"\", MainRaw!K139)","v":""},{"$f":"IF(MainRaw!L139=\"\", \"\", MainRaw!L139)","v":""},{"$f":"IF(MainRaw!M139=\"\", \"\", MainRaw!M139)","v":""},{"$f":"IF(MainRaw!R139=\"\", \"\", MainRaw!R139)","v":""},{"$f":"IF(MainRaw!S139=\"\", \"\", MainRaw!S139)","v":""}," -  - ",{"$f":"IF(MainRaw!L139=\"\", \"\", MainRaw!L139)","v":""},{"$f":"IF(MainRaw!M139=\"\", \"\", MainRaw!M139)","v":""},{"$f":"IF(MainRaw!N139=\"\", \"\", MainRaw!N139)","v":""},{"$f":"IF(MainRaw!O139=\"\", \"\", MainRaw!O139)","v":""},{"$f":"IF(MainRaw!P139=\"\", \"\", MainRaw!P139)","v":""},{"$f":"IF(MainRaw!Q139=\"\", \"\", MainRaw!Q139)","v":""}]
[{"$f":"IF(MainRaw!A140=\"\", \"\", MainRaw!A140)","v":""},{"$f":"IF(MainRaw!B140=\"\", \"\", MainRaw!B140)","v":""},{"$f":"IF(MainRaw!E140=\"\", \"\", MainRaw!E140)","v":""},{"$f":"IF(MainRaw!H140=\"\", \"\", MainRaw!H140)","v":""},{"$f":"IF(MainRaw!J140=\"\", \"\", MainRaw!J140)","v":""},{"$f":"IF(MainRaw!K140=\"\", \"\", MainRaw!K140)","v":""},{"$f":"IF(MainRaw!L140=\"\", \"\", MainRaw!L140)","v":""},{"$f":"IF(MainRaw!M140=\"\", \"\", MainRaw!M140)","v":""},{"$f":"IF(MainRaw!R140=\"\", \"\", MainRaw!R140)","v":""},{"$f":"IF(MainRaw!S140=\"\", \"\", MainRaw!S140)","v":""}," -  - ",{"$f":"IF(MainRaw!L140=\"\", \"\", MainRaw!L140)","v":""},{"$f":"IF(MainRaw!M140=\"\", \"\", MainRaw!M140)","v":""},{"$f":"IF(MainRaw!N140=\"\", \"\", MainRaw!N140)","v":""},{"$f":"IF(MainRaw!O140=\"\", \"\", MainRaw!O140)","v":""},{"$f":"IF(MainRaw!P140=\"\", \"\", MainRaw!P140)","v":""},{"$f":"IF(MainRaw!Q140=\"\", \"\", MainRaw!Q140)","v":""}]
[{"$f":"IF(MainRaw!A141=\"\", \"\", MainRaw!A141)","v":""},{"$f":"IF(MainRaw!B141=\"\", \"\", MainRaw!B141)","v":""},{"$f":"IF(MainRaw!E141=\"\", \"\", MainRaw!E141)","v":""},{"$f":"IF(MainRaw!H141=\"\", \"\", MainRaw!H141)","v":""},{"$f":"IF(MainRaw!J141=\"\", \"\", MainRaw!J141)","v":""},{"$f":"IF(MainRaw!K141=\"\", \"\", MainRaw!K141)","v":""},{"$f":"IF(MainRaw!L141=\"\", \"\", MainRaw!L141)","v":""},{"$f":"IF(MainRaw!M141=\"\", \"\", MainRaw!M141)","v":""},{"$f":"IF(MainRaw!R141=\"\", \"\", MainRaw!R141)","v":""},{"$f":"IF(MainRaw!S141=\"\", \"\", MainRaw!S141)","v":""}," -  - ",{"$f":"IF(MainRaw!L141=\"\", \"\", MainRaw!L141)","v":""},{"$f":"IF(MainRaw!M141=\"\", \"\", MainRaw!M141)","v":""},{"$f":"IF(MainRaw!N141=\"\", \"\", MainRaw!N141)","v":""},{"$f":"IF(MainRaw!O141=\"\", \"\", MainRaw!O141)","v":""},{"$f":"IF(MainRaw!P141=\"\", \"\", MainRaw!P141)","v":""},{"$f":"IF(MainRaw!Q141=\"\", \"\", MainRaw!Q141)","v":""}]
[{"$f":"IF(MainRaw!A142=\"\", \"\", MainRaw!A142)","v":""},{"$f":"IF(MainRaw!B142=\"\", \"\", MainRaw!B142)","v":""},{"$f":"IF(MainRaw!E142=\"\", \"\", MainRaw!E142)","v":""},{"$f":"IF(MainRaw!H142=\"\", \"\", MainRaw!H142)","v":""},{"$f":"IF(MainRaw!J142=\"\", \"\", MainRaw!J142)","v":""},{"$f":"IF(MainRaw!K142=\"\", \"\", MainRaw!K142)","v":""},{"$f":"IF(MainRaw!L142=\"\", \"\", MainRaw!L142)","v":""},{"$f":"IF(MainRaw!M142=\"\", \"\", MainRaw!M142)","v":""},{"$f":"IF(MainRaw!R142=\"\", \"\", MainRaw!R142)","v":""},{"$f":"IF(MainRaw!S142=\"\", \"\", MainRaw!S142)","v":""}," -  - ",{"$f":"IF(MainRaw!L142=\"\", \"\", MainRaw!L142)","v":""},{"$f":"IF(MainRaw!M142=\"\", \"\", MainRaw!M142)","v":""},{"$f":"IF(MainRaw!N142=\"\", \"\", MainRaw!N142)","v":""},{"$f":"IF(MainRaw!O142=\"\", \"\", MainRaw!O142)","v":""},{"$f":"IF(MainRaw!P142=\"\", \"\", MainRaw!P142)","v":""},{"$f":"IF(MainRaw!Q142=\"\", \"\", MainRaw!Q142)","v":""}]
[{"$f":"IF(MainRaw!A143=\"\", \"\", MainRaw!A143)","v":""},{"$f":"IF(MainRaw!B143=\"\", \"\", MainRaw!B143)","v":""},{"$f":"IF(MainRaw!E143=\"\", \"\", MainRaw!E143)","v":""},{"$f":"IF(MainRaw!H143=\"\", \"\", MainRaw!H143)","v":""},{"$f":"IF(MainRaw!J143=\"\", \"\", MainRaw!J143)","v":""},{"$f":"IF(MainRaw!K143=\"\", \"\", MainRaw!K143)","v":""},{"$f":"IF(MainRaw!L143=\"\", \"\", MainRaw!L143)","v":""},{"$f":"IF(MainRaw!M143=\"\", \"\", MainRaw!M143)","v":""},{"$f":"IF(MainRaw!R143=\"\", \"\", MainRaw!R143)","v":""},{"$f":"IF(MainRaw!S143=\"\", \"\", MainRaw!S143)","v":""}," -  - ",{"$f":"IF(MainRaw!L143=\"\", \"\", MainRaw!L143)","v":""},{"$f":"IF(MainRaw!M143=\"\", \"\", MainRaw!M143)","v":""},{"$f":"IF(MainRaw!N143=\"\", \"\", MainRaw!N143)","v":""},{"$f":"IF(MainRaw!O143=\"\", \"\", MainRaw!O143)","v":""},{"$f":"IF(MainRaw!P143=\"\", \"\", MainRaw!P143)","v":""},{"$f":"IF(MainRaw!Q143=\"\", \"\", MainRaw!Q143)","v":""}]
[{"$f":"IF(MainRaw!A144=\"\", \"\", MainRaw!A144)","v":""},{"$f":"IF(MainRaw!B144=\"\", \"\", MainRaw!B144)","v":""},{"$f":"IF(MainRaw!E144=\"\", \"\", MainRaw!E144)","v":""},{"$f":"IF(MainRaw!H144=\"\", \"\", MainRaw!H144)","v":""},{"$f":"IF(MainRaw!J144=\"\", \"\", MainRaw!J144)","v":""},{"$f":"IF(MainRaw!K144=\"\", \"\", MainRaw!K144)","v":""},{"$f":"IF(MainRaw!L144=\"\", \"\", MainRaw!L144)","v":""},{"$f":"IF(MainRaw!M144=\"\", \"\", MainRaw!M144)","v":""},{"$f":"IF(MainRaw!R144=\"\", \"\", MainRaw!R144)","v":""},{"$f":"IF(MainRaw!S144=\"\", \"\", MainRaw!S144)","v":""}," -  - ",{"$f":"IF(MainRaw!L144=\"\", \"\", MainRaw!L144)","v":""},{"$f":"IF(MainRaw!M144=\"\", \"\", MainRaw!M144)","v":""},{"$f":"IF(MainRaw!N144=\"\", \"\", MainRaw!N144)","v":""},{"$f":"IF(MainRaw!O144=\"\", \"\", MainRaw!O144)","v":""},{"$f":"IF(MainRaw!P144=\"\", \"\", MainRaw!P144)","v":""},{"$f":"IF(MainRaw!Q144=\"\", \"\", MainRaw!Q144)","v":""}]
[{"$f":"IF(MainRaw!A145=\"\", \"\", MainRaw!A145)","v":""},{"$f":"IF(MainRaw!B145=\"\", \"\", MainRaw!B145)","v":""},{"$f":"IF(MainRaw!E145=\"\", \"\", MainRaw!E145)","v":""},{"$f":"IF(MainRaw!H145=\"\", \"\", MainRaw!H145)","v":""},{"$f":"IF(MainRaw!J145=\"\", \"\", MainRaw!J145)","v":""},{"$f":"IF(MainRaw!K145=\"\", \"\", MainRaw!K145)","v":""},{"$f":"IF(MainRaw!L145=\"\", \"\", MainRaw!L145)","v":""},{"$f":"IF(MainRaw!M145=\"\", \"\", MainRaw!M145)","v":""},{"$f":"IF(MainRaw!R145=\"\", \"\", MainRaw!R145)","v":""},{"$f":"IF(MainRaw!S145=\"\", \"\", MainRaw!S145)","v":""}," -  - ",{"$f":"IF(MainRaw!L145=\"\", \"\", MainRaw!L145)","v":""},{"$f":"IF(MainRaw!M145=\"\", \"\", MainRaw!M145)","v":""},{"$f":"IF(MainRaw!N145=\"\", \"\", MainRaw!N145)","v":""},{"$f":"IF(MainRaw!O145=\"\", \"\", MainRaw!O145)","v":""},{"$f":"IF(MainRaw!P145=\"\", \"\", MainRaw!P145)","v":""},{"$f":"IF(MainRaw!Q145=\"\", \"\", MainRaw!Q145)","v":""}]
[{"$f":"IF(MainRaw!A146=\"\", \"\", MainRaw!A146)","v":""},{"$f":"IF(MainRaw!B146=\"\", \"\", MainRaw!B146)","v":""},{"$f":"IF(MainRaw!E146=\"\", \"\", MainRaw!E146)","v":""},{"$f":"IF(MainRaw!H146=\"\", \"\", MainRaw!H146)","v":""},{"$f":"IF(MainRaw!J146=\"\", \"\", MainRaw!J146)","v":""},{"$f":"IF(MainRaw!K146=\"\", \"\", MainRaw!K146)","v":""},{"$f":"IF(MainRaw!L146=\"\", \"\", MainRaw!L146)","v":""},{"$f":"IF(MainRaw!M146=\"\", \"\", MainRaw!M146)","v":""},{"$f":"IF(MainRaw!R146=\"\", \"\", MainRaw!R146)","v":""},{"$f":"IF(MainRaw!S146=\"\", \"\", MainRaw!S146)","v":""}," -  - ",{"$f":"IF(MainRaw!L146=\"\", \"\", MainRaw!L146)","v":""},{"$f":"IF(MainRaw!M146=\"\", \"\", MainRaw!M146)","v":""},{"$f":"IF(MainRaw!N146=\"\", \"\", MainRaw!N146)","v":""},{"$f":"IF(MainRaw!O146=\"\", \"\", MainRaw!O146)","v":""},{"$f":"IF(MainRaw!P146=\"\", \"\", MainRaw!P146)","v":""},{"$f":"IF(MainRaw!Q146=\"\", \"\", MainRaw!Q146)","v":""}]
[{"$f":"IF(MainRaw!A147=\"\", \"\", MainRaw!A147)","v":""},{"$f":"IF(MainRaw!B147=\"\", \"\", MainRaw!B147)","v":""},{"$f":"IF(MainRaw!E147=\"\", \"\", MainRaw!E147)","v":""},{"$f":"IF(MainRaw!H147=\"\", \"\", MainRaw!H147)","v":""},{"$f":"IF(MainRaw!J147=\"\", \"\", MainRaw!J147)","v":""},{"$f":"IF(MainRaw!K147=\"\", \"\", MainRaw!K147)","v":""},{"$f":"IF(MainRaw!L147=\"\", \"\", MainRaw!L147)","v":""},{"$f":"IF(MainRaw!M147=\"\", \"\", MainRaw!M147)","v":""},{"$f":"IF(MainRaw!R147=\"\", \"\", MainRaw!R147)","v":""},{"$f":"IF(MainRaw!S147=\"\", \"\", MainRaw!S147)","v":""}," -  - ",{"$f":"IF(MainRaw!L147=\"\", \"\", MainRaw!L147)","v":""},{"$f":"IF(MainRaw!M147=\"\", \"\", MainRaw!M147)","v":""},{"$f":"IF(MainRaw!N147=\"\", \"\", MainRaw!N147)","v":""},{"$f":"IF(MainRaw!O147=\"\", \"\", MainRaw!O147)","v":""},{"$f":"IF(MainRaw!P147=\"\", \"\", MainRaw!P147)","v":""},{"$f":"IF(MainRaw!Q147=\"\", \"\", MainRaw!Q147)","v":""}]
[{"$f":"IF(MainRaw!A148=\"\", \"\", MainRaw!A148)","v":""},{"$f":"IF(MainRaw!B148=\"\", \"\", MainRaw!B148)","v":""},{"$f":"IF(MainRaw!E148=\"\", \"\", MainRaw!E148)","v":""},{"$f":"IF(MainRaw!H148=\"\", \"\", MainRaw!H148)","v":""},{"$f":"IF(MainRaw!J148=\"\", \"\", MainRaw!J148)","v":""},{"$f":"IF(MainRaw!K148=\"\", \"\", MainRaw!K148)","v":""},{"$f":"IF(MainRaw!L148=\"\", \"\", MainRaw!L148)","v":""},{"$f":"IF(MainRaw!M148=\"\", \"\", MainRaw!M148)","v":""},{"$f":"IF(MainRaw!R148=\"\", \"\", MainRaw!R148)","v":""},{"$f":"IF(MainRaw!S148=\"\", \"\", MainRaw!S148)","v":""}," -  - ",{"$f":"IF(MainRaw!L148=\"\", \"\", MainRaw!L148)","v":""},{"$f":"IF(MainRaw!M148=\"\", \"\", MainRaw!M148)","v":""},{"$f":"IF(MainRaw!N148=\"\", \"\", MainRaw!N148)","v":""},{"$f":"IF(MainRaw!O148=\"\", \"\", MainRaw!O148)","v":""},{"$f":"IF(MainRaw!P148=\"\", \"\", MainRaw!P148)","v":""},{"$f":"IF(MainRaw!Q148=\"\", \"\", MainRaw!Q148)","v":""}]
[{"$f":"IF(MainRaw!A149=\"\", \"\", MainRaw!A149)","v":""},{"$f":"IF(MainRaw!B149=\"\", \"\", MainRaw!B149)","v":""},{"$f":"IF(MainRaw!E149=\"\", \"\", MainRaw!E149)","v":""},{"$f":"IF(MainRaw!H149=\"\", \"\", MainRaw!H149)","v":""},{"$f":"IF(MainRaw!J149=\"\", \"\", MainRaw!J149)","v":""},{"$f":"IF(MainRaw!K149=\"\", \"\", MainRaw!K149)","v":""},{"$f":"IF(MainRaw!L149=\"\", \"\", MainRaw!L149)","v":""},{"$f":"IF(MainRaw!M149=\"\", \"\", MainRaw!M149)","v":""},{"$f":"IF(MainRaw!R149=\"\", \"\", MainRaw!R149)","v":""},{"$f":"IF(MainRaw!S149=\"\", \"\", MainRaw!S149)","v":""}," -  - ",{"$f":"IF(MainRaw!L149=\"\", \"\", MainRaw!L149)","v":""},{"$f":"IF(MainRaw!M149=\"\", \"\", MainRaw!M149)","v":""},{"$f":"IF(MainRaw!N149=\"\", \"\", MainRaw!N149)","v":""},{"$f":"IF(MainRaw!O149=\"\", \"\", MainRaw!O149)","v":""},{"$f":"IF(MainRaw!P149=\"\", \"\", MainRaw!P149)","v":""},{"$f":"IF(MainRaw!Q149=\"\", \"\", MainRaw!Q149)","v":""}]
[{"$f":"IF(MainRaw!A150=\"\", \"\", MainRaw!A150)","v":""},{"$f":"IF(MainRaw!B150=\"\", \"\", MainRaw!B150)","v":""},{"$f":"IF(MainRaw!E150=\"\", \"\", MainRaw!E150)","v":""},{"$f":"IF(MainRaw!H150=\"\", \"\", MainRaw!H150)","v":""},{"$f":"IF(MainRaw!J150=\"\", \"\", MainRaw!J150)","v":""},{"$f":"IF(MainRaw!K150=\"\", \"\", MainRaw!K150)","v":""},{"$f":"IF(MainRaw!L150=\"\", \"\", MainRaw!L150)","v":""},{"$f":"IF(MainRaw!M150=\"\", \"\", MainRaw!M150)","v":""},{"$f":"IF(MainRaw!R150=\"\", \"\", MainRaw!R150)","v":""},{"$f":"IF(MainRaw!S150=\"\", \"\", MainRaw!S150)","v":""}," -  - ",{"$f":"IF(MainRaw!L150=\"\", \"\", MainRaw!L150)","v":""},{"$f":"IF(MainRaw!M150=\"\", \"\", MainRaw!M150)","v":""},{"$f":"IF(MainRaw!N150=\"\", \"\", MainRaw!N150)","v":""},{"$f":"IF(MainRaw!O150=\"\", \"\", MainRaw!O150)","v":""},{"$f":"IF(MainRaw!P150=\"\", \"\", MainRaw!P150)","v":""},{"$f":"IF(MainRaw!Q150=\"\", \"\", MainRaw!Q150)","v":""}]
[{"$f":"IF(MainRaw!A151=\"\", \"\", MainRaw!A151)","v":""},{"$f":"IF(MainRaw!B151=\"\", \"\", MainRaw!B151)","v":""},{"$f":"IF(MainRaw!E151=\"\", \"\", MainRaw!E151)","v":""},{"$f":"IF(MainRaw!H151=\"\", \"\", MainRaw!H151)","v":""},{"$f":"IF(MainRaw!J151=\"\", \"\", MainRaw!J151)","v":""},{"$f":"IF(MainRaw!K151=\"\", \"\", MainRaw!K151)","v":""},{"$f":"IF(MainRaw!L151=\"\", \"\", MainRaw!L151)","v":""},{"$f":"IF(MainRaw!M151=\"\", \"\", MainRaw!M151)","v":""},{"$f":"IF(MainRaw!R151=\"\", \"\", MainRaw!R151)","v":""},{"$f":"IF(MainRaw!S151=\"\", \"\", MainRaw!S151)","v":""}," -  - ",{"$f":"IF(MainRaw!L151=\"\", \"\", MainRaw!L151)","v":""},{"$f":"IF(MainRaw!M151=\"\", \"\", MainRaw!M151)","v":""},{"$f":"IF(MainRaw!N151=\"\", \"\", MainRaw!N151)","v":""},{"$f":"IF(MainRaw!O151=\"\", \"\", MainRaw!O151)","v":""},{"$f":"IF(MainRaw!P151=\"\", \"\", MainRaw!P151)","v":""},{"$f":"IF(MainRaw!Q151=\"\", \"\", MainRaw!Q151)","v":""}]
[{"$f":"IF(MainRaw!A152=\"\", \"\", MainRaw!A152)","v":""},{"$f":"IF(MainRaw!B152=\"\", \"\", MainRaw!B152)","v":""},{"$f":"IF(MainRaw!E152=\"\", \"\", MainRaw!E152)","v":""},{"$f":"IF(MainRaw!H152=\"\", \"\", MainRaw!H152)","v":""},{"$f":"IF(MainRaw!J152=\"\", \"\", MainRaw!J152)","v":""},{"$f":"IF(MainRaw!K152=\"\", \"\", MainRaw!K152)","v":""},{"$f":"IF(MainRaw!L152=\"\", \"\", MainRaw!L152)","v":""},{"$f":"IF(MainRaw!M152=\"\", \"\", MainRaw!M152)","v":""},{"$f":"IF(MainRaw!R152=\"\", \"\", MainRaw!R152)","v":""},{"$f":"IF(MainRaw!S152=\"\", \"\", MainRaw!S152)","v":""}," -  - ",{"$f":"IF(MainRaw!L152=\"\", \"\", MainRaw!L152)","v":""},{"$f":"IF(MainRaw!M152=\"\", \"\", MainRaw!M152)","v":""},{"$f":"IF(MainRaw!N152=\"\", \"\", MainRaw!N152)","v":""},{"$f":"IF(MainRaw!O152=\"\", \"\", MainRaw!O152)","v":""},{"$f":"IF(MainRaw!P152=\"\", \"\", MainRaw!P152)","v":""},{"$f":"IF(MainRaw!Q152=\"\", \"\", MainRaw!Q152)","v":""}]
[{"$f":"IF(MainRaw!A153=\"\", \"\", MainRaw!A153)","v":""},{"$f":"IF(MainRaw!B153=\"\", \"\", MainRaw!B153)","v":""},{"$f":"IF(MainRaw!E153=\"\", \"\", MainRaw!E153)","v":""},{"$f":"IF(MainRaw!H153=\"\", \"\", MainRaw!H153)","v":""},{"$f":"IF(MainRaw!J153=\"\", \"\", MainRaw!J153)","v":""},{"$f":"IF(MainRaw!K153=\"\", \"\", MainRaw!K153)","v":""},{"$f":"IF(MainRaw!L153=\"\", \"\", MainRaw!L153)","v":""},{"$f":"IF(MainRaw!M153=\"\", \"\", MainRaw!M153)","v":""},{"$f":"IF(MainRaw!R153=\"\", \"\", MainRaw!R153)","v":""},{"$f":"IF(MainRaw!S153=\"\", \"\", MainRaw!S153)","v":""}," -  - ",{"$f":"IF(MainRaw!L153=\"\", \"\", MainRaw!L153)","v":""},{"$f":"IF(MainRaw!M153=\"\", \"\", MainRaw!M153)","v":""},{"$f":"IF(MainRaw!N153=\"\", \"\", MainRaw!N153)","v":""},{"$f":"IF(MainRaw!O153=\"\", \"\", MainRaw!O153)","v":""},{"$f":"IF(MainRaw!P153=\"\", \"\", MainRaw!P153)","v":""},{"$f":"IF(MainRaw!Q153=\"\", \"\", MainRaw!Q153)","v":""}]
[{"$f":"IF(MainRaw!A154=\"\", \"\", MainRaw!A154)","v":""},{"$f":"IF(MainRaw!B154=\"\", \"\", MainRaw!B154)","v":""},{"$f":"IF(MainRaw!E154=\"\", \"\", MainRaw!E154)","v":""},{"$f":"IF(MainRaw!H154=\"\", \"\", MainRaw!H154)","v":""},{"$f":"IF(MainRaw!J154=\"\", \"\", MainRaw!J154)","v":""},{"$f":"IF(MainRaw!K154=\"\", \"\", MainRaw!K154)","v":""},{"$f":"IF(MainRaw!L154=\"\", \"\", MainRaw!L154)","v":""},{"$f":"IF(MainRaw!M154=\"\", \"\", MainRaw!M154)","v":""},{"$f":"IF(MainRaw!R154=\"\", \"\", MainRaw!R154)","v":""},{"$f":"IF(MainRaw!S154=\"\", \"\", MainRaw!S154)","v":""}," -  - ",{"$f":"IF(MainRaw!L154=\"\", \"\", MainRaw!L154)","v":""},{"$f":"IF(MainRaw!M154=\"\", \"\", MainRaw!M154)","v":""},{"$f":"IF(MainRaw!N154=\"\", \"\", MainRaw!N154)","v":""},{"$f":"IF(MainRaw!O154=\"\", \"\", MainRaw!O154)","v":""},{"$f":"IF(MainRaw!P154=\"\", \"\", MainRaw!P154)","v":""},{"$f":"IF(MainRaw!Q154=\"\", \"\", MainRaw!Q154)","v":""}]
[{"$f":"IF(MainRaw!A155=\"\", \"\", MainRaw!A155)","v":""},{"$f":"IF(MainRaw!B155=\"\", \"\", MainRaw!B155)","v":""},{"$f":"IF(MainRaw!E155=\"\", \"\", MainRaw!E155)","v":""},{"$f":"IF(MainRaw!H155=\"\", \"\", MainRaw!H155)","v":""},{"$f":"IF(MainRaw!J155=\"\", \"\", MainRaw!J155)","v":""},{"$f":"IF(MainRaw!K155=\"\", \"\", MainRaw!K155)","v":""},{"$f":"IF(MainRaw!L155=\"\", \"\", MainRaw!L155)","v":""},{"$f":"IF(MainRaw!M155=\"\", \"\", MainRaw!M155)","v":""},{"$f":"IF(MainRaw!R155=\"\", \"\", MainRaw!R155)","v":""},{"$f":"IF(MainRaw!S155=\"\", \"\", MainRaw!S155)","v":""}," -  - ",{"$f":"IF(MainRaw!L155=\"\", \"\", MainRaw!L155)","v":""},{"$f":"IF(MainRaw!M155=\"\", \"\", MainRaw!M155)","v":""},{"$f":"IF(MainRaw!N155=\"\", \"\", MainRaw!N155)","v":""},{"$f":"IF(MainRaw!O155=\"\", \"\", MainRaw!O155)","v":""},{"$f":"IF(MainRaw!P155=\"\", \"\", MainRaw!P155)","v":""},{"$f":"IF(MainRaw!Q155=\"\", \"\", MainRaw!Q155)","v":""}]
[{"$f":"IF(MainRaw!A156=\"\", \"\", MainRaw!A156)","v":""},{"$f":"IF(MainRaw!B156=\"\", \"\", MainRaw!B156)","v":""},{"$f":"IF(MainRaw!E156=\"\", \"\", MainRaw!E156)","v":""},{"$f":"IF(MainRaw!H156=\"\", \"\", MainRaw!H156)","v":""},{"$f":"IF(MainRaw!J156=\"\", \"\", MainRaw!J156)","v":""},{"$f":"IF(MainRaw!K156=\"\", \"\", MainRaw!K156)","v":""},{"$f":"IF(MainRaw!L156=\"\", \"\", MainRaw!L156)","v":""},{"$f":"IF(MainRaw!M156=\"\", \"\", MainRaw!M156)","v":""},{"$f":"IF(MainRaw!R156=\"\", \"\", MainRaw!R156)","v":""},{"$f":"IF(MainRaw!S156=\"\", \"\", MainRaw!S156)","v":""}," -  - ",{"$f":"IF(MainRaw!L156=\"\", \"\", MainRaw!L156)","v":""},{"$f":"IF(MainRaw!M156=\"\", \"\", MainRaw!M156)","v":""},{"$f":"IF(MainRaw!N156=\"\", \"\", MainRaw!N156)","v":""},{"$f":"IF(MainRaw!O156=\"\", \"\", MainRaw!O156)","v":""},{"$f":"IF(MainRaw!P156=\"\", \"\", MainRaw!P156)","v":""},{"$f":"IF(MainRaw!Q156=\"\", \"\", MainRaw!Q156)","v":""}]
[{"$f":"IF(MainRaw!A157=\"\", \"\", MainRaw!A157)","v":""},{"$f":"IF(MainRaw!B157=\"\", \"\", MainRaw!B157)","v":""},{"$f":"IF(MainRaw!E157=\"\", \"\", MainRaw!E157)","v":""},{"$f":"IF(MainRaw!H157=\"\", \"\", MainRaw!H157)","v":""},{"$f":"IF(MainRaw!J157=\"\", \"\", MainRaw!J157)","v":""},{"$f":"IF(MainRaw!K157=\"\", \"\", MainRaw!K157)","v":""},{"$f":"IF(MainRaw!L157=\"\", \"\", MainRaw!L157)","v":""},{"$f":"IF(MainRaw!M157=\"\", \"\", MainRaw!M157)","v":""},{"$f":"IF(MainRaw!R157=\"\", \"\", MainRaw!R157)","v":""},{"$f":"IF(MainRaw!S157=\"\", \"\", MainRaw!S157)","v":""}," -  - ",{"$f":"IF(MainRaw!L157=\"\", \"\", MainRaw!L157)","v":""},{"$f":"IF(MainRaw!M157=\"\", \"\", MainRaw!M157)","v":""},{"$f":"IF(MainRaw!N157=\"\", \"\", MainRaw!N157)","v":""},{"$f":"IF(MainRaw!O157=\"\", \"\", MainRaw!O157)","v":""},{"$f":"IF(MainRaw!P157=\"\", \"\", MainRaw!P157)","v":""},{"$f":"IF(MainRaw!Q157=\"\", \"\", MainRaw!Q157)","v":""}]
[{"$f":"IF(MainRaw!A158=\"\", \"\", MainRaw!A158)","v":""},{"$f":"IF(MainRaw!B158=\"\", \"\", MainRaw!B158)","v":""},{"$f":"IF(MainRaw!E158=\"\", \"\", MainRaw!E158)","v":""},{"$f":"IF(MainRaw!H158=\"\", \"\", MainRaw!H158)","v":""},{"$f":"IF(MainRaw!J158=\"\", \"\", MainRaw!J158)","v":""},{"$f":"IF(MainRaw!K158=\"\", \"\", MainRaw!K158)","v":""},{"$f":"IF(MainRaw!L158=\"\", \"\", MainRaw!L158)","v":""},{"$f":"IF(MainRaw!M158=\"\", \"\", MainRaw!M158)","v":""},{"$f":"IF(MainRaw!R158=\"\", \"\", MainRaw!R158)","v":""},{"$f":"IF(MainRaw!S158=\"\", \"\", MainRaw!S158)","v":""}," -  - ",{"$f":"IF(MainRaw!L158=\"\", \"\", MainRaw!L158)","v":""},{"$f":"IF(MainRaw!M158=\"\", \"\", MainRaw!M158)","v":""},{"$f":"IF(MainRaw!N158=\"\", \"\", MainRaw!N158)","v":""},{"$f":"IF(MainRaw!O158=\"\", \"\", MainRaw!O158)","v":""},{"$f":"IF(MainRaw!P158=\"\", \"\", MainRaw!P158)","v":""},{"$f":"IF(MainRaw!Q158=\"\", \"\", MainRaw!Q158)","v":""}]
[{"$f":"IF(MainRaw!A159=\"\", \"\", MainRaw!A159)","v":""},{"$f":"IF(MainRaw!B159=\"\", \"\", MainRaw!B159)","v":""},{"$f":"IF(MainRaw!E159=\"\", \"\", MainRaw!E159)","v":""},{"$f":"IF(MainRaw!H159=\"\", \"\", MainRaw!H159)","v":""},{"$f":"IF(MainRaw!J159=\"\", \"\", MainRaw!J159)","v":""},{"$f":"IF(MainRaw!K159=\"\", \"\", MainRaw!K159)","v":""},{"$f":"IF(MainRaw!L159=\"\", \"\", MainRaw!L159)","v":""},{"$f":"IF(MainRaw!M159=\"\", \"\", MainRaw!M159)","v":""},{"$f":"IF(MainRaw!R159=\"\", \"\", MainRaw!R159)","v":""},{"$f":"IF(MainRaw!S159=\"\", \"\", MainRaw!S159)","v":""}," -  - ",{"$f":"IF(MainRaw!L159=\"\", \"\", MainRaw!L159)","v":""},{"$f":"IF(MainRaw!M159=\"\", \"\", MainRaw!M159)","v":""},{"$f":"IF(MainRaw!N159=\"\", \"\", MainRaw!N159)","v":""},{"$f":"IF(MainRaw!O159=\"\", \"\", MainRaw!O159)","v":""},{"$f":"IF(MainRaw!P159=\"\", \"\", MainRaw!P159)","v":""},{"$f":"IF(MainRaw!Q159=\"\", \"\", MainRaw!Q159)","v":""}]
[{"$f":"IF(MainRaw!A160=\"\", \"\", MainRaw!A160)","v":""},{"$f":"IF(MainRaw!B160=\"\", \"\", MainRaw!B160)","v":""},{"$f":"IF(MainRaw!E160=\"\", \"\", MainRaw!E160)","v":""},{"$f":"IF(MainRaw!H160=\"\", \"\", MainRaw!H160)","v":""},{"$f":"IF(MainRaw!J160=\"\", \"\", MainRaw!J160)","v":""},{"$f":"IF(MainRaw!K160=\"\", \"\", MainRaw!K160)","v":""},{"$f":"IF(MainRaw!L160=\"\", \"\", MainRaw!L160)","v":""},{"$f":"IF(MainRaw!M160=\"\", \"\", MainRaw!M160)","v":""},{"$f":"IF(MainRaw!R160=\"\", \"\", MainRaw!R160)","v":""},{"$f":"IF(MainRaw!S160=\"\", \"\", MainRaw!S160)","v":""}," -  - ",{"$f":"IF(MainRaw!L160=\"\", \"\", MainRaw!L160)","v":""},{"$f":"IF(MainRaw!M160=\"\", \"\", MainRaw!M160)","v":""},{"$f":"IF(MainRaw!N160=\"\", \"\", MainRaw!N160)","v":""},{"$f":"IF(MainRaw!O160=\"\", \"\", MainRaw!O160)","v":""},{"$f":"IF(MainRaw!P160=\"\", \"\", MainRaw!P160)","v":""},{"$f":"IF(MainRaw!Q160=\"\", \"\", MainRaw!Q160)","v":""}]
[{"$f":"IF(MainRaw!A161=\"\", \"\", MainRaw!A161)","v":""},{"$f":"IF(MainRaw!B161=\"\", \"\", MainRaw!B161)","v":""},{"$f":"IF(MainRaw!E161=\"\", \"\", MainRaw!E161)","v":""},{"$f":"IF(MainRaw!H161=\"\", \"\", MainRaw!H161)","v":""},{"$f":"IF(MainRaw!J161=\"\", \"\", MainRaw!J161)","v":""},{"$f":"IF(MainRaw!K161=\"\", \"\", MainRaw!K161)","v":""},{"$f":"IF(MainRaw!L161=\"\", \"\", MainRaw!L161)","v":""},{"$f":"IF(MainRaw!M161=\"\", \"\", MainRaw!M161)","v":""},{"$f":"IF(MainRaw!R161=\"\", \"\", MainRaw!R161)","v":""},{"$f":"IF(MainRaw!S161=\"\", \"\", MainRaw!S161)","v":""}," -  - ",{"$f":"IF(MainRaw!L161=\"\", \"\", MainRaw!L161)","v":""},{"$f":"IF(MainRaw!M161=\"\", \"\", MainRaw!M161)","v":""},{"$f":"IF(MainRaw!N161=\"\", \"\", MainRaw!N161)","v":""},{"$f":"IF(MainRaw!O161=\"\", \"\", MainRaw!O161)","v":""},{"$f":"IF(MainRaw!P161=\"\", \"\", MainRaw!P161)","v":""},{"$f":"IF(MainRaw!Q161=\"\", \"\", MainRaw!Q161)","v":""}]
[{"$f":"IF(MainRaw!A162=\"\", \"\", MainRaw!A162)","v":""},{"$f":"IF(MainRaw!B162=\"\", \"\", MainRaw!B162)","v":""},{"$f":"IF(MainRaw!E162=\"\", \"\", MainRaw!E162)","v":""},{"$f":"IF(MainRaw!H162=\"\", \"\", MainRaw!H162)","v":""},{"$f":"IF(MainRaw!J162=\"\", \"\", MainRaw!J162)","v":""},{"$f":"IF(MainRaw!K162=\"\", \"\", MainRaw!K162)","v":""},{"$f":"IF(MainRaw!L162=\"\", \"\", MainRaw!L162)","v":""},{"$f":"IF(MainRaw!M162=\"\", \"\", MainRaw!M162)","v":""},{"$f":"IF(MainRaw!R162=\"\", \"\", MainRaw!R162)","v":""},{"$f":"IF(MainRaw!S162=\"\", \"\", MainRaw!S162)","v":""}," -  - ",{"$f":"IF(MainRaw!L162=\"\", \"\", MainRaw!L162)","v":""},{"$f":"IF(MainRaw!M162=\"\", \"\", MainRaw!M162)","v":""},{"$f":"IF(MainRaw!N162=\"\", \"\", MainRaw!N162)","v":""},{"$f":"IF(MainRaw!O162=\"\", \"\", MainRaw!O162)","v":""},{"$f":"IF(MainRaw!P162=\"\", \"\", MainRaw!P162)","v":""},{"$f":"IF(MainRaw!Q162=\"\", \"\", MainRaw!Q162)","v":""}]
[{"$f":"IF(MainRaw!A163=\"\", \"\", MainRaw!A163)","v":""},{"$f":"IF(MainRaw!B163=\"\", \"\", MainRaw!B163)","v":""},{"$f":"IF(MainRaw!E163=\"\", \"\", MainRaw!E163)","v":""},{"$f":"IF(MainRaw!H163=\"\", \"\", MainRaw!H163)","v":""},{"$f":"IF(MainRaw!J163=\"\", \"\", MainRaw!J163)","v":""},{"$f":"IF(MainRaw!K163=\"\", \"\", MainRaw!K163)","v":""},{"$f":"IF(MainRaw!L163=\"\", \"\", MainRaw!L163)","v":""},{"$f":"IF(MainRaw!M163=\"\", \"\", MainRaw!M163)","v":""},{"$f":"IF(MainRaw!R163=\"\", \"\", MainRaw!R163)","v":""},{"$f":"IF(MainRaw!S163=\"\", \"\", MainRaw!S163)","v":""}," -  - ",{"$f":"IF(MainRaw!L163=\"\", \"\", MainRaw!L163)","v":""},{"$f":"IF(MainRaw!M163=\"\", \"\", MainRaw!M163)","v":""},{"$f":"IF(MainRaw!N163=\"\", \"\", MainRaw!N163)","v":""},{"$f":"IF(MainRaw!O163=\"\", \"\", MainRaw!O163)","v":""},{"$f":"IF(MainRaw!P163=\"\", \"\", MainRaw!P163)","v":""},{"$f":"IF(MainRaw!Q163=\"\", \"\", MainRaw!Q163)","v":""}]
[{"$f":"IF(MainRaw!A164=\"\", \"\", MainRaw!A164)","v":""},{"$f":"IF(MainRaw!B164=\"\", \"\", MainRaw!B164)","v":""},{"$f":"IF(MainRaw!E164=\"\", \"\", MainRaw!E164)","v":""},{"$f":"IF(MainRaw!H164=\"\", \"\", MainRaw!H164)","v":""},{"$f":"IF(MainRaw!J164=\"\", \"\", MainRaw!J164)","v":""},{"$f":"IF(MainRaw!K164=\"\", \"\", MainRaw!K164)","v":""},{"$f":"IF(MainRaw!L164=\"\", \"\", MainRaw!L164)","v":""},{"$f":"IF(MainRaw!M164=\"\", \"\", MainRaw!M164)","v":""},{"$f":"IF(MainRaw!R164=\"\", \"\", MainRaw!R164)","v":""},{"$f":"IF(MainRaw!S164=\"\", \"\", MainRaw!S164)","v":""}," -  - ",{"$f":"IF(MainRaw!L164=\"\", \"\", MainRaw!L164)","v":""},{"$f":"IF(MainRaw!M164=\"\", \"\", MainRaw!M164)","v":""},{"$f":"IF(MainRaw!N164=\"\", \"\", MainRaw!N164)","v":""},{"$f":"IF(MainRaw!O164=\"\", \"\", MainRaw!O164)","v":""},{"$f":"IF(MainRaw!P164=\"\", \"\", MainRaw!P164)","v":""},{"$f":"IF(MainRaw!Q164=\"\", \"\", MainRaw!Q164)","v":""}]
[{"$f":"IF(MainRaw!A165=\"\", \"\", MainRaw!A165)","v":""},{"$f":"IF(MainRaw!B165=\"\", \"\", MainRaw!B165)","v":""},{"$f":"IF(MainRaw!E165=\"\", \"\", MainRaw!E165)","v":""},{"$f":"IF(MainRaw!H165=\"\", \"\", MainRaw!H165)","v":""},{"$f":"IF(MainRaw!J165=\"\", \"\", MainRaw!J165)","v":""},{"$f":"IF(MainRaw!K165=\"\", \"\", MainRaw!K165)","v":""},{"$f":"IF(MainRaw!L165=\"\", \"\", MainRaw!L165)","v":""},{"$f":"IF(MainRaw!M165=\"\", \"\", MainRaw!M165)","v":""},{"$f":"IF(MainRaw!R165=\"\", \"\", MainRaw!R165)","v":""},{"$f":"IF(MainRaw!S165=\"\", \"\", MainRaw!S165)","v":""}," -  - ",{"$f":"IF(MainRaw!L165=\"\", \"\", MainRaw!L165)","v":""},{"$f":"IF(MainRaw!M165=\"\", \"\", MainRaw!M165)","v":""},{"$f":"IF(MainRaw!N165=\"\", \"\", MainRaw!N165)","v":""},{"$f":"IF(MainRaw!O165=\"\", \"\", MainRaw!O165)","v":""},{"$f":"IF(MainRaw!P165=\"\", \"\", MainRaw!P165)","v":""},{"$f":"IF(MainRaw!Q165=\"\", \"\", MainRaw!Q165)","v":""}]
[{"$f":"IF(MainRaw!A166=\"\", \"\", MainRaw!A166)","v":""},{"$f":"IF(MainRaw!B166=\"\", \"\", MainRaw!B166)","v":""},{"$f":"IF(MainRaw!E166=\"\", \"\", MainRaw!E166)","v":""},{"$f":"IF(MainRaw!H166=\"\", \"\", MainRaw!H166)","v":""},{"$f":"IF(MainRaw!J166=\"\", \"\", MainRaw!J166)","v":""},{"$f":"IF(MainRaw!K166=\"\", \"\", MainRaw!K166)","v":""},{"$f":"IF(MainRaw!L166=\"\", \"\", MainRaw!L166)","v":""},{"$f":"IF(MainRaw!M166=\"\", \"\", MainRaw!M166)","v":""},{"$f":"IF(MainRaw!R166=\"\", \"\", MainRaw!R166)","v":""},{"$f":"IF(MainRaw!S166=\"\", \"\", MainRaw!S166)","v":""}," -  - ",{"$f":"IF(MainRaw!L166=\"\", \"\", MainRaw!L166)","v":""},{"$f":"IF(MainRaw!M166=\"\", \"\", MainRaw!M166)","v":""},{"$f":"IF(MainRaw!N166=\"\", \"\", MainRaw!N166)","v":""},{"$f":"IF(MainRaw!O166=\"\", \"\", MainRaw!O166)","v":""},{"$f":"IF(MainRaw!P166=\"\", \"\", MainRaw!P166)","v":""},{"$f":"IF(MainRaw!Q166=\"\", \"\", MainRaw!Q166)","v":""}]
[{"$f":"IF(MainRaw!A167=\"\", \"\", MainRaw!A167)","v":""},{"$f":"IF(MainRaw!B167=\"\", \"\", MainRaw!B167)","v":""},{"$f":"IF(MainRaw!E167=\"\", \"\", MainRaw!E167)","v":""},{"$f":"IF(MainRaw!H167=\"\", \"\", MainRaw!H167)","v":""},{"$f":"IF(MainRaw!J167=\"\", \"\", MainRaw!J167)","v":""},{"$f":"IF(MainRaw!K167=\"\", \"\", MainRaw!K167)","v":""},{"$f":"IF(MainRaw!L167=\"\", \"\", MainRaw!L167)","v":""},{"$f":"IF(MainRaw!M167=\"\", \"\", MainRaw!M167)","v":""},{"$f":"IF(MainRaw!R167=\"\", \"\", MainRaw!R167)","v":""},{"$f":"IF(MainRaw!S167=\"\", \"\", MainRaw!S167)","v":""}," -  - ",{"$f":"IF(MainRaw!L167=\"\", \"\", MainRaw!L167)","v":""},{"$f":"IF(MainRaw!M167=\"\", \"\", MainRaw!M167)","v":""},{"$f":"IF(MainRaw!N167=\"\", \"\", MainRaw!N167)","v":""},{"$f":"IF(MainRaw!O167=\"\", \"\", MainRaw!O167)","v":""},{"$f":"IF(MainRaw!P167=\"\", \"\", MainRaw!P167)","v":""},{"$f":"IF(MainRaw!Q167=\"\", \"\", MainRaw!Q167)","v":""}]
[{"$f":"IF(MainRaw!A168=\"\", \"\", MainRaw!A168)","v":""},{"$f":"IF(MainRaw!B168=\"\", \"\", MainRaw!B168)","v":""},{"$f":"IF(MainRaw!E168=\"\", \"\", MainRaw!E168)","v":""},{"$f":"IF(MainRaw!H168=\"\", \"\", MainRaw!H168)","v":""},{"$f":"IF(MainRaw!J168=\"\", \"\", MainRaw!J168)","v":""},{"$f":"IF(MainRaw!K168=\"\", \"\", MainRaw!K168)","v":""},{"$f":"IF(MainRaw!L168=\"\", \"\", MainRaw!L168)","v":""},{"$f":"IF(MainRaw!M168=\"\", \"\", MainRaw!M168)","v":""},{"$f":"IF(MainRaw!R168=\"\", \"\", MainRaw!R168)","v":""},{"$f":"IF(MainRaw!S168=\"\", \"\", MainRaw!S168)","v":""}," -  - ",{"$f":"IF(MainRaw!L168=\"\", \"\", MainRaw!L168)","v":""},{"$f":"IF(MainRaw!M168=\"\", \"\", MainRaw!M168)","v":""},{"$f":"IF(MainRaw!N168=\"\", \"\", MainRaw!N168)","v":""},{"$f":"IF(MainRaw!O168=\"\", \"\", MainRaw!O168)","v":""},{"$f":"IF(MainRaw!P168=\"\", \"\", MainRaw!P168)","v":""},{"$f":"IF(MainRaw!Q168=\"\", \"\", MainRaw!Q168)","v":""}]
[{"$f":"IF(MainRaw!A169=\"\", \"\", MainRaw!A169)","v":""},{"$f":"IF(MainRaw!B169=\"\", \"\", MainRaw!B169)","v":""},{"$f":"IF(MainRaw!E169=\"\", \"\", MainRaw!E169)","v":""},{"$f":"IF(MainRaw!H169=\"\", \"\", MainRaw!H169)","v":""},{"$f":"IF(MainRaw!J169=\"\", \"\", MainRaw!J169)","v":""},{"$f":"IF(MainRaw!K169=\"\", \"\", MainRaw!K169)","v":""},{"$f":"IF(MainRaw!L169=\"\", \"\", MainRaw!L169)","v":""},{"$f":"IF(MainRaw!M169=\"\", \"\", MainRaw!M169)","v":""},{"$f":"IF(MainRaw!R169=\"\", \"\", MainRaw!R169)","v":""},{"$f":"IF(MainRaw!S169=\"\", \"\", MainRaw!S169)","v":""}," -  - ",{"$f":"IF(MainRaw!L169=\"\", \"\", MainRaw!L169)","v":""},{"$f":"IF(MainRaw!M169=\"\", \"\", MainRaw!M169)","v":""},{"$f":"IF(MainRaw!N169=\"\", \"\", MainRaw!N169)","v":""},{"$f":"IF(MainRaw!O169=\"\", \"\", MainRaw!O169)","v":""},{"$f":"IF(MainRaw!P169=\"\", \"\", MainRaw!P169)","v":""},{"$f":"IF(MainRaw!Q169=\"\", \"\", MainRaw!Q169)","v":""}]
[{"$f":"IF(MainRaw!A170=\"\", \"\", MainRaw!A170)","v":""},{"$f":"IF(MainRaw!B170=\"\", \"\", MainRaw!B170)","v":""},{"$f":"IF(MainRaw!E170=\"\", \"\", MainRaw!E170)","v":""},{"$f":"IF(MainRaw!H170=\"\", \"\", MainRaw!H170)","v":""},{"$f":"IF(MainRaw!J170=\"\", \"\", MainRaw!J170)","v":""},{"$f":"IF(MainRaw!K170=\"\", \"\", MainRaw!K170)","v":""},{"$f":"IF(MainRaw!L170=\"\", \"\", MainRaw!L170)","v":""},{"$f":"IF(MainRaw!M170=\"\", \"\", MainRaw!M170)","v":""},{"$f":"IF(MainRaw!R170=\"\", \"\", MainRaw!R170)","v":""},{"$f":"IF(MainRaw!S170=\"\", \"\", MainRaw!S170)","v":""}," -  - ",{"$f":"IF(MainRaw!L170=\"\", \"\", MainRaw!L170)","v":""},{"$f":"IF(MainRaw!M170=\"\", \"\", MainRaw!M170)","v":""},{"$f":"IF(MainRaw!N170=\"\", \"\", MainRaw!N170)","v":""},{"$f":"IF(MainRaw!O170=\"\", \"\", MainRaw!O170)","v":""},{"$f":"IF(MainRaw!P170=\"\", \"\", MainRaw!P170)","v":""},{"$f":"IF(MainRaw!Q170=\"\", \"\", MainRaw!Q170)","v":""}]
[{"$f":"IF(MainRaw!A171=\"\", \"\", MainRaw!A171)","v":""},{"$f":"IF(MainRaw!B171=\"\", \"\", MainRaw!B171)","v":""},{"$f":"IF(MainRaw!E171=\"\", \"\", MainRaw!E171)","v":""},{"$f":"IF(MainRaw!H171=\"\", \"\", MainRaw!H171)","v":""},{"$f":"IF(MainRaw!J171=\"\", \"\", MainRaw!J171)","v":""},{"$f":"IF(MainRaw!K171=\"\", \"\", MainRaw!K171)","v":""},{"$f":"IF(MainRaw!L171=\"\", \"\", MainRaw!L171)","v":""},{"$f":"IF(MainRaw!M171=\"\", \"\", MainRaw!M171)","v":""},{"$f":"IF(MainRaw!R171=\"\", \"\", MainRaw!R171)","v":""},{"$f":"IF(MainRaw!S171=\"\", \"\", MainRaw!S171)","v":""}," -  - ",{"$f":"IF(MainRaw!L171=\"\", \"\", MainRaw!L171)","v":""},{"$f":"IF(MainRaw!M171=\"\", \"\", MainRaw!M171)","v":""},{"$f":"IF(MainRaw!N171=\"\", \"\", MainRaw!N171)","v":""},{"$f":"IF(MainRaw!O171=\"\", \"\", MainRaw!O171)","v":""},{"$f":"IF(MainRaw!P171=\"\", \"\", MainRaw!P171)","v":""},{"$f":"IF(MainRaw!Q171=\"\", \"\", MainRaw!Q171)","v":""}]
[{"$f":"IF(MainRaw!A172=\"\", \"\", MainRaw!A172)","v":""},{"$f":"IF(MainRaw!B172=\"\", \"\", MainRaw!B172)","v":""},{"$f":"IF(MainRaw!E172=\"\", \"\", MainRaw!E172)","v":""},{"$f":"IF(MainRaw!H172=\"\", \"\", MainRaw!H172)","v":""},{"$f":"IF(MainRaw!J172=\"\", \"\", MainRaw!J172)","v":""},{"$f":"IF(MainRaw!K172=\"\", \"\", MainRaw!K172)","v":""},{"$f":"IF(MainRaw!L172=\"\", \"\", MainRaw!L172)","v":""},{"$f":"IF(MainRaw!M172=\"\", \"\", MainRaw!M172)","v":""},{"$f":"IF(MainRaw!R172=\"\", \"\", MainRaw!R172)","v":""},{"$f":"IF(MainRaw!S172=\"\", \"\", MainRaw!S172)","v":""}," -  - ",{"$f":"IF(MainRaw!L172=\"\", \"\", MainRaw!L172)","v":""},{"$f":"IF(MainRaw!M172=\"\", \"\", MainRaw!M172)","v":""},{"$f":"IF(MainRaw!N172=\"\", \"\", MainRaw!N172)","v":""},{"$f":"IF(MainRaw!O172=\"\", \"\", MainRaw!O172)","v":""},{"$f":"IF(MainRaw!P172=\"\", \"\", MainRaw!P172)","v":""},{"$f":"IF(MainRaw!Q172=\"\", \"\", MainRaw!Q172)","v":""}]
[{"$f":"IF(MainRaw!A173=\"\", \"\", MainRaw!A173)","v":""},{"$f":"IF(MainRaw!B173=\"\", \"\", MainRaw!B173)","v":""},{"$f":"IF(MainRaw!E173=\"\", \"\", MainRaw!E173)","v":""},{"$f":"IF(MainRaw!H173=\"\", \"\", MainRaw!H173)","v":""},{"$f":"IF(MainRaw!J173=\"\", \"\", MainRaw!J173)","v":""},{"$f":"IF(MainRaw!K173=\"\", \"\", MainRaw!K173)","v":""},{"$f":"IF(MainRaw!L173=\"\", \"\", MainRaw!L173)","v":""},{"$f":"IF(MainRaw!M173=\"\", \"\", MainRaw!M173)","v":""},{"$f":"IF(MainRaw!R173=\"\", \"\", MainRaw!R173)","v":""},{"$f":"IF(MainRaw!S173=\"\", \"\", MainRaw!S173)","v":""}," -  - ",{"$f":"IF(MainRaw!L173=\"\", \"\", MainRaw!L173)","v":""},{"$f":"IF(MainRaw!M173=\"\", \"\", MainRaw!M173)","v":""},{"$f":"IF(MainRaw!N173=\"\", \"\", MainRaw!N173)","v":""},{"$f":"IF(MainRaw!O173=\"\", \"\", MainRaw!O173)","v":""},{"$f":"IF(MainRaw!P173=\"\", \"\", MainRaw!P173)","v":""},{"$f":"IF(MainRaw!Q173=\"\", \"\", MainRaw!Q173)","v":""}]
[{"$f":"IF(MainRaw!A174=\"\", \"\", MainRaw!A174)","v":""},{"$f":"IF(MainRaw!B174=\"\", \"\", MainRaw!B174)","v":""},{"$f":"IF(MainRaw!E174=\"\", \"\", MainRaw!E174)","v":""},{"$f":"IF(MainRaw!H174=\"\", \"\", MainRaw!H174)","v":""},{"$f":"IF(MainRaw!J174=\"\", \"\", MainRaw!J174)","v":""},{"$f":"IF(MainRaw!K174=\"\", \"\", MainRaw!K174)","v":""},{"$f":"IF(MainRaw!L174=\"\", \"\", MainRaw!L174)","v":""},{"$f":"IF(MainRaw!M174=\"\", \"\", MainRaw!M174)","v":""},{"$f":"IF(MainRaw!R174=\"\", \"\", MainRaw!R174)","v":""},{"$f":"IF(MainRaw!S174=\"\", \"\", MainRaw!S174)","v":""}," -  - ",{"$f":"IF(MainRaw!L174=\"\", \"\", MainRaw!L174)","v":""},{"$f":"IF(MainRaw!M174=\"\", \"\", MainRaw!M174)","v":""},{"$f":"IF(MainRaw!N174=\"\", \"\", MainRaw!N174)","v":""},{"$f":"IF(MainRaw!O174=\"\", \"\", MainRaw!O174)","v":""},{"$f":"IF(MainRaw!P174=\"\", \"\", MainRaw!P174)","v":""},{"$f":"IF(MainRaw!Q174=\"\", \"\", MainRaw!Q174)","v":""}]
[{"$f":"IF(MainRaw!A175=\"\", \"\", MainRaw!A175)","v":""},{"$f":"IF(MainRaw!B175=\"\", \"\", MainRaw!B175)","v":""},{"$f":"IF(MainRaw!E175=\"\", \"\", MainRaw!E175)","v":""},{"$f":"IF(MainRaw!H175=\"\", \"\", MainRaw!H175)","v":""},{"$f":"IF(MainRaw!J175=\"\", \"\", MainRaw!J175)","v":""},{"$f":"IF(MainRaw!K175=\"\", \"\", MainRaw!K175)","v":""},{"$f":"IF(MainRaw!L175=\"\", \"\", MainRaw!L175)","v":""},{"$f":"IF(MainRaw!M175=\"\", \"\", MainRaw!M175)","v":""},{"$f":"IF(MainRaw!R175=\"\", \"\", MainRaw!R175)","v":""},{"$f":"IF(MainRaw!S175=\"\", \"\", MainRaw!S175)","v":""}," -  - ",{"$f":"IF(MainRaw!L175=\"\", \"\", MainRaw!L175)","v":""},{"$f":"IF(MainRaw!M175=\"\", \"\", MainRaw!M175)","v":""},{"$f":"IF(MainRaw!N175=\"\", \"\", MainRaw!N175)","v":""},{"$f":"IF(MainRaw!O175=\"\", \"\", MainRaw!O175)","v":""},{"$f":"IF(MainRaw!P175=\"\", \"\", MainRaw!P175)","v":""},{"$f":"IF(MainRaw!Q175=\"\", \"\", MainRaw!Q175)","v":""}]
[{"$f":"IF(MainRaw!A176=\"\", \"\", MainRaw!A176)","v":""},{"$f":"IF(MainRaw!B176=\"\", \"\", MainRaw!B176)","v":""},{"$f":"IF(MainRaw!E176=\"\", \"\", MainRaw!E176)","v":""},{"$f":"IF(MainRaw!H176=\"\", \"\", MainRaw!H176)","v":""},{"$f":"IF(MainRaw!J176=\"\", \"\", MainRaw!J176)","v":""},{"$f":"IF(MainRaw!K176=\"\", \"\", MainRaw!K176)","v":""},{"$f":"IF(MainRaw!L176=\"\", \"\", MainRaw!L176)","v":""},{"$f":"IF(MainRaw!M176=\"\", \"\", MainRaw!M176)","v":""},{"$f":"IF(MainRaw!R176=\"\", \"\", MainRaw!R176)","v":""},{"$f":"IF(MainRaw!S176=\"\", \"\", MainRaw!S176)","v":""}," -  - ",{"$f":"IF(MainRaw!L176=\"\", \"\", MainRaw!L176)","v":""},{"$f":"IF(MainRaw!M176=\"\", \"\", MainRaw!M176)","v":""},{"$f":"IF(MainRaw!N176=\"\", \"\", MainRaw!N176)","v":""},{"$f":"IF(MainRaw!O176=\"\", \"\", MainRaw!O176)","v":""},{"$f":"IF(MainRaw!P176=\"\", \"\", MainRaw!P176)","v":""},{"$f":"IF(MainRaw!Q176=\"\", \"\", MainRaw!Q176)","v":""}]
[{"$f":"IF(MainRaw!A177=\"\", \"\", MainRaw!A177)","v":""},{"$f":"IF(MainRaw!B177=\"\", \"\", MainRaw!B177)","v":""},{"$f":"IF(MainRaw!E177=\"\", \"\", MainRaw!E177)","v":""},{"$f":"IF(MainRaw!H177=\"\", \"\", MainRaw!H177)","v":""},{"$f":"IF(MainRaw!J177=\"\", \"\", MainRaw!J177)","v":""},{"$f":"IF(MainRaw!K177=\"\", \"\", MainRaw!K177)","v":""},{"$f":"IF(MainRaw!L177=\"\", \"\", MainRaw!L177)","v":""},{"$f":"IF(MainRaw!M177=\"\", \"\", MainRaw!M177)","v":""},{"$f":"IF(MainRaw!R177=\"\", \"\", MainRaw!R177)","v":""},{"$f":"IF(MainRaw!S177=\"\", \"\", MainRaw!S177)","v":""}," -  - ",{"$f":"IF(MainRaw!L177=\"\", \"\", MainRaw!L177)","v":""},{"$f":"IF(MainRaw!M177=\"\", \"\", MainRaw!M177)","v":""},{"$f":"IF(MainRaw!N177=\"\", \"\", MainRaw!N177)","v":""},{"$f":"IF(MainRaw!O177=\"\", \"\", MainRaw!O177)","v":""},{"$f":"IF(MainRaw!P177=\"\", \"\", MainRaw!P177)","v":""},{"$f":"IF(MainRaw!Q177=\"\", \"\", MainRaw!Q177)","v":""}]
[{"$f":"IF(MainRaw!A178=\"\", \"\", MainRaw!A178)","v":""},{"$f":"IF(MainRaw!B178=\"\", \"\", MainRaw!B178)","v":""},{"$f":"IF(MainRaw!E178=\"\", \"\", MainRaw!E178)","v":""},{"$f":"IF(MainRaw!H178=\"\", \"\", MainRaw!H178)","v":""},{"$f":"IF(MainRaw!J178=\"\", \"\", MainRaw!J178)","v":""},{"$f":"IF(MainRaw!K178=\"\", \"\", MainRaw!K178)","v":""},{"$f":"IF(MainRaw!L178=\"\", \"\", MainRaw!L178)","v":""},{"$f":"IF(MainRaw!M178=\"\", \"\", MainRaw!M178)","v":""},{"$f":"IF(MainRaw!R178=\"\", \"\", MainRaw!R178)","v":""},{"$f":"IF(MainRaw!S178=\"\", \"\", MainRaw!S178)","v":""}," -  - ",{"$f":"IF(MainRaw!L178=\"\", \"\", MainRaw!L178)","v":""},{"$f":"IF(MainRaw!M178=\"\", \"\", MainRaw!M178)","v":""},{"$f":"IF(MainRaw!N178=\"\", \"\", MainRaw!N178)","v":""},{"$f":"IF(MainRaw!O178=\"\", \"\", MainRaw!O178)","v":""},{"$f":"IF(MainRaw!P178=\"\", \"\", MainRaw!P178)","v":""},{"$f":"IF(MainRaw!Q178=\"\", \"\", MainRaw!Q178)","v":""}]
[{"$f":"IF(MainRaw!A179=\"\", \"\", MainRaw!A179)","v":""},{"$f":"IF(MainRaw!B179=\"\", \"\", MainRaw!B179)","v":""},{"$f":"IF(MainRaw!E179=\"\", \"\", MainRaw!E179)","v":""},{"$f":"IF(MainRaw!H179=\"\", \"\", MainRaw!H179)","v":""},{"$f":"IF(MainRaw!J179=\"\", \"\", MainRaw!J179)","v":""},{"$f":"IF(MainRaw!K179=\"\", \"\", MainRaw!K179)","v":""},{"$f":"IF(MainRaw!L179=\"\", \"\", MainRaw!L179)","v":""},{"$f":"IF(MainRaw!M179=\"\", \"\", MainRaw!M179)","v":""},{"$f":"IF(MainRaw!R179=\"\", \"\", MainRaw!R179)","v":""},{"$f":"IF(MainRaw!S179=\"\", \"\", MainRaw!S179)","v":""}," -  - ",{"$f":"IF(MainRaw!L179=\"\", \"\", MainRaw!L179)","v":""},{"$f":"IF(MainRaw!M179=\"\", \"\", MainRaw!M179)","v":""},{"$f":"IF(MainRaw!N179=\"\", \"\", MainRaw!N179)","v":""},{"$f":"IF(MainRaw!O179=\"\", \"\", MainRaw!O179)","v":""},{"$f":"IF(MainRaw!P179=\"\", \"\", MainRaw!P179)","v":""},{"$f":"IF(MainRaw!Q179=\"\", \"\", MainRaw!Q179)","v":""}]
[{"$f":"IF(MainRaw!A180=\"\", \"\", MainRaw!A180)","v":""},{"$f":"IF(MainRaw!B180=\"\", \"\", MainRaw!B180)","v":""},{"$f":"IF(MainRaw!E180=\"\", \"\", MainRaw!E180)","v":""},{"$f":"IF(MainRaw!H180=\"\", \"\", MainRaw!H180)","v":""},{"$f":"IF(MainRaw!J180=\"\", \"\", MainRaw!J180)","v":""},{"$f":"IF(MainRaw!K180=\"\", \"\", MainRaw!K180)","v":""},{"$f":"IF(MainRaw!L180=\"\", \"\", MainRaw!L180)","v":""},{"$f":"IF(MainRaw!M180=\"\", \"\", MainRaw!M180)","v":""},{"$f":"IF(MainRaw!R180=\"\", \"\", MainRaw!R180)","v":""},{"$f":"IF(MainRaw!S180=\"\", \"\", MainRaw!S180)","v":""}," -  - ",{"$f":"IF(MainRaw!L180=\"\", \"\", MainRaw!L180)","v":""},{"$f":"IF(MainRaw!M180=\"\", \"\", MainRaw!M180)","v":""},{"$f":"IF(MainRaw!N180=\"\", \"\", MainRaw!N180)","v":""},{"$f":"IF(MainRaw!O180=\"\", \"\", MainRaw!O180)","v":""},{"$f":"IF(MainRaw!P180=\"\", \"\", MainRaw!P180)","v":""},{"$f":"IF(MainRaw!Q180=\"\", \"\", MainRaw!Q180)","v":""}]
[{"$f":"IF(MainRaw!A181=\"\", \"\", MainRaw!A181)","v":""},{"$f":"IF(MainRaw!B181=\"\", \"\", MainRaw!B181)","v":""},{"$f":"IF(MainRaw!E181=\"\", \"\", MainRaw!E181)","v":""},{"$f":"IF(MainRaw!H181=\"\", \"\", MainRaw!H181)","v":""},{"$f":"IF(MainRaw!J181=\"\", \"\", MainRaw!J181)","v":""},{"$f":"IF(MainRaw!K181=\"\", \"\", MainRaw!K181)","v":""},{"$f":"IF(MainRaw!L181=\"\", \"\", MainRaw!L181)","v":""},{"$f":"IF(MainRaw!M181=\"\", \"\", MainRaw!M181)","v":""},{"$f":"IF(MainRaw!R181=\"\", \"\", MainRaw!R181)","v":""},{"$f":"IF(MainRaw!S181=\"\", \"\", MainRaw!S181)","v":""}," -  - ",{"$f":"IF(MainRaw!L181=\"\", \"\", MainRaw!L181)","v":""},{"$f":"IF(MainRaw!M181=\"\", \"\", MainRaw!M181)","v":""},{"$f":"IF(MainRaw!N181=\"\", \"\", MainRaw!N181)","v":""},{"$f":"IF(MainRaw!O181=\"\", \"\", MainRaw!O181)","v":""},{"$f":"IF(MainRaw!P181=\"\", \"\", MainRaw!P181)","v":""},{"$f":"IF(MainRaw!Q181=\"\", \"\", MainRaw!Q181)","v":""}]
[{"$f":"IF(MainRaw!A182=\"\", \"\", MainRaw!A182)","v":""},{"$f":"IF(MainRaw!B182=\"\", \"\", MainRaw!B182)","v":""},{"$f":"IF(MainRaw!E182=\"\", \"\", MainRaw!E182)","v":""},{"$f":"IF(MainRaw!H182=\"\", \"\", MainRaw!H182)","v":""},{"$f":"IF(MainRaw!J182=\"\", \"\", MainRaw!J182)","v":""},{"$f":"IF(MainRaw!K182=\"\", \"\", MainRaw!K182)","v":""},{"$f":"IF(MainRaw!L182=\"\", \"\", MainRaw!L182)","v":""},{"$f":"IF(MainRaw!M182=\"\", \"\", MainRaw!M182)","v":""},{"$f":"IF(MainRaw!R182=\"\", \"\", MainRaw!R182)","v":""},{"$f":"IF(MainRaw!S182=\"\", \"\", MainRaw!S182)","v":""}," -  - ",{"$f":"IF(MainRaw!L182=\"\", \"\", MainRaw!L182)","v":""},{"$f":"IF(MainRaw!M182=\"\", \"\", MainRaw!M182)","v":""},{"$f":"IF(MainRaw!N182=\"\", \"\", MainRaw!N182)","v":""},{"$f":"IF(MainRaw!O182=\"\", \"\", MainRaw!O182)","v":""},{"$f":"IF(MainRaw!P182=\"\", \"\", MainRaw!P182)","v":""},{"$f":"IF(MainRaw!Q182=\"\", \"\", MainRaw!Q182)","v":""}]
[{"$f":"IF(MainRaw!A183=\"\", \"\", MainRaw!A183)","v":""},{"$f":"IF(MainRaw!B183=\"\", \"\", MainRaw!B183)","v":""},{"$f":"IF(MainRaw!E183=\"\", \"\", MainRaw!E183)","v":""},{"$f":"IF(MainRaw!H183=\"\", \"\", MainRaw!H183)","v":""},{"$f":"IF(MainRaw!J183=\"\", \"\", MainRaw!J183)","v":""},{"$f":"IF(MainRaw!K183=\"\", \"\", MainRaw!K183)","v":""},{"$f":"IF(MainRaw!L183=\"\", \"\", MainRaw!L183)","v":""},{"$f":"IF(MainRaw!M183=\"\", \"\", MainRaw!M183)","v":""},{"$f":"IF(MainRaw!R183=\"\", \"\", MainRaw!R183)","v":""},{"$f":"IF(MainRaw!S183=\"\", \"\", MainRaw!S183)","v":""}," -  - ",{"$f":"IF(MainRaw!L183=\"\", \"\", MainRaw!L183)","v":""},{"$f":"IF(MainRaw!M183=\"\", \"\", MainRaw!M183)","v":""},{"$f":"IF(MainRaw!N183=\"\", \"\", MainRaw!N183)","v":""},{"$f":"IF(MainRaw!O183=\"\", \"\", MainRaw!O183)","v":""},{"$f":"IF(MainRaw!P183=\"\", \"\", MainRaw!P183)","v":""},{"$f":"IF(MainRaw!Q183=\"\", \"\", MainRaw!Q183)","v":""}]
[{"$f":"IF(MainRaw!A184=\"\", \"\", MainRaw!A184)","v":""},{"$f":"IF(MainRaw!B184=\"\", \"\", MainRaw!B184)","v":""},{"$f":"IF(MainRaw!E184=\"\", \"\", MainRaw!E184)","v":""},{"$f":"IF(MainRaw!H184=\"\", \"\", MainRaw!H184)","v":""},{"$f":"IF(MainRaw!J184=\"\", \"\", MainRaw!J184)","v":""},{"$f":"IF(MainRaw!K184=\"\", \"\", MainRaw!K184)","v":""},{"$f":"IF(MainRaw!L184=\"\", \"\", MainRaw!L184)","v":""},{"$f":"IF(MainRaw!M184=\"\", \"\", MainRaw!M184)","v":""},{"$f":"IF(MainRaw!R184=\"\", \"\", MainRaw!R184)","v":""},{"$f":"IF(MainRaw!S184=\"\", \"\", MainRaw!S184)","v":""}," -  - ",{"$f":"IF(MainRaw!L184=\"\", \"\", MainRaw!L184)","v":""},{"$f":"IF(MainRaw!M184=\"\", \"\", MainRaw!M184)","v":""},{"$f":"IF(MainRaw!N184=\"\", \"\", MainRaw!N184)","v":""},{"$f":"IF(MainRaw!O184=\"\", \"\", MainRaw!O184)","v":""},{"$f":"IF(MainRaw!P184=\"\", \"\", MainRaw!P184)","v":""},{"$f":"IF(MainRaw!Q184=\"\", \"\", MainRaw!Q184)","v":""}]
[{"$f":"IF(MainRaw!A185=\"\", \"\", MainRaw!A185)","v":""},{"$f":"IF(MainRaw!B185=\"\", \"\", MainRaw!B185)","v":""},{"$f":"IF(MainRaw!E185=\"\", \"\", MainRaw!E185)","v":""},{"$f":"IF(MainRaw!H185=\"\", \"\", MainRaw!H185)","v":""},{"$f":"IF(MainRaw!J185=\"\", \"\", MainRaw!J185)","v":""},{"$f":"IF(MainRaw!K185=\"\", \"\", MainRaw!K185)","v":""},{"$f":"IF(MainRaw!L185=\"\", \"\", MainRaw!L185)","v":""},{"$f":"IF(MainRaw!M185=\"\", \"\", MainRaw!M185)","v":""},{"$f":"IF(MainRaw!R185=\"\", \"\", MainRaw!R185)","v":""},{"$f":"IF(MainRaw!S185=\"\", \"\", MainRaw!S185)","v":""}," -  - ",{"$f":"IF(MainRaw!L185=\"\", \"\", MainRaw!L185)","v":""},{"$f":"IF(MainRaw!M185=\"\", \"\", MainRaw!M185)","v":""},{"$f":"IF(MainRaw!N185=\"\", \"\", MainRaw!N185)","v":""},{"$f":"IF(MainRaw!O185=\"\", \"\", MainRaw!O185)","v":""},{"$f":"IF(MainRaw!P185=\"\", \"\", MainRaw!P185)","v":""},{"$f":"IF(MainRaw!Q185=\"\", \"\", MainRaw!Q185)","v":""}]
[{"$f":"IF(MainRaw!A186=\"\", \"\", MainRaw!A186)","v":""},{"$f":"IF(MainRaw!B186=\"\", \"\", MainRaw!B186)","v":""},{"$f":"IF(MainRaw!E186=\"\", \"\", MainRaw!E186)","v":""},{"$f":"IF(MainRaw!H186=\"\", \"\", MainRaw!H186)","v":""},{"$f":"IF(MainRaw!J186=\"\", \"\", MainRaw!J186)","v":""},{"$f":"IF(MainRaw!K186=\"\", \"\", MainRaw!K186)","v":""},{"$f":"IF(MainRaw!L186=\"\", \"\", MainRaw!L186)","v":""},{"$f":"IF(MainRaw!M186=\"\", \"\", MainRaw!M186)","v":""},{"$f":"IF(MainRaw!R186=\"\", \"\", MainRaw!R186)","v":""},{"$f":"IF(MainRaw!S186=\"\", \"\", MainRaw!S186)","v":""}," -  - ",{"$f":"IF(MainRaw!L186=\"\", \"\", MainRaw!L186)","v":""},{"$f":"IF(MainRaw!M186=\"\", \"\", MainRaw!M186)","v":""},{"$f":"IF(MainRaw!N186=\"\", \"\", MainRaw!N186)","v":""},{"$f":"IF(MainRaw!O186=\"\", \"\", MainRaw!O186)","v":""},{"$f":"IF(MainRaw!P186=\"\", \"\", MainRaw!P186)","v":""},{"$f":"IF(MainRaw!Q186=\"\", \"\", MainRaw!Q186)","v":""}]
[{"$f":"IF(MainRaw!A187=\"\", \"\", MainRaw!A187)","v":""},{"$f":"IF(MainRaw!B187=\"\", \"\", MainRaw!B187)","v":""},{"$f":"IF(MainRaw!E187=\"\", \"\", MainRaw!E187)","v":""},{"$f":"IF(MainRaw!H187=\"\", \"\", MainRaw!H187)","v":""},{"$f":"IF(MainRaw!J187=\"\", \"\", MainRaw!J187)","v":""},{"$f":"IF(MainRaw!K187=\"\", \"\", MainRaw!K187)","v":""},{"$f":"IF(MainRaw!L187=\"\", \"\", MainRaw!L187)","v":""},{"$f":"IF(MainRaw!M187=\"\", \"\", MainRaw!M187)","v":""},{"$f":"IF(MainRaw!R187=\"\", \"\", MainRaw!R187)","v":""},{"$f":"IF(MainRaw!S187=\"\", \"\", MainRaw!S187)","v":""}," -  - ",{"$f":"IF(MainRaw!L187=\"\", \"\", MainRaw!L187)","v":""},{"$f":"IF(MainRaw!M187=\"\", \"\", MainRaw!M187)","v":""},{"$f":"IF(MainRaw!N187=\"\", \"\", MainRaw!N187)","v":""},{"$f":"IF(MainRaw!O187=\"\", \"\", MainRaw!O187)","v":""},{"$f":"IF(MainRaw!P187=\"\", \"\", MainRaw!P187)","v":""},{"$f":"IF(MainRaw!Q187=\"\", \"\", MainRaw!Q187)","v":""}]
[{"$f":"IF(MainRaw!A188=\"\", \"\", MainRaw!A188)","v":""},{"$f":"IF(MainRaw!B188=\"\", \"\", MainRaw!B188)","v":""},{"$f":"IF(MainRaw!E188=\"\", \"\", MainRaw!E188)","v":""},{"$f":"IF(MainRaw!H188=\"\", \"\", MainRaw!H188)","v":""},{"$f":"IF(MainRaw!J188=\"\", \"\", MainRaw!J188)","v":""},{"$f":"IF(MainRaw!K188=\"\", \"\", MainRaw!K188)","v":""},{"$f":"IF(MainRaw!L188=\"\", \"\", MainRaw!L188)","v":""},{"$f":"IF(MainRaw!M188=\"\", \"\", MainRaw!M188)","v":""},{"$f":"IF(MainRaw!R188=\"\", \"\", MainRaw!R188)","v":""},{"$f":"IF(MainRaw!S188=\"\", \"\", MainRaw!S188)","v":""}," -  - ",{"$f":"IF(MainRaw!L188=\"\", \"\", MainRaw!L188)","v":""},{"$f":"IF(MainRaw!M188=\"\", \"\", MainRaw!M188)","v":""},{"$f":"IF(MainRaw!N188=\"\", \"\", MainRaw!N188)","v":""},{"$f":"IF(MainRaw!O188=\"\", \"\", MainRaw!O188)","v":""},{"$f":"IF(MainRaw!P188=\"\", \"\", MainRaw!P188)","v":""},{"$f":"IF(MainRaw!Q188=\"\", \"\", MainRaw!Q188)","v":""}]
[{"$f":"IF(MainRaw!A189=\"\", \"\", MainRaw!A189)","v":""},{"$f":"IF(MainRaw!B189=\"\", \"\", MainRaw!B189)","v":""},{"$f":"IF(MainRaw!E189=\"\", \"\", MainRaw!E189)","v":""},{"$f":"IF(MainRaw!H189=\"\", \"\", MainRaw!H189)","v":""},{"$f":"IF(MainRaw!J189=\"\", \"\", MainRaw!J189)","v":""},{"$f":"IF(MainRaw!K189=\"\", \"\", MainRaw!K189)","v":""},{"$f":"IF(MainRaw!L189=\"\", \"\", MainRaw!L189)","v":""},{"$f":"IF(MainRaw!M189=\"\", \"\", MainRaw!M189)","v":""},{"$f":"IF(MainRaw!R189=\"\", \"\", MainRaw!R189)","v":""},{"$f":"IF(MainRaw!S189=\"\", \"\", MainRaw!S189)","v":""}," -  - ",{"$f":"IF(MainRaw!L189=\"\", \"\", MainRaw!L189)","v":""},{"$f":"IF(MainRaw!M189=\"\", \"\", MainRaw!M189)","v":""},{"$f":"IF(MainRaw!N189=\"\", \"\", MainRaw!N189)","v":""},{"$f":"IF(MainRaw!O189=\"\", \"\", MainRaw!O189)","v":""},{"$f":"IF(MainRaw!P189=\"\", \"\", MainRaw!P189)","v":""},{"$f":"IF(MainRaw!Q189=\"\", \"\", MainRaw!Q189)","v":""}]
[{"$f":"IF(MainRaw!A190=\"\", \"\", MainRaw!A190)","v":""},{"$f":"IF(MainRaw!B190=\"\", \"\", MainRaw!B190)","v":""},{"$f":"IF(MainRaw!E190=\"\", \"\", MainRaw!E190)","v":""},{"$f":"IF(MainRaw!H190=\"\", \"\", MainRaw!H190)","v":""},{"$f":"IF(MainRaw!J190=\"\", \"\", MainRaw!J190)","v":""},{"$f":"IF(MainRaw!K190=\"\", \"\", MainRaw!K190)","v":""},{"$f":"IF(MainRaw!L190=\"\", \"\", MainRaw!L190)","v":""},{"$f":"IF(MainRaw!M190=\"\", \"\", MainRaw!M190)","v":""},{"$f":"IF(MainRaw!R190=\"\", \"\", MainRaw!R190)","v":""},{"$f":"IF(MainRaw!S190=\"\", \"\", MainRaw!S190)","v":""}," -  - ",{"$f":"IF(MainRaw!L190=\"\", \"\", MainRaw!L190)","v":""},{"$f":"IF(MainRaw!M190=\"\", \"\", MainRaw!M190)","v":""},{"$f":"IF(MainRaw!N190=\"\", \"\", MainRaw!N190)","v":""},{"$f":"IF(MainRaw!O190=\"\", \"\", MainRaw!O190)","v":""},{"$f":"IF(MainRaw!P190=\"\", \"\", MainRaw!P190)","v":""},{"$f":"IF(MainRaw!Q190=\"\", \"\", MainRaw!Q190)","v":""}]
[{"$f":"IF(MainRaw!A191=\"\", \"\", MainRaw!A191)","v":""},{"$f":"IF(MainRaw!B191=\"\", \"\", MainRaw!B191)","v":""},{"$f":"IF(MainRaw!E191=\"\", \"\", MainRaw!E191)","v":""},{"$f":"IF(MainRaw!H191=\"\", \"\", MainRaw!H191)","v":""},{"$f":"IF(MainRaw!J191=\"\", \"\", MainRaw!J191)","v":""},{"$f":"IF(MainRaw!K191=\"\", \"\", MainRaw!K191)","v":""},{"$f":"IF(MainRaw!L191=\"\", \"\", MainRaw!L191)","v":""},{"$f":"IF(MainRaw!M191=\"\", \"\", MainRaw!M191)","v":""},{"$f":"IF(MainRaw!R191=\"\", \"\", MainRaw!R191)","v":""},{"$f":"IF(MainRaw!S191=\"\", \"\", MainRaw!S191)","v":""}," -  - ",{"$f":"IF(MainRaw!L191=\"\", \"\", MainRaw!L191)","v":""},{"$f":"IF(MainRaw!M191=\"\", \"\", MainRaw!M191)","v":""},{"$f":"IF(MainRaw!N191=\"\", \"\", MainRaw!N191)","v":""},{"$f":"IF(MainRaw!O191=\"\", \"\", MainRaw!O191)","v":""},{"$f":"IF(MainRaw!P191=\"\", \"\", MainRaw!P191)","v":""},{"$f":"IF(MainRaw!Q191=\"\", \"\", MainRaw!Q191)","v":""}]
[{"$f":"IF(MainRaw!A192=\"\", \"\", MainRaw!A192)","v":""},{"$f":"IF(MainRaw!B192=\"\", \"\", MainRaw!B192)","v":""},{"$f":"IF(MainRaw!E192=\"\", \"\", MainRaw!E192)","v":""},{"$f":"IF(MainRaw!H192=\"\", \"\", MainRaw!H192)","v":""},{"$f":"IF(MainRaw!J192=\"\", \"\", MainRaw!J192)","v":""},{"$f":"IF(MainRaw!K192=\"\", \"\", MainRaw!K192)","v":""},{"$f":"IF(MainRaw!L192=\"\", \"\", MainRaw!L192)","v":""},{"$f":"IF(MainRaw!M192=\"\", \"\", MainRaw!M192)","v":""},{"$f":"IF(MainRaw!R192=\"\", \"\", MainRaw!R192)","v":""},{"$f":"IF(MainRaw!S192=\"\", \"\", MainRaw!S192)","v":""}," -  - ",{"$f":"IF(MainRaw!L192=\"\", \"\", MainRaw!L192)","v":""},{"$f":"IF(MainRaw!M192=\"\", \"\", MainRaw!M192)","v":""},{"$f":"IF(MainRaw!N192=\"\", \"\", MainRaw!N192)","v":""},{"$f":"IF(MainRaw!O192=\"\", \"\", MainRaw!O192)","v":""},{"$f":"IF(MainRaw!P192=\"\", \"\", MainRaw!P192)","v":""},{"$f":"IF(MainRaw!Q192=\"\", \"\", MainRaw!Q192)","v":""}]
[{"$f":"IF(MainRaw!A193=\"\", \"\", MainRaw!A193)","v":""},{"$f":"IF(MainRaw!B193=\"\", \"\", MainRaw!B193)","v":""},{"$f":"IF(MainRaw!E193=\"\", \"\", MainRaw!E193)","v":""},{"$f":"IF(MainRaw!H193=\"\", \"\", MainRaw!H193)","v":""},{"$f":"IF(MainRaw!J193=\"\", \"\", MainRaw!J193)","v":""},{"$f":"IF(MainRaw!K193=\"\", \"\", MainRaw!K193)","v":""},{"$f":"IF(MainRaw!L193=\"\", \"\", MainRaw!L193)","v":""},{"$f":"IF(MainRaw!M193=\"\", \"\", MainRaw!M193)","v":""},{"$f":"IF(MainRaw!R193=\"\", \"\", MainRaw!R193)","v":""},{"$f":"IF(MainRaw!S193=\"\", \"\", MainRaw!S193)","v":""}," -  - ",{"$f":"IF(MainRaw!L193=\"\", \"\", MainRaw!L193)","v":""},{"$f":"IF(MainRaw!M193=\"\", \"\", MainRaw!M193)","v":""},{"$f":"IF(MainRaw!N193=\"\", \"\", MainRaw!N193)","v":""},{"$f":"IF(MainRaw!O193=\"\", \"\", MainRaw!O193)","v":""},{"$f":"IF(MainRaw!P193=\"\", \"\", MainRaw!P193)","v":""},{"$f":"IF(MainRaw!Q193=\"\", \"\", MainRaw!Q193)","v":""}]
[{"$f":"IF(MainRaw!A194=\"\", \"\", MainRaw!A194)","v":""},{"$f":"IF(MainRaw!B194=\"\", \"\", MainRaw!B194)","v":""},{"$f":"IF(MainRaw!E194=\"\", \"\", MainRaw!E194)","v":""},{"$f":"IF(MainRaw!H194=\"\", \"\", MainRaw!H194)","v":""},{"$f":"IF(MainRaw!J194=\"\", \"\", MainRaw!J194)","v":""},{"$f":"IF(MainRaw!K194=\"\", \"\", MainRaw!K194)","v":""},{"$f":"IF(MainRaw!L194=\"\", \"\", MainRaw!L194)","v":""},{"$f":"IF(MainRaw!M194=\"\", \"\", MainRaw!M194)","v":""},{"$f":"IF(MainRaw!R194=\"\", \"\", MainRaw!R194)","v":""},{"$f":"IF(MainRaw!S194=\"\", \"\", MainRaw!S194)","v":""}," -  - ",{"$f":"IF(MainRaw!L194=\"\", \"\", MainRaw!L194)","v":""},{"$f":"IF(MainRaw!M194=\"\", \"\", MainRaw!M194)","v":""},{"$f":"IF(MainRaw!N194=\"\", \"\", MainRaw!N194)","v":""},{"$f":"IF(MainRaw!O194=\"\", \"\", MainRaw!O194)","v":""},{"$f":"IF(MainRaw!P194=\"\", \"\", MainRaw!P194)","v":""},{"$f":"IF(MainRaw!Q194=\"\", \"\", MainRaw!Q194)","v":""}]
[{"$f":"IF(MainRaw!A195=\"\", \"\", MainRaw!A195)","v":""},{"$f":"IF(MainRaw!B195=\"\", \"\", MainRaw!B195)","v":""},{"$f":"IF(MainRaw!E195=\"\", \"\", MainRaw!E195)","v":""},{"$f":"IF(MainRaw!H195=\"\", \"\", MainRaw!H195)","v":""},{"$f":"IF(MainRaw!J195=\"\", \"\", MainRaw!J195)","v":""},{"$f":"IF(MainRaw!K195=\"\", \"\", MainRaw!K195)","v":""},{"$f":"IF(MainRaw!L195=\"\", \"\", MainRaw!L195)","v":""},{"$f":"IF(MainRaw!M195=\"\", \"\", MainRaw!M195)","v":""},{"$f":"IF(MainRaw!R195=\"\", \"\", MainRaw!R195)","v":""},{"$f":"IF(MainRaw!S195=\"\", \"\", MainRaw!S195)","v":""}," -  - ",{"$f":"IF(MainRaw!L195=\"\", \"\", MainRaw!L195)","v":""},{"$f":"IF(MainRaw!M195=\"\", \"\", MainRaw!M195)","v":""},{"$f":"IF(MainRaw!N195=\"\", \"\", MainRaw!N195)","v":""},{"$f":"IF(MainRaw!O195=\"\", \"\", MainRaw!O195)","v":""},{"$f":"IF(MainRaw!P195=\"\", \"\", MainRaw!P195)","v":""},{"$f":"IF(MainRaw!Q195=\"\", \"\", MainRaw!Q195)","v":""}]
[{"$f":"IF(MainRaw!A196=\"\", \"\", MainRaw!A196)","v":""},{"$f":"IF(MainRaw!B196=\"\", \"\", MainRaw!B196)","v":""},{"$f":"IF(MainRaw!E196=\"\", \"\", MainRaw!E196)","v":""},{"$f":"IF(MainRaw!H196=\"\", \"\", MainRaw!H196)","v":""},{"$f":"IF(MainRaw!J196=\"\", \"\", MainRaw!J196)","v":""},{"$f":"IF(MainRaw!K196=\"\", \"\", MainRaw!K196)","v":""},{"$f":"IF(MainRaw!L196=\"\", \"\", MainRaw!L196)","v":""},{"$f":"IF(MainRaw!M196=\"\", \"\", MainRaw!M196)","v":""},{"$f":"IF(MainRaw!R196=\"\", \"\", MainRaw!R196)","v":""},{"$f":"IF(MainRaw!S196=\"\", \"\", MainRaw!S196)","v":""}," -  - ",{"$f":"IF(MainRaw!L196=\"\", \"\", MainRaw!L196)","v":""},{"$f":"IF(MainRaw!M196=\"\", \"\", MainRaw!M196)","v":""},{"$f":"IF(MainRaw!N196=\"\", \"\", MainRaw!N196)","v":""},{"$f":"IF(MainRaw!O196=\"\", \"\", MainRaw!O196)","v":""},{"$f":"IF(MainRaw!P196=\"\", \"\", MainRaw!P196)","v":""},{"$f":"IF(MainRaw!Q196=\"\", \"\", MainRaw!Q196)","v":""}]
[{"$f":"IF(MainRaw!A197=\"\", \"\", MainRaw!A197)","v":""},{"$f":"IF(MainRaw!B197=\"\", \"\", MainRaw!B197)","v":""},{"$f":"IF(MainRaw!E197=\"\", \"\", MainRaw!E197)","v":""},{"$f":"IF(MainRaw!H197=\"\", \"\", MainRaw!H197)","v":""},{"$f":"IF(MainRaw!J197=\"\", \"\", MainRaw!J197)","v":""},{"$f":"IF(MainRaw!K197=\"\", \"\", MainRaw!K197)","v":""},{"$f":"IF(MainRaw!L197=\"\", \"\", MainRaw!L197)","v":""},{"$f":"IF(MainRaw!M197=\"\", \"\", MainRaw!M197)","v":""},{"$f":"IF(MainRaw!R197=\"\", \"\", MainRaw!R197)","v":""},{"$f":"IF(MainRaw!S197=\"\", \"\", MainRaw!S197)","v":""}," -  - ",{"$f":"IF(MainRaw!L197=\"\", \"\", MainRaw!L197)","v":""},{"$f":"IF(MainRaw!M197=\"\", \"\", MainRaw!M197)","v":""},{"$f":"IF(MainRaw!N197=\"\", \"\", MainRaw!N197)","v":""},{"$f":"IF(MainRaw!O197=\"\", \"\", MainRaw!O197)","v":""},{"$f":"IF(MainRaw!P197=\"\", \"\", MainRaw!P197)","v":""},{"$f":"IF(MainRaw!Q197=\"\", \"\", MainRaw!Q197)","v":""}]
[{"$f":"IF(MainRaw!A198=\"\", \"\", MainRaw!A198)","v":""},{"$f":"IF(MainRaw!B198=\"\", \"\", MainRaw!B198)","v":""},{"$f":"IF(MainRaw!E198=\"\", \"\", MainRaw!E198)","v":""},{"$f":"IF(MainRaw!H198=\"\", \"\", MainRaw!H198)","v":""},{"$f":"IF(MainRaw!J198=\"\", \"\", MainRaw!J198)","v":""},{"$f":"IF(MainRaw!K198=\"\", \"\", MainRaw!K198)","v":""},{"$f":"IF(MainRaw!L198=\"\", \"\", MainRaw!L198)","v":""},{"$f":"IF(MainRaw!M198=\"\", \"\", MainRaw!M198)","v":""},{"$f":"IF(MainRaw!R198=\"\", \"\", MainRaw!R198)","v":""},{"$f":"IF(MainRaw!S198=\"\", \"\", MainRaw!S198)","v":""}," -  - ",{"$f":"IF(MainRaw!L198=\"\", \"\", MainRaw!L198)","v":""},{"$f":"IF(MainRaw!M198=\"\", \"\", MainRaw!M198)","v":""},{"$f":"IF(MainRaw!N198=\"\", \"\", MainRaw!N198)","v":""},{"$f":"IF(MainRaw!O198=\"\", \"\", MainRaw!O198)","v":""},{"$f":"IF(MainRaw!P198=\"\", \"\", MainRaw!P198)","v":""},{"$f":"IF(MainRaw!Q198=\"\", \"\", MainRaw!Q198)","v":""}]
[{"$f":"IF(MainRaw!A199=\"\", \"\", MainRaw!A199)","v":""},{"$f":"IF(MainRaw!B199=\"\", \"\", MainRaw!B199)","v":""},{"$f":"IF(MainRaw!E199=\"\", \"\", MainRaw!E199)","v":""},{"$f":"IF(MainRaw!H199=\"\", \"\", MainRaw!H199)","v":""},{"$f":"IF(MainRaw!J199=\"\", \"\", MainRaw!J199)","v":""},{"$f":"IF(MainRaw!K199=\"\", \"\", MainRaw!K199)","v":""},{"$f":"IF(MainRaw!L199=\"\", \"\", MainRaw!L199)","v":""},{"$f":"IF(MainRaw!M199=\"\", \"\", MainRaw!M199)","v":""},{"$f":"IF(MainRaw!R199=\"\", \"\", MainRaw!R199)","v":""},{"$f":"IF(MainRaw!S199=\"\", \"\", MainRaw!S199)","v":""}," -  - ",{"$f":"IF(MainRaw!L199=\"\", \"\", MainRaw!L199)","v":""},{"$f":"IF(MainRaw!M199=\"\", \"\", MainRaw!M199)","v":""},{"$f":"IF(MainRaw!N199=\"\", \"\", MainRaw!N199)","v":""},{"$f":"IF(MainRaw!O199=\"\", \"\", MainRaw!O199)","v":""},{"$f":"IF(MainRaw!P199=\"\", \"\", MainRaw!P199)","v":""},{"$f":"IF(MainRaw!Q199=\"\", \"\", MainRaw!Q199)","v":""}]
[{"$f":"IF(MainRaw!A200=\"\", \"\", MainRaw!A200)","v":""},{"$f":"IF(MainRaw!B200=\"\", \"\", MainRaw!B200)","v":""},{"$f":"IF(MainRaw!E200=\"\", \"\", MainRaw!E200)","v":""},{"$f":"IF(MainRaw!H200=\"\", \"\", MainRaw!H200)","v":""},{"$f":"IF(MainRaw!J200=\"\", \"\", MainRaw!J200)","v":""},{"$f":"IF(MainRaw!K200=\"\", \"\", MainRaw!K200)","v":""},{"$f":"IF(MainRaw!L200=\"\", \"\", MainRaw!L200)","v":""},{"$f":"IF(MainRaw!M200=\"\", \"\", MainRaw!M200)","v":""},{"$f":"IF(MainRaw!R200=\"\", \"\", MainRaw!R200)","v":""},{"$f":"IF(MainRaw!S200=\"\", \"\", MainRaw!S200)","v":""},{"$f":"A201 & \" - \" & B201 & \" - \" & I201","v":" -  - "},{"$f":"IF(MainRaw!L200=\"\", \"\", MainRaw!L200)","v":""},{"$f":"IF(MainRaw!M200=\"\", \"\", MainRaw!M200)","v":""},{"$f":"IF(MainRaw!N200=\"\", \"\", MainRaw!N200)","v":""},{"$f":"IF(MainRaw!O200=\"\", \"\", MainRaw!O200)","v":""},{"$f":"IF(MainRaw!P200=\"\", \"\", MainRaw!P200)","v":""},{"$f":"IF(MainRaw!Q200=\"\", \"\", MainRaw!Q200)","v":""}]
[{"$f":"IF(MainRaw!A201=\"\", \"\", MainRaw!A201)","v":""},{"$f":"IF(MainRaw!B201=\"\", \"\", MainRaw!B201)","v":""},{"$f":"IF(MainRaw!E201=\"\", \"\", MainRaw!E201)","v":""},{"$f":"IF(MainRaw!H201=\"\", \"\", MainRaw!H201)","v":""},{"$f":"IF(MainRaw!J201=\"\", \"\", MainRaw!J201)","v":""},{"$f":"IF(MainRaw!K201=\"\", \"\", MainRaw!K201)","v":""},{"$f":"IF(MainRaw!L201=\"\", \"\", MainRaw!L201)","v":""},{"$f":"IF(MainRaw!M201=\"\", \"\", MainRaw!M201)","v":""},{"$f":"IF(MainRaw!R201=\"\", \"\", MainRaw!R201)","v":""},{"$f":"IF(MainRaw!S201=\"\", \"\", MainRaw!S201)","v":""}," -  - ",{"$f":"IF(MainRaw!L201=\"\", \"\", MainRaw!L201)","v":""},{"$f":"IF(MainRaw!M201=\"\", \"\", MainRaw!M201)","v":""},{"$f":"IF(MainRaw!N201=\"\", \"\", MainRaw!N201)","v":""},{"$f":"IF(MainRaw!O201=\"\", \"\", MainRaw!O201)","v":""},{"$f":"IF(MainRaw!P201=\"\", \"\", MainRaw!P201)","v":""},{"$f":"IF(MainRaw!Q201=\"\", \"\", MainRaw!Q201)","v":""}]
[{"$f":"IF(MainRaw!A202=\"\", \"\", MainRaw!A202)","v":""},{"$f":"IF(MainRaw!B202=\"\", \"\", MainRaw!B202)","v":""},{"$f":"IF(MainRaw!E202=\"\", \"\", MainRaw!E202)","v":""},{"$f":"IF(MainRaw!H202=\"\", \"\", MainRaw!H202)","v":""},{"$f":"IF(MainRaw!J202=\"\", \"\", MainRaw!J202)","v":""},{"$f":"IF(MainRaw!K202=\"\", \"\", MainRaw!K202)","v":""},{"$f":"IF(MainRaw!L202=\"\", \"\", MainRaw!L202)","v":""},{"$f":"IF(MainRaw!M202=\"\", \"\", MainRaw!M202)","v":""},{"$f":"IF(MainRaw!R202=\"\", \"\", MainRaw!R202)","v":""},{"$f":"IF(MainRaw!S202=\"\", \"\", MainRaw!S202)","v":""}," -  - ",{"$f":"IF(MainRaw!L202=\"\", \"\", MainRaw!L202)","v":""},{"$f":"IF(MainRaw!M202=\"\", \"\", MainRaw!M202)","v":""},{"$f":"IF(MainRaw!N202=\"\", \"\", MainRaw!N202)","v":""},{"$f":"IF(MainRaw!O202=\"\", \"\", MainRaw!O202)","v":""},{"$f":"IF(MainRaw!P202=\"\", \"\", MainRaw!P202)","v":""},{"$f":"IF(MainRaw!Q202=\"\", \"\", MainRaw!Q202)","v":""}]
[{"$f":"IF(MainRaw!A203=\"\", \"\", MainRaw!A203)","v":""},{"$f":"IF(MainRaw!B203=\"\", \"\", MainRaw!B203)","v":""},{"$f":"IF(MainRaw!E203=\"\", \"\", MainRaw!E203)","v":""},{"$f":"IF(MainRaw!H203=\"\", \"\", MainRaw!H203)","v":""},{"$f":"IF(MainRaw!J203=\"\", \"\", MainRaw!J203)","v":""},{"$f":"IF(MainRaw!K203=\"\", \"\", MainRaw!K203)","v":""},{"$f":"IF(MainRaw!L203=\"\", \"\", MainRaw!L203)","v":""},{"$f":"IF(MainRaw!M203=\"\", \"\", MainRaw!M203)","v":""},{"$f":"IF(MainRaw!R203=\"\", \"\", MainRaw!R203)","v":""},{"$f":"IF(MainRaw!S203=\"\", \"\", MainRaw!S203)","v":""}," -  - ",{"$f":"IF(MainRaw!L203=\"\", \"\", MainRaw!L203)","v":""},{"$f":"IF(MainRaw!M203=\"\", \"\", MainRaw!M203)","v":""},{"$f":"IF(MainRaw!N203=\"\", \"\", MainRaw!N203)","v":""},{"$f":"IF(MainRaw!O203=\"\", \"\", MainRaw!O203)","v":""},{"$f":"IF(MainRaw!P203=\"\", \"\", MainRaw!P203)","v":""},{"$f":"IF(MainRaw!Q203=\"\", \"\", MainRaw!Q203)","v":""}]
[{"$f":"IF(MainRaw!A204=\"\", \"\", MainRaw!A204)","v":""},{"$f":"IF(MainRaw!B204=\"\", \"\", MainRaw!B204)","v":""},{"$f":"IF(MainRaw!E204=\"\", \"\", MainRaw!E204)","v":""},{"$f":"IF(MainRaw!H204=\"\", \"\", MainRaw!H204)","v":""},{"$f":"IF(MainRaw!J204=\"\", \"\", MainRaw!J204)","v":""},{"$f":"IF(MainRaw!K204=\"\", \"\", MainRaw!K204)","v":""},{"$f":"IF(MainRaw!L204=\"\", \"\", MainRaw!L204)","v":""},{"$f":"IF(MainRaw!M204=\"\", \"\", MainRaw!M204)","v":""},{"$f":"IF(MainRaw!R204=\"\", \"\", MainRaw!R204)","v":""},{"$f":"IF(MainRaw!S204=\"\", \"\", MainRaw!S204)","v":""}," -  - ",{"$f":"IF(MainRaw!L204=\"\", \"\", MainRaw!L204)","v":""},{"$f":"IF(MainRaw!M204=\"\", \"\", MainRaw!M204)","v":""},{"$f":"IF(MainRaw!N204=\"\", \"\", MainRaw!N204)","v":""},{"$f":"IF(MainRaw!O204=\"\", \"\", MainRaw!O204)","v":""},{"$f":"IF(MainRaw!P204=\"\", \"\", MainRaw!P204)","v":""},{"$f":"IF(MainRaw!Q204=\"\", \"\", MainRaw!Q204)","v":""}]
[{"$f":"IF(MainRaw!A205=\"\", \"\", MainRaw!A205)","v":""},{"$f":"IF(MainRaw!B205=\"\", \"\", MainRaw!B205)","v":""},{"$f":"IF(MainRaw!E205=\"\", \"\", MainRaw!E205)","v":""},{"$f":"IF(MainRaw!H205=\"\", \"\", MainRaw!H205)","v":""},{"$f":"IF(MainRaw!J205=\"\", \"\", MainRaw!J205)","v":""},{"$f":"IF(MainRaw!K205=\"\", \"\", MainRaw!K205)","v":""},{"$f":"IF(MainRaw!L205=\"\", \"\", MainRaw!L205)","v":""},{"$f":"IF(MainRaw!M205=\"\", \"\", MainRaw!M205)","v":""},{"$f":"IF(MainRaw!R205=\"\", \"\", MainRaw!R205)","v":""},{"$f":"IF(MainRaw!S205=\"\", \"\", MainRaw!S205)","v":""}," -  - ",{"$f":"IF(MainRaw!L205=\"\", \"\", MainRaw!L205)","v":""},{"$f":"IF(MainRaw!M205=\"\", \"\", MainRaw!M205)","v":""},{"$f":"IF(MainRaw!N205=\"\", \"\", MainRaw!N205)","v":""},{"$f":"IF(MainRaw!O205=\"\", \"\", MainRaw!O205)","v":""},{"$f":"IF(MainRaw!P205=\"\", \"\", MainRaw!P205)","v":""},{"$f":"IF(MainRaw!Q205=\"\", \"\", MainRaw!Q205)","v":""}]
[{"$f":"IF(MainRaw!A206=\"\", \"\", MainRaw!A206)","v":""},{"$f":"IF(MainRaw!B206=\"\", \"\", MainRaw!B206)","v":""},{"$f":"IF(MainRaw!E206=\"\", \"\", MainRaw!E206)","v":""},{"$f":"IF(MainRaw!H206=\"\", \"\", MainRaw!H206)","v":""},{"$f":"IF(MainRaw!J206=\"\", \"\", MainRaw!J206)","v":""},{"$f":"IF(MainRaw!K206=\"\", \"\", MainRaw!K206)","v":""},{"$f":"IF(MainRaw!L206=\"\", \"\", MainRaw!L206)","v":""},{"$f":"IF(MainRaw!M206=\"\", \"\", MainRaw!M206)","v":""},{"$f":"IF(MainRaw!R206=\"\", \"\", MainRaw!R206)","v":""},{"$f":"IF(MainRaw!S206=\"\", \"\", MainRaw!S206)","v":""}," -  - ",{"$f":"IF(MainRaw!L206=\"\", \"\", MainRaw!L206)","v":""},{"$f":"IF(MainRaw!M206=\"\", \"\", MainRaw!M206)","v":""},{"$f":"IF(MainRaw!N206=\"\", \"\", MainRaw!N206)","v":""},{"$f":"IF(MainRaw!O206=\"\", \"\", MainRaw!O206)","v":""},{"$f":"IF(MainRaw!P206=\"\", \"\", MainRaw!P206)","v":""},{"$f":"IF(MainRaw!Q206=\"\", \"\", MainRaw!Q206)","v":""}]
[{"$f":"IF(MainRaw!A207=\"\", \"\", MainRaw!A207)","v":""},{"$f":"IF(MainRaw!B207=\"\", \"\", MainRaw!B207)","v":""},{"$f":"IF(MainRaw!E207=\"\", \"\", MainRaw!E207)","v":""},{"$f":"IF(MainRaw!H207=\"\", \"\", MainRaw!H207)","v":""},{"$f":"IF(MainRaw!J207=\"\", \"\", MainRaw!J207)","v":""},{"$f":"IF(MainRaw!K207=\"\", \"\", MainRaw!K207)","v":""},{"$f":"IF(MainRaw!L207=\"\", \"\", MainRaw!L207)","v":""},{"$f":"IF(MainRaw!M207=\"\", \"\", MainRaw!M207)","v":""},{"$f":"IF(MainRaw!R207=\"\", \"\", MainRaw!R207)","v":""},{"$f":"IF(MainRaw!S207=\"\", \"\", MainRaw!S207)","v":""}," -  - ",{"$f":"IF(MainRaw!L207=\"\", \"\", MainRaw!L207)","v":""},{"$f":"IF(MainRaw!M207=\"\", \"\", MainRaw!M207)","v":""},{"$f":"IF(MainRaw!N207=\"\", \"\", MainRaw!N207)","v":""},{"$f":"IF(MainRaw!O207=\"\", \"\", MainRaw!O207)","v":""},{"$f":"IF(MainRaw!P207=\"\", \"\", MainRaw!P207)","v":""},{"$f":"IF(MainRaw!Q207=\"\", \"\", MainRaw!Q207)","v":""}]
[{"$f":"IF(MainRaw!A208=\"\", \"\", MainRaw!A208)","v":""},{"$f":"IF(MainRaw!B208=\"\", \"\", MainRaw!B208)","v":""},{"$f":"IF(MainRaw!E208=\"\", \"\", MainRaw!E208)","v":""},{"$f":"IF(MainRaw!H208=\"\", \"\", MainRaw!H208)","v":""},{"$f":"IF(MainRaw!J208=\"\", \"\", MainRaw!J208)","v":""},{"$f":"IF(MainRaw!K208=\"\", \"\", MainRaw!K208)","v":""},{"$f":"IF(MainRaw!L208=\"\", \"\", MainRaw!L208)","v":""},{"$f":"IF(MainRaw!M208=\"\", \"\", MainRaw!M208)","v":""},{"$f":"IF(MainRaw!R208=\"\", \"\", MainRaw!R208)","v":""},{"$f":"IF(MainRaw!S208=\"\", \"\", MainRaw!S208)","v":""}," -  - ",{"$f":"IF(MainRaw!L208=\"\", \"\", MainRaw!L208)","v":""},{"$f":"IF(MainRaw!M208=\"\", \"\", MainRaw!M208)","v":""},{"$f":"IF(MainRaw!N208=\"\", \"\", MainRaw!N208)","v":""},{"$f":"IF(MainRaw!O208=\"\", \"\", MainRaw!O208)","v":""},{"$f":"IF(MainRaw!P208=\"\", \"\", MainRaw!P208)","v":""},{"$f":"IF(MainRaw!Q208=\"\", \"\", MainRaw!Q208)","v":""}]
[{"$f":"IF(MainRaw!A209=\"\", \"\", MainRaw!A209)","v":""},{"$f":"IF(MainRaw!B209=\"\", \"\", MainRaw!B209)","v":""},{"$f":"IF(MainRaw!E209=\"\", \"\", MainRaw!E209)","v":""},{"$f":"IF(MainRaw!H209=\"\", \"\", MainRaw!H209)","v":""},{"$f":"IF(MainRaw!J209=\"\", \"\", MainRaw!J209)","v":""},{"$f":"IF(MainRaw!K209=\"\", \"\", MainRaw!K209)","v":""},{"$f":"IF(MainRaw!L209=\"\", \"\", MainRaw!L209)","v":""},{"$f":"IF(MainRaw!M209=\"\", \"\", MainRaw!M209)","v":""},{"$f":"IF(MainRaw!R209=\"\", \"\", MainRaw!R209)","v":""},{"$f":"IF(MainRaw!S209=\"\", \"\", MainRaw!S209)","v":""}," -  - ",{"$f":"IF(MainRaw!L209=\"\", \"\", MainRaw!L209)","v":""},{"$f":"IF(MainRaw!M209=\"\", \"\", MainRaw!M209)","v":""},{"$f":"IF(MainRaw!N209=\"\", \"\", MainRaw!N209)","v":""},{"$f":"IF(MainRaw!O209=\"\", \"\", MainRaw!O209)","v":""},{"$f":"IF(MainRaw!P209=\"\", \"\", MainRaw!P209)","v":""},{"$f":"IF(MainRaw!Q209=\"\", \"\", MainRaw!Q209)","v":""}]
[{"$f":"IF(MainRaw!A210=\"\", \"\", MainRaw!A210)","v":""},{"$f":"IF(MainRaw!B210=\"\", \"\", MainRaw!B210)","v":""},{"$f":"IF(MainRaw!E210=\"\", \"\", MainRaw!E210)","v":""},{"$f":"IF(MainRaw!H210=\"\", \"\", MainRaw!H210)","v":""},{"$f":"IF(MainRaw!J210=\"\", \"\", MainRaw!J210)","v":""},{"$f":"IF(MainRaw!K210=\"\", \"\", MainRaw!K210)","v":""},{"$f":"IF(MainRaw!L210=\"\", \"\", MainRaw!L210)","v":""},{"$f":"IF(MainRaw!M210=\"\", \"\", MainRaw!M210)","v":""},{"$f":"IF(MainRaw!R210=\"\", \"\", MainRaw!R210)","v":""},{"$f":"IF(MainRaw!S210=\"\", \"\", MainRaw!S210)","v":""}," -  - ",{"$f":"IF(MainRaw!L210=\"\", \"\", MainRaw!L210)","v":""},{"$f":"IF(MainRaw!M210=\"\", \"\", MainRaw!M210)","v":""},{"$f":"IF(MainRaw!N210=\"\", \"\", MainRaw!N210)","v":""},{"$f":"IF(MainRaw!O210=\"\", \"\", MainRaw!O210)","v":""},{"$f":"IF(MainRaw!P210=\"\", \"\", MainRaw!P210)","v":""},{"$f":"IF(MainRaw!Q210=\"\", \"\", MainRaw!Q210)","v":""}]
[{"$f":"IF(MainRaw!A211=\"\", \"\", MainRaw!A211)","v":""},{"$f":"IF(MainRaw!B211=\"\", \"\", MainRaw!B211)","v":""},{"$f":"IF(MainRaw!E211=\"\", \"\", MainRaw!E211)","v":""},{"$f":"IF(MainRaw!H211=\"\", \"\", MainRaw!H211)","v":""},{"$f":"IF(MainRaw!J211=\"\", \"\", MainRaw!J211)","v":""},{"$f":"IF(MainRaw!K211=\"\", \"\", MainRaw!K211)","v":""},{"$f":"IF(MainRaw!L211=\"\", \"\", MainRaw!L211)","v":""},{"$f":"IF(MainRaw!M211=\"\", \"\", MainRaw!M211)","v":""},{"$f":"IF(MainRaw!R211=\"\", \"\", MainRaw!R211)","v":""},{"$f":"IF(MainRaw!S211=\"\", \"\", MainRaw!S211)","v":""}," -  - ",{"$f":"IF(MainRaw!L211=\"\", \"\", MainRaw!L211)","v":""},{"$f":"IF(MainRaw!M211=\"\", \"\", MainRaw!M211)","v":""},{"$f":"IF(MainRaw!N211=\"\", \"\", MainRaw!N211)","v":""},{"$f":"IF(MainRaw!O211=\"\", \"\", MainRaw!O211)","v":""},{"$f":"IF(MainRaw!P211=\"\", \"\", MainRaw!P211)","v":""},{"$f":"IF(MainRaw!Q211=\"\", \"\", MainRaw!Q211)","v":""}]
[{"$f":"IF(MainRaw!A212=\"\", \"\", MainRaw!A212)","v":""},{"$f":"IF(MainRaw!B212=\"\", \"\", MainRaw!B212)","v":""},{"$f":"IF(MainRaw!E212=\"\", \"\", MainRaw!E212)","v":""},{"$f":"IF(MainRaw!H212=\"\", \"\", MainRaw!H212)","v":""},{"$f":"IF(MainRaw!J212=\"\", \"\", MainRaw!J212)","v":""},{"$f":"IF(MainRaw!K212=\"\", \"\", MainRaw!K212)","v":""},{"$f":"IF(MainRaw!L212=\"\", \"\", MainRaw!L212)","v":""},{"$f":"IF(MainRaw!M212=\"\", \"\", MainRaw!M212)","v":""},{"$f":"IF(MainRaw!R212=\"\", \"\", MainRaw!R212)","v":""},{"$f":"IF(MainRaw!S212=\"\", \"\", MainRaw!S212)","v":""}," -  - ",{"$f":"IF(MainRaw!L212=\"\", \"\", MainRaw!L212)","v":""},{"$f":"IF(MainRaw!M212=\"\", \"\", MainRaw!M212)","v":""},{"$f":"IF(MainRaw!N212=\"\", \"\", MainRaw!N212)","v":""},{"$f":"IF(MainRaw!O212=\"\", \"\", MainRaw!O212)","v":""},{"$f":"IF(MainRaw!P212=\"\", \"\", MainRaw!P212)","v":""},{"$f":"IF(MainRaw!Q212=\"\", \"\", MainRaw!Q212)","v":""}]
[{"$f":"IF(MainRaw!A213=\"\", \"\", MainRaw!A213)","v":""},{"$f":"IF(MainRaw!B213=\"\", \"\", MainRaw!B213)","v":""},{"$f":"IF(MainRaw!E213=\"\", \"\", MainRaw!E213)","v":""},{"$f":"IF(MainRaw!H213=\"\", \"\", MainRaw!H213)","v":""},{"$f":"IF(MainRaw!J213=\"\", \"\", MainRaw!J213)","v":""},{"$f":"IF(MainRaw!K213=\"\", \"\", MainRaw!K213)","v":""},{"$f":"IF(MainRaw!L213=\"\", \"\", MainRaw!L213)","v":""},{"$f":"IF(MainRaw!M213=\"\", \"\", MainRaw!M213)","v":""},{"$f":"IF(MainRaw!R213=\"\", \"\", MainRaw!R213)","v":""},{"$f":"IF(MainRaw!S213=\"\", \"\", MainRaw!S213)","v":""}," -  - ",{"$f":"IF(MainRaw!L213=\"\", \"\", MainRaw!L213)","v":""},{"$f":"IF(MainRaw!M213=\"\", \"\", MainRaw!M213)","v":""},{"$f":"IF(MainRaw!N213=\"\", \"\", MainRaw!N213)","v":""},{"$f":"IF(MainRaw!O213=\"\", \"\", MainRaw!O213)","v":""},{"$f":"IF(MainRaw!P213=\"\", \"\", MainRaw!P213)","v":""},{"$f":"IF(MainRaw!Q213=\"\", \"\", MainRaw!Q213)","v":""}]
[{"$f":"IF(MainRaw!A214=\"\", \"\", MainRaw!A214)","v":""},{"$f":"IF(MainRaw!B214=\"\", \"\", MainRaw!B214)","v":""},{"$f":"IF(MainRaw!E214=\"\", \"\", MainRaw!E214)","v":""},{"$f":"IF(MainRaw!H214=\"\", \"\", MainRaw!H214)","v":""},{"$f":"IF(MainRaw!J214=\"\", \"\", MainRaw!J214)","v":""},{"$f":"IF(MainRaw!K214=\"\", \"\", MainRaw!K214)","v":""},{"$f":"IF(MainRaw!L214=\"\", \"\", MainRaw!L214)","v":""},{"$f":"IF(MainRaw!M214=\"\", \"\", MainRaw!M214)","v":""},{"$f":"IF(MainRaw!R214=\"\", \"\", MainRaw!R214)","v":""},{"$f":"IF(MainRaw!S214=\"\", \"\", MainRaw!S214)","v":""}," -  - ",{"$f":"IF(MainRaw!L214=\"\", \"\", MainRaw!L214)","v":""},{"$f":"IF(MainRaw!M214=\"\", \"\", MainRaw!M214)","v":""},{"$f":"IF(MainRaw!N214=\"\", \"\", MainRaw!N214)","v":""},{"$f":"IF(MainRaw!O214=\"\", \"\", MainRaw!O214)","v":""},{"$f":"IF(MainRaw!P214=\"\", \"\", MainRaw!P214)","v":""},{"$f":"IF(MainRaw!Q214=\"\", \"\", MainRaw!Q214)","v":""}]
[{"$f":"IF(MainRaw!A215=\"\", \"\", MainRaw!A215)","v":""},{"$f":"IF(MainRaw!B215=\"\", \"\", MainRaw!B215)","v":""},{"$f":"IF(MainRaw!E215=\"\", \"\", MainRaw!E215)","v":""},{"$f":"IF(MainRaw!H215=\"\", \"\", MainRaw!H215)","v":""},{"$f":"IF(MainRaw!J215=\"\", \"\", MainRaw!J215)","v":""},{"$f":"IF(MainRaw!K215=\"\", \"\", MainRaw!K215)","v":""},{"$f":"IF(MainRaw!L215=\"\", \"\", MainRaw!L215)","v":""},{"$f":"IF(MainRaw!M215=\"\", \"\", MainRaw!M215)","v":""},{"$f":"IF(MainRaw!R215=\"\", \"\", MainRaw!R215)","v":""},{"$f":"IF(MainRaw!S215=\"\", \"\", MainRaw!S215)","v":""}," -  - ",{"$f":"IF(MainRaw!L215=\"\", \"\", MainRaw!L215)","v":""},{"$f":"IF(MainRaw!M215=\"\", \"\", MainRaw!M215)","v":""},{"$f":"IF(MainRaw!N215=\"\", \"\", MainRaw!N215)","v":""},{"$f":"IF(MainRaw!O215=\"\", \"\", MainRaw!O215)","v":""},{"$f":"IF(MainRaw!P215=\"\", \"\", MainRaw!P215)","v":""},{"$f":"IF(MainRaw!Q215=\"\", \"\", MainRaw!Q215)","v":""}]
[{"$f":"IF(MainRaw!A216=\"\", \"\", MainRaw!A216)","v":""},{"$f":"IF(MainRaw!B216=\"\", \"\", MainRaw!B216)","v":""},{"$f":"IF(MainRaw!E216=\"\", \"\", MainRaw!E216)","v":""},{"$f":"IF(MainRaw!H216=\"\", \"\", MainRaw!H216)","v":""},{"$f":"IF(MainRaw!J216=\"\", \"\", MainRaw!J216)","v":""},{"$f":"IF(MainRaw!K216=\"\", \"\", MainRaw!K216)","v":""},{"$f":"IF(MainRaw!L216=\"\", \"\", MainRaw!L216)","v":""},{"$f":"IF(MainRaw!M216=\"\", \"\", MainRaw!M216)","v":""},{"$f":"IF(MainRaw!R216=\"\", \"\", MainRaw!R216)","v":""},{"$f":"IF(MainRaw!S216=\"\", \"\", MainRaw!S216)","v":""}," -  - ",{"$f":"IF(MainRaw!L216=\"\", \"\", MainRaw!L216)","v":""},{"$f":"IF(MainRaw!M216=\"\", \"\", MainRaw!M216)","v":""},{"$f":"IF(MainRaw!N216=\"\", \"\", MainRaw!N216)","v":""},{"$f":"IF(MainRaw!O216=\"\", \"\", MainRaw!O216)","v":""},{"$f":"IF(MainRaw!P216=\"\", \"\", MainRaw!P216)","v":""},{"$f":"IF(MainRaw!Q216=\"\", \"\", MainRaw!Q216)","v":""}]
[{"$f":"IF(MainRaw!A217=\"\", \"\", MainRaw!A217)","v":""},{"$f":"IF(MainRaw!B217=\"\", \"\", MainRaw!B217)","v":""},{"$f":"IF(MainRaw!E217=\"\", \"\", MainRaw!E217)","v":""},{"$f":"IF(MainRaw!H217=\"\", \"\", MainRaw!H217)","v":""},{"$f":"IF(MainRaw!J217=\"\", \"\", MainRaw!J217)","v":""},{"$f":"IF(MainRaw!K217=\"\", \"\", MainRaw!K217)","v":""},{"$f":"IF(MainRaw!L217=\"\", \"\", MainRaw!L217)","v":""},{"$f":"IF(MainRaw!M217=\"\", \"\", MainRaw!M217)","v":""},{"$f":"IF(MainRaw!R217=\"\", \"\", MainRaw!R217)","v":""},{"$f":"IF(MainRaw!S217=\"\", \"\", MainRaw!S217)","v":""}," -  - ",{"$f":"IF(MainRaw!L217=\"\", \"\", MainRaw!L217)","v":""},{"$f":"IF(MainRaw!M217=\"\", \"\", MainRaw!M217)","v":""},{"$f":"IF(MainRaw!N217=\"\", \"\", MainRaw!N217)","v":""},{"$f":"IF(MainRaw!O217=\"\", \"\", MainRaw!O217)","v":""},{"$f":"IF(MainRaw!P217=\"\", \"\", MainRaw!P217)","v":""},{"$f":"IF(MainRaw!Q217=\"\", \"\", MainRaw!Q217)","v":""}]
[{"$f":"IF(MainRaw!A218=\"\", \"\", MainRaw!A218)","v":""},{"$f":"IF(MainRaw!B218=\"\", \"\", MainRaw!B218)","v":""},{"$f":"IF(MainRaw!E218=\"\", \"\", MainRaw!E218)","v":""},{"$f":"IF(MainRaw!H218=\"\", \"\", MainRaw!H218)","v":""},{"$f":"IF(MainRaw!J218=\"\", \"\", MainRaw!J218)","v":""},{"$f":"IF(MainRaw!K218=\"\", \"\", MainRaw!K218)","v":""},{"$f":"IF(MainRaw!L218=\"\", \"\", MainRaw!L218)","v":""},{"$f":"IF(MainRaw!M218=\"\", \"\", MainRaw!M218)","v":""},{"$f":"IF(MainRaw!R218=\"\", \"\", MainRaw!R218)","v":""},{"$f":"IF(MainRaw!S218=\"\", \"\", MainRaw!S218)","v":""}," -  - ",{"$f":"IF(MainRaw!L218=\"\", \"\", MainRaw!L218)","v":""},{"$f":"IF(MainRaw!M218=\"\", \"\", MainRaw!M218)","v":""},{"$f":"IF(MainRaw!N218=\"\", \"\", MainRaw!N218)","v":""},{"$f":"IF(MainRaw!O218=\"\", \"\", MainRaw!O218)","v":""},{"$f":"IF(MainRaw!P218=\"\", \"\", MainRaw!P218)","v":""},{"$f":"IF(MainRaw!Q218=\"\", \"\", MainRaw!Q218)","v":""}]
[{"$f":"IF(MainRaw!A219=\"\", \"\", MainRaw!A219)","v":""},{"$f":"IF(MainRaw!B219=\"\", \"\", MainRaw!B219)","v":""},{"$f":"IF(MainRaw!E219=\"\", \"\", MainRaw!E219)","v":""},{"$f":"IF(MainRaw!H219=\"\", \"\", MainRaw!H219)","v":""},{"$f":"IF(MainRaw!J219=\"\", \"\", MainRaw!J219)","v":""},{"$f":"IF(MainRaw!K219=\"\", \"\", MainRaw!K219)","v":""},{"$f":"IF(MainRaw!L219=\"\", \"\", MainRaw!L219)","v":""},{"$f":"IF(MainRaw!M219=\"\", \"\", MainRaw!M219)","v":""},{"$f":"IF(MainRaw!R219=\"\", \"\", MainRaw!R219)","v":""},{"$f":"IF(MainRaw!S219=\"\", \"\", MainRaw!S219)","v":""}," -  - ",{"$f":"IF(MainRaw!L219=\"\", \"\", MainRaw!L219)","v":""},{"$f":"IF(MainRaw!M219=\"\", \"\", MainRaw!M219)","v":""},{"$f":"IF(MainRaw!N219=\"\", \"\", MainRaw!N219)","v":""},{"$f":"IF(MainRaw!O219=\"\", \"\", MainRaw!O219)","v":""},{"$f":"IF(MainRaw!P219=\"\", \"\", MainRaw!P219)","v":""},{"$f":"IF(MainRaw!Q219=\"\", \"\", MainRaw!Q219)","v":""}]
[{"$f":"IF(MainRaw!A220=\"\", \"\", MainRaw!A220)","v":""},{"$f":"IF(MainRaw!B220=\"\", \"\", MainRaw!B220)","v":""},{"$f":"IF(MainRaw!E220=\"\", \"\", MainRaw!E220)","v":""},{"$f":"IF(MainRaw!H220=\"\", \"\", MainRaw!H220)","v":""},{"$f":"IF(MainRaw!J220=\"\", \"\", MainRaw!J220)","v":""},{"$f":"IF(MainRaw!K220=\"\", \"\", MainRaw!K220)","v":""},{"$f":"IF(MainRaw!L220=\"\", \"\", MainRaw!L220)","v":""},{"$f":"IF(MainRaw!M220=\"\", \"\", MainRaw!M220)","v":""},{"$f":"IF(MainRaw!R220=\"\", \"\", MainRaw!R220)","v":""},{"$f":"IF(MainRaw!S220=\"\", \"\", MainRaw!S220)","v":""}," -  - ",{"$f":"IF(MainRaw!L220=\"\", \"\", MainRaw!L220)","v":""},{"$f":"IF(MainRaw!M220=\"\", \"\", MainRaw!M220)","v":""},{"$f":"IF(MainRaw!N220=\"\", \"\", MainRaw!N220)","v":""},{"$f":"IF(MainRaw!O220=\"\", \"\", MainRaw!O220)","v":""},{"$f":"IF(MainRaw!P220=\"\", \"\", MainRaw!P220)","v":""},{"$f":"IF(MainRaw!Q220=\"\", \"\", MainRaw!Q220)","v":""}]
[{"$f":"IF(MainRaw!A221=\"\", \"\", MainRaw!A221)","v":""},{"$f":"IF(MainRaw!B221=\"\", \"\", MainRaw!B221)","v":""},{"$f":"IF(MainRaw!E221=\"\", \"\", MainRaw!E221)","v":""},{"$f":"IF(MainRaw!H221=\"\", \"\", MainRaw!H221)","v":""},{"$f":"IF(MainRaw!J221=\"\", \"\", MainRaw!J221)","v":""},{"$f":"IF(MainRaw!K221=\"\", \"\", MainRaw!K221)","v":""},{"$f":"IF(MainRaw!L221=\"\", \"\", MainRaw!L221)","v":""},{"$f":"IF(MainRaw!M221=\"\", \"\", MainRaw!M221)","v":""},{"$f":"IF(MainRaw!R221=\"\", \"\", MainRaw!R221)","v":""},{"$f":"IF(MainRaw!S221=\"\", \"\", MainRaw!S221)","v":""}," -  - ",{"$f":"IF(MainRaw!L221=\"\", \"\", MainRaw!L221)","v":""},{"$f":"IF(MainRaw!M221=\"\", \"\", MainRaw!M221)","v":""},{"$f":"IF(MainRaw!N221=\"\", \"\", MainRaw!N221)","v":""},{"$f":"IF(MainRaw!O221=\"\", \"\", MainRaw!O221)","v":""},{"$f":"IF(MainRaw!P221=\"\", \"\", MainRaw!P221)","v":""},{"$f":"IF(MainRaw!Q221=\"\", \"\", MainRaw!Q221)","v":""}]
[{"$f":"IF(MainRaw!A222=\"\", \"\", MainRaw!A222)","v":""},{"$f":"IF(MainRaw!B222=\"\", \"\", MainRaw!B222)","v":""},{"$f":"IF(MainRaw!E222=\"\", \"\", MainRaw!E222)","v":""},{"$f":"IF(MainRaw!H222=\"\", \"\", MainRaw!H222)","v":""},{"$f":"IF(MainRaw!J222=\"\", \"\", MainRaw!J222)","v":""},{"$f":"IF(MainRaw!K222=\"\", \"\", MainRaw!K222)","v":""},{"$f":"IF(MainRaw!L222=\"\", \"\", MainRaw!L222)","v":""},{"$f":"IF(MainRaw!M222=\"\", \"\", MainRaw!M222)","v":""},{"$f":"IF(MainRaw!R222=\"\", \"\", MainRaw!R222)","v":""},{"$f":"IF(MainRaw!S222=\"\", \"\", MainRaw!S222)","v":""}," -  - ",{"$f":"IF(MainRaw!L222=\"\", \"\", MainRaw!L222)","v":""},{"$f":"IF(MainRaw!M222=\"\", \"\", MainRaw!M222)","v":""},{"$f":"IF(MainRaw!N222=\"\", \"\", MainRaw!N222)","v":""},{"$f":"IF(MainRaw!O222=\"\", \"\", MainRaw!O222)","v":""},{"$f":"IF(MainRaw!P222=\"\", \"\", MainRaw!P222)","v":""},{"$f":"IF(MainRaw!Q222=\"\", \"\", MainRaw!Q222)","v":""}]
[{"$f":"IF(MainRaw!A223=\"\", \"\", MainRaw!A223)","v":""},{"$f":"IF(MainRaw!B223=\"\", \"\", MainRaw!B223)","v":""},{"$f":"IF(MainRaw!E223=\"\", \"\", MainRaw!E223)","v":""},{"$f":"IF(MainRaw!H223=\"\", \"\", MainRaw!H223)","v":""},{"$f":"IF(MainRaw!J223=\"\", \"\", MainRaw!J223)","v":""},{"$f":"IF(MainRaw!K223=\"\", \"\", MainRaw!K223)","v":""},{"$f":"IF(MainRaw!L223=\"\", \"\", MainRaw!L223)","v":""},{"$f":"IF(MainRaw!M223=\"\", \"\", MainRaw!M223)","v":""},{"$f":"IF(MainRaw!R223=\"\", \"\", MainRaw!R223)","v":""},{"$f":"IF(MainRaw!S223=\"\", \"\", MainRaw!S223)","v":""}," -  - ",{"$f":"IF(MainRaw!L223=\"\", \"\", MainRaw!L223)","v":""},{"$f":"IF(MainRaw!M223=\"\", \"\", MainRaw!M223)","v":""},{"$f":"IF(MainRaw!N223=\"\", \"\", MainRaw!N223)","v":""},{"$f":"IF(MainRaw!O223=\"\", \"\", MainRaw!O223)","v":""},{"$f":"IF(MainRaw!P223=\"\", \"\", MainRaw!P223)","v":""},{"$f":"IF(MainRaw!Q223=\"\", \"\", MainRaw!Q223)","v":""}]
[{"$f":"IF(MainRaw!A224=\"\", \"\", MainRaw!A224)","v":""},{"$f":"IF(MainRaw!B224=\"\", \"\", MainRaw!B224)","v":""},{"$f":"IF(MainRaw!E224=\"\", \"\", MainRaw!E224)","v":""},{"$f":"IF(MainRaw!H224=\"\", \"\", MainRaw!H224)","v":""},{"$f":"IF(MainRaw!J224=\"\", \"\", MainRaw!J224)","v":""},{"$f":"IF(MainRaw!K224=\"\", \"\", MainRaw!K224)","v":""},{"$f":"IF(MainRaw!L224=\"\", \"\", MainRaw!L224)","v":""},{"$f":"IF(MainRaw!M224=\"\", \"\", MainRaw!M224)","v":""},{"$f":"IF(MainRaw!R224=\"\", \"\", MainRaw!R224)","v":""},{"$f":"IF(MainRaw!S224=\"\", \"\", MainRaw!S224)","v":""}," -  - ",{"$f":"IF(MainRaw!L224=\"\", \"\", MainRaw!L224)","v":""},{"$f":"IF(MainRaw!M224=\"\", \"\", MainRaw!M224)","v":""},{"$f":"IF(MainRaw!N224=\"\", \"\", MainRaw!N224)","v":""},{"$f":"IF(MainRaw!O224=\"\", \"\", MainRaw!O224)","v":""},{"$f":"IF(MainRaw!P224=\"\", \"\", MainRaw!P224)","v":""},{"$f":"IF(MainRaw!Q224=\"\", \"\", MainRaw!Q224)","v":""}]
[{"$f":"IF(MainRaw!A225=\"\", \"\", MainRaw!A225)","v":""},{"$f":"IF(MainRaw!B225=\"\", \"\", MainRaw!B225)","v":""},{"$f":"IF(MainRaw!E225=\"\", \"\", MainRaw!E225)","v":""},{"$f":"IF(MainRaw!H225=\"\", \"\", MainRaw!H225)","v":""},{"$f":"IF(MainRaw!J225=\"\", \"\", MainRaw!J225)","v":""},{"$f":"IF(MainRaw!K225=\"\", \"\", MainRaw!K225)","v":""},{"$f":"IF(MainRaw!L225=\"\", \"\", MainRaw!L225)","v":""},{"$f":"IF(MainRaw!M225=\"\", \"\", MainRaw!M225)","v":""},{"$f":"IF(MainRaw!R225=\"\", \"\", MainRaw!R225)","v":""},{"$f":"IF(MainRaw!S225=\"\", \"\", MainRaw!S225)","v":""}," -  - ",{"$f":"IF(MainRaw!L225=\"\", \"\", MainRaw!L225)","v":""},{"$f":"IF(MainRaw!M225=\"\", \"\", MainRaw!M225)","v":""},{"$f":"IF(MainRaw!N225=\"\", \"\", MainRaw!N225)","v":""},{"$f":"IF(MainRaw!O225=\"\", \"\", MainRaw!O225)","v":""},{"$f":"IF(MainRaw!P225=\"\", \"\", MainRaw!P225)","v":""},{"$f":"IF(MainRaw!Q225=\"\", \"\", MainRaw!Q225)","v":""}]
[{"$f":"IF(MainRaw!A226=\"\", \"\", MainRaw!A226)","v":""},{"$f":"IF(MainRaw!B226=\"\", \"\", MainRaw!B226)","v":""},{"$f":"IF(MainRaw!E226=\"\", \"\", MainRaw!E226)","v":""},{"$f":"IF(MainRaw!H226=\"\", \"\", MainRaw!H226)","v":""},{"$f":"IF(MainRaw!J226=\"\", \"\", MainRaw!J226)","v":""},{"$f":"IF(MainRaw!K226=\"\", \"\", MainRaw!K226)","v":""},{"$f":"IF(MainRaw!L226=\"\", \"\", MainRaw!L226)","v":""},{"$f":"IF(MainRaw!M226=\"\", \"\", MainRaw!M226)","v":""},{"$f":"IF(MainRaw!R226=\"\", \"\", MainRaw!R226)","v":""},{"$f":"IF(MainRaw!S226=\"\", \"\", MainRaw!S226)","v":""}," -  - ",{"$f":"IF(MainRaw!L226=\"\", \"\", MainRaw!L226)","v":""},{"$f":"IF(MainRaw!M226=\"\", \"\", MainRaw!M226)","v":""},{"$f":"IF(MainRaw!N226=\"\", \"\", MainRaw!N226)","v":""},{"$f":"IF(MainRaw!O226=\"\", \"\", MainRaw!O226)","v":""},{"$f":"IF(MainRaw!P226=\"\", \"\", MainRaw!P226)","v":""},{"$f":"IF(MainRaw!Q226=\"\", \"\", MainRaw!Q226)","v":""}]
[{"$f":"IF(MainRaw!A227=\"\", \"\", MainRaw!A227)","v":""},{"$f":"IF(MainRaw!B227=\"\", \"\", MainRaw!B227)","v":""},{"$f":"IF(MainRaw!E227=\"\", \"\", MainRaw!E227)","v":""},{"$f":"IF(MainRaw!H227=\"\", \"\", MainRaw!H227)","v":""},{"$f":"IF(MainRaw!J227=\"\", \"\", MainRaw!J227)","v":""},{"$f":"IF(MainRaw!K227=\"\", \"\", MainRaw!K227)","v":""},{"$f":"IF(MainRaw!L227=\"\", \"\", MainRaw!L227)","v":""},{"$f":"IF(MainRaw!M227=\"\", \"\", MainRaw!M227)","v":""},{"$f":"IF(MainRaw!R227=\"\", \"\", MainRaw!R227)","v":""},{"$f":"IF(MainRaw!S227=\"\", \"\", MainRaw!S227)","v":""}," -  - ",{"$f":"IF(MainRaw!L227=\"\", \"\", MainRaw!L227)","v":""},{"$f":"IF(MainRaw!M227=\"\", \"\", MainRaw!M227)","v":""},{"$f":"IF(MainRaw!N227=\"\", \"\", MainRaw!N227)","v":""},{"$f":"IF(MainRaw!O227=\"\", \"\", MainRaw!O227)","v":""},{"$f":"IF(MainRaw!P227=\"\", \"\", MainRaw!P227)","v":""},{"$f":"IF(MainRaw!Q227=\"\", \"\", MainRaw!Q227)","v":""}]
[{"$f":"IF(MainRaw!A228=\"\", \"\", MainRaw!A228)","v":""},{"$f":"IF(MainRaw!B228=\"\", \"\", MainRaw!B228)","v":""},{"$f":"IF(MainRaw!E228=\"\", \"\", MainRaw!E228)","v":""},{"$f":"IF(MainRaw!H228=\"\", \"\", MainRaw!H228)","v":""},{"$f":"IF(MainRaw!J228=\"\", \"\", MainRaw!J228)","v":""},{"$f":"IF(MainRaw!K228=\"\", \"\", MainRaw!K228)","v":""},{"$f":"IF(MainRaw!L228=\"\", \"\", MainRaw!L228)","v":""},{"$f":"IF(MainRaw!M228=\"\", \"\", MainRaw!M228)","v":""},{"$f":"IF(MainRaw!R228=\"\", \"\", MainRaw!R228)","v":""},{"$f":"IF(MainRaw!S228=\"\", \"\", MainRaw!S228)","v":""}," -  - ",{"$f":"IF(MainRaw!L228=\"\", \"\", MainRaw!L228)","v":""},{"$f":"IF(MainRaw!M228=\"\", \"\", MainRaw!M228)","v":""},{"$f":"IF(MainRaw!N228=\"\", \"\", MainRaw!N228)","v":""},{"$f":"IF(MainRaw!O228=\"\", \"\", MainRaw!O228)","v":""},{"$f":"IF(MainRaw!P228=\"\", \"\", MainRaw!P228)","v":""},{"$f":"IF(MainRaw!Q228=\"\", \"\", MainRaw!Q228)","v":""}]
[{"$f":"IF(MainRaw!A229=\"\", \"\", MainRaw!A229)","v":""},{"$f":"IF(MainRaw!B229=\"\", \"\", MainRaw!B229)","v":""},{"$f":"IF(MainRaw!E229=\"\", \"\", MainRaw!E229)","v":""},{"$f":"IF(MainRaw!H229=\"\", \"\", MainRaw!H229)","v":""},{"$f":"IF(MainRaw!J229=\"\", \"\", MainRaw!J229)","v":""},{"$f":"IF(MainRaw!K229=\"\", \"\", MainRaw!K229)","v":""},{"$f":"IF(MainRaw!L229=\"\", \"\", MainRaw!L229)","v":""},{"$f":"IF(MainRaw!M229=\"\", \"\", MainRaw!M229)","v":""},{"$f":"IF(MainRaw!R229=\"\", \"\", MainRaw!R229)","v":""},{"$f":"IF(MainRaw!S229=\"\", \"\", MainRaw!S229)","v":""}," -  - ",{"$f":"IF(MainRaw!L229=\"\", \"\", MainRaw!L229)","v":""},{"$f":"IF(MainRaw!M229=\"\", \"\", MainRaw!M229)","v":""},{"$f":"IF(MainRaw!N229=\"\", \"\", MainRaw!N229)","v":""},{"$f":"IF(MainRaw!O229=\"\", \"\", MainRaw!O229)","v":""},{"$f":"IF(MainRaw!P229=\"\", \"\", MainRaw!P229)","v":""},{"$f":"IF(MainRaw!Q229=\"\", \"\", MainRaw!Q229)","v":""}]
[{"$f":"IF(MainRaw!A230=\"\", \"\", MainRaw!A230)","v":""},{"$f":"IF(MainRaw!B230=\"\", \"\", MainRaw!B230)","v":""},{"$f":"IF(MainRaw!E230=\"\", \"\", MainRaw!E230)","v":""},{"$f":"IF(MainRaw!H230=\"\", \"\", MainRaw!H230)","v":""},{"$f":"IF(MainRaw!J230=\"\", \"\", MainRaw!J230)","v":""},{"$f":"IF(MainRaw!K230=\"\", \"\", MainRaw!K230)","v":""},{"$f":"IF(MainRaw!L230=\"\", \"\", MainRaw!L230)","v":""},{"$f":"IF(MainRaw!M230=\"\", \"\", MainRaw!M230)","v":""},{"$f":"IF(MainRaw!R230=\"\", \"\", MainRaw!R230)","v":""},{"$f":"IF(MainRaw!S230=\"\", \"\", MainRaw!S230)","v":""}," -  - ",{"$f":"IF(MainRaw!L230=\"\", \"\", MainRaw!L230)","v":""},{"$f":"IF(MainRaw!M230=\"\", \"\", MainRaw!M230)","v":""},{"$f":"IF(MainRaw!N230=\"\", \"\", MainRaw!N230)","v":""},{"$f":"IF(MainRaw!O230=\"\", \"\", MainRaw!O230)","v":""},{"$f":"IF(MainRaw!P230=\"\", \"\", MainRaw!P230)","v":""},{"$f":"IF(MainRaw!Q230=\"\", \"\", MainRaw!Q230)","v":""}]
[{"$f":"IF(MainRaw!A231=\"\", \"\", MainRaw!A231)","v":""},{"$f":"IF(MainRaw!B231=\"\", \"\", MainRaw!B231)","v":""},{"$f":"IF(MainRaw!E231=\"\", \"\", MainRaw!E231)","v":""},{"$f":"IF(MainRaw!H231=\"\", \"\", MainRaw!H231)","v":""},{"$f":"IF(MainRaw!J231=\"\", \"\", MainRaw!J231)","v":""},{"$f":"IF(MainRaw!K231=\"\", \"\", MainRaw!K231)","v":""},{"$f":"IF(MainRaw!L231=\"\", \"\", MainRaw!L231)","v":""},{"$f":"IF(MainRaw!M231=\"\", \"\", MainRaw!M231)","v":""},{"$f":"IF(MainRaw!R231=\"\", \"\", MainRaw!R231)","v":""},{"$f":"IF(MainRaw!S231=\"\", \"\", MainRaw!S231)","v":""}," -  - ",{"$f":"IF(MainRaw!L231=\"\", \"\", MainRaw!L231)","v":""},{"$f":"IF(MainRaw!M231=\"\", \"\", MainRaw!M231)","v":""},{"$f":"IF(MainRaw!N231=\"\", \"\", MainRaw!N231)","v":""},{"$f":"IF(MainRaw!O231=\"\", \"\", MainRaw!O231)","v":""},{"$f":"IF(MainRaw!P231=\"\", \"\", MainRaw!P231)","v":""},{"$f":"IF(MainRaw!Q231=\"\", \"\", MainRaw!Q231)","v":""}]
[{"$f":"IF(MainRaw!A232=\"\", \"\", MainRaw!A232)","v":""},{"$f":"IF(MainRaw!B232=\"\", \"\", MainRaw!B232)","v":""},{"$f":"IF(MainRaw!E232=\"\", \"\", MainRaw!E232)","v":""},{"$f":"IF(MainRaw!H232=\"\", \"\", MainRaw!H232)","v":""},{"$f":"IF(MainRaw!J232=\"\", \"\", MainRaw!J232)","v":""},{"$f":"IF(MainRaw!K232=\"\", \"\", MainRaw!K232)","v":""},{"$f":"IF(MainRaw!L232=\"\", \"\", MainRaw!L232)","v":""},{"$f":"IF(MainRaw!M232=\"\", \"\", MainRaw!M232)","v":""},{"$f":"IF(MainRaw!R232=\"\", \"\", MainRaw!R232)","v":""},{"$f":"IF(MainRaw!S232=\"\", \"\", MainRaw!S232)","v":""}," -  - ",{"$f":"IF(MainRaw!L232=\"\", \"\", MainRaw!L232)","v":""},{"$f":"IF(MainRaw!M232=\"\", \"\", MainRaw!M232)","v":""},{"$f":"IF(MainRaw!N232=\"\", \"\", MainRaw!N232)","v":""},{"$f":"IF(MainRaw!O232=\"\", \"\", MainRaw!O232)","v":""},{"$f":"IF(MainRaw!P232=\"\", \"\", MainRaw!P232)","v":""},{"$f":"IF(MainRaw!Q232=\"\", \"\", MainRaw!Q232)","v":""}]
[{"$f":"IF(MainRaw!A233=\"\", \"\", MainRaw!A233)","v":""},{"$f":"IF(MainRaw!B233=\"\", \"\", MainRaw!B233)","v":""},{"$f":"IF(MainRaw!E233=\"\", \"\", MainRaw!E233)","v":""},{"$f":"IF(MainRaw!H233=\"\", \"\", MainRaw!H233)","v":""},{"$f":"IF(MainRaw!J233=\"\", \"\", MainRaw!J233)","v":""},{"$f":"IF(MainRaw!K233=\"\", \"\", MainRaw!K233)","v":""},{"$f":"IF(MainRaw!L233=\"\", \"\", MainRaw!L233)","v":""},{"$f":"IF(MainRaw!M233=\"\", \"\", MainRaw!M233)","v":""},{"$f":"IF(MainRaw!R233=\"\", \"\", MainRaw!R233)","v":""},{"$f":"IF(MainRaw!S233=\"\", \"\", MainRaw!S233)","v":""}," -  - ",{"$f":"IF(MainRaw!L233=\"\", \"\", MainRaw!L233)","v":""},{"$f":"IF(MainRaw!M233=\"\", \"\", MainRaw!M233)","v":""},{"$f":"IF(MainRaw!N233=\"\", \"\", MainRaw!N233)","v":""},{"$f":"IF(MainRaw!O233=\"\", \"\", MainRaw!O233)","v":""},{"$f":"IF(MainRaw!P233=\"\", \"\", MainRaw!P233)","v":""},{"$f":"IF(MainRaw!Q233=\"\", \"\", MainRaw!Q233)","v":""}]
[{"$f":"IF(MainRaw!A234=\"\", \"\", MainRaw!A234)","v":""},{"$f":"IF(MainRaw!B234=\"\", \"\", MainRaw!B234)","v":""},{"$f":"IF(MainRaw!E234=\"\", \"\", MainRaw!E234)","v":""},{"$f":"IF(MainRaw!H234=\"\", \"\", MainRaw!H234)","v":""},{"$f":"IF(MainRaw!J234=\"\", \"\", MainRaw!J234)","v":""},{"$f":"IF(MainRaw!K234=\"\", \"\", MainRaw!K234)","v":""},{"$f":"IF(MainRaw!L234=\"\", \"\", MainRaw!L234)","v":""},{"$f":"IF(MainRaw!M234=\"\", \"\", MainRaw!M234)","v":""},{"$f":"IF(MainRaw!R234=\"\", \"\", MainRaw!R234)","v":""},{"$f":"IF(MainRaw!S234=\"\", \"\", MainRaw!S234)","v":""}," -  - ",{"$f":"IF(MainRaw!L234=\"\", \"\", MainRaw!L234)","v":""},{"$f":"IF(MainRaw!M234=\"\", \"\", MainRaw!M234)","v":""},{"$f":"IF(MainRaw!N234=\"\", \"\", MainRaw!N234)","v":""},{"$f":"IF(MainRaw!O234=\"\", \"\", MainRaw!O234)","v":""},{"$f":"IF(MainRaw!P234=\"\", \"\", MainRaw!P234)","v":""},{"$f":"IF(MainRaw!Q234=\"\", \"\", MainRaw!Q234)","v":""}]
[{"$f":"IF(MainRaw!A235=\"\", \"\", MainRaw!A235)","v":""},{"$f":"IF(MainRaw!B235=\"\", \"\", MainRaw!B235)","v":""},{"$f":"IF(MainRaw!E235=\"\", \"\", MainRaw!E235)","v":""},{"$f":"IF(MainRaw!H235=\"\", \"\", MainRaw!H235)","v":""},{"$f":"IF(MainRaw!J235=\"\", \"\", MainRaw!J235)","v":""},{"$f":"IF(MainRaw!K235=\"\", \"\", MainRaw!K235)","v":""},{"$f":"IF(MainRaw!L235=\"\", \"\", MainRaw!L235)","v":""},{"$f":"IF(MainRaw!M235=\"\", \"\", MainRaw!M235)","v":""},{"$f":"IF(MainRaw!R235=\"\", \"\", MainRaw!R235)","v":""},{"$f":"IF(MainRaw!S235=\"\", \"\", MainRaw!S235)","v":""}," -  - ",{"$f":"IF(MainRaw!L235=\"\", \"\", MainRaw!L235)","v":""},{"$f":"IF(MainRaw!M235=\"\", \"\", MainRaw!M235)","v":""},{"$f":"IF(MainRaw!N235=\"\", \"\", MainRaw!N235)","v":""},{"$f":"IF(MainRaw!O235=\"\", \"\", MainRaw!O235)","v":""},{"$f":"IF(MainRaw!P235=\"\", \"\", MainRaw!P235)","v":""},{"$f":"IF(MainRaw!Q235=\"\", \"\", MainRaw!Q235)","v":""}]
[{"$f":"IF(MainRaw!A236=\"\", \"\", MainRaw!A236)","v":""},{"$f":"IF(MainRaw!B236=\"\", \"\", MainRaw!B236)","v":""},{"$f":"IF(MainRaw!E236=\"\", \"\", MainRaw!E236)","v":""},{"$f":"IF(MainRaw!H236=\"\", \"\", MainRaw!H236)","v":""},{"$f":"IF(MainRaw!J236=\"\", \"\", MainRaw!J236)","v":""},{"$f":"IF(MainRaw!K236=\"\", \"\", MainRaw!K236)","v":""},{"$f":"IF(MainRaw!L236=\"\", \"\", MainRaw!L236)","v":""},{"$f":"IF(MainRaw!M236=\"\", \"\", MainRaw!M236)","v":""},{"$f":"IF(MainRaw!R236=\"\", \"\", MainRaw!R236)","v":""},{"$f":"IF(MainRaw!S236=\"\", \"\", MainRaw!S236)","v":""}," -  - ",{"$f":"IF(MainRaw!L236=\"\", \"\", MainRaw!L236)","v":""},{"$f":"IF(MainRaw!M236=\"\", \"\", MainRaw!M236)","v":""},{"$f":"IF(MainRaw!N236=\"\", \"\", MainRaw!N236)","v":""},{"$f":"IF(MainRaw!O236=\"\", \"\", MainRaw!O236)","v":""},{"$f":"IF(MainRaw!P236=\"\", \"\", MainRaw!P236)","v":""},{"$f":"IF(MainRaw!Q236=\"\", \"\", MainRaw!Q236)","v":""}]
[{"$f":"IF(MainRaw!A237=\"\", \"\", MainRaw!A237)","v":""},{"$f":"IF(MainRaw!B237=\"\", \"\", MainRaw!B237)","v":""},{"$f":"IF(MainRaw!E237=\"\", \"\", MainRaw!E237)","v":""},{"$f":"IF(MainRaw!H237=\"\", \"\", MainRaw!H237)","v":""},{"$f":"IF(MainRaw!J237=\"\", \"\", MainRaw!J237)","v":""},{"$f":"IF(MainRaw!K237=\"\", \"\", MainRaw!K237)","v":""},{"$f":"IF(MainRaw!L237=\"\", \"\", MainRaw!L237)","v":""},{"$f":"IF(MainRaw!M237=\"\", \"\", MainRaw!M237)","v":""},{"$f":"IF(MainRaw!R237=\"\", \"\", MainRaw!R237)","v":""},{"$f":"IF(MainRaw!S237=\"\", \"\", MainRaw!S237)","v":""}," -  - ",{"$f":"IF(MainRaw!L237=\"\", \"\", MainRaw!L237)","v":""},{"$f":"IF(MainRaw!M237=\"\", \"\", MainRaw!M237)","v":""},{"$f":"IF(MainRaw!N237=\"\", \"\", MainRaw!N237)","v":""},{"$f":"IF(MainRaw!O237=\"\", \"\", MainRaw!O237)","v":""},{"$f":"IF(MainRaw!P237=\"\", \"\", MainRaw!P237)","v":""},{"$f":"IF(MainRaw!Q237=\"\", \"\", MainRaw!Q237)","v":""}]
[{"$f":"IF(MainRaw!A238=\"\", \"\", MainRaw!A238)","v":""},{"$f":"IF(MainRaw!B238=\"\", \"\", MainRaw!B238)","v":""},{"$f":"IF(MainRaw!E238=\"\", \"\", MainRaw!E238)","v":""},{"$f":"IF(MainRaw!H238=\"\", \"\", MainRaw!H238)","v":""},{"$f":"IF(MainRaw!J238=\"\", \"\", MainRaw!J238)","v":""},{"$f":"IF(MainRaw!K238=\"\", \"\", MainRaw!K238)","v":""},{"$f":"IF(MainRaw!L238=\"\", \"\", MainRaw!L238)","v":""},{"$f":"IF(MainRaw!M238=\"\", \"\", MainRaw!M238)","v":""},{"$f":"IF(MainRaw!R238=\"\", \"\", MainRaw!R238)","v":""},{"$f":"IF(MainRaw!S238=\"\", \"\", MainRaw!S238)","v":""}," -  - ",{"$f":"IF(MainRaw!L238=\"\", \"\", MainRaw!L238)","v":""},{"$f":"IF(MainRaw!M238=\"\", \"\", MainRaw!M238)","v":""},{"$f":"IF(MainRaw!N238=\"\", \"\", MainRaw!N238)","v":""},{"$f":"IF(MainRaw!O238=\"\", \"\", MainRaw!O238)","v":""},{"$f":"IF(MainRaw!P238=\"\", \"\", MainRaw!P238)","v":""},{"$f":"IF(MainRaw!Q238=\"\", \"\", MainRaw!Q238)","v":""}]
[{"$f":"IF(MainRaw!A239=\"\", \"\", MainRaw!A239)","v":""},{"$f":"IF(MainRaw!B239=\"\", \"\", MainRaw!B239)","v":""},{"$f":"IF(MainRaw!E239=\"\", \"\", MainRaw!E239)","v":""},{"$f":"IF(MainRaw!H239=\"\", \"\", MainRaw!H239)","v":""},{"$f":"IF(MainRaw!J239=\"\", \"\", MainRaw!J239)","v":""},{"$f":"IF(MainRaw!K239=\"\", \"\", MainRaw!K239)","v":""},{"$f":"IF(MainRaw!L239=\"\", \"\", MainRaw!L239)","v":""},{"$f":"IF(MainRaw!M239=\"\", \"\", MainRaw!M239)","v":""},{"$f":"IF(MainRaw!R239=\"\", \"\", MainRaw!R239)","v":""},{"$f":"IF(MainRaw!S239=\"\", \"\", MainRaw!S239)","v":""}," -  - ",{"$f":"IF(MainRaw!L239=\"\", \"\", MainRaw!L239)","v":""},{"$f":"IF(MainRaw!M239=\"\", \"\", MainRaw!M239)","v":""},{"$f":"IF(MainRaw!N239=\"\", \"\", MainRaw!N239)","v":""},{"$f":"IF(MainRaw!O239=\"\", \"\", MainRaw!O239)","v":""},{"$f":"IF(MainRaw!P239=\"\", \"\", MainRaw!P239)","v":""},{"$f":"IF(MainRaw!Q239=\"\", \"\", MainRaw!Q239)","v":""}]
[{"$f":"IF(MainRaw!A240=\"\", \"\", MainRaw!A240)","v":""},{"$f":"IF(MainRaw!B240=\"\", \"\", MainRaw!B240)","v":""},{"$f":"IF(MainRaw!E240=\"\", \"\", MainRaw!E240)","v":""},{"$f":"IF(MainRaw!H240=\"\", \"\", MainRaw!H240)","v":""},{"$f":"IF(MainRaw!J240=\"\", \"\", MainRaw!J240)","v":""},{"$f":"IF(MainRaw!K240=\"\", \"\", MainRaw!K240)","v":""},{"$f":"IF(MainRaw!L240=\"\", \"\", MainRaw!L240)","v":""},{"$f":"IF(MainRaw!M240=\"\", \"\", MainRaw!M240)","v":""},{"$f":"IF(MainRaw!R240=\"\", \"\", MainRaw!R240)","v":""},{"$f":"IF(MainRaw!S240=\"\", \"\", MainRaw!S240)","v":""}," -  - ",{"$f":"IF(MainRaw!L240=\"\", \"\", MainRaw!L240)","v":""},{"$f":"IF(MainRaw!M240=\"\", \"\", MainRaw!M240)","v":""},{"$f":"IF(MainRaw!N240=\"\", \"\", MainRaw!N240)","v":""},{"$f":"IF(MainRaw!O240=\"\", \"\", MainRaw!O240)","v":""},{"$f":"IF(MainRaw!P240=\"\", \"\", MainRaw!P240)","v":""},{"$f":"IF(MainRaw!Q240=\"\", \"\", MainRaw!Q240)","v":""}]
[{"$f":"IF(MainRaw!A241=\"\", \"\", MainRaw!A241)","v":""},{"$f":"IF(MainRaw!B241=\"\", \"\", MainRaw!B241)","v":""},{"$f":"IF(MainRaw!E241=\"\", \"\", MainRaw!E241)","v":""},{"$f":"IF(MainRaw!H241=\"\", \"\", MainRaw!H241)","v":""},{"$f":"IF(MainRaw!J241=\"\", \"\", MainRaw!J241)","v":""},{"$f":"IF(MainRaw!K241=\"\", \"\", MainRaw!K241)","v":""},{"$f":"IF(MainRaw!L241=\"\", \"\", MainRaw!L241)","v":""},{"$f":"IF(MainRaw!M241=\"\", \"\", MainRaw!M241)","v":""},{"$f":"IF(MainRaw!R241=\"\", \"\", MainRaw!R241)","v":""},{"$f":"IF(MainRaw!S241=\"\", \"\", MainRaw!S241)","v":""}," -  - ",{"$f":"IF(MainRaw!L241=\"\", \"\", MainRaw!L241)","v":""},{"$f":"IF(MainRaw!M241=\"\", \"\", MainRaw!M241)","v":""},{"$f":"IF(MainRaw!N241=\"\", \"\", MainRaw!N241)","v":""},{"$f":"IF(MainRaw!O241=\"\", \"\", MainRaw!O241)","v":""},{"$f":"IF(MainRaw!P241=\"\", \"\", MainRaw!P241)","v":""},{"$f":"IF(MainRaw!Q241=\"\", \"\", MainRaw!Q241)","v":""}]
[{"$f":"IF(MainRaw!A242=\"\", \"\", MainRaw!A242)","v":""},{"$f":"IF(MainRaw!B242=\"\", \"\", MainRaw!B242)","v":""},{"$f":"IF(MainRaw!E242=\"\", \"\", MainRaw!E242)","v":""},{"$f":"IF(MainRaw!H242=\"\", \"\", MainRaw!H242)","v":""},{"$f":"IF(MainRaw!J242=\"\", \"\", MainRaw!J242)","v":""},{"$f":"IF(MainRaw!K242=\"\", \"\", MainRaw!K242)","v":""},{"$f":"IF(MainRaw!L242=\"\", \"\", MainRaw!L242)","v":""},{"$f":"IF(MainRaw!M242=\"\", \"\", MainRaw!M242)","v":""},{"$f":"IF(MainRaw!R242=\"\", \"\", MainRaw!R242)","v":""},{"$f":"IF(MainRaw!S242=\"\", \"\", MainRaw!S242)","v":""}," -  - ",{"$f":"IF(MainRaw!L242=\"\", \"\", MainRaw!L242)","v":""},{"$f":"IF(MainRaw!M242=\"\", \"\", MainRaw!M242)","v":""},{"$f":"IF(MainRaw!N242=\"\", \"\", MainRaw!N242)","v":""},{"$f":"IF(MainRaw!O242=\"\", \"\", MainRaw!O242)","v":""},{"$f":"IF(MainRaw!P242=\"\", \"\", MainRaw!P242)","v":""},{"$f":"IF(MainRaw!Q242=\"\", \"\", MainRaw!Q242)","v":""}]
[{"$f":"IF(MainRaw!A243=\"\", \"\", MainRaw!A243)","v":""},{"$f":"IF(MainRaw!B243=\"\", \"\", MainRaw!B243)","v":""},{"$f":"IF(MainRaw!E243=\"\", \"\", MainRaw!E243)","v":""},{"$f":"IF(MainRaw!H243=\"\", \"\", MainRaw!H243)","v":""},{"$f":"IF(MainRaw!J243=\"\", \"\", MainRaw!J243)","v":""},{"$f":"IF(MainRaw!K243=\"\", \"\", MainRaw!K243)","v":""},{"$f":"IF(MainRaw!L243=\"\", \"\", MainRaw!L243)","v":""},{"$f":"IF(MainRaw!M243=\"\", \"\", MainRaw!M243)","v":""},{"$f":"IF(MainRaw!R243=\"\", \"\", MainRaw!R243)","v":""},{"$f":"IF(MainRaw!S243=\"\", \"\", MainRaw!S243)","v":""}," -  - ",{"$f":"IF(MainRaw!L243=\"\", \"\", MainRaw!L243)","v":""},{"$f":"IF(MainRaw!M243=\"\", \"\", MainRaw!M243)","v":""},{"$f":"IF(MainRaw!N243=\"\", \"\", MainRaw!N243)","v":""},{"$f":"IF(MainRaw!O243=\"\", \"\", MainRaw!O243)","v":""},{"$f":"IF(MainRaw!P243=\"\", \"\", MainRaw!P243)","v":""},{"$f":"IF(MainRaw!Q243=\"\", \"\", MainRaw!Q243)","v":""}]
[{"$f":"IF(MainRaw!A244=\"\", \"\", MainRaw!A244)","v":""},{"$f":"IF(MainRaw!B244=\"\", \"\", MainRaw!B244)","v":""},{"$f":"IF(MainRaw!E244=\"\", \"\", MainRaw!E244)","v":""},{"$f":"IF(MainRaw!H244=\"\", \"\", MainRaw!H244)","v":""},{"$f":"IF(MainRaw!J244=\"\", \"\", MainRaw!J244)","v":""},{"$f":"IF(MainRaw!K244=\"\", \"\", MainRaw!K244)","v":""},{"$f":"IF(MainRaw!L244=\"\", \"\", MainRaw!L244)","v":""},{"$f":"IF(MainRaw!M244=\"\", \"\", MainRaw!M244)","v":""},{"$f":"IF(MainRaw!R244=\"\", \"\", MainRaw!R244)","v":""},{"$f":"IF(MainRaw!S244=\"\", \"\", MainRaw!S244)","v":""}," -  - ",{"$f":"IF(MainRaw!L244=\"\", \"\", MainRaw!L244)","v":""},{"$f":"IF(MainRaw!M244=\"\", \"\", MainRaw!M244)","v":""},{"$f":"IF(MainRaw!N244=\"\", \"\", MainRaw!N244)","v":""},{"$f":"IF(MainRaw!O244=\"\", \"\", MainRaw!O244)","v":""},{"$f":"IF(MainRaw!P244=\"\", \"\", MainRaw!P244)","v":""},{"$f":"IF(MainRaw!Q244=\"\", \"\", MainRaw!Q244)","v":""}]
[{"$f":"IF(MainRaw!A245=\"\", \"\", MainRaw!A245)","v":""},{"$f":"IF(MainRaw!B245=\"\", \"\", MainRaw!B245)","v":""},{"$f":"IF(MainRaw!E245=\"\", \"\", MainRaw!E245)","v":""},{"$f":"IF(MainRaw!H245=\"\", \"\", MainRaw!H245)","v":""},{"$f":"IF(MainRaw!J245=\"\", \"\", MainRaw!J245)","v":""},{"$f":"IF(MainRaw!K245=\"\", \"\", MainRaw!K245)","v":""},{"$f":"IF(MainRaw!L245=\"\", \"\", MainRaw!L245)","v":""},{"$f":"IF(MainRaw!M245=\"\", \"\", MainRaw!M245)","v":""},{"$f":"IF(MainRaw!R245=\"\", \"\", MainRaw!R245)","v":""},{"$f":"IF(MainRaw!S245=\"\", \"\", MainRaw!S245)","v":""}," -  - ",{"$f":"IF(MainRaw!L245=\"\", \"\", MainRaw!L245)","v":""},{"$f":"IF(MainRaw!M245=\"\", \"\", MainRaw!M245)","v":""},{"$f":"IF(MainRaw!N245=\"\", \"\", MainRaw!N245)","v":""},{"$f":"IF(MainRaw!O245=\"\", \"\", MainRaw!O245)","v":""},{"$f":"IF(MainRaw!P245=\"\", \"\", MainRaw!P245)","v":""},{"$f":"IF(MainRaw!Q245=\"\", \"\", MainRaw!Q245)","v":""}]
[{"$f":"IF(MainRaw!A246=\"\", \"\", MainRaw!A246)","v":""},{"$f":"IF(MainRaw!B246=\"\", \"\", MainRaw!B246)","v":""},{"$f":"IF(MainRaw!E246=\"\", \"\", MainRaw!E246)","v":""},{"$f":"IF(MainRaw!H246=\"\", \"\", MainRaw!H246)","v":""},{"$f":"IF(MainRaw!J246=\"\", \"\", MainRaw!J246)","v":""},{"$f":"IF(MainRaw!K246=\"\", \"\", MainRaw!K246)","v":""},{"$f":"IF(MainRaw!L246=\"\", \"\", MainRaw!L246)","v":""},{"$f":"IF(MainRaw!M246=\"\", \"\", MainRaw!M246)","v":""},{"$f":"IF(MainRaw!R246=\"\", \"\", MainRaw!R246)","v":""},{"$f":"IF(MainRaw!S246=\"\", \"\", MainRaw!S246)","v":""}," -  - ",{"$f":"IF(MainRaw!L246=\"\", \"\", MainRaw!L246)","v":""},{"$f":"IF(MainRaw!M246=\"\", \"\", MainRaw!M246)","v":""},{"$f":"IF(MainRaw!N246=\"\", \"\", MainRaw!N246)","v":""},{"$f":"IF(MainRaw!O246=\"\", \"\", MainRaw!O246)","v":""},{"$f":"IF(MainRaw!P246=\"\", \"\", MainRaw!P246)","v":""},{"$f":"IF(MainRaw!Q246=\"\", \"\", MainRaw!Q246)","v":""}]
[{"$f":"IF(MainRaw!A247=\"\", \"\", MainRaw!A247)","v":""},{"$f":"IF(MainRaw!B247=\"\", \"\", MainRaw!B247)","v":""},{"$f":"IF(MainRaw!E247=\"\", \"\", MainRaw!E247)","v":""},{"$f":"IF(MainRaw!H247=\"\", \"\", MainRaw!H247)","v":""},{"$f":"IF(MainRaw!J247=\"\", \"\", MainRaw!J247)","v":""},{"$f":"IF(MainRaw!K247=\"\", \"\", MainRaw!K247)","v":""},{"$f":"IF(MainRaw!L247=\"\", \"\", MainRaw!L247)","v":""},{"$f":"IF(MainRaw!M247=\"\", \"\", MainRaw!M247)","v":""},{"$f":"IF(MainRaw!R247=\"\", \"\", MainRaw!R247)","v":""},{"$f":"IF(MainRaw!S247=\"\", \"\", MainRaw!S247)","v":""}," -  - ",{"$f":"IF(MainRaw!L247=\"\", \"\", MainRaw!L247)","v":""},{"$f":"IF(MainRaw!M247=\"\", \"\", MainRaw!M247)","v":""},{"$f":"IF(MainRaw!N247=\"\", \"\", MainRaw!N247)","v":""},{"$f":"IF(MainRaw!O247=\"\", \"\", MainRaw!O247)","v":""},{"$f":"IF(MainRaw!P247=\"\", \"\", MainRaw!P247)","v":""},{"$f":"IF(MainRaw!Q247=\"\", \"\", MainRaw!Q247)","v":""}]
[{"$f":"IF(MainRaw!A248=\"\", \"\", MainRaw!A248)","v":""},{"$f":"IF(MainRaw!B248=\"\", \"\", MainRaw!B248)","v":""},{"$f":"IF(MainRaw!E248=\"\", \"\", MainRaw!E248)","v":""},{"$f":"IF(MainRaw!H248=\"\", \"\", MainRaw!H248)","v":""},{"$f":"IF(MainRaw!J248=\"\", \"\", MainRaw!J248)","v":""},{"$f":"IF(MainRaw!K248=\"\", \"\", MainRaw!K248)","v":""},{"$f":"IF(MainRaw!L248=\"\", \"\", MainRaw!L248)","v":""},{"$f":"IF(MainRaw!M248=\"\", \"\", MainRaw!M248)","v":""},{"$f":"IF(MainRaw!R248=\"\", \"\", MainRaw!R248)","v":""},{"$f":"IF(MainRaw!S248=\"\", \"\", MainRaw!S248)","v":""}," -  - ",{"$f":"IF(MainRaw!L248=\"\", \"\", MainRaw!L248)","v":""},{"$f":"IF(MainRaw!M248=\"\", \"\", MainRaw!M248)","v":""},{"$f":"IF(MainRaw!N248=\"\", \"\", MainRaw!N248)","v":""},{"$f":"IF(MainRaw!O248=\"\", \"\", MainRaw!O248)","v":""},{"$f":"IF(MainRaw!P248=\"\", \"\", MainRaw!P248)","v":""},{"$f":"IF(MainRaw!Q248=\"\", \"\", MainRaw!Q248)","v":""}]
[{"$f":"IF(MainRaw!A249=\"\", \"\", MainRaw!A249)","v":""},{"$f":"IF(MainRaw!B249=\"\", \"\", MainRaw!B249)","v":""},{"$f":"IF(MainRaw!E249=\"\", \"\", MainRaw!E249)","v":""},{"$f":"IF(MainRaw!H249=\"\", \"\", MainRaw!H249)","v":""},{"$f":"IF(MainRaw!J249=\"\", \"\", MainRaw!J249)","v":""},{"$f":"IF(MainRaw!K249=\"\", \"\", MainRaw!K249)","v":""},{"$f":"IF(MainRaw!L249=\"\", \"\", MainRaw!L249)","v":""},{"$f":"IF(MainRaw!M249=\"\", \"\", MainRaw!M249)","v":""},{"$f":"IF(MainRaw!R249=\"\", \"\", MainRaw!R249)","v":""},{"$f":"IF(MainRaw!S249=\"\", \"\", MainRaw!S249)","v":""}," -  - ",{"$f":"IF(MainRaw!L249=\"\", \"\", MainRaw!L249)","v":""},{"$f":"IF(MainRaw!M249=\"\", \"\", MainRaw!M249)","v":""},{"$f":"IF(MainRaw!N249=\"\", \"\", MainRaw!N249)","v":""},{"$f":"IF(MainRaw!O249=\"\", \"\", MainRaw!O249)","v":""},{"$f":"IF(MainRaw!P249=\"\", \"\", MainRaw!P249)","v":""},{"$f":"IF(MainRaw!Q249=\"\", \"\", MainRaw!Q249)","v":""}]
[{"$f":"IF(MainRaw!A250=\"\", \"\", MainRaw!A250)","v":""},{"$f":"IF(MainRaw!B250=\"\", \"\", MainRaw!B250)","v":""},{"$f":"IF(MainRaw!E250=\"\", \"\", MainRaw!E250)","v":""},{"$f":"IF(MainRaw!H250=\"\", \"\", MainRaw!H250)","v":""},{"$f":"IF(MainRaw!J250=\"\", \"\", MainRaw!J250)","v":""},{"$f":"IF(MainRaw!K250=\"\", \"\", MainRaw!K250)","v":""},{"$f":"IF(MainRaw!L250=\"\", \"\", MainRaw!L250)","v":""},{"$f":"IF(MainRaw!M250=\"\", \"\", MainRaw!M250)","v":""},{"$f":"IF(MainRaw!R250=\"\", \"\", MainRaw!R250)","v":""},{"$f":"IF(MainRaw!S250=\"\", \"\", MainRaw!S250)","v":""}," -  - ",{"$f":"IF(MainRaw!L250=\"\", \"\", MainRaw!L250)","v":""},{"$f":"IF(MainRaw!M250=\"\", \"\", MainRaw!M250)","v":""},{"$f":"IF(MainRaw!N250=\"\", \"\", MainRaw!N250)","v":""},{"$f":"IF(MainRaw!O250=\"\", \"\", MainRaw!O250)","v":""},{"$f":"IF(MainRaw!P250=\"\", \"\", MainRaw!P250)","v":""},{"$f":"IF(MainRaw!Q250=\"\", \"\", MainRaw!Q250)","v":""}]
[{"$f":"IF(MainRaw!A251=\"\", \"\", MainRaw!A251)","v":""},{"$f":"IF(MainRaw!B251=\"\", \"\", MainRaw!B251)","v":""},{"$f":"IF(MainRaw!E251=\"\", \"\", MainRaw!E251)","v":""},{"$f":"IF(MainRaw!H251=\"\", \"\", MainRaw!H251)","v":""},{"$f":"IF(MainRaw!J251=\"\", \"\", MainRaw!J251)","v":""},{"$f":"IF(MainRaw!K251=\"\", \"\", MainRaw!K251)","v":""},{"$f":"IF(MainRaw!L251=\"\", \"\", MainRaw!L251)","v":""},{"$f":"IF(MainRaw!M251=\"\", \"\", MainRaw!M251)","v":""},{"$f":"IF(MainRaw!R251=\"\", \"\", MainRaw!R251)","v":""},{"$f":"IF(MainRaw!S251=\"\", \"\", MainRaw!S251)","v":""}," -  - ",{"$f":"IF(MainRaw!L251=\"\", \"\", MainRaw!L251)","v":""},{"$f":"IF(MainRaw!M251=\"\", \"\", MainRaw!M251)","v":""},{"$f":"IF(MainRaw!N251=\"\", \"\", MainRaw!N251)","v":""},{"$f":"IF(MainRaw!O251=\"\", \"\", MainRaw!O251)","v":""},{"$f":"IF(MainRaw!P251=\"\", \"\", MainRaw!P251)","v":""},{"$f":"IF(MainRaw!Q251=\"\", \"\", MainRaw!Q251)","v":""}]
[{"$f":"IF(MainRaw!A252=\"\", \"\", MainRaw!A252)","v":""},{"$f":"IF(MainRaw!B252=\"\", \"\", MainRaw!B252)","v":""},{"$f":"IF(MainRaw!E252=\"\", \"\", MainRaw!E252)","v":""},{"$f":"IF(MainRaw!H252=\"\", \"\", MainRaw!H252)","v":""},{"$f":"IF(MainRaw!J252=\"\", \"\", MainRaw!J252)","v":""},{"$f":"IF(MainRaw!K252=\"\", \"\", MainRaw!K252)","v":""},{"$f":"IF(MainRaw!L252=\"\", \"\", MainRaw!L252)","v":""},{"$f":"IF(MainRaw!M252=\"\", \"\", MainRaw!M252)","v":""},{"$f":"IF(MainRaw!R252=\"\", \"\", MainRaw!R252)","v":""},{"$f":"IF(MainRaw!S252=\"\", \"\", MainRaw!S252)","v":""}," -  - ",{"$f":"IF(MainRaw!L252=\"\", \"\", MainRaw!L252)","v":""},{"$f":"IF(MainRaw!M252=\"\", \"\", MainRaw!M252)","v":""},{"$f":"IF(MainRaw!N252=\"\", \"\", MainRaw!N252)","v":""},{"$f":"IF(MainRaw!O252=\"\", \"\", MainRaw!O252)","v":""},{"$f":"IF(MainRaw!P252=\"\", \"\", MainRaw!P252)","v":""},{"$f":"IF(MainRaw!Q252=\"\", \"\", MainRaw!Q252)","v":""}]
[{"$f":"IF(MainRaw!A253=\"\", \"\", MainRaw!A253)","v":""},{"$f":"IF(MainRaw!B253=\"\", \"\", MainRaw!B253)","v":""},{"$f":"IF(MainRaw!E253=\"\", \"\", MainRaw!E253)","v":""},{"$f":"IF(MainRaw!H253=\"\", \"\", MainRaw!H253)","v":""},{"$f":"IF(MainRaw!J253=\"\", \"\", MainRaw!J253)","v":""},{"$f":"IF(MainRaw!K253=\"\", \"\", MainRaw!K253)","v":""},{"$f":"IF(MainRaw!L253=\"\", \"\", MainRaw!L253)","v":""},{"$f":"IF(MainRaw!M253=\"\", \"\", MainRaw!M253)","v":""},{"$f":"IF(MainRaw!R253=\"\", \"\", MainRaw!R253)","v":""},{"$f":"IF(MainRaw!S253=\"\", \"\", MainRaw!S253)","v":""}," -  - ",{"$f":"IF(MainRaw!L253=\"\", \"\", MainRaw!L253)","v":""},{"$f":"IF(MainRaw!M253=\"\", \"\", MainRaw!M253)","v":""},{"$f":"IF(MainRaw!N253=\"\", \"\", MainRaw!N253)","v":""},{"$f":"IF(MainRaw!O253=\"\", \"\", MainRaw!O253)","v":""},{"$f":"IF(MainRaw!P253=\"\", \"\", MainRaw!P253)","v":""},{"$f":"IF(MainRaw!Q253=\"\", \"\", MainRaw!Q253)","v":""}]
[{"$f":"IF(MainRaw!A254=\"\", \"\", MainRaw!A254)","v":""},{"$f":"IF(MainRaw!B254=\"\", \"\", MainRaw!B254)","v":""},{"$f":"IF(MainRaw!E254=\"\", \"\", MainRaw!E254)","v":""},{"$f":"IF(MainRaw!H254=\"\", \"\", MainRaw!H254)","v":""},{"$f":"IF(MainRaw!J254=\"\", \"\", MainRaw!J254)","v":""},{"$f":"IF(MainRaw!K254=\"\", \"\", MainRaw!K254)","v":""},{"$f":"IF(MainRaw!L254=\"\", \"\", MainRaw!L254)","v":""},{"$f":"IF(MainRaw!M254=\"\", \"\", MainRaw!M254)","v":""},{"$f":"IF(MainRaw!R254=\"\", \"\", MainRaw!R254)","v":""},{"$f":"IF(MainRaw!S254=\"\", \"\", MainRaw!S254)","v":""}," -  - ",{"$f":"IF(MainRaw!L254=\"\", \"\", MainRaw!L254)","v":""},{"$f":"IF(MainRaw!M254=\"\", \"\", MainRaw!M254)","v":""},{"$f":"IF(MainRaw!N254=\"\", \"\", MainRaw!N254)","v":""},{"$f":"IF(MainRaw!O254=\"\", \"\", MainRaw!O254)","v":""},{"$f":"IF(MainRaw!P254=\"\", \"\", MainRaw!P254)","v":""},{"$f":"IF(MainRaw!Q254=\"\", \"\", MainRaw!Q254)","v":""}]
[{"$f":"IF(MainRaw!A255=\"\", \"\", MainRaw!A255)","v":""},{"$f":"IF(MainRaw!B255=\"\", \"\", MainRaw!B255)","v":""},{"$f":"IF(MainRaw!E255=\"\", \"\", MainRaw!E255)","v":""},{"$f":"IF(MainRaw!H255=\"\", \"\", MainRaw!H255)","v":""},{"$f":"IF(MainRaw!J255=\"\", \"\", MainRaw!J255)","v":""},{"$f":"IF(MainRaw!K255=\"\", \"\", MainRaw!K255)","v":""},{"$f":"IF(MainRaw!L255=\"\", \"\", MainRaw!L255)","v":""},{"$f":"IF(MainRaw!M255=\"\", \"\", MainRaw!M255)","v":""},{"$f":"IF(MainRaw!R255=\"\", \"\", MainRaw!R255)","v":""},{"$f":"IF(MainRaw!S255=\"\", \"\", MainRaw!S255)","v":""}," -  - ",{"$f":"IF(MainRaw!L255=\"\", \"\", MainRaw!L255)","v":""},{"$f":"IF(MainRaw!M255=\"\", \"\", MainRaw!M255)","v":""},{"$f":"IF(MainRaw!N255=\"\", \"\", MainRaw!N255)","v":""},{"$f":"IF(MainRaw!O255=\"\", \"\", MainRaw!O255)","v":""},{"$f":"IF(MainRaw!P255=\"\", \"\", MainRaw!P255)","v":""},{"$f":"IF(MainRaw!Q255=\"\", \"\", MainRaw!Q255)","v":""}]
[{"$f":"IF(MainRaw!A256=\"\", \"\", MainRaw!A256)","v":""},{"$f":"IF(MainRaw!B256=\"\", \"\", MainRaw!B256)","v":""},{"$f":"IF(MainRaw!E256=\"\", \"\", MainRaw!E256)","v":""},{"$f":"IF(MainRaw!H256=\"\", \"\", MainRaw!H256)","v":""},{"$f":"IF(MainRaw!J256=\"\", \"\", MainRaw!J256)","v":""},{"$f":"IF(MainRaw!K256=\"\", \"\", MainRaw!K256)","v":""},{"$f":"IF(MainRaw!L256=\"\", \"\", MainRaw!L256)","v":""},{"$f":"IF(MainRaw!M256=\"\", \"\", MainRaw!M256)","v":""},{"$f":"IF(MainRaw!R256=\"\", \"\", MainRaw!R256)","v":""},{"$f":"IF(MainRaw!S256=\"\", \"\", MainRaw!S256)","v":""}," -  - ",{"$f":"IF(MainRaw!L256=\"\", \"\", MainRaw!L256)","v":""},{"$f":"IF(MainRaw!M256=\"\", \"\", MainRaw!M256)","v":""},{"$f":"IF(MainRaw!N256=\"\", \"\", MainRaw!N256)","v":""},{"$f":"IF(MainRaw!O256=\"\", \"\", MainRaw!O256)","v":""},{"$f":"IF(MainRaw!P256=\"\", \"\", MainRaw!P256)","v":""},{"$f":"IF(MainRaw!Q256=\"\", \"\", MainRaw!Q256)","v":""}]
[{"$f":"IF(MainRaw!A257=\"\", \"\", MainRaw!A257)","v":""},{"$f":"IF(MainRaw!B257=\"\", \"\", MainRaw!B257)","v":""},{"$f":"IF(MainRaw!E257=\"\", \"\", MainRaw!E257)","v":""},{"$f":"IF(MainRaw!H257=\"\", \"\", MainRaw!H257)","v":""},{"$f":"IF(MainRaw!J257=\"\", \"\", MainRaw!J257)","v":""},{"$f":"IF(MainRaw!K257=\"\", \"\", MainRaw!K257)","v":""},{"$f":"IF(MainRaw!L257=\"\", \"\", MainRaw!L257)","v":""},{"$f":"IF(MainRaw!M257=\"\", \"\", MainRaw!M257)","v":""},{"$f":"IF(MainRaw!R257=\"\", \"\", MainRaw!R257)","v":""},{"$f":"IF(MainRaw!S257=\"\", \"\", MainRaw!S257)","v":""}," -  - ",{"$f":"IF(MainRaw!L257=\"\", \"\", MainRaw!L257)","v":""},{"$f":"IF(MainRaw!M257=\"\", \"\", MainRaw!M257)","v":""},{"$f":"IF(MainRaw!N257=\"\", \"\", MainRaw!N257)","v":""},{"$f":"IF(MainRaw!O257=\"\", \"\", MainRaw!O257)","v":""},{"$f":"IF(MainRaw!P257=\"\", \"\", MainRaw!P257)","v":""},{"$f":"IF(MainRaw!Q257=\"\", \"\", MainRaw!Q257)","v":""}]
[{"$f":"IF(MainRaw!A258=\"\", \"\", MainRaw!A258)","v":""},{"$f":"IF(MainRaw!B258=\"\", \"\", MainRaw!B258)","v":""},{"$f":"IF(MainRaw!E258=\"\", \"\", MainRaw!E258)","v":""},{"$f":"IF(MainRaw!H258=\"\", \"\", MainRaw!H258)","v":""},{"$f":"IF(MainRaw!J258=\"\", \"\", MainRaw!J258)","v":""},{"$f":"IF(MainRaw!K258=\"\", \"\", MainRaw!K258)","v":""},{"$f":"IF(MainRaw!L258=\"\", \"\", MainRaw!L258)","v":""},{"$f":"IF(MainRaw!M258=\"\", \"\", MainRaw!M258)","v":""},{"$f":"IF(MainRaw!R258=\"\", \"\", MainRaw!R258)","v":""},{"$f":"IF(MainRaw!S258=\"\", \"\", MainRaw!S258)","v":""}," -  - ",{"$f":"IF(MainRaw!L258=\"\", \"\", MainRaw!L258)","v":""},{"$f":"IF(MainRaw!M258=\"\", \"\", MainRaw!M258)","v":""},{"$f":"IF(MainRaw!N258=\"\", \"\", MainRaw!N258)","v":""},{"$f":"IF(MainRaw!O258=\"\", \"\", MainRaw!O258)","v":""},{"$f":"IF(MainRaw!P258=\"\", \"\", MainRaw!P258)","v":""},{"$f":"IF(MainRaw!Q258=\"\", \"\", MainRaw!Q258)","v":""}]
[{"$f":"IF(MainRaw!A259=\"\", \"\", MainRaw!A259)","v":""},{"$f":"IF(MainRaw!B259=\"\", \"\", MainRaw!B259)","v":""},{"$f":"IF(MainRaw!E259=\"\", \"\", MainRaw!E259)","v":""},{"$f":"IF(MainRaw!H259=\"\", \"\", MainRaw!H259)","v":""},{"$f":"IF(MainRaw!J259=\"\", \"\", MainRaw!J259)","v":""},{"$f":"IF(MainRaw!K259=\"\", \"\", MainRaw!K259)","v":""},{"$f":"IF(MainRaw!L259=\"\", \"\", MainRaw!L259)","v":""},{"$f":"IF(MainRaw!M259=\"\", \"\", MainRaw!M259)","v":""},{"$f":"IF(MainRaw!R259=\"\", \"\", MainRaw!R259)","v":""},{"$f":"IF(MainRaw!S259=\"\", \"\", MainRaw!S259)","v":""}," -  - ",{"$f":"IF(MainRaw!L259=\"\", \"\", MainRaw!L259)","v":""},{"$f":"IF(MainRaw!M259=\"\", \"\", MainRaw!M259)","v":""},{"$f":"IF(MainRaw!N259=\"\", \"\", MainRaw!N259)","v":""},{"$f":"IF(MainRaw!O259=\"\", \"\", MainRaw!O259)","v":""},{"$f":"IF(MainRaw!P259=\"\", \"\", MainRaw!P259)","v":""},{"$f":"IF(MainRaw!Q259=\"\", \"\", MainRaw!Q259)","v":""}]
[{"$f":"IF(MainRaw!A260=\"\", \"\", MainRaw!A260)","v":""},{"$f":"IF(MainRaw!B260=\"\", \"\", MainRaw!B260)","v":""},{"$f":"IF(MainRaw!E260=\"\", \"\", MainRaw!E260)","v":""},{"$f":"IF(MainRaw!H260=\"\", \"\", MainRaw!H260)","v":""},{"$f":"IF(MainRaw!J260=\"\", \"\", MainRaw!J260)","v":""},{"$f":"IF(MainRaw!K260=\"\", \"\", MainRaw!K260)","v":""},{"$f":"IF(MainRaw!L260=\"\", \"\", MainRaw!L260)","v":""},{"$f":"IF(MainRaw!M260=\"\", \"\", MainRaw!M260)","v":""},{"$f":"IF(MainRaw!R260=\"\", \"\", MainRaw!R260)","v":""},{"$f":"IF(MainRaw!S260=\"\", \"\", MainRaw!S260)","v":""}," -  - ",{"$f":"IF(MainRaw!L260=\"\", \"\", MainRaw!L260)","v":""},{"$f":"IF(MainRaw!M260=\"\", \"\", MainRaw!M260)","v":""},{"$f":"IF(MainRaw!N260=\"\", \"\", MainRaw!N260)","v":""},{"$f":"IF(MainRaw!O260=\"\", \"\", MainRaw!O260)","v":""},{"$f":"IF(MainRaw!P260=\"\", \"\", MainRaw!P260)","v":""},{"$f":"IF(MainRaw!Q260=\"\", \"\", MainRaw!Q260)","v":""}]
[{"$f":"IF(MainRaw!A261=\"\", \"\", MainRaw!A261)","v":""},{"$f":"IF(MainRaw!B261=\"\", \"\", MainRaw!B261)","v":""},{"$f":"IF(MainRaw!E261=\"\", \"\", MainRaw!E261)","v":""},{"$f":"IF(MainRaw!H261=\"\", \"\", MainRaw!H261)","v":""},{"$f":"IF(MainRaw!J261=\"\", \"\", MainRaw!J261)","v":""},{"$f":"IF(MainRaw!K261=\"\", \"\", MainRaw!K261)","v":""},{"$f":"IF(MainRaw!L261=\"\", \"\", MainRaw!L261)","v":""},{"$f":"IF(MainRaw!M261=\"\", \"\", MainRaw!M261)","v":""},{"$f":"IF(MainRaw!R261=\"\", \"\", MainRaw!R261)","v":""},{"$f":"IF(MainRaw!S261=\"\", \"\", MainRaw!S261)","v":""}," -  - ",{"$f":"IF(MainRaw!L261=\"\", \"\", MainRaw!L261)","v":""},{"$f":"IF(MainRaw!M261=\"\", \"\", MainRaw!M261)","v":""},{"$f":"IF(MainRaw!N261=\"\", \"\", MainRaw!N261)","v":""},{"$f":"IF(MainRaw!O261=\"\", \"\", MainRaw!O261)","v":""},{"$f":"IF(MainRaw!P261=\"\", \"\", MainRaw!P261)","v":""},{"$f":"IF(MainRaw!Q261=\"\", \"\", MainRaw!Q261)","v":""}]
[{"$f":"IF(MainRaw!A262=\"\", \"\", MainRaw!A262)","v":""},{"$f":"IF(MainRaw!B262=\"\", \"\", MainRaw!B262)","v":""},{"$f":"IF(MainRaw!E262=\"\", \"\", MainRaw!E262)","v":""},{"$f":"IF(MainRaw!H262=\"\", \"\", MainRaw!H262)","v":""},{"$f":"IF(MainRaw!J262=\"\", \"\", MainRaw!J262)","v":""},{"$f":"IF(MainRaw!K262=\"\", \"\", MainRaw!K262)","v":""},{"$f":"IF(MainRaw!L262=\"\", \"\", MainRaw!L262)","v":""},{"$f":"IF(MainRaw!M262=\"\", \"\", MainRaw!M262)","v":""},{"$f":"IF(MainRaw!R262=\"\", \"\", MainRaw!R262)","v":""},{"$f":"IF(MainRaw!S262=\"\", \"\", MainRaw!S262)","v":""}," -  - ",{"$f":"IF(MainRaw!L262=\"\", \"\", MainRaw!L262)","v":""},{"$f":"IF(MainRaw!M262=\"\", \"\", MainRaw!M262)","v":""},{"$f":"IF(MainRaw!N262=\"\", \"\", MainRaw!N262)","v":""},{"$f":"IF(MainRaw!O262=\"\", \"\", MainRaw!O262)","v":""},{"$f":"IF(MainRaw!P262=\"\", \"\", MainRaw!P262)","v":""},{"$f":"IF(MainRaw!Q262=\"\", \"\", MainRaw!Q262)","v":""}]
[{"$f":"IF(MainRaw!A263=\"\", \"\", MainRaw!A263)","v":""},{"$f":"IF(MainRaw!B263=\"\", \"\", MainRaw!B263)","v":""},{"$f":"IF(MainRaw!E263=\"\", \"\", MainRaw!E263)","v":""},{"$f":"IF(MainRaw!H263=\"\", \"\", MainRaw!H263)","v":""},{"$f":"IF(MainRaw!J263=\"\", \"\", MainRaw!J263)","v":""},{"$f":"IF(MainRaw!K263=\"\", \"\", MainRaw!K263)","v":""},{"$f":"IF(MainRaw!L263=\"\", \"\", MainRaw!L263)","v":""},{"$f":"IF(MainRaw!M263=\"\", \"\", MainRaw!M263)","v":""},{"$f":"IF(MainRaw!R263=\"\", \"\", MainRaw!R263)","v":""},{"$f":"IF(MainRaw!S263=\"\", \"\", MainRaw!S263)","v":""}," -  - ",{"$f":"IF(MainRaw!L263=\"\", \"\", MainRaw!L263)","v":""},{"$f":"IF(MainRaw!M263=\"\", \"\", MainRaw!M263)","v":""},{"$f":"IF(MainRaw!N263=\"\", \"\", MainRaw!N263)","v":""},{"$f":"IF(MainRaw!O263=\"\", \"\", MainRaw!O263)","v":""},{"$f":"IF(MainRaw!P263=\"\", \"\", MainRaw!P263)","v":""},{"$f":"IF(MainRaw!Q263=\"\", \"\", MainRaw!Q263)","v":""}]
[{"$f":"IF(MainRaw!A264=\"\", \"\", MainRaw!A264)","v":""},{"$f":"IF(MainRaw!B264=\"\", \"\", MainRaw!B264)","v":""},{"$f":"IF(MainRaw!E264=\"\", \"\", MainRaw!E264)","v":""},{"$f":"IF(MainRaw!H264=\"\", \"\", MainRaw!H264)","v":""},{"$f":"IF(MainRaw!J264=\"\", \"\", MainRaw!J264)","v":""},{"$f":"IF(MainRaw!K264=\"\", \"\", MainRaw!K264)","v":""},{"$f":"IF(MainRaw!L264=\"\", \"\", MainRaw!L264)","v":""},{"$f":"IF(MainRaw!M264=\"\", \"\", MainRaw!M264)","v":""},{"$f":"IF(MainRaw!R264=\"\", \"\", MainRaw!R264)","v":""},{"$f":"IF(MainRaw!S264=\"\", \"\", MainRaw!S264)","v":""},{"$f":"A265 & \" - \" & B265 & \" - \" & I265","v":" -  - "},{"$f":"IF(MainRaw!L264=\"\", \"\", MainRaw!L264)","v":""},{"$f":"IF(MainRaw!M264=\"\", \"\", MainRaw!M264)","v":""},{"$f":"IF(MainRaw!N264=\"\", \"\", MainRaw!N264)","v":""},{"$f":"IF(MainRaw!O264=\"\", \"\", MainRaw!O264)","v":""},{"$f":"IF(MainRaw!P264=\"\", \"\", MainRaw!P264)","v":""},{"$f":"IF(MainRaw!Q264=\"\", \"\", MainRaw!Q264)","v":""}]
[{"$f":"IF(MainRaw!A265=\"\", \"\", MainRaw!A265)","v":""},{"$f":"IF(MainRaw!B265=\"\", \"\", MainRaw!B265)","v":""},{"$f":"IF(MainRaw!E265=\"\", \"\", MainRaw!E265)","v":""},{"$f":"IF(MainRaw!H265=\"\", \"\", MainRaw!H265)","v":""},{"$f":"IF(MainRaw!J265=\"\", \"\", MainRaw!J265)","v":""},{"$f":"IF(MainRaw!K265=\"\", \"\", MainRaw!K265)","v":""},{"$f":"IF(MainRaw!L265=\"\", \"\", MainRaw!L265)","v":""},{"$f":"IF(MainRaw!M265=\"\", \"\", MainRaw!M265)","v":""},{"$f":"IF(MainRaw!R265=\"\", \"\", MainRaw!R265)","v":""},{"$f":"IF(MainRaw!S265=\"\", \"\", MainRaw!S265)","v":""}," -  - ",{"$f":"IF(MainRaw!L265=\"\", \"\", MainRaw!L265)","v":""},{"$f":"IF(MainRaw!M265=\"\", \"\", MainRaw!M265)","v":""},{"$f":"IF(MainRaw!N265=\"\", \"\", MainRaw!N265)","v":""},{"$f":"IF(MainRaw!O265=\"\", \"\", MainRaw!O265)","v":""},{"$f":"IF(MainRaw!P265=\"\", \"\", MainRaw!P265)","v":""},{"$f":"IF(MainRaw!Q265=\"\", \"\", MainRaw!Q265)","v":""}]
[{"$f":"IF(MainRaw!A266=\"\", \"\", MainRaw!A266)","v":""},{"$f":"IF(MainRaw!B266=\"\", \"\", MainRaw!B266)","v":""},{"$f":"IF(MainRaw!E266=\"\", \"\", MainRaw!E266)","v":""},{"$f":"IF(MainRaw!H266=\"\", \"\", MainRaw!H266)","v":""},{"$f":"IF(MainRaw!J266=\"\", \"\", MainRaw!J266)","v":""},{"$f":"IF(MainRaw!K266=\"\", \"\", MainRaw!K266)","v":""},{"$f":"IF(MainRaw!L266=\"\", \"\", MainRaw!L266)","v":""},{"$f":"IF(MainRaw!M266=\"\", \"\", MainRaw!M266)","v":""},{"$f":"IF(MainRaw!R266=\"\", \"\", MainRaw!R266)","v":""},{"$f":"IF(MainRaw!S266=\"\", \"\", MainRaw!S266)","v":""}," -  - ",{"$f":"IF(MainRaw!L266=\"\", \"\", MainRaw!L266)","v":""},{"$f":"IF(MainRaw!M266=\"\", \"\", MainRaw!M266)","v":""},{"$f":"IF(MainRaw!N266=\"\", \"\", MainRaw!N266)","v":""},{"$f":"IF(MainRaw!O266=\"\", \"\", MainRaw!O266)","v":""},{"$f":"IF(MainRaw!P266=\"\", \"\", MainRaw!P266)","v":""},{"$f":"IF(MainRaw!Q266=\"\", \"\", MainRaw!Q266)","v":""}]
[{"$f":"IF(MainRaw!A267=\"\", \"\", MainRaw!A267)","v":""},{"$f":"IF(MainRaw!B267=\"\", \"\", MainRaw!B267)","v":""},{"$f":"IF(MainRaw!E267=\"\", \"\", MainRaw!E267)","v":""},{"$f":"IF(MainRaw!H267=\"\", \"\", MainRaw!H267)","v":""},{"$f":"IF(MainRaw!J267=\"\", \"\", MainRaw!J267)","v":""},{"$f":"IF(MainRaw!K267=\"\", \"\", MainRaw!K267)","v":""},{"$f":"IF(MainRaw!L267=\"\", \"\", MainRaw!L267)","v":""},{"$f":"IF(MainRaw!M267=\"\", \"\", MainRaw!M267)","v":""},{"$f":"IF(MainRaw!R267=\"\", \"\", MainRaw!R267)","v":""},{"$f":"IF(MainRaw!S267=\"\", \"\", MainRaw!S267)","v":""}," -  - ",{"$f":"IF(MainRaw!L267=\"\", \"\", MainRaw!L267)","v":""},{"$f":"IF(MainRaw!M267=\"\", \"\", MainRaw!M267)","v":""},{"$f":"IF(MainRaw!N267=\"\", \"\", MainRaw!N267)","v":""},{"$f":"IF(MainRaw!O267=\"\", \"\", MainRaw!O267)","v":""},{"$f":"IF(MainRaw!P267=\"\", \"\", MainRaw!P267)","v":""},{"$f":"IF(MainRaw!Q267=\"\", \"\", MainRaw!Q267)","v":""}]
[{"$f":"IF(MainRaw!A268=\"\", \"\", MainRaw!A268)","v":""},{"$f":"IF(MainRaw!B268=\"\", \"\", MainRaw!B268)","v":""},{"$f":"IF(MainRaw!E268=\"\", \"\", MainRaw!E268)","v":""},{"$f":"IF(MainRaw!H268=\"\", \"\", MainRaw!H268)","v":""},{"$f":"IF(MainRaw!J268=\"\", \"\", MainRaw!J268)","v":""},{"$f":"IF(MainRaw!K268=\"\", \"\", MainRaw!K268)","v":""},{"$f":"IF(MainRaw!L268=\"\", \"\", MainRaw!L268)","v":""},{"$f":"IF(MainRaw!M268=\"\", \"\", MainRaw!M268)","v":""},{"$f":"IF(MainRaw!R268=\"\", \"\", MainRaw!R268)","v":""},{"$f":"IF(MainRaw!S268=\"\", \"\", MainRaw!S268)","v":""}," -  - ",{"$f":"IF(MainRaw!L268=\"\", \"\", MainRaw!L268)","v":""},{"$f":"IF(MainRaw!M268=\"\", \"\", MainRaw!M268)","v":""},{"$f":"IF(MainRaw!N268=\"\", \"\", MainRaw!N268)","v":""},{"$f":"IF(MainRaw!O268=\"\", \"\", MainRaw!O268)","v":""},{"$f":"IF(MainRaw!P268=\"\", \"\", MainRaw!P268)","v":""},{"$f":"IF(MainRaw!Q268=\"\", \"\", MainRaw!Q268)","v":""}]
[{"$f":"IF(MainRaw!A269=\"\", \"\", MainRaw!A269)","v":""},{"$f":"IF(MainRaw!B269=\"\", \"\", MainRaw!B269)","v":""},{"$f":"IF(MainRaw!E269=\"\", \"\", MainRaw!E269)","v":""},{"$f":"IF(MainRaw!H269=\"\", \"\", MainRaw!H269)","v":""},{"$f":"IF(MainRaw!J269=\"\", \"\", MainRaw!J269)","v":""},{"$f":"IF(MainRaw!K269=\"\", \"\", MainRaw!K269)","v":""},{"$f":"IF(MainRaw!L269=\"\", \"\", MainRaw!L269)","v":""},{"$f":"IF(MainRaw!M269=\"\", \"\", MainRaw!M269)","v":""},{"$f":"IF(MainRaw!R269=\"\", \"\", MainRaw!R269)","v":""},{"$f":"IF(MainRaw!S269=\"\", \"\", MainRaw!S269)","v":""}," -  - ",{"$f":"IF(MainRaw!L269=\"\", \"\", MainRaw!L269)","v":""},{"$f":"IF(MainRaw!M269=\"\", \"\", MainRaw!M269)","v":""},{"$f":"IF(MainRaw!N269=\"\", \"\", MainRaw!N269)","v":""},{"$f":"IF(MainRaw!O269=\"\", \"\", MainRaw!O269)","v":""},{"$f":"IF(MainRaw!P269=\"\", \"\", MainRaw!P269)","v":""},{"$f":"IF(MainRaw!Q269=\"\", \"\", MainRaw!Q269)","v":""}]
[{"$f":"IF(MainRaw!A270=\"\", \"\", MainRaw!A270)","v":""},{"$f":"IF(MainRaw!B270=\"\", \"\", MainRaw!B270)","v":""},{"$f":"IF(MainRaw!E270=\"\", \"\", MainRaw!E270)","v":""},{"$f":"IF(MainRaw!H270=\"\", \"\", MainRaw!H270)","v":""},{"$f":"IF(MainRaw!J270=\"\", \"\", MainRaw!J270)","v":""},{"$f":"IF(MainRaw!K270=\"\", \"\", MainRaw!K270)","v":""},{"$f":"IF(MainRaw!L270=\"\", \"\", MainRaw!L270)","v":""},{"$f":"IF(MainRaw!M270=\"\", \"\", MainRaw!M270)","v":""},{"$f":"IF(MainRaw!R270=\"\", \"\", MainRaw!R270)","v":""},{"$f":"IF(MainRaw!S270=\"\", \"\", MainRaw!S270)","v":""}," -  - ",{"$f":"IF(MainRaw!L270=\"\", \"\", MainRaw!L270)","v":""},{"$f":"IF(MainRaw!M270=\"\", \"\", MainRaw!M270)","v":""},{"$f":"IF(MainRaw!N270=\"\", \"\", MainRaw!N270)","v":""},{"$f":"IF(MainRaw!O270=\"\", \"\", MainRaw!O270)","v":""},{"$f":"IF(MainRaw!P270=\"\", \"\", MainRaw!P270)","v":""},{"$f":"IF(MainRaw!Q270=\"\", \"\", MainRaw!Q270)","v":""}]
[{"$f":"IF(MainRaw!A271=\"\", \"\", MainRaw!A271)","v":""},{"$f":"IF(MainRaw!B271=\"\", \"\", MainRaw!B271)","v":""},{"$f":"IF(MainRaw!E271=\"\", \"\", MainRaw!E271)","v":""},{"$f":"IF(MainRaw!H271=\"\", \"\", MainRaw!H271)","v":""},{"$f":"IF(MainRaw!J271=\"\", \"\", MainRaw!J271)","v":""},{"$f":"IF(MainRaw!K271=\"\", \"\", MainRaw!K271)","v":""},{"$f":"IF(MainRaw!L271=\"\", \"\", MainRaw!L271)","v":""},{"$f":"IF(MainRaw!M271=\"\", \"\", MainRaw!M271)","v":""},{"$f":"IF(MainRaw!R271=\"\", \"\", MainRaw!R271)","v":""},{"$f":"IF(MainRaw!S271=\"\", \"\", MainRaw!S271)","v":""}," -  - ",{"$f":"IF(MainRaw!L271=\"\", \"\", MainRaw!L271)","v":""},{"$f":"IF(MainRaw!M271=\"\", \"\", MainRaw!M271)","v":""},{"$f":"IF(MainRaw!N271=\"\", \"\", MainRaw!N271)","v":""},{"$f":"IF(MainRaw!O271=\"\", \"\", MainRaw!O271)","v":""},{"$f":"IF(MainRaw!P271=\"\", \"\", MainRaw!P271)","v":""},{"$f":"IF(MainRaw!Q271=\"\", \"\", MainRaw!Q271)","v":""}]
[{"$f":"IF(MainRaw!A272=\"\", \"\", MainRaw!A272)","v":""},{"$f":"IF(MainRaw!B272=\"\", \"\", MainRaw!B272)","v":""},{"$f":"IF(MainRaw!E272=\"\", \"\", MainRaw!E272)","v":""},{"$f":"IF(MainRaw!H272=\"\", \"\", MainRaw!H272)","v":""},{"$f":"IF(MainRaw!J272=\"\", \"\", MainRaw!J272)","v":""},{"$f":"IF(MainRaw!K272=\"\", \"\", MainRaw!K272)","v":""},{"$f":"IF(MainRaw!L272=\"\", \"\", MainRaw!L272)","v":""},{"$f":"IF(MainRaw!M272=\"\", \"\", MainRaw!M272)","v":""},{"$f":"IF(MainRaw!R272=\"\", \"\", MainRaw!R272)","v":""},{"$f":"IF(MainRaw!S272=\"\", \"\", MainRaw!S272)","v":""}," -  - ",{"$f":"IF(MainRaw!L272=\"\", \"\", MainRaw!L272)","v":""},{"$f":"IF(MainRaw!M272=\"\", \"\", MainRaw!M272)","v":""},{"$f":"IF(MainRaw!N272=\"\", \"\", MainRaw!N272)","v":""},{"$f":"IF(MainRaw!O272=\"\", \"\", MainRaw!O272)","v":""},{"$f":"IF(MainRaw!P272=\"\", \"\", MainRaw!P272)","v":""},{"$f":"IF(MainRaw!Q272=\"\", \"\", MainRaw!Q272)","v":""}]
[{"$f":"IF(MainRaw!A273=\"\", \"\", MainRaw!A273)","v":""},{"$f":"IF(MainRaw!B273=\"\", \"\", MainRaw!B273)","v":""},{"$f":"IF(MainRaw!E273=\"\", \"\", MainRaw!E273)","v":""},{"$f":"IF(MainRaw!H273=\"\", \"\", MainRaw!H273)","v":""},{"$f":"IF(MainRaw!J273=\"\", \"\", MainRaw!J273)","v":""},{"$f":"IF(MainRaw!K273=\"\", \"\", MainRaw!K273)","v":""},{"$f":"IF(MainRaw!L273=\"\", \"\", MainRaw!L273)","v":""},{"$f":"IF(MainRaw!M273=\"\", \"\", MainRaw!M273)","v":""},{"$f":"IF(MainRaw!R273=\"\", \"\", MainRaw!R273)","v":""},{"$f":"IF(MainRaw!S273=\"\", \"\", MainRaw!S273)","v":""}," -  - ",{"$f":"IF(MainRaw!L273=\"\", \"\", MainRaw!L273)","v":""},{"$f":"IF(MainRaw!M273=\"\", \"\", MainRaw!M273)","v":""},{"$f":"IF(MainRaw!N273=\"\", \"\", MainRaw!N273)","v":""},{"$f":"IF(MainRaw!O273=\"\", \"\", MainRaw!O273)","v":""},{"$f":"IF(MainRaw!P273=\"\", \"\", MainRaw!P273)","v":""},{"$f":"IF(MainRaw!Q273=\"\", \"\", MainRaw!Q273)","v":""}]
[{"$f":"IF(MainRaw!A274=\"\", \"\", MainRaw!A274)","v":""},{"$f":"IF(MainRaw!B274=\"\", \"\", MainRaw!B274)","v":""},{"$f":"IF(MainRaw!E274=\"\", \"\", MainRaw!E274)","v":""},{"$f":"IF(MainRaw!H274=\"\", \"\", MainRaw!H274)","v":""},{"$f":"IF(MainRaw!J274=\"\", \"\", MainRaw!J274)","v":""},{"$f":"IF(MainRaw!K274=\"\", \"\", MainRaw!K274)","v":""},{"$f":"IF(MainRaw!L274=\"\", \"\", MainRaw!L274)","v":""},{"$f":"IF(MainRaw!M274=\"\", \"\", MainRaw!M274)","v":""},{"$f":"IF(MainRaw!R274=\"\", \"\", MainRaw!R274)","v":""},{"$f":"IF(MainRaw!S274=\"\", \"\", MainRaw!S274)","v":""}," -  - ",{"$f":"IF(MainRaw!L274=\"\", \"\", MainRaw!L274)","v":""},{"$f":"IF(MainRaw!M274=\"\", \"\", MainRaw!M274)","v":""},{"$f":"IF(MainRaw!N274=\"\", \"\", MainRaw!N274)","v":""},{"$f":"IF(MainRaw!O274=\"\", \"\", MainRaw!O274)","v":""},{"$f":"IF(MainRaw!P274=\"\", \"\", MainRaw!P274)","v":""},{"$f":"IF(MainRaw!Q274=\"\", \"\", MainRaw!Q274)","v":""}]
[{"$f":"IF(MainRaw!A275=\"\", \"\", MainRaw!A275)","v":""},{"$f":"IF(MainRaw!B275=\"\", \"\", MainRaw!B275)","v":""},{"$f":"IF(MainRaw!E275=\"\", \"\", MainRaw!E275)","v":""},{"$f":"IF(MainRaw!H275=\"\", \"\", MainRaw!H275)","v":""},{"$f":"IF(MainRaw!J275=\"\", \"\", MainRaw!J275)","v":""},{"$f":"IF(MainRaw!K275=\"\", \"\", MainRaw!K275)","v":""},{"$f":"IF(MainRaw!L275=\"\", \"\", MainRaw!L275)","v":""},{"$f":"IF(MainRaw!M275=\"\", \"\", MainRaw!M275)","v":""},{"$f":"IF(MainRaw!R275=\"\", \"\", MainRaw!R275)","v":""},{"$f":"IF(MainRaw!S275=\"\", \"\", MainRaw!S275)","v":""}," -  - ",{"$f":"IF(MainRaw!L275=\"\", \"\", MainRaw!L275)","v":""},{"$f":"IF(MainRaw!M275=\"\", \"\", MainRaw!M275)","v":""},{"$f":"IF(MainRaw!N275=\"\", \"\", MainRaw!N275)","v":""},{"$f":"IF(MainRaw!O275=\"\", \"\", MainRaw!O275)","v":""},{"$f":"IF(MainRaw!P275=\"\", \"\", MainRaw!P275)","v":""},{"$f":"IF(MainRaw!Q275=\"\", \"\", MainRaw!Q275)","v":""}]
[{"$f":"IF(MainRaw!A276=\"\", \"\", MainRaw!A276)","v":""},{"$f":"IF(MainRaw!B276=\"\", \"\", MainRaw!B276)","v":""},{"$f":"IF(MainRaw!E276=\"\", \"\", MainRaw!E276)","v":""},{"$f":"IF(MainRaw!H276=\"\", \"\", MainRaw!H276)","v":""},{"$f":"IF(MainRaw!J276=\"\", \"\", MainRaw!J276)","v":""},{"$f":"IF(MainRaw!K276=\"\", \"\", MainRaw!K276)","v":""},{"$f":"IF(MainRaw!L276=\"\", \"\", MainRaw!L276)","v":""},{"$f":"IF(MainRaw!M276=\"\", \"\", MainRaw!M276)","v":""},{"$f":"IF(MainRaw!R276=\"\", \"\", MainRaw!R276)","v":""},{"$f":"IF(MainRaw!S276=\"\", \"\", MainRaw!S276)","v":""}," -  - ",{"$f":"IF(MainRaw!L276=\"\", \"\", MainRaw!L276)","v":""},{"$f":"IF(MainRaw!M276=\"\", \"\", MainRaw!M276)","v":""},{"$f":"IF(MainRaw!N276=\"\", \"\", MainRaw!N276)","v":""},{"$f":"IF(MainRaw!O276=\"\", \"\", MainRaw!O276)","v":""},{"$f":"IF(MainRaw!P276=\"\", \"\", MainRaw!P276)","v":""},{"$f":"IF(MainRaw!Q276=\"\", \"\", MainRaw!Q276)","v":""}]
[{"$f":"IF(MainRaw!A277=\"\", \"\", MainRaw!A277)","v":""},{"$f":"IF(MainRaw!B277=\"\", \"\", MainRaw!B277)","v":""},{"$f":"IF(MainRaw!E277=\"\", \"\", MainRaw!E277)","v":""},{"$f":"IF(MainRaw!H277=\"\", \"\", MainRaw!H277)","v":""},{"$f":"IF(MainRaw!J277=\"\", \"\", MainRaw!J277)","v":""},{"$f":"IF(MainRaw!K277=\"\", \"\", MainRaw!K277)","v":""},{"$f":"IF(MainRaw!L277=\"\", \"\", MainRaw!L277)","v":""},{"$f":"IF(MainRaw!M277=\"\", \"\", MainRaw!M277)","v":""},{"$f":"IF(MainRaw!R277=\"\", \"\", MainRaw!R277)","v":""},{"$f":"IF(MainRaw!S277=\"\", \"\", MainRaw!S277)","v":""}," -  - ",{"$f":"IF(MainRaw!L277=\"\", \"\", MainRaw!L277)","v":""},{"$f":"IF(MainRaw!M277=\"\", \"\", MainRaw!M277)","v":""},{"$f":"IF(MainRaw!N277=\"\", \"\", MainRaw!N277)","v":""},{"$f":"IF(MainRaw!O277=\"\", \"\", MainRaw!O277)","v":""},{"$f":"IF(MainRaw!P277=\"\", \"\", MainRaw!P277)","v":""},{"$f":"IF(MainRaw!Q277=\"\", \"\", MainRaw!Q277)","v":""}]
[{"$f":"IF(MainRaw!A278=\"\", \"\", MainRaw!A278)","v":""},{"$f":"IF(MainRaw!B278=\"\", \"\", MainRaw!B278)","v":""},{"$f":"IF(MainRaw!E278=\"\", \"\", MainRaw!E278)","v":""},{"$f":"IF(MainRaw!H278=\"\", \"\", MainRaw!H278)","v":""},{"$f":"IF(MainRaw!J278=\"\", \"\", MainRaw!J278)","v":""},{"$f":"IF(MainRaw!K278=\"\", \"\", MainRaw!K278)","v":""},{"$f":"IF(MainRaw!L278=\"\", \"\", MainRaw!L278)","v":""},{"$f":"IF(MainRaw!M278=\"\", \"\", MainRaw!M278)","v":""},{"$f":"IF(MainRaw!R278=\"\", \"\", MainRaw!R278)","v":""},{"$f":"IF(MainRaw!S278=\"\", \"\", MainRaw!S278)","v":""}," -  - ",{"$f":"IF(MainRaw!L278=\"\", \"\", MainRaw!L278)","v":""},{"$f":"IF(MainRaw!M278=\"\", \"\", MainRaw!M278)","v":""},{"$f":"IF(MainRaw!N278=\"\", \"\", MainRaw!N278)","v":""},{"$f":"IF(MainRaw!O278=\"\", \"\", MainRaw!O278)","v":""},{"$f":"IF(MainRaw!P278=\"\", \"\", MainRaw!P278)","v":""},{"$f":"IF(MainRaw!Q278=\"\", \"\", MainRaw!Q278)","v":""}]
[{"$f":"IF(MainRaw!A279=\"\", \"\", MainRaw!A279)","v":""},{"$f":"IF(MainRaw!B279=\"\", \"\", MainRaw!B279)","v":""},{"$f":"IF(MainRaw!E279=\"\", \"\", MainRaw!E279)","v":""},{"$f":"IF(MainRaw!H279=\"\", \"\", MainRaw!H279)","v":""},{"$f":"IF(MainRaw!J279=\"\", \"\", MainRaw!J279)","v":""},{"$f":"IF(MainRaw!K279=\"\", \"\", MainRaw!K279)","v":""},{"$f":"IF(MainRaw!L279=\"\", \"\", MainRaw!L279)","v":""},{"$f":"IF(MainRaw!M279=\"\", \"\", MainRaw!M279)","v":""},{"$f":"IF(MainRaw!R279=\"\", \"\", MainRaw!R279)","v":""},{"$f":"IF(MainRaw!S279=\"\", \"\", MainRaw!S279)","v":""}," -  - ",{"$f":"IF(MainRaw!L279=\"\", \"\", MainRaw!L279)","v":""},{"$f":"IF(MainRaw!M279=\"\", \"\", MainRaw!M279)","v":""},{"$f":"IF(MainRaw!N279=\"\", \"\", MainRaw!N279)","v":""},{"$f":"IF(MainRaw!O279=\"\", \"\", MainRaw!O279)","v":""},{"$f":"IF(MainRaw!P279=\"\", \"\", MainRaw!P279)","v":""},{"$f":"IF(MainRaw!Q279=\"\", \"\", MainRaw!Q279)","v":""}]
[{"$f":"IF(MainRaw!A280=\"\", \"\", MainRaw!A280)","v":""},{"$f":"IF(MainRaw!B280=\"\", \"\", MainRaw!B280)","v":""},{"$f":"IF(MainRaw!E280=\"\", \"\", MainRaw!E280)","v":""},{"$f":"IF(MainRaw!H280=\"\", \"\", MainRaw!H280)","v":""},{"$f":"IF(MainRaw!J280=\"\", \"\", MainRaw!J280)","v":""},{"$f":"IF(MainRaw!K280=\"\", \"\", MainRaw!K280)","v":""},{"$f":"IF(MainRaw!L280=\"\", \"\", MainRaw!L280)","v":""},{"$f":"IF(MainRaw!M280=\"\", \"\", MainRaw!M280)","v":""},{"$f":"IF(MainRaw!R280=\"\", \"\", MainRaw!R280)","v":""},{"$f":"IF(MainRaw!S280=\"\", \"\", MainRaw!S280)","v":""}," -  - ",{"$f":"IF(MainRaw!L280=\"\", \"\", MainRaw!L280)","v":""},{"$f":"IF(MainRaw!M280=\"\", \"\", MainRaw!M280)","v":""},{"$f":"IF(MainRaw!N280=\"\", \"\", MainRaw!N280)","v":""},{"$f":"IF(MainRaw!O280=\"\", \"\", MainRaw!O280)","v":""},{"$f":"IF(MainRaw!P280=\"\", \"\", MainRaw!P280)","v":""},{"$f":"IF(MainRaw!Q280=\"\", \"\", MainRaw!Q280)","v":""}]
[{"$f":"IF(MainRaw!A281=\"\", \"\", MainRaw!A281)","v":""},{"$f":"IF(MainRaw!B281=\"\", \"\", MainRaw!B281)","v":""},{"$f":"IF(MainRaw!E281=\"\", \"\", MainRaw!E281)","v":""},{"$f":"IF(MainRaw!H281=\"\", \"\", MainRaw!H281)","v":""},{"$f":"IF(MainRaw!J281=\"\", \"\", MainRaw!J281)","v":""},{"$f":"IF(MainRaw!K281=\"\", \"\", MainRaw!K281)","v":""},{"$f":"IF(MainRaw!L281=\"\", \"\", MainRaw!L281)","v":""},{"$f":"IF(MainRaw!M281=\"\", \"\", MainRaw!M281)","v":""},{"$f":"IF(MainRaw!R281=\"\", \"\", MainRaw!R281)","v":""},{"$f":"IF(MainRaw!S281=\"\", \"\", MainRaw!S281)","v":""}," -  - ",{"$f":"IF(MainRaw!L281=\"\", \"\", MainRaw!L281)","v":""},{"$f":"IF(MainRaw!M281=\"\", \"\", MainRaw!M281)","v":""},{"$f":"IF(MainRaw!N281=\"\", \"\", MainRaw!N281)","v":""},{"$f":"IF(MainRaw!O281=\"\", \"\", MainRaw!O281)","v":""},{"$f":"IF(MainRaw!P281=\"\", \"\", MainRaw!P281)","v":""},{"$f":"IF(MainRaw!Q281=\"\", \"\", MainRaw!Q281)","v":""}]
[{"$f":"IF(MainRaw!A282=\"\", \"\", MainRaw!A282)","v":""},{"$f":"IF(MainRaw!B282=\"\", \"\", MainRaw!B282)","v":""},{"$f":"IF(MainRaw!E282=\"\", \"\", MainRaw!E282)","v":""},{"$f":"IF(MainRaw!H282=\"\", \"\", MainRaw!H282)","v":""},{"$f":"IF(MainRaw!J282=\"\", \"\", MainRaw!J282)","v":""},{"$f":"IF(MainRaw!K282=\"\", \"\", MainRaw!K282)","v":""},{"$f":"IF(MainRaw!L282=\"\", \"\", MainRaw!L282)","v":""},{"$f":"IF(MainRaw!M282=\"\", \"\", MainRaw!M282)","v":""},{"$f":"IF(MainRaw!R282=\"\", \"\", MainRaw!R282)","v":""},{"$f":"IF(MainRaw!S282=\"\", \"\", MainRaw!S282)","v":""}," -  - ",{"$f":"IF(MainRaw!L282=\"\", \"\", MainRaw!L282)","v":""},{"$f":"IF(MainRaw!M282=\"\", \"\", MainRaw!M282)","v":""},{"$f":"IF(MainRaw!N282=\"\", \"\", MainRaw!N282)","v":""},{"$f":"IF(MainRaw!O282=\"\", \"\", MainRaw!O282)","v":""},{"$f":"IF(MainRaw!P282=\"\", \"\", MainRaw!P282)","v":""},{"$f":"IF(MainRaw!Q282=\"\", \"\", MainRaw!Q282)","v":""}]
[{"$f":"IF(MainRaw!A283=\"\", \"\", MainRaw!A283)","v":""},{"$f":"IF(MainRaw!B283=\"\", \"\", MainRaw!B283)","v":""},{"$f":"IF(MainRaw!E283=\"\", \"\", MainRaw!E283)","v":""},{"$f":"IF(MainRaw!H283=\"\", \"\", MainRaw!H283)","v":""},{"$f":"IF(MainRaw!J283=\"\", \"\", MainRaw!J283)","v":""},{"$f":"IF(MainRaw!K283=\"\", \"\", MainRaw!K283)","v":""},{"$f":"IF(MainRaw!L283=\"\", \"\", MainRaw!L283)","v":""},{"$f":"IF(MainRaw!M283=\"\", \"\", MainRaw!M283)","v":""},{"$f":"IF(MainRaw!R283=\"\", \"\", MainRaw!R283)","v":""},{"$f":"IF(MainRaw!S283=\"\", \"\", MainRaw!S283)","v":""}," -  - ",{"$f":"IF(MainRaw!L283=\"\", \"\", MainRaw!L283)","v":""},{"$f":"IF(MainRaw!M283=\"\", \"\", MainRaw!M283)","v":""},{"$f":"IF(MainRaw!N283=\"\", \"\", MainRaw!N283)","v":""},{"$f":"IF(MainRaw!O283=\"\", \"\", MainRaw!O283)","v":""},{"$f":"IF(MainRaw!P283=\"\", \"\", MainRaw!P283)","v":""},{"$f":"IF(MainRaw!Q283=\"\", \"\", MainRaw!Q283)","v":""}]
[{"$f":"IF(MainRaw!A284=\"\", \"\", MainRaw!A284)","v":""},{"$f":"IF(MainRaw!B284=\"\", \"\", MainRaw!B284)","v":""},{"$f":"IF(MainRaw!E284=\"\", \"\", MainRaw!E284)","v":""},{"$f":"IF(MainRaw!H284=\"\", \"\", MainRaw!H284)","v":""},{"$f":"IF(MainRaw!J284=\"\", \"\", MainRaw!J284)","v":""},{"$f":"IF(MainRaw!K284=\"\", \"\", MainRaw!K284)","v":""},{"$f":"IF(MainRaw!L284=\"\", \"\", MainRaw!L284)","v":""},{"$f":"IF(MainRaw!M284=\"\", \"\", MainRaw!M284)","v":""},{"$f":"IF(MainRaw!R284=\"\", \"\", MainRaw!R284)","v":""},{"$f":"IF(MainRaw!S284=\"\", \"\", MainRaw!S284)","v":""}," -  - ",{"$f":"IF(MainRaw!L284=\"\", \"\", MainRaw!L284)","v":""},{"$f":"IF(MainRaw!M284=\"\", \"\", MainRaw!M284)","v":""},{"$f":"IF(MainRaw!N284=\"\", \"\", MainRaw!N284)","v":""},{"$f":"IF(MainRaw!O284=\"\", \"\", MainRaw!O284)","v":""},{"$f":"IF(MainRaw!P284=\"\", \"\", MainRaw!P284)","v":""},{"$f":"IF(MainRaw!Q284=\"\", \"\", MainRaw!Q284)","v":""}]
[{"$f":"IF(MainRaw!A285=\"\", \"\", MainRaw!A285)","v":""},{"$f":"IF(MainRaw!B285=\"\", \"\", MainRaw!B285)","v":""},{"$f":"IF(MainRaw!E285=\"\", \"\", MainRaw!E285)","v":""},{"$f":"IF(MainRaw!H285=\"\", \"\", MainRaw!H285)","v":""},{"$f":"IF(MainRaw!J285=\"\", \"\", MainRaw!J285)","v":""},{"$f":"IF(MainRaw!K285=\"\", \"\", MainRaw!K285)","v":""},{"$f":"IF(MainRaw!L285=\"\", \"\", MainRaw!L285)","v":""},{"$f":"IF(MainRaw!M285=\"\", \"\", MainRaw!M285)","v":""},{"$f":"IF(MainRaw!R285=\"\", \"\", MainRaw!R285)","v":""},{"$f":"IF(MainRaw!S285=\"\", \"\", MainRaw!S285)","v":""}," -  - ",{"$f":"IF(MainRaw!L285=\"\", \"\", MainRaw!L285)","v":""},{"$f":"IF(MainRaw!M285=\"\", \"\", MainRaw!M285)","v":""},{"$f":"IF(MainRaw!N285=\"\", \"\", MainRaw!N285)","v":""},{"$f":"IF(MainRaw!O285=\"\", \"\", MainRaw!O285)","v":""},{"$f":"IF(MainRaw!P285=\"\", \"\", MainRaw!P285)","v":""},{"$f":"IF(MainRaw!Q285=\"\", \"\", MainRaw!Q285)","v":""}]
[{"$f":"IF(MainRaw!A286=\"\", \"\", MainRaw!A286)","v":""},{"$f":"IF(MainRaw!B286=\"\", \"\", MainRaw!B286)","v":""},{"$f":"IF(MainRaw!E286=\"\", \"\", MainRaw!E286)","v":""},{"$f":"IF(MainRaw!H286=\"\", \"\", MainRaw!H286)","v":""},{"$f":"IF(MainRaw!J286=\"\", \"\", MainRaw!J286)","v":""},{"$f":"IF(MainRaw!K286=\"\", \"\", MainRaw!K286)","v":""},{"$f":"IF(MainRaw!L286=\"\", \"\", MainRaw!L286)","v":""},{"$f":"IF(MainRaw!M286=\"\", \"\", MainRaw!M286)","v":""},{"$f":"IF(MainRaw!R286=\"\", \"\", MainRaw!R286)","v":""},{"$f":"IF(MainRaw!S286=\"\", \"\", MainRaw!S286)","v":""}," -  - ",{"$f":"IF(MainRaw!L286=\"\", \"\", MainRaw!L286)","v":""},{"$f":"IF(MainRaw!M286=\"\", \"\", MainRaw!M286)","v":""},{"$f":"IF(MainRaw!N286=\"\", \"\", MainRaw!N286)","v":""},{"$f":"IF(MainRaw!O286=\"\", \"\", MainRaw!O286)","v":""},{"$f":"IF(MainRaw!P286=\"\", \"\", MainRaw!P286)","v":""},{"$f":"IF(MainRaw!Q286=\"\", \"\", MainRaw!Q286)","v":""}]
[{"$f":"IF(MainRaw!A287=\"\", \"\", MainRaw!A287)","v":""},{"$f":"IF(MainRaw!B287=\"\", \"\", MainRaw!B287)","v":""},{"$f":"IF(MainRaw!E287=\"\", \"\", MainRaw!E287)","v":""},{"$f":"IF(MainRaw!H287=\"\", \"\", MainRaw!H287)","v":""},{"$f":"IF(MainRaw!J287=\"\", \"\", MainRaw!J287)","v":""},{"$f":"IF(MainRaw!K287=\"\", \"\", MainRaw!K287)","v":""},{"$f":"IF(MainRaw!L287=\"\", \"\", MainRaw!L287)","v":""},{"$f":"IF(MainRaw!M287=\"\", \"\", MainRaw!M287)","v":""},{"$f":"IF(MainRaw!R287=\"\", \"\", MainRaw!R287)","v":""},{"$f":"IF(MainRaw!S287=\"\", \"\", MainRaw!S287)","v":""}," -  - ",{"$f":"IF(MainRaw!L287=\"\", \"\", MainRaw!L287)","v":""},{"$f":"IF(MainRaw!M287=\"\", \"\", MainRaw!M287)","v":""},{"$f":"IF(MainRaw!N287=\"\", \"\", MainRaw!N287)","v":""},{"$f":"IF(MainRaw!O287=\"\", \"\", MainRaw!O287)","v":""},{"$f":"IF(MainRaw!P287=\"\", \"\", MainRaw!P287)","v":""},{"$f":"IF(MainRaw!Q287=\"\", \"\", MainRaw!Q287)","v":""}]
[{"$f":"IF(MainRaw!A288=\"\", \"\", MainRaw!A288)","v":""},{"$f":"IF(MainRaw!B288=\"\", \"\", MainRaw!B288)","v":""},{"$f":"IF(MainRaw!E288=\"\", \"\", MainRaw!E288)","v":""},{"$f":"IF(MainRaw!H288=\"\", \"\", MainRaw!H288)","v":""},{"$f":"IF(MainRaw!J288=\"\", \"\", MainRaw!J288)","v":""},{"$f":"IF(MainRaw!K288=\"\", \"\", MainRaw!K288)","v":""},{"$f":"IF(MainRaw!L288=\"\", \"\", MainRaw!L288)","v":""},{"$f":"IF(MainRaw!M288=\"\", \"\", MainRaw!M288)","v":""},{"$f":"IF(MainRaw!R288=\"\", \"\", MainRaw!R288)","v":""},{"$f":"IF(MainRaw!S288=\"\", \"\", MainRaw!S288)","v":""}," -  - ",{"$f":"IF(MainRaw!L288=\"\", \"\", MainRaw!L288)","v":""},{"$f":"IF(MainRaw!M288=\"\", \"\", MainRaw!M288)","v":""},{"$f":"IF(MainRaw!N288=\"\", \"\", MainRaw!N288)","v":""},{"$f":"IF(MainRaw!O288=\"\", \"\", MainRaw!O288)","v":""},{"$f":"IF(MainRaw!P288=\"\", \"\", MainRaw!P288)","v":""},{"$f":"IF(MainRaw!Q288=\"\", \"\", MainRaw!Q288)","v":""}]
[{"$f":"IF(MainRaw!A289=\"\", \"\", MainRaw!A289)","v":""},{"$f":"IF(MainRaw!B289=\"\", \"\", MainRaw!B289)","v":""},{"$f":"IF(MainRaw!E289=\"\", \"\", MainRaw!E289)","v":""},{"$f":"IF(MainRaw!H289=\"\", \"\", MainRaw!H289)","v":""},{"$f":"IF(MainRaw!J289=\"\", \"\", MainRaw!J289)","v":""},{"$f":"IF(MainRaw!K289=\"\", \"\", MainRaw!K289)","v":""},{"$f":"IF(MainRaw!L289=\"\", \"\", MainRaw!L289)","v":""},{"$f":"IF(MainRaw!M289=\"\", \"\", MainRaw!M289)","v":""},{"$f":"IF(MainRaw!R289=\"\", \"\", MainRaw!R289)","v":""},{"$f":"IF(MainRaw!S289=\"\", \"\", MainRaw!S289)","v":""}," -  - ",{"$f":"IF(MainRaw!L289=\"\", \"\", MainRaw!L289)","v":""},{"$f":"IF(MainRaw!M289=\"\", \"\", MainRaw!M289)","v":""},{"$f":"IF(MainRaw!N289=\"\", \"\", MainRaw!N289)","v":""},{"$f":"IF(MainRaw!O289=\"\", \"\", MainRaw!O289)","v":""},{"$f":"IF(MainRaw!P289=\"\", \"\", MainRaw!P289)","v":""},{"$f":"IF(MainRaw!Q289=\"\", \"\", MainRaw!Q289)","v":""}]
[{"$f":"IF(MainRaw!A290=\"\", \"\", MainRaw!A290)","v":""},{"$f":"IF(MainRaw!B290=\"\", \"\", MainRaw!B290)","v":""},{"$f":"IF(MainRaw!E290=\"\", \"\", MainRaw!E290)","v":""},{"$f":"IF(MainRaw!H290=\"\", \"\", MainRaw!H290)","v":""},{"$f":"IF(MainRaw!J290=\"\", \"\", MainRaw!J290)","v":""},{"$f":"IF(MainRaw!K290=\"\", \"\", MainRaw!K290)","v":""},{"$f":"IF(MainRaw!L290=\"\", \"\", MainRaw!L290)","v":""},{"$f":"IF(MainRaw!M290=\"\", \"\", MainRaw!M290)","v":""},{"$f":"IF(MainRaw!R290=\"\", \"\", MainRaw!R290)","v":""},{"$f":"IF(MainRaw!S290=\"\", \"\", MainRaw!S290)","v":""}," -  - ",{"$f":"IF(MainRaw!L290=\"\", \"\", MainRaw!L290)","v":""},{"$f":"IF(MainRaw!M290=\"\", \"\", MainRaw!M290)","v":""},{"$f":"IF(MainRaw!N290=\"\", \"\", MainRaw!N290)","v":""},{"$f":"IF(MainRaw!O290=\"\", \"\", MainRaw!O290)","v":""},{"$f":"IF(MainRaw!P290=\"\", \"\", MainRaw!P290)","v":""},{"$f":"IF(MainRaw!Q290=\"\", \"\", MainRaw!Q290)","v":""}]
[{"$f":"IF(MainRaw!A291=\"\", \"\", MainRaw!A291)","v":""},{"$f":"IF(MainRaw!B291=\"\", \"\", MainRaw!B291)","v":""},{"$f":"IF(MainRaw!E291=\"\", \"\", MainRaw!E291)","v":""},{"$f":"IF(MainRaw!H291=\"\", \"\", MainRaw!H291)","v":""},{"$f":"IF(MainRaw!J291=\"\", \"\", MainRaw!J291)","v":""},{"$f":"IF(MainRaw!K291=\"\", \"\", MainRaw!K291)","v":""},{"$f":"IF(MainRaw!L291=\"\", \"\", MainRaw!L291)","v":""},{"$f":"IF(MainRaw!M291=\"\", \"\", MainRaw!M291)","v":""},{"$f":"IF(MainRaw!R291=\"\", \"\", MainRaw!R291)","v":""},{"$f":"IF(MainRaw!S291=\"\", \"\", MainRaw!S291)","v":""}," -  - ",{"$f":"IF(MainRaw!L291=\"\", \"\", MainRaw!L291)","v":""},{"$f":"IF(MainRaw!M291=\"\", \"\", MainRaw!M291)","v":""},{"$f":"IF(MainRaw!N291=\"\", \"\", MainRaw!N291)","v":""},{"$f":"IF(MainRaw!O291=\"\", \"\", MainRaw!O291)","v":""},{"$f":"IF(MainRaw!P291=\"\", \"\", MainRaw!P291)","v":""},{"$f":"IF(MainRaw!Q291=\"\", \"\", MainRaw!Q291)","v":""}]
[{"$f":"IF(MainRaw!A292=\"\", \"\", MainRaw!A292)","v":""},{"$f":"IF(MainRaw!B292=\"\", \"\", MainRaw!B292)","v":""},{"$f":"IF(MainRaw!E292=\"\", \"\", MainRaw!E292)","v":""},{"$f":"IF(MainRaw!H292=\"\", \"\", MainRaw!H292)","v":""},{"$f":"IF(MainRaw!J292=\"\", \"\", MainRaw!J292)","v":""},{"$f":"IF(MainRaw!K292=\"\", \"\", MainRaw!K292)","v":""},{"$f":"IF(MainRaw!L292=\"\", \"\", MainRaw!L292)","v":""},{"$f":"IF(MainRaw!M292=\"\", \"\", MainRaw!M292)","v":""},{"$f":"IF(MainRaw!R292=\"\", \"\", MainRaw!R292)","v":""},{"$f":"IF(MainRaw!S292=\"\", \"\", MainRaw!S292)","v":""}," -  - ",{"$f":"IF(MainRaw!L292=\"\", \"\", MainRaw!L292)","v":""},{"$f":"IF(MainRaw!M292=\"\", \"\", MainRaw!M292)","v":""},{"$f":"IF(MainRaw!N292=\"\", \"\", MainRaw!N292)","v":""},{"$f":"IF(MainRaw!O292=\"\", \"\", MainRaw!O292)","v":""},{"$f":"IF(MainRaw!P292=\"\", \"\", MainRaw!P292)","v":""},{"$f":"IF(MainRaw!Q292=\"\", \"\", MainRaw!Q292)","v":""}]
[{"$f":"IF(MainRaw!A293=\"\", \"\", MainRaw!A293)","v":""},{"$f":"IF(MainRaw!B293=\"\", \"\", MainRaw!B293)","v":""},{"$f":"IF(MainRaw!E293=\"\", \"\", MainRaw!E293)","v":""},{"$f":"IF(MainRaw!H293=\"\", \"\", MainRaw!H293)","v":""},{"$f":"IF(MainRaw!J293=\"\", \"\", MainRaw!J293)","v":""},{"$f":"IF(MainRaw!K293=\"\", \"\", MainRaw!K293)","v":""},{"$f":"IF(MainRaw!L293=\"\", \"\", MainRaw!L293)","v":""},{"$f":"IF(MainRaw!M293=\"\", \"\", MainRaw!M293)","v":""},{"$f":"IF(MainRaw!R293=\"\", \"\", MainRaw!R293)","v":""},{"$f":"IF(MainRaw!S293=\"\", \"\", MainRaw!S293)","v":""}," -  - ",{"$f":"IF(MainRaw!L293=\"\", \"\", MainRaw!L293)","v":""},{"$f":"IF(MainRaw!M293=\"\", \"\", MainRaw!M293)","v":""},{"$f":"IF(MainRaw!N293=\"\", \"\", MainRaw!N293)","v":""},{"$f":"IF(MainRaw!O293=\"\", \"\", MainRaw!O293)","v":""},{"$f":"IF(MainRaw!P293=\"\", \"\", MainRaw!P293)","v":""},{"$f":"IF(MainRaw!Q293=\"\", \"\", MainRaw!Q293)","v":""}]
[{"$f":"IF(MainRaw!A294=\"\", \"\", MainRaw!A294)","v":""},{"$f":"IF(MainRaw!B294=\"\", \"\", MainRaw!B294)","v":""},{"$f":"IF(MainRaw!E294=\"\", \"\", MainRaw!E294)","v":""},{"$f":"IF(MainRaw!H294=\"\", \"\", MainRaw!H294)","v":""},{"$f":"IF(MainRaw!J294=\"\", \"\", MainRaw!J294)","v":""},{"$f":"IF(MainRaw!K294=\"\", \"\", MainRaw!K294)","v":""},{"$f":"IF(MainRaw!L294=\"\", \"\", MainRaw!L294)","v":""},{"$f":"IF(MainRaw!M294=\"\", \"\", MainRaw!M294)","v":""},{"$f":"IF(MainRaw!R294=\"\", \"\", MainRaw!R294)","v":""},{"$f":"IF(MainRaw!S294=\"\", \"\", MainRaw!S294)","v":""}," -  - ",{"$f":"IF(MainRaw!L294=\"\", \"\", MainRaw!L294)","v":""},{"$f":"IF(MainRaw!M294=\"\", \"\", MainRaw!M294)","v":""},{"$f":"IF(MainRaw!N294=\"\", \"\", MainRaw!N294)","v":""},{"$f":"IF(MainRaw!O294=\"\", \"\", MainRaw!O294)","v":""},{"$f":"IF(MainRaw!P294=\"\", \"\", MainRaw!P294)","v":""},{"$f":"IF(MainRaw!Q294=\"\", \"\", MainRaw!Q294)","v":""}]
[{"$f":"IF(MainRaw!A295=\"\", \"\", MainRaw!A295)","v":""},{"$f":"IF(MainRaw!B295=\"\", \"\", MainRaw!B295)","v":""},{"$f":"IF(MainRaw!E295=\"\", \"\", MainRaw!E295)","v":""},{"$f":"IF(MainRaw!H295=\"\", \"\", MainRaw!H295)","v":""},{"$f":"IF(MainRaw!J295=\"\", \"\", MainRaw!J295)","v":""},{"$f":"IF(MainRaw!K295=\"\", \"\", MainRaw!K295)","v":""},{"$f":"IF(MainRaw!L295=\"\", \"\", MainRaw!L295)","v":""},{"$f":"IF(MainRaw!M295=\"\", \"\", MainRaw!M295)","v":""},{"$f":"IF(MainRaw!R295=\"\", \"\", MainRaw!R295)","v":""},{"$f":"IF(MainRaw!S295=\"\", \"\", MainRaw!S295)","v":""}," -  - ",{"$f":"IF(MainRaw!L295=\"\", \"\", MainRaw!L295)","v":""},{"$f":"IF(MainRaw!M295=\"\", \"\", MainRaw!M295)","v":""},{"$f":"IF(MainRaw!N295=\"\", \"\", MainRaw!N295)","v":""},{"$f":"IF(MainRaw!O295=\"\", \"\", MainRaw!O295)","v":""},{"$f":"IF(MainRaw!P295=\"\", \"\", MainRaw!P295)","v":""},{"$f":"IF(MainRaw!Q295=\"\", \"\", MainRaw!Q295)","v":""}]
[{"$f":"IF(MainRaw!A296=\"\", \"\", MainRaw!A296)","v":""},{"$f":"IF(MainRaw!B296=\"\", \"\", MainRaw!B296)","v":""},{"$f":"IF(MainRaw!E296=\"\", \"\", MainRaw!E296)","v":""},{"$f":"IF(MainRaw!H296=\"\", \"\", MainRaw!H296)","v":""},{"$f":"IF(MainRaw!J296=\"\", \"\", MainRaw!J296)","v":""},{"$f":"IF(MainRaw!K296=\"\", \"\", MainRaw!K296)","v":""},{"$f":"IF(MainRaw!L296=\"\", \"\", MainRaw!L296)","v":""},{"$f":"IF(MainRaw!M296=\"\", \"\", MainRaw!M296)","v":""},{"$f":"IF(MainRaw!R296=\"\", \"\", MainRaw!R296)","v":""},{"$f":"IF(MainRaw!S296=\"\", \"\", MainRaw!S296)","v":""}," -  - ",{"$f":"IF(MainRaw!L296=\"\", \"\", MainRaw!L296)","v":""},{"$f":"IF(MainRaw!M296=\"\", \"\", MainRaw!M296)","v":""},{"$f":"IF(MainRaw!N296=\"\", \"\", MainRaw!N296)","v":""},{"$f":"IF(MainRaw!O296=\"\", \"\", MainRaw!O296)","v":""},{"$f":"IF(MainRaw!P296=\"\", \"\", MainRaw!P296)","v":""},{"$f":"IF(MainRaw!Q296=\"\", \"\", MainRaw!Q296)","v":""}]
[{"$f":"IF(MainRaw!A297=\"\", \"\", MainRaw!A297)","v":""},{"$f":"IF(MainRaw!B297=\"\", \"\", MainRaw!B297)","v":""},{"$f":"IF(MainRaw!E297=\"\", \"\", MainRaw!E297)","v":""},{"$f":"IF(MainRaw!H297=\"\", \"\", MainRaw!H297)","v":""},{"$f":"IF(MainRaw!J297=\"\", \"\", MainRaw!J297)","v":""},{"$f":"IF(MainRaw!K297=\"\", \"\", MainRaw!K297)","v":""},{"$f":"IF(MainRaw!L297=\"\", \"\", MainRaw!L297)","v":""},{"$f":"IF(MainRaw!M297=\"\", \"\", MainRaw!M297)","v":""},{"$f":"IF(MainRaw!R297=\"\", \"\", MainRaw!R297)","v":""},{"$f":"IF(MainRaw!S297=\"\", \"\", MainRaw!S297)","v":""}," -  - ",{"$f":"IF(MainRaw!L297=\"\", \"\", MainRaw!L297)","v":""},{"$f":"IF(MainRaw!M297=\"\", \"\", MainRaw!M297)","v":""},{"$f":"IF(MainRaw!N297=\"\", \"\", MainRaw!N297)","v":""},{"$f":"IF(MainRaw!O297=\"\", \"\", MainRaw!O297)","v":""},{"$f":"IF(MainRaw!P297=\"\", \"\", MainRaw!P297)","v":""},{"$f":"IF(MainRaw!Q297=\"\", \"\", MainRaw!Q297)","v":""}]
[{"$f":"IF(MainRaw!A298=\"\", \"\", MainRaw!A298)","v":""},{"$f":"IF(MainRaw!B298=\"\", \"\", MainRaw!B298)","v":""},{"$f":"IF(MainRaw!E298=\"\", \"\", MainRaw!E298)","v":""},{"$f":"IF(MainRaw!H298=\"\", \"\", MainRaw!H298)","v":""},{"$f":"IF(MainRaw!J298=\"\", \"\", MainRaw!J298)","v":""},{"$f":"IF(MainRaw!K298=\"\", \"\", MainRaw!K298)","v":""},{"$f":"IF(MainRaw!L298=\"\", \"\", MainRaw!L298)","v":""},{"$f":"IF(MainRaw!M298=\"\", \"\", MainRaw!M298)","v":""},{"$f":"IF(MainRaw!R298=\"\", \"\", MainRaw!R298)","v":""},{"$f":"IF(MainRaw!S298=\"\", \"\", MainRaw!S298)","v":""}," -  - ",{"$f":"IF(MainRaw!L298=\"\", \"\", MainRaw!L298)","v":""},{"$f":"IF(MainRaw!M298=\"\", \"\", MainRaw!M298)","v":""},{"$f":"IF(MainRaw!N298=\"\", \"\", MainRaw!N298)","v":""},{"$f":"IF(MainRaw!O298=\"\", \"\", MainRaw!O298)","v":""},{"$f":"IF(MainRaw!P298=\"\", \"\", MainRaw!P298)","v":""},{"$f":"IF(MainRaw!Q298=\"\", \"\", MainRaw!Q298)","v":""}]
[{"$f":"IF(MainRaw!A299=\"\", \"\", MainRaw!A299)","v":""},{"$f":"IF(MainRaw!B299=\"\", \"\", MainRaw!B299)","v":""},{"$f":"IF(MainRaw!E299=\"\", \"\", MainRaw!E299)","v":""},{"$f":"IF(MainRaw!H299=\"\", \"\", MainRaw!H299)","v":""},{"$f":"IF(MainRaw!J299=\"\", \"\", MainRaw!J299)","v":""},{"$f":"IF(MainRaw!K299=\"\", \"\", MainRaw!K299)","v":""},{"$f":"IF(MainRaw!L299=\"\", \"\", MainRaw!L299)","v":""},{"$f":"IF(MainRaw!M299=\"\", \"\", MainRaw!M299)","v":""},{"$f":"IF(MainRaw!R299=\"\", \"\", MainRaw!R299)","v":""},{"$f":"IF(MainRaw!S299=\"\", \"\", MainRaw!S299)","v":""}," -  - ",{"$f":"IF(MainRaw!L299=\"\", \"\", MainRaw!L299)","v":""},{"$f":"IF(MainRaw!M299=\"\", \"\", MainRaw!M299)","v":""},{"$f":"IF(MainRaw!N299=\"\", \"\", MainRaw!N299)","v":""},{"$f":"IF(MainRaw!O299=\"\", \"\", MainRaw!O299)","v":""},{"$f":"IF(MainRaw!P299=\"\", \"\", MainRaw!P299)","v":""},{"$f":"IF(MainRaw!Q299=\"\", \"\", MainRaw!Q299)","v":""}]
[{"$f":"IF(MainRaw!A300=\"\", \"\", MainRaw!A300)","v":""},{"$f":"IF(MainRaw!B300=\"\", \"\", MainRaw!B300)","v":""},{"$f":"IF(MainRaw!E300=\"\", \"\", MainRaw!E300)","v":""},{"$f":"IF(MainRaw!H300=\"\", \"\", MainRaw!H300)","v":""},{"$f":"IF(MainRaw!J300=\"\", \"\", MainRaw!J300)","v":""},{"$f":"IF(MainRaw!K300=\"\", \"\", MainRaw!K300)","v":""},{"$f":"IF(MainRaw!L300=\"\", \"\", MainRaw!L300)","v":""},{"$f":"IF(MainRaw!M300=\"\", \"\", MainRaw!M300)","v":""},{"$f":"IF(MainRaw!R300=\"\", \"\", MainRaw!R300)","v":""},{"$f":"IF(MainRaw!S300=\"\", \"\", MainRaw!S300)","v":""}," -  - ",{"$f":"IF(MainRaw!L300=\"\", \"\", MainRaw!L300)","v":""},{"$f":"IF(MainRaw!M300=\"\", \"\", MainRaw!M300)","v":""},{"$f":"IF(MainRaw!N300=\"\", \"\", MainRaw!N300)","v":""},{"$f":"IF(MainRaw!O300=\"\", \"\", MainRaw!O300)","v":""},{"$f":"IF(MainRaw!P300=\"\", \"\", MainRaw!P300)","v":""},{"$f":"IF(MainRaw!Q300=\"\", \"\", MainRaw!Q300)","v":""}]
[null,null,null,null,null,null,null,null,null,null,{"$f":"A302 & \" - \" & B302 & \" - \" & I302","v":" -  - "}]
[null,null,null,null,null,null,null,null,null,null," -  - "]
[null,null,null,null,null,null,null,null,null,null," -  - "]
[null,null,null,null,null,null,null,null,null,null," -  - "]
[null,null,null,null,null,null,null,null,null,null," -  - "]
[null,null,null,null,null,null,null,null,null,null," -  - "]

{"sheet":"offeringsRaw","index":2,"n_rows":201,"n_cols":22,"rows_kept":201,"cut":false,"hidden":true,"merged":[]}
["-","-",null,3," ",0,30," ",3,"9:00a - 9:50a","MW",250,"SWKT",null,null,3,"Kimball, Richard Ian",null,null," ",30,30]
[null,null,null,null,null,null,null,null,null,"10:00a - 10:50a","Th",341,"MCKB"]
["-","-",null,77," ",0,30," ",3,"9:00a - 9:50a","MW",250,"SWKT",null,null,77,"Kimball, Richard Ian",null,null," ",30,30]
[null,null,null,null,null,null,null,null,null,"10:00a - 10:50a","F",114,"JSB"]
["-","-",null,78," ",0,30," ",3,"9:00a - 9:50a","MW",250,"SWKT",null,null,78,"Kimball, Richard Ian",null,null," ",30,30]
[null,null,null,null,null,null,null,null,null,"9:00a - 9:50a","Th",366,"MARB"]
["-","-",null,87," ",0,30," ",3,"9:00a - 9:50a","MW",250,"SWKT",null,null,87,"Kimball, Richard Ian",null,null," ",30,30]
[null,null,null,null,null,null,null,null,null,"9:00a - 9:50a","F",203,"JSB"]
["-","-",null,88," ",0,30," ",3,"9:00a - 9:50a","MW",250,"SWKT",null,null,88,"Kimball, Richard Ian",null,null," ",30,30]
[null,null,null,null,null,null,null,null,null,"10:00a - 10:50a","Th",366,"MARB"]
["-","-",null,91," ",0,30," ",3,"9:00a - 9:50a","MW",250,"SWKT",null,null,91,"Kimball, Richard Ian",null,null," ",30,30]
[null,null,null,null,null,null,null,null,null,"9:00a - 9:50a","F",114,"JSB"]
["-","-",null,92," ",0,30," ",3,"9:00a - 9:50a","MW",250,"SWKT",null,null,92,"Kimball, Richard Ian",null,null," ",30,30]
[null,null,null,null,null,null,null,null,null,"9:00a - 9:50a","F",170,"JSB"]
["-","-",null,94," ",0,30," ",3,"9:00a - 9:50a","MW",250,"SWKT",null,null,94,"Kimball, Richard Ian",null,null," ",30,30]
[null,null,null,null,null,null,null,null,null,"8:00a - 8:50a","F",171,"JSB"]
["-","-",null,95," ",0,30," ",3,"9:00a - 9:50a","MW",250,"SWKT",null,null,95,"Kimball, Richard Ian",null,null," ",30,30]
[null,null,null,null,null,null,null,null,null,"8:00a - 8:50a","F",175,"JSB"]
["-","-",null,47," ",0,30," ",3,"10:00a - 10:50a","MW",250,"SWKT",null,null,47,"Kimball, Richard Ian",null,null," ",30,30]
[null,null,null,null,null,null,null,null,null,"9:00a - 9:50a","F",106,"JSB"]
["-","-",null,49," ",0,30," ",3,"10:00a - 10:50a","MW",250,"SWKT",null,null,49,"Kimball, Richard Ian",null,null," ",30,30]
[null,null,null,null,null,null,null,null,null,"10:00a - 10:50a","Th",280,"MCKB"]
["-","-",null,74," ",0,30," ",3,"10:00a - 10:50a","MW",250,"SWKT",null,null,74,"Kimball, Richard Ian",null,null," ",30,30]
[null,null,null,null,null,null,null,null,null,"9:00a - 9:50a","F",103,"JSB"]
["-","-",null,76," ",0,30," ",3,"10:00a - 10:50a","MW",250,"SWKT",null,null,76,"Kimball, Richard Ian",null,null," ",30,30]
[null,null,null,null,null,null,null,null,null,"11:00a - 11:50a","F",174,"JSB"]
["-","-",null,82," ",0,30," ",3,"10:00a - 10:50a","MW",250,"SWKT",null,null,82,"Kimball, Richard Ian",null,null," ",30,30]
[null,null,null,null,null,null,null,null,null,"11:00a - 11:50a","F",110,"JSB"]
["-","-",null,84," ",0,30," ",3,"10:00a - 10:50a","MW",250,"SWKT",null,null,84,"Kimball, Richard Ian",null,null," ",30,30]
[null,null,null,null,null,null,null,null,null,"10:00a - 10:50a","F",171,"JSB"]
["-","-",null,90," ",0,30," ",3,"10:00a - 10:50a","MW",250,"SWKT",null,null,90,"Kimball, Richard Ian",null,null," ",30,30]
[null,null,null,null,null,null,null,null,null,"10:00a - 10:50a","F",178,"JSB"]
["-","-",null,93," ",0,30," ",3,"10:00a - 10:50a","MW",250,"SWKT",null,null,93,"Kimball, Richard Ian",null,null," ",30,30]
[null,null,null,null,null,null,null,null,null,"9:00a - 9:50a","Th",406,"CB"]
["-","-",null,96," ",0,30," ",3,"10:00a - 10:50a","MW",250,"SWKT",null,null,96,"Kimball, Richard Ian",null,null," ",30,30]
[null,null,null,null,null,null,null,null,null,"9:00a - 9:50a","Th",250,"BRMB"]
["-","-",null,1," ",0,30," ",3,"11:00a - 11:50a","MW",140,"JSB",null,null,1,"Patterson, Kelly D",null,null," ",30,30]
[null,null,null,null,null,null,null,null,null,"8:00a - 8:50a","Th",202,"JSB"]
["-","-",null,2," ",0,30," ",3,"11:00a - 11:50a","MW",140,"JSB",null,null,2,"Patterson, Kelly D",null,null," ",30,30]
[null,null,null,null,null,null,null,null,null,"9:00a - 9:50a","Th",280,"MCKB"]
["-","-",null,4," ",0,30," ",3,"11:00a - 11:50a","MW",140,"JSB",null,null,4,"Patterson, Kelly D",null,null," ",30,30]
[null,null,null,null,null,null,null,null,null,"10:00a - 10:50a","Th",107,"HGB"]
["-","-",null,5," ",0,30," ",3,"11:00a - 11:50a","MW",140,"JSB",null,null,5,"Patterson, Kelly D",null,null," ",30,30]
[null,null,null,null,null,null,null,null,null,"12:00p - 12:50p","Th",160,"MCKB"]
["-","-",null,6," ",0,30," ",3,"11:00a - 11:50a","MW",140,"JSB",null,null,6,"Patterson, Kelly D",null,null," ",30,30]
[null,null,null,null,null,null,null,null,null,"10:00a - 10:50a","Th",406,"CB"]
["-","-",null,7," ",0,30," ",3,"11:00a - 11:50a","MW",140,"JSB",null,null,7,"Patterson, Kelly D",null,null," ",30,30]
[null,null,null,null,null,null,null,null,null,"9:00a - 9:50a","F",107,"JSB"]
["-","-",null,8," ",0,30," ",3,"11:00a - 11:50a","MW",140,"JSB",null,null,8,"Patterson, Kelly D",null,null," ",30,30]
[null,null,null,null,null,null,null,null,null,"10:00a - 10:50a","F",174,"JSB"]
["-","-",null,9," ",0,30," ",3,"11:00a - 11:50a","MW",140,"JSB",null,null,9,"Patterson, Kelly D",null,null," ",30,30]
[null,null,null,null,null,null,null,null,null,"11:00a - 11:50a","F",178,"JSB"]
["-","-",null,21," ",0,30," ",3,"11:00a - 11:50a","MW",140,"JSB",null,null,21,"Patterson, Kelly D",null,null," ",30,30]
[null,null,null,null,null,null,null,null,null,"10:00a - 10:50a","F",175,"JSB"]
["-","-",null,23," ",0,30," ",3,"11:00a - 11:50a","MW",140,"JSB",null,null,23,"Patterson, Kelly D",null,null," ",30,30]
[null,null,null,null,null,null,null,null,null,"11:00a - 11:50a","F",182,"JSB"]
["-","-",null,29," ",0,30," ",3,"11:00a - 11:50a","MW",140,"JSB",null,null,29,"Patterson, Kelly D",null,null," ",30,30]
[null,null,null,null,null,null,null,null,null,"10:00a - 10:50a","F",179,"JSB"]
["-","-",null,37," ",0,30," ",3,"11:00a - 11:50a","MW",140,"JSB",null,null,37,"Patterson, Kelly D",null,null," ",30,30]
[null,null,null,null,null,null,null,null,null,"10:00a - 10:50a","F",103,"JSB"]
["-","-",null,38," ",0,30," ",3,"11:00a - 11:50a","MW",140,"JSB",null,null,38,"Patterson, Kelly D",null,null," ",30,30]
[null,null,null,null,null,null,null,null,null,"10:00a - 10:50a","F",110,"JSB"]
["-","<A href=\"javascript:addRainCheck('A HTG','100',' ','050'); \">R</A>","<A href=\"javascript:viewLims('This class can only be added by approved rainchecks.^This class is a(n) INTERNATIONAL section.^'); \">Y</A>",50," ",0,30," ",3,"11:00a - 11:50a","MW",140,"JSB",null,null,50,"Patterson, Kelly D",null,null," ",30,30]
[null,null,null,null,null,null,null,null,null,"11:00a - 11:50a","F",175,"JSB"]
["-","-",null,53," ",0,30," ",3,"11:00a - 11:50a","MW",140,"JSB",null,null,53,"Patterson, Kelly D",null,null," ",30,30]
[null,null,null,null,null,null,null,null,null,"8:00a - 8:50a","Th",178,"JSB"]
["-","-",null,54," ",0,30," ",3,"11:00a - 11:50a","MW",140,"JSB",null,null,54,"Patterson, Kelly D",null,null," ",30,30]
[null,null,null,null,null,null,null,null,null,"12:00p - 12:50p","Th","B142","JFSB"]
["-","-",null,58," ",0,30," ",3,"11:00a - 11:50a","MW",140,"JSB",null,null,58,"Patterson, Kelly D",null,null," ",30,30]
[null,null,null,null,null,null,null,null,null,"10:00a - 10:50a","F",203,"JSB"]
["-","-",null,59," ",0,30," ",3,"11:00a - 11:50a","MW",140,"JSB",null,null,59,"Patterson, Kelly D",null,null," ",30,30]
[null,null,null,null,null,null,null,null,null,"11:00a - 11:50a","F",202,"JSB"]
["-","-",null,60," ",0,30," ",3,"11:00a - 11:50a","MW",140,"JSB",null,null,60,"Patterson, Kelly D",null,null," ",30,30]
[null,null,null,null,null,null,null,null,null,"11:00a - 11:50a","F",203,"JSB"]
["-","-",null,62," ",0,30," ",3,"11:00a - 11:50a","MW",140,"JSB",null,null,62,"Patterson, Kelly D",null,null," ",30,30]
[null,null,null,null,null,null,null,null,null,"10:00a - 10:50a","F",182,"JSB"]
["-","-",null,66," ",0,30," ",3,"11:00a - 11:50a","MW",140,"JSB",null,null,66,"Patterson, Kelly D",null,null," ",30,30]
[null,null,null,null,null,null,null,null,null,"11:00a - 11:50a","F",171,"JSB"]
["-","-",null,70," ",0,30," ",3,"11:00a - 11:50a","MW",140,"JSB",null,null,70,"Patterson, Kelly D",null,null," ",30,30]
[null,null,null,null,null,null,null,null,null,"11:00a - 11:50a","F",170,"JSB"]
["-","-",null,73," ",0,30," ",3,"11:00a - 11:50a","MW",140,"JSB",null,null,73,"Patterson, Kelly D",null,null," ",30,30]
[null,null,null,null,null,null,null,null,null,"8:00a - 8:50a","F",103,"JSB"]
["-","-",null,75," ",0,30," ",3,"11:00a - 11:50a","MW",140,"JSB",null,null,75,"Patterson, Kelly D",null,null," ",30,30]
[null,null,null,null,null,null,null,null,null,"10:00a - 10:50a","F",107,"JSB"]
["-","-",null,12," ",0,30," ",3,"12:00p - 12:50p","MW",140,"JSB",null,null,12,"Patterson, Kelly D",null,null," ",30,30]
[null,null,null,null,null,null,null,null,null,"1:00p - 1:50p","Th",160,"MCKB"]
["-","-",null,13," ",0,30," ",3,"12:00p - 12:50p","MW",140,"JSB",null,null,13,"Patterson, Kelly D",null,null," ",30,30]
[null,null,null,null,null,null,null,null,null,"11:00a - 11:50a","F",103,"JSB"]
["-","-",null,14," ",0,30," ",3,"12:00p - 12:50p","MW",140,"JSB",null,null,14,"Patterson, Kelly D",null,null," ",30,30]
[null,null,null,null,null,null,null,null,null,"12:00p - 12:50p","F",175,"JSB"]
["-","-",null,15," ",0,30," ",3,"12:00p - 12:50p","MW",140,"JSB",null,null,15,"Patterson, Kelly D",null,null," ",30,30]
[null,null,null,null,null,null,null,null,null,"1:00p - 1:50p","Th",341,"MCKB"]
["-","-",null,16," ",0,30," ",3,"12:00p - 12:50p","MW",140,"JSB",null,null,16,"Patterson, Kelly D",null,null," ",30,30]
[null,null,null,null,null,null,null,null,null,"1:00p - 1:50p","Th",393,"CB"]
["-","-",null,17," ",0,30," ",3,"12:00p - 12:50p","MW",140,"JSB",null,null,17,"Patterson, Kelly D",null,null," ",30,30]
[null,null,null,null,null,null,null,null,null,"3:00p - 3:50p","Th",240,"SWKT"]
["-","-",null,18," ",0,30," ",3,"12:00p - 12:50p","MW",140,"JSB",null,null,18,"Patterson, Kelly D",null,null," ",30,30]
[null,null,null,null,null,null,null,null,null,"8:00a - 8:50a","F",106,"JSB"]
["-","-",null,19," ",0,30," ",3,"12:00p - 12:50p","MW",140,"JSB",null,null,19,"Patterson, Kelly D",null,null," ",30,30]
[null,null,null,null,null,null,null,null,null,"11:00a - 11:50a","F",106,"JSB"]
["-","-",null,20," ",0,30," ",3,"12:00p - 12:50p","MW",140,"JSB",null,null,20,"Patterson, Kelly D",null,null," ",30,30]
[null,null,null,null,null,null,null,null,null,"9:00a - 9:50a","F",110,"JSB"]
["-","-",null,22," ",0,30," ",3,"12:00p - 12:50p","MW",140,"JSB",null,null,22,"Patterson, Kelly D",null,null," ",30,30]
[null,null,null,null,null,null,null,null,null,"11:00a - 11:50a","F",179,"JSB"]
["-","-",null,24," ",0,30," ",3,"12:00p - 12:50p","MW",140,"JSB",null,null,24,"Patterson, Kelly D",null,null," ",30,30]
[null,null,null,null,null,null,null,null,null,"12:00p - 12:50p","F",171,"JSB"]
["-","-",null,27," ",0,30," ",3,"12:00p - 12:50p","MW",140,"JSB",null,null,27,"Patterson, Kelly D",null,null," ",30,30]
[null,null,null,null,null,null,null,null,null,"1:00p - 1:50p","Th",230,"MCKB"]
["-","-",null,36," ",0,30," ",3,"12:00p - 12:50p","MW",140,"JSB",null,null,36,"Patterson, Kelly D",null,null," ",30,30]
[null,null,null,null,null,null,null,null,null,"1:00p - 1:50p","Th","W142","BNSN"]
["-","-",null,39," ",0,30," ",3,"12:00p - 12:50p","MW",140,"JSB",null,null,39,"Patterson, Kelly D",null,null," ",30,30]
[null,null,null,null,null,null,null,null,null,"12:00p - 12:50p","F",107,"JSB"]
["-","-",null,42," ",0,30," ",3,"12:00p - 12:50p","MW",140,"JSB",null,null,42,"Patterson, Kelly D",null,null," ",30,30]
[null,null,null,null,null,null,null,null,null,"12:00p - 12:50p","F",110,"JSB"]
["-","-",null,45," ",0,30," ",3,"12:00p - 12:50p","MW",140,"JSB",null,null,45,"Patterson, Kelly D",null,null," ",30,30]
[null,null,null,null,null,null,null,null,null,"12:00p - 12:50p","F",114,"JSB"]
["-","-",null,48," ",0,30," ",3,"12:00p - 12:50p","MW",140,"JSB",null,null,48,"Patterson, Kelly D",null,null," ",30,30]
[null,null,null,null,null,null,null,null,null,"12:00p - 12:50p","Th",150,"HRCB"]
["-","<A href=\"javascript:addRainCheck('A HTG','100',' ','051'); \">R</A>","<A href=\"javascript:viewLims('This class can only be added by approved rainchecks.^This class is a(n) INTERNATIONAL section.^'); \">Y</A>",51," ",0,30," ",3,"12:00p - 12:50p","MW",140,"JSB",null,null,51,"Patterson, Kelly D",null,null," ",30,30]
[null,null,null,null,null,null,null,null,null,"12:00p - 12:50p","F",170,"JSB"]
["-","-",null,55," ",0,30," ",3,"12:00p - 12:50p","MW",140,"JSB",null,null,55,"Patterson, Kelly D",null,null," ",30,30]
[null,null,null,null,null,null,null,null,null,"1:00p - 1:50p","Th",366,"MARB"]
["-","-",null,57," ",0,30," ",3,"12:00p - 12:50p","MW",140,"JSB",null,null,57,"Patterson, Kelly D",null,null," ",30,30]
[null,null,null,null,null,null,null,null,null,"8:00a - 8:50a","F",107,"JSB"]
["-","-",null,64," ",0,30," ",3,"12:00p - 12:50p","MW",140,"JSB",null,null,64,"Patterson, Kelly D",null,null," ",30,30]
[null,null,null,null,null,null,null,null,null,"12:00p - 12:50p","F",174,"JSB"]
["-","-",null,69," ",0,30," ",3,"12:00p - 12:50p","MW",140,"JSB",null,null,69,"Patterson, Kelly D",null,null," ",30,30]
[null,null,null,null,null,null,null,null,null,"12:00p - 12:50p","F",103,"JSB"]
["-","-",null,71," ",0,30," ",3,"12:00p - 12:50p","MW",140,"JSB",null,null,71,"Patterson, Kelly D",null,null," ",30,30]
[null,null,null,null,null,null,null,null,null,"12:00p - 12:50p","F",106,"JSB"]
["-","-",null,72," ",0,30," ",3,"12:00p - 12:50p","MW",140,"JSB",null,null,72,"Patterson, Kelly D",null,null," ",30,30]
[null,null,null,null,null,null,null,null,null,"1:00p - 1:50p","F",103,"JSB"]
["-","-",null,10," ",0,30," ",3,"1:00p - 1:50p","MW",140,"JSB",null,null,10,"Patterson, Kelly D",null,null," ",30,30]
[null,null,null,null,null,null,null,null,null,"1:00p - 1:50p","F",114,"JSB"]
["-","-",null,11," ",0,30," ",3,"1:00p - 1:50p","MW",140,"JSB",null,null,11,"Patterson, Kelly D",null,null," ",30,30]
[null,null,null,null,null,null,null,null,null,"2:00p - 2:50p","F",203,"JSB"]
["-","-",null,25," ",0,30," ",3,"1:00p - 1:50p","MW",140,"JSB",null,null,25,"Patterson, Kelly D",null,null," ",30,30]
[null,null,null,null,null,null,null,null,null,"1:00p - 1:50p","F",170,"JSB"]
["-","-",null,26," ",0,30," ",3,"1:00p - 1:50p","MW",140,"JSB",null,null,26,"Patterson, Kelly D",null,null," ",30,30]
[null,null,null,null,null,null,null,null,null,"2:00p - 2:50p","F",103,"JSB"]
["-","-",null,28," ",0,30," ",3,"1:00p - 1:50p","MW",140,"JSB",null,null,28,"Patterson, Kelly D",null,null," ",30,30]
[null,null,null,null,null,null,null,null,null,"9:00a - 9:50a","F",179,"JSB"]
["-","-",null,30," ",0,30," ",3,"1:00p - 1:50p","MW",140,"JSB",null,null,30,"Patterson, Kelly D",null,null," ",30,30]
[null,null,null,null,null,null,null,null,null,"12:00p - 12:50p","Th",1004,"JKB"]
["-","-",null,31," ",0,30," ",3,"1:00p - 1:50p","MW",140,"JSB",null,null,31,"Patterson, Kelly D",null,null," ",30,30]
[null,null,null,null,null,null,null,null,null,"12:00p - 12:50p","Th",1006,"JKB"]
["-","-",null,32," ",0,30," ",3,"1:00p - 1:50p","MW",140,"JSB",null,null,32,"Patterson, Kelly D",null,null," ",30,30]
[null,null,null,null,null,null,null,null,null,"1:00p - 1:50p","Th",191,"SFH"]
["-","-",null,34," ",0,30," ",3,"1:00p - 1:50p","MW",140,"JSB",null,null,34,"Patterson, Kelly D",null,null," ",30,30]
[null,null,null,null,null,null,null,null,null,"3:00p - 3:50p","Th",361,"MARB"]
["-","-",null,35," ",0,30," ",3,"1:00p - 1:50p","MW",140,"JSB",null,null,35,"Patterson, Kelly D",null,null," ",30,30]
[null,null,null,null,null,null,null,null,null,"8:00a - 8:50a","F",114,"JSB"]
["-","-",null,40," ",0,30," ",3,"1:00p - 1:50p","MW",140,"JSB",null,null,40,"Patterson, Kelly D",null,null," ",30,30]
[null,null,null,null,null,null,null,null,null,"1:00p - 1:50p","F",106,"JSB"]
["-","-",null,41," ",0,30," ",3,"1:00p - 1:50p","MW",140,"JSB",null,null,41,"Patterson, Kelly D",null,null," ",30,30]
[null,null,null,null,null,null,null,null,null,"2:00p - 2:50p","F",174,"JSB"]
["-","-",null,43," ",0,30," ",3,"1:00p - 1:50p","MW",140,"JSB",null,null,43,"Patterson, Kelly D",null,null," ",30,30]
[null,null,null,null,null,null,null,null,null,"1:00p - 1:50p","F",107,"JSB"]
["-","-",null,44," ",0,30," ",3,"1:00p - 1:50p","MW",140,"JSB",null,null,44,"Patterson, Kelly D",null,null," ",30,30]
[null,null,null,null,null,null,null,null,null,"12:00p - 12:50p","Th",170,"JSB"]
["-","-",null,46," ",0,30," ",3,"1:00p - 1:50p","MW",140,"JSB",null,null,46,"Patterson, Kelly D",null,null," ",30,30]
[null,null,null,null,null,null,null,null,null,"2:00p - 2:50p","F",175,"JSB"]
["-","<A href=\"javascript:addRainCheck('A HTG','100',' ','052'); \">R</A>","<A href=\"javascript:viewLims('This class can only be added by approved rainchecks.^This class is a(n) INTERNATIONAL section.^'); \">Y</A>",52," ",0,30," ",3,"1:00p - 1:50p","MW",140,"JSB",null,null,52,"Patterson, Kelly D",null,null," ",30,30]
[null,null,null,null,null,null,null,null,null,"1:00p - 1:50p","F",110,"JSB"]
["-","-",null,56," ",0,30," ",3,"1:00p - 1:50p","MW",140,"JSB",null,null,56,"Patterson, Kelly D",null,null," ",30,30]
[null,null,null,null,null,null,null,null,null,"2:00p - 2:50p","Th",160,"MCKB"]
["-","-",null,61," ",0,30," ",3,"1:00p - 1:50p","MW",140,"JSB",null,null,61,"Patterson, Kelly D",null,null," ",30,30]
[null,null,null,null,null,null,null,null,null,"2:00p - 2:50p","Th",341,"MCKB"]
["-","-",null,63," ",0,30," ",3,"1:00p - 1:50p","MW",140,"JSB",null,null,63,"Patterson, Kelly D",null,null," ",30,30]
[null,null,null,null,null,null,null,null,null,"12:00p - 12:50p","Th",1012,"JKB"]
["-","-",null,65," ",0,30," ",3,"1:00p - 1:50p","MW",140,"JSB",null,null,65,"Patterson, Kelly D",null,null," ",30,30]
[null,null,null,null,null,null,null,null,null,"1:00p - 1:50p","F",171,"JSB"]
["-","-",null,67," ",0,30," ",3,"1:00p - 1:50p","MW",140,"JSB",null,null,67,"Patterson, Kelly D",null,null," ",30,30]
[null,null,null,null,null,null,null,null,null,"1:00p - 1:50p","F",174,"JSB"]
["-","-",null,68," ",0,30," ",3,"1:00p - 1:50p","MW",140,"JSB",null,null,68,"Patterson, Kelly D",null,null," ",30,30]
[null,null,null,null,null,null,null,null,null,"2:00p - 2:50p","F",106,"JSB"]
["-","-",null,33," ",0,30," ",3,"2:00p - 2:50p","MW",250,"SWKT",null,null,33,"Kimball, Richard Ian",null,null," ",30,30]
[null,null,null,null,null,null,null,null,null,"2:00p - 2:50p","Th",280,"MCKB"]
["-","-",null,79," ",0,30," ",3,"2:00p - 2:50p","MW",250,"SWKT",null,null,79,"Kimball, Richard Ian",null,null," ",30,30]
[null,null,null,null,null,null,null,null,null,"1:00p - 1:50p","Th",250,"BRMB"]
["-","-",null,80," ",0,30," ",3,"2:00p - 2:50p","MW",250,"SWKT",null,null,80,"Kimball, Richard Ian",null,null," ",30,30]
[null,null,null,null,null,null,null,null,null,"2:00p - 2:50p","F",178,"JSB"]
["-","-",null,81," ",0,30," ",3,"2:00p - 2:50p","MW",250,"SWKT",null,null,81,"Kimball, Richard Ian",null,null," ",30,30]
[null,null,null,null,null,null,null,null,null,"3:00p - 3:50p","Th",174,"JSB"]
["-","-",null,83," ",0,30," ",3,"2:00p - 2:50p","MW",250,"SWKT",null,null,83,"Kimball, Richard Ian",null,null," ",30,30]
[null,null,null,null,null,null,null,null,null,"2:00p - 2:50p","F",179,"JSB"]
["-","-",null,85," ",0,30," ",3,"2:00p - 2:50p","MW",250,"SWKT",null,null,85,"Kimball, Richard Ian",null,null," ",30,30]
[null,null,null,null,null,null,null,null,null,"2:00p - 2:50p","F",182,"JSB"]
["-","-",null,86," ",0,30," ",3,"2:00p - 2:50p","MW",250,"SWKT",null,null,86,"Kimball, Richard Ian",null,null," ",30,30]
[null,null,null,null,null,null,null,null,null,"2:00p - 2:50p","F",202,"JSB"]
["-","-",null,89," ",0,30," ",3,"2:00p - 2:50p","MW",250,"SWKT",null,null,89,"Kimball, Richard Ian",null,null," ",30,30]
[null,null,null,null,null,null,null,null,null,"3:00p - 3:50p","F",170,"JSB"]
["-","-",null,97," ",0,30," ",3,"2:00p - 2:50p","MW",250,"SWKT",null,null,97,"Kimball, Richard Ian",null,null," ",30,30]
[null,null,null,null,null,null,null,null,null,"1:00p - 1:50p","F",175,"JSB"]
["-","<A href=\"javascript:addClass('F','3.0','3.0','A HTG','100',' ','103','SALT LAKE'); \">A</A>",null,103,"SALT LAKE",40,40," ",3,"8:30a - 10:55a","T",313,"SLC",null,null,103,"Fish, Rick Jay",null,null," ",40,0]
["-","<A href=\"javascript:addClass('F','3.0','3.0','A HTG','100',' ','102','SALT LAKE'); \">A</A>",null,102,"SALT LAKE",30,40," ",3,"9:30a - 11:55a","W",316,"SLC",null,null,102,"Shrum, Joan H",null,null," ",40,10]
["-","<A href=\"javascript:addClass('F','3.0','3.0','A HTG','100',' ','100','SALT LAKE'); \">A</A>",null,100,"SALT LAKE",38,40," ",3,"9:30a - 11:55a","Th",316,"SLC",null,null,100,"Shrum, Joan H",null,null," ",40,2]
["-","<A href=\"javascript:addClass('F','3.0','3.0','A HTG','100',' ','098','SALT LAKE'); \">A</A>",null,98,"SALT LAKE",40,40," ",3,"2:30p - 4:55p","M",411,"SLC",null,null,98,"Sargent, Kathryn Pon",null,null," ",40,0]
["-","<A href=\"javascript:addClass('F','3.0','3.0','A HTG','100',' ','101','SALT LAKE'); \">A</A>",null,101,"SALT LAKE",33,40," ",3,"5:00p - 7:25p","M",306,"SLC",null,null,101,"Fish, Rick Jay",null,null," ",40,7]
["-","<A href=\"javascript:addClass('F','3.0','3.0','A HTG','100',' ','099','SALT LAKE'); \">A</A>",null,99,"SALT LAKE",4,40," ",3,"5:00p - 7:25p","W",411,"SLC",null,null,99,"Latimer, Brett Hugh",null,null," ",40,36]
[null,null,null,null,null,null,null,null,null,"5:00p - 7:25p","W",411,"SLC"]

{"sheet":"Password","index":3,"n_rows":1,"n_cols":2,"rows_kept":1,"cut":false,"hidden":true,"merged":[]}
["brasswil","paige3116"]

{"sheet":"Offerings","index":4,"n_rows":305,"n_cols":14,"rows_kept":305,"cut":false,"hidden":true,"merged":[[0,0,3,0]]}
["Click the \"A\" in this column to add the class to your list.",20105,null,"Semester","Fall 2010"]
[null,"A HTG",null,"Department","A HTG - American Heritage"]
[null,2859006,null,"Class","100 - American Heritage"]
[]
["Add","Add","Note","Section","Type","Seats Available","Class Size","Hours","Class Period","Days","Room","Building","Instructor"]
[{"$f":"IF(RIGHT(B6,5)=\"A</A>\",\"A\",\"\")","v":""},{"$f":"IF(offeringsRaw!B1=\"\",\"\",offeringsRaw!B1)","v":"-"},{"$f":"IF(offeringsRaw!C1=\"\",\"\",offeringsRaw!C1)","v":""},{"$f":"IF(offeringsRaw!D1=\"\",\"\",offeringsRaw!D1)","v":3},{"$f":"IF(offeringsRaw!E1=\"\",\"\",offeringsRaw!E1)","v":" "},{"$f":"IF(offeringsRaw!F1=\"\",\"\",offeringsRaw!F1)","v":0},{"$f":"IF(offeringsRaw!G1=\"\",\"\",offeringsRaw!G1)","v":30},{"$f":"IF(offeringsRaw!I1=\"\",\"\",offeringsRaw!I1)","v":3},{"$f":"IF(offeringsRaw!J1=\"\",\"\",offeringsRaw!J1)","v":"9:00a - 9:50a"},{"$f":"IF(offeringsRaw!K1=\"\",\"\",offeringsRaw!K1)","v":"MW"},{"$f":"IF(offeringsRaw!L1=\"\",\"\",offeringsRaw!L1)","v":250},{"$f":"IF(offeringsRaw!M1=\"\",\"\",offeringsRaw!M1)","v":"SWKT"},{"$f":"IF(offeringsRaw!Q1=\"\",\"\",offeringsRaw!Q1)","v":"Kimball, Richard Ian"},{"$f":"TEXT(D6,\"000\") & \" - \" &M6","v":"003 - Kimball, Richard Ian"}]
[{"$f":"IF(RIGHT(B7,5)=\"A</A>\",\"A\",\"\")","v":""},{"$f":"IF(offeringsRaw!B2=\"\",\"\",offeringsRaw!B2)","v":""},{"$f":"IF(offeringsRaw!C2=\"\",\"\",offeringsRaw!C2)","v":""},{"$f":"IF(offeringsRaw!D2=\"\",\"\",offeringsRaw!D2)","v":""},{"$f":"IF(offeringsRaw!E2=\"\",\"\",offeringsRaw!E2)","v":""},{"$f":"IF(offeringsRaw!F2=\"\",\"\",offeringsRaw!F2)","v":""},{"$f":"IF(offeringsRaw!G2=\"\",\"\",offeringsRaw!G2)","v":""},{"$f":"IF(offeringsRaw!I2=\"\",\"\",offeringsRaw!I2)","v":""},{"$f":"IF(offeringsRaw!J2=\"\",\"\",offeringsRaw!J2)","v":"10:00a - 10:50a"},{"$f":"IF(offeringsRaw!K2=\"\",\"\",offeringsRaw!K2)","v":"Th"},{"$f":"IF(offeringsRaw!L2=\"\",\"\",offeringsRaw!L2)","v":341},{"$f":"IF(offeringsRaw!M2=\"\",\"\",offeringsRaw!M2)","v":"MCKB"},{"$f":"IF(offeringsRaw!Q2=\"\",\"\",offeringsRaw!Q2)","v":""}," - "]
["",{"$f":"IF(offeringsRaw!B3=\"\",\"\",offeringsRaw!B3)","v":"-"},{"$f":"IF(offeringsRaw!C3=\"\",\"\",offeringsRaw!C3)","v":""},{"$f":"IF(offeringsRaw!D3=\"\",\"\",offeringsRaw!D3)","v":77},{"$f":"IF(offeringsRaw!E3=\"\",\"\",offeringsRaw!E3)","v":" "},{"$f":"IF(offeringsRaw!F3=\"\",\"\",offeringsRaw!F3)","v":0},{"$f":"IF(offeringsRaw!G3=\"\",\"\",offeringsRaw!G3)","v":30},{"$f":"IF(offeringsRaw!I3=\"\",\"\",offeringsRaw!I3)","v":3},{"$f":"IF(offeringsRaw!J3=\"\",\"\",offeringsRaw!J3)","v":"9:00a - 9:50a"},{"$f":"IF(offeringsRaw!K3=\"\",\"\",offeringsRaw!K3)","v":"MW"},{"$f":"IF(offeringsRaw!L3=\"\",\"\",offeringsRaw!L3)","v":250},{"$f":"IF(offeringsRaw!M3=\"\",\"\",offeringsRaw!M3)","v":"SWKT"},{"$f":"IF(offeringsRaw!Q3=\"\",\"\",offeringsRaw!Q3)","v":"Kimball, Richard Ian"},"077 - Kimball, Richard Ian"]
[{"$f":"IF(RIGHT(B9,5)=\"A</A>\",\"A\",\"\")","v":""},{"$f":"IF(offeringsRaw!B4=\"\",\"\",offeringsRaw!B4)","v":""},{"$f":"IF(offeringsRaw!C4=\"\",\"\",offeringsRaw!C4)","v":""},{"$f":"IF(offeringsRaw!D4=\"\",\"\",offeringsRaw!D4)","v":""},{"$f":"IF(offeringsRaw!E4=\"\",\"\",offeringsRaw!E4)","v":""},{"$f":"IF(offeringsRaw!F4=\"\",\"\",offeringsRaw!F4)","v":""},{"$f":"IF(offeringsRaw!G4=\"\",\"\",offeringsRaw!G4)","v":""},{"$f":"IF(offeringsRaw!I4=\"\",\"\",offeringsRaw!I4)","v":""},{"$f":"IF(offeringsRaw!J4=\"\",\"\",offeringsRaw!J4)","v":"10:00a - 10:50a"},{"$f":"IF(offeringsRaw!K4=\"\",\"\",offeringsRaw!K4)","v":"F"},{"$f":"IF(offeringsRaw!L4=\"\",\"\",offeringsRaw!L4)","v":114},{"$f":"IF(offeringsRaw!M4=\"\",\"\",offeringsRaw!M4)","v":"JSB"},{"$f":"IF(offeringsRaw!Q4=\"\",\"\",offeringsRaw!Q4)","v":""}," - "]
["",{"$f":"IF(offeringsRaw!B5=\"\",\"\",offeringsRaw!B5)","v":"-"},{"$f":"IF(offeringsRaw!C5=\"\",\"\",offeringsRaw!C5)","v":""},{"$f":"IF(offeringsRaw!D5=\"\",\"\",offeringsRaw!D5)","v":78},{"$f":"IF(offeringsRaw!E5=\"\",\"\",offeringsRaw!E5)","v":" "},{"$f":"IF(offeringsRaw!F5=\"\",\"\",offeringsRaw!F5)","v":0},{"$f":"IF(offeringsRaw!G5=\"\",\"\",offeringsRaw!G5)","v":30},{"$f":"IF(offeringsRaw!I5=\"\",\"\",offeringsRaw!I5)","v":3},{"$f":"IF(offeringsRaw!J5=\"\",\"\",offeringsRaw!J5)","v":"9:00a - 9:50a"},{"$f":"IF(offeringsRaw!K5=\"\",\"\",offeringsRaw!K5)","v":"MW"},{"$f":"IF(offeringsRaw!L5=\"\",\"\",offeringsRaw!L5)","v":250},{"$f":"IF(offeringsRaw!M5=\"\",\"\",offeringsRaw!M5)","v":"SWKT"},{"$f":"IF(offeringsRaw!Q5=\"\",\"\",offeringsRaw!Q5)","v":"Kimball, Richard Ian"},"078 - Kimball, Richard Ian"]
["",{"$f":"IF(offeringsRaw!B6=\"\",\"\",offeringsRaw!B6)","v":""},{"$f":"IF(offeringsRaw!C6=\"\",\"\",offeringsRaw!C6)","v":""},{"$f":"IF(offeringsRaw!D6=\"\",\"\",offeringsRaw!D6)","v":""},{"$f":"IF(offeringsRaw!E6=\"\",\"\",offeringsRaw!E6)","v":""},{"$f":"IF(offeringsRaw!F6=\"\",\"\",offeringsRaw!F6)","v":""},{"$f":"IF(offeringsRaw!G6=\"\",\"\",offeringsRaw!G6)","v":""},{"$f":"IF(offeringsRaw!I6=\"\",\"\",offeringsRaw!I6)","v":""},{"$f":"IF(offeringsRaw!J6=\"\",\"\",offeringsRaw!J6)","v":"9:00a - 9:50a"},{"$f":"IF(offeringsRaw!K6=\"\",\"\",offeringsRaw!K6)","v":"Th"},{"$f":"IF(offeringsRaw!L6=\"\",\"\",offeringsRaw!L6)","v":366},{"$f":"IF(offeringsRaw!M6=\"\",\"\",offeringsRaw!M6)","v":"MARB"},{"$f":"IF(offeringsRaw!Q6=\"\",\"\",offeringsRaw!Q6)","v":""}," - "]
["",{"$f":"IF(offeringsRaw!B7=\"\",\"\",offeringsRaw!B7)","v":"-"},{"$f":"IF(offeringsRaw!C7=\"\",\"\",offeringsRaw!C7)","v":""},{"$f":"IF(offeringsRaw!D7=\"\",\"\",offeringsRaw!D7)","v":87},{"$f":"IF(offeringsRaw!E7=\"\",\"\",offeringsRaw!E7)","v":" "},{"$f":"IF(offeringsRaw!F7=\"\",\"\",offeringsRaw!F7)","v":0},{"$f":"IF(offeringsRaw!G7=\"\",\"\",offeringsRaw!G7)","v":30},{"$f":"IF(offeringsRaw!I7=\"\",\"\",offeringsRaw!I7)","v":3},{"$f":"IF(offeringsRaw!J7=\"\",\"\",offeringsRaw!J7)","v":"9:00a - 9:50a"},{"$f":"IF(offeringsRaw!K7=\"\",\"\",offeringsRaw!K7)","v":"MW"},{"$f":"IF(offeringsRaw!L7=\"\",\"\",offeringsRaw!L7)","v":250},{"$f":"IF(offeringsRaw!M7=\"\",\"\",offeringsRaw!M7)","v":"SWKT"},{"$f":"IF(offeringsRaw!Q7=\"\",\"\",offeringsRaw!Q7)","v":"Kimball, Richard Ian"},"087 - Kimball, Richard Ian"]
["",{"$f":"IF(offeringsRaw!B8=\"\",\"\",offeringsRaw!B8)","v":""},{"$f":"IF(offeringsRaw!C8=\"\",\"\",offeringsRaw!C8)","v":""},{"$f":"IF(offeringsRaw!D8=\"\",\"\",offeringsRaw!D8)","v":""},{"$f":"IF(offeringsRaw!E8=\"\",\"\",offeringsRaw!E8)","v":""},{"$f":"IF(offeringsRaw!F8=\"\",\"\",offeringsRaw!F8)","v":""},{"$f":"IF(offeringsRaw!G8=\"\",\"\",offeringsRaw!G8)","v":""},{"$f":"IF(offeringsRaw!I8=\"\",\"\",offeringsRaw!I8)","v":""},{"$f":"IF(offeringsRaw!J8=\"\",\"\",offeringsRaw!J8)","v":"9:00a - 9:50a"},{"$f":"IF(offeringsRaw!K8=\"\",\"\",offeringsRaw!K8)","v":"F"},{"$f":"IF(offeringsRaw!L8=\"\",\"\",offeringsRaw!L8)","v":203},{"$f":"IF(offeringsRaw!M8=\"\",\"\",offeringsRaw!M8)","v":"JSB"},{"$f":"IF(offeringsRaw!Q8=\"\",\"\",offeringsRaw!Q8)","v":""}," - "]
["",{"$f":"IF(offeringsRaw!B9=\"\",\"\",offeringsRaw!B9)","v":"-"},{"$f":"IF(offeringsRaw!C9=\"\",\"\",offeringsRaw!C9)","v":""},{"$f":"IF(offeringsRaw!D9=\"\",\"\",offeringsRaw!D9)","v":88},{"$f":"IF(offeringsRaw!E9=\"\",\"\",offeringsRaw!E9)","v":" "},{"$f":"IF(offeringsRaw!F9=\"\",\"\",offeringsRaw!F9)","v":0},{"$f":"IF(offeringsRaw!G9=\"\",\"\",offeringsRaw!G9)","v":30},{"$f":"IF(offeringsRaw!I9=\"\",\"\",offeringsRaw!I9)","v":3},{"$f":"IF(offeringsRaw!J9=\"\",\"\",offeringsRaw!J9)","v":"9:00a - 9:50a"},{"$f":"IF(offeringsRaw!K9=\"\",\"\",offeringsRaw!K9)","v":"MW"},{"$f":"IF(offeringsRaw!L9=\"\",\"\",offeringsRaw!L9)","v":250},{"$f":"IF(offeringsRaw!M9=\"\",\"\",offeringsRaw!M9)","v":"SWKT"},{"$f":"IF(offeringsRaw!Q9=\"\",\"\",offeringsRaw!Q9)","v":"Kimball, Richard Ian"},"088 - Kimball, Richard Ian"]
["",{"$f":"IF(offeringsRaw!B10=\"\",\"\",offeringsRaw!B10)","v":""},{"$f":"IF(offeringsRaw!C10=\"\",\"\",offeringsRaw!C10)","v":""},{"$f":"IF(offeringsRaw!D10=\"\",\"\",offeringsRaw!D10)","v":""},{"$f":"IF(offeringsRaw!E10=\"\",\"\",offeringsRaw!E10)","v":""},{"$f":"IF(offeringsRaw!F10=\"\",\"\",offeringsRaw!F10)","v":""},{"$f":"IF(offeringsRaw!G10=\"\",\"\",offeringsRaw!G10)","v":""},{"$f":"IF(offeringsRaw!I10=\"\",\"\",offeringsRaw!I10)","v":""},{"$f":"IF(offeringsRaw!J10=\"\",\"\",offeringsRaw!J10)","v":"10:00a - 10:50a"},{"$f":"IF(offeringsRaw!K10=\"\",\"\",offeringsRaw!K10)","v":"Th"},{"$f":"IF(offeringsRaw!L10=\"\",\"\",offeringsRaw!L10)","v":366},{"$f":"IF(offeringsRaw!M10=\"\",\"\",offeringsRaw!M10)","v":"MARB"},{"$f":"IF(offeringsRaw!Q10=\"\",\"\",offeringsRaw!Q10)","v":""}," - "]
["",{"$f":"IF(offeringsRaw!B11=\"\",\"\",offeringsRaw!B11)","v":"-"},{"$f":"IF(offeringsRaw!C11=\"\",\"\",offeringsRaw!C11)","v":""},{"$f":"IF(offeringsRaw!D11=\"\",\"\",offeringsRaw!D11)","v":91},{"$f":"IF(offeringsRaw!E11=\"\",\"\",offeringsRaw!E11)","v":" "},{"$f":"IF(offeringsRaw!F11=\"\",\"\",offeringsRaw!F11)","v":0},{"$f":"IF(offeringsRaw!G11=\"\",\"\",offeringsRaw!G11)","v":30},{"$f":"IF(offeringsRaw!I11=\"\",\"\",offeringsRaw!I11)","v":3},{"$f":"IF(offeringsRaw!J11=\"\",\"\",offeringsRaw!J11)","v":"9:00a - 9:50a"},{"$f":"IF(offeringsRaw!K11=\"\",\"\",offeringsRaw!K11)","v":"MW"},{"$f":"IF(offeringsRaw!L11=\"\",\"\",offeringsRaw!L11)","v":250},{"$f":"IF(offeringsRaw!M11=\"\",\"\",offeringsRaw!M11)","v":"SWKT"},{"$f":"IF(offeringsRaw!Q11=\"\",\"\",offeringsRaw!Q11)","v":"Kimball, Richard Ian"},"091 - Kimball, Richard Ian"]
["",{"$f":"IF(offeringsRaw!B12=\"\",\"\",offeringsRaw!B12)","v":""},{"$f":"IF(offeringsRaw!C12=\"\",\"\",offeringsRaw!C12)","v":""},{"$f":"IF(offeringsRaw!D12=\"\",\"\",offeringsRaw!D12)","v":""},{"$f":"IF(offeringsRaw!E12=\"\",\"\",offeringsRaw!E12)","v":""},{"$f":"IF(offeringsRaw!F12=\"\",\"\",offeringsRaw!F12)","v":""},{"$f":"IF(offeringsRaw!G12=\"\",\"\",offeringsRaw!G12)","v":""},{"$f":"IF(offeringsRaw!I12=\"\",\"\",offeringsRaw!I12)","v":""},{"$f":"IF(offeringsRaw!J12=\"\",\"\",offeringsRaw!J12)","v":"9:00a - 9:50a"},{"$f":"IF(offeringsRaw!K12=\"\",\"\",offeringsRaw!K12)","v":"F"},{"$f":"IF(offeringsRaw!L12=\"\",\"\",offeringsRaw!L12)","v":114},{"$f":"IF(offeringsRaw!M12=\"\",\"\",offeringsRaw!M12)","v":"JSB"},{"$f":"IF(offeringsRaw!Q12=\"\",\"\",offeringsRaw!Q12)","v":""}," - "]
["",{"$f":"IF(offeringsRaw!B13=\"\",\"\",offeringsRaw!B13)","v":"-"},{"$f":"IF(offeringsRaw!C13=\"\",\"\",offeringsRaw!C13)","v":""},{"$f":"IF(offeringsRaw!D13=\"\",\"\",offeringsRaw!D13)","v":92},{"$f":"IF(offeringsRaw!E13=\"\",\"\",offeringsRaw!E13)","v":" "},{"$f":"IF(offeringsRaw!F13=\"\",\"\",offeringsRaw!F13)","v":0},{"$f":"IF(offeringsRaw!G13=\"\",\"\",offeringsRaw!G13)","v":30},{"$f":"IF(offeringsRaw!I13=\"\",\"\",offeringsRaw!I13)","v":3},{"$f":"IF(offeringsRaw!J13=\"\",\"\",offeringsRaw!J13)","v":"9:00a - 9:50a"},{"$f":"IF(offeringsRaw!K13=\"\",\"\",offeringsRaw!K13)","v":"MW"},{"$f":"IF(offeringsRaw!L13=\"\",\"\",offeringsRaw!L13)","v":250},{"$f":"IF(offeringsRaw!M13=\"\",\"\",offeringsRaw!M13)","v":"SWKT"},{"$f":"IF(offeringsRaw!Q13=\"\",\"\",offeringsRaw!Q13)","v":"Kimball, Richard Ian"},"092 - Kimball, Richard Ian"]
["",{"$f":"IF(offeringsRaw!B14=\"\",\"\",offeringsRaw!B14)","v":""},{"$f":"IF(offeringsRaw!C14=\"\",\"\",offeringsRaw!C14)","v":""},{"$f":"IF(offeringsRaw!D14=\"\",\"\",offeringsRaw!D14)","v":""},{"$f":"IF(offeringsRaw!E14=\"\",\"\",offeringsRaw!E14)","v":""},{"$f":"IF(offeringsRaw!F14=\"\",\"\",offeringsRaw!F14)","v":""},{"$f":"IF(offeringsRaw!G14=\"\",\"\",offeringsRaw!G14)","v":""},{"$f":"IF(offeringsRaw!I14=\"\",\"\",offeringsRaw!I14)","v":""},{"$f":"IF(offeringsRaw!J14=\"\",\"\",offeringsRaw!J14)","v":"9:00a - 9:50a"},{"$f":"IF(offeringsRaw!K14=\"\",\"\",offeringsRaw!K14)","v":"F"},{"$f":"IF(offeringsRaw!L14=\"\",\"\",offeringsRaw!L14)","v":170},{"$f":"IF(offeringsRaw!M14=\"\",\"\",offeringsRaw!M14)","v":"JSB"},{"$f":"IF(offeringsRaw!Q14=\"\",\"\",offeringsRaw!Q14)","v":""}," - "]
["",{"$f":"IF(offeringsRaw!B15=\"\",\"\",offeringsRaw!B15)","v":"-"},{"$f":"IF(offeringsRaw!C15=\"\",\"\",offeringsRaw!C15)","v":""},{"$f":"IF(offeringsRaw!D15=\"\",\"\",offeringsRaw!D15)","v":94},{"$f":"IF(offeringsRaw!E15=\"\",\"\",offeringsRaw!E15)","v":" "},{"$f":"IF(offeringsRaw!F15=\"\",\"\",offeringsRaw!F15)","v":0},{"$f":"IF(offeringsRaw!G15=\"\",\"\",offeringsRaw!G15)","v":30},{"$f":"IF(offeringsRaw!I15=\"\",\"\",offeringsRaw!I15)","v":3},{"$f":"IF(offeringsRaw!J15=\"\",\"\",offeringsRaw!J15)","v":"9:00a - 9:50a"},{"$f":"IF(offeringsRaw!K15=\"\",\"\",offeringsRaw!K15)","v":"MW"},{"$f":"IF(offeringsRaw!L15=\"\",\"\",offeringsRaw!L15)","v":250},{"$f":"IF(offeringsRaw!M15=\"\",\"\",offeringsRaw!M15)","v":"SWKT"},{"$f":"IF(offeringsRaw!Q15=\"\",\"\",offeringsRaw!Q15)","v":"Kimball, Richard Ian"},"094 - Kimball, Richard Ian"]
["",{"$f":"IF(offeringsRaw!B16=\"\",\"\",offeringsRaw!B16)","v":""},{"$f":"IF(offeringsRaw!C16=\"\",\"\",offeringsRaw!C16)","v":""},{"$f":"IF(offeringsRaw!D16=\"\",\"\",offeringsRaw!D16)","v":""},{"$f":"IF(offeringsRaw!E16=\"\",\"\",offeringsRaw!E16)","v":""},{"$f":"IF(offeringsRaw!F16=\"\",\"\",offeringsRaw!F16)","v":""},{"$f":"IF(offeringsRaw!G16=\"\",\"\",offeringsRaw!G16)","v":""},{"$f":"IF(offeringsRaw!I16=\"\",\"\",offeringsRaw!I16)","v":""},{"$f":"IF(offeringsRaw!J16=\"\",\"\",offeringsRaw!J16)","v":"8:00a - 8:50a"},{"$f":"IF(offeringsRaw!K16=\"\",\"\",offeringsRaw!K16)","v":"F"},{"$f":"IF(offeringsRaw!L16=\"\",\"\",offeringsRaw!L16)","v":171},{"$f":"IF(offeringsRaw!M16=\"\",\"\",offeringsRaw!M16)","v":"JSB"},{"$f":"IF(offeringsRaw!Q16=\"\",\"\",offeringsRaw!Q16)","v":""}," - "]
["",{"$f":"IF(offeringsRaw!B17=\"\",\"\",offeringsRaw!B17)","v":"-"},{"$f":"IF(offeringsRaw!C17=\"\",\"\",offeringsRaw!C17)","v":""},{"$f":"IF(offeringsRaw!D17=\"\",\"\",offeringsRaw!D17)","v":95},{"$f":"IF(offeringsRaw!E17=\"\",\"\",offeringsRaw!E17)","v":" "},{"$f":"IF(offeringsRaw!F17=\"\",\"\",offeringsRaw!F17)","v":0},{"$f":"IF(offeringsRaw!G17=\"\",\"\",offeringsRaw!G17)","v":30},{"$f":"IF(offeringsRaw!I17=\"\",\"\",offeringsRaw!I17)","v":3},{"$f":"IF(offeringsRaw!J17=\"\",\"\",offeringsRaw!J17)","v":"9:00a - 9:50a"},{"$f":"IF(offeringsRaw!K17=\"\",\"\",offeringsRaw!K17)","v":"MW"},{"$f":"IF(offeringsRaw!L17=\"\",\"\",offeringsRaw!L17)","v":250},{"$f":"IF(offeringsRaw!M17=\"\",\"\",offeringsRaw!M17)","v":"SWKT"},{"$f":"IF(offeringsRaw!Q17=\"\",\"\",offeringsRaw!Q17)","v":"Kimball, Richard Ian"},"095 - Kimball, Richard Ian"]
["",{"$f":"IF(offeringsRaw!B18=\"\",\"\",offeringsRaw!B18)","v":""},{"$f":"IF(offeringsRaw!C18=\"\",\"\",offeringsRaw!C18)","v":""},{"$f":"IF(offeringsRaw!D18=\"\",\"\",offeringsRaw!D18)","v":""},{"$f":"IF(offeringsRaw!E18=\"\",\"\",offeringsRaw!E18)","v":""},{"$f":"IF(offeringsRaw!F18=\"\",\"\",offeringsRaw!F18)","v":""},{"$f":"IF(offeringsRaw!G18=\"\",\"\",offeringsRaw!G18)","v":""},{"$f":"IF(offeringsRaw!I18=\"\",\"\",offeringsRaw!I18)","v":""},{"$f":"IF(offeringsRaw!J18=\"\",\"\",offeringsRaw!J18)","v":"8:00a - 8:50a"},{"$f":"IF(offeringsRaw!K18=\"\",\"\",offeringsRaw!K18)","v":"F"},{"$f":"IF(offeringsRaw!L18=\"\",\"\",offeringsRaw!L18)","v":175},{"$f":"IF(offeringsRaw!M18=\"\",\"\",offeringsRaw!M18)","v":"JSB"},{"$f":"IF(offeringsRaw!Q18=\"\",\"\",offeringsRaw!Q18)","v":""}," - "]
["",{"$f":"IF(offeringsRaw!B19=\"\",\"\",offeringsRaw!B19)","v":"-"},{"$f":"IF(offeringsRaw!C19=\"\",\"\",offeringsRaw!C19)","v":""},{"$f":"IF(offeringsRaw!D19=\"\",\"\",offeringsRaw!D19)","v":47},{"$f":"IF(offeringsRaw!E19=\"\",\"\",offeringsRaw!E19)","v":" "},{"$f":"IF(offeringsRaw!F19=\"\",\"\",offeringsRaw!F19)","v":0},{"$f":"IF(offeringsRaw!G19=\"\",\"\",offeringsRaw!G19)","v":30},{"$f":"IF(offeringsRaw!I19=\"\",\"\",offeringsRaw!I19)","v":3},{"$f":"IF(offeringsRaw!J19=\"\",\"\",offeringsRaw!J19)","v":"10:00a - 10:50a"},{"$f":"IF(offeringsRaw!K19=\"\",\"\",offeringsRaw!K19)","v":"MW"},{"$f":"IF(offeringsRaw!L19=\"\",\"\",offeringsRaw!L19)","v":250},{"$f":"IF(offeringsRaw!M19=\"\",\"\",offeringsRaw!M19)","v":"SWKT"},{"$f":"IF(offeringsRaw!Q19=\"\",\"\",offeringsRaw!Q19)","v":"Kimball, Richard Ian"},"047 - Kimball, Richard Ian"]
["",{"$f":"IF(offeringsRaw!B20=\"\",\"\",offeringsRaw!B20)","v":""},{"$f":"IF(offeringsRaw!C20=\"\",\"\",offeringsRaw!C20)","v":""},{"$f":"IF(offeringsRaw!D20=\"\",\"\",offeringsRaw!D20)","v":""},{"$f":"IF(offeringsRaw!E20=\"\",\"\",offeringsRaw!E20)","v":""},{"$f":"IF(offeringsRaw!F20=\"\",\"\",offeringsRaw!F20)","v":""},{"$f":"IF(offeringsRaw!G20=\"\",\"\",offeringsRaw!G20)","v":""},{"$f":"IF(offeringsRaw!I20=\"\",\"\",offeringsRaw!I20)","v":""},{"$f":"IF(offeringsRaw!J20=\"\",\"\",offeringsRaw!J20)","v":"9:00a - 9:50a"},{"$f":"IF(offeringsRaw!K20=\"\",\"\",offeringsRaw!K20)","v":"F"},{"$f":"IF(offeringsRaw!L20=\"\",\"\",offeringsRaw!L20)","v":106},{"$f":"IF(offeringsRaw!M20=\"\",\"\",offeringsRaw!M20)","v":"JSB"},{"$f":"IF(offeringsRaw!Q20=\"\",\"\",offeringsRaw!Q20)","v":""}," - "]
["",{"$f":"IF(offeringsRaw!B21=\"\",\"\",offeringsRaw!B21)","v":"-"},{"$f":"IF(offeringsRaw!C21=\"\",\"\",offeringsRaw!C21)","v":""},{"$f":"IF(offeringsRaw!D21=\"\",\"\",offeringsRaw!D21)","v":49},{"$f":"IF(offeringsRaw!E21=\"\",\"\",offeringsRaw!E21)","v":" "},{"$f":"IF(offeringsRaw!F21=\"\",\"\",offeringsRaw!F21)","v":0},{"$f":"IF(offeringsRaw!G21=\"\",\"\",offeringsRaw!G21)","v":30},{"$f":"IF(offeringsRaw!I21=\"\",\"\",offeringsRaw!I21)","v":3},{"$f":"IF(offeringsRaw!J21=\"\",\"\",offeringsRaw!J21)","v":"10:00a - 10:50a"},{"$f":"IF(offeringsRaw!K21=\"\",\"\",offeringsRaw!K21)","v":"MW"},{"$f":"IF(offeringsRaw!L21=\"\",\"\",offeringsRaw!L21)","v":250},{"$f":"IF(offeringsRaw!M21=\"\",\"\",offeringsRaw!M21)","v":"SWKT"},{"$f":"IF(offeringsRaw!Q21=\"\",\"\",offeringsRaw!Q21)","v":"Kimball, Richard Ian"},"049 - Kimball, Richard Ian"]
["",{"$f":"IF(offeringsRaw!B22=\"\",\"\",offeringsRaw!B22)","v":""},{"$f":"IF(offeringsRaw!C22=\"\",\"\",offeringsRaw!C22)","v":""},{"$f":"IF(offeringsRaw!D22=\"\",\"\",offeringsRaw!D22)","v":""},{"$f":"IF(offeringsRaw!E22=\"\",\"\",offeringsRaw!E22)","v":""},{"$f":"IF(offeringsRaw!F22=\"\",\"\",offeringsRaw!F22)","v":""},{"$f":"IF(offeringsRaw!G22=\"\",\"\",offeringsRaw!G22)","v":""},{"$f":"IF(offeringsRaw!I22=\"\",\"\",offeringsRaw!I22)","v":""},{"$f":"IF(offeringsRaw!J22=\"\",\"\",offeringsRaw!J22)","v":"10:00a - 10:50a"},{"$f":"IF(offeringsRaw!K22=\"\",\"\",offeringsRaw!K22)","v":"Th"},{"$f":"IF(offeringsRaw!L22=\"\",\"\",offeringsRaw!L22)","v":280},{"$f":"IF(offeringsRaw!M22=\"\",\"\",offeringsRaw!M22)","v":"MCKB"},{"$f":"IF(offeringsRaw!Q22=\"\",\"\",offeringsRaw!Q22)","v":""}," - "]
["",{"$f":"IF(offeringsRaw!B23=\"\",\"\",offeringsRaw!B23)","v":"-"},{"$f":"IF(offeringsRaw!C23=\"\",\"\",offeringsRaw!C23)","v":""},{"$f":"IF(offeringsRaw!D23=\"\",\"\",offeringsRaw!D23)","v":74},{"$f":"IF(offeringsRaw!E23=\"\",\"\",offeringsRaw!E23)","v":" "},{"$f":"IF(offeringsRaw!F23=\"\",\"\",offeringsRaw!F23)","v":0},{"$f":"IF(offeringsRaw!G23=\"\",\"\",offeringsRaw!G23)","v":30},{"$f":"IF(offeringsRaw!I23=\"\",\"\",offeringsRaw!I23)","v":3},{"$f":"IF(offeringsRaw!J23=\"\",\"\",offeringsRaw!J23)","v":"10:00a - 10:50a"},{"$f":"IF(offeringsRaw!K23=\"\",\"\",offeringsRaw!K23)","v":"MW"},{"$f":"IF(offeringsRaw!L23=\"\",\"\",offeringsRaw!L23)","v":250},{"$f":"IF(offeringsRaw!M23=\"\",\"\",offeringsRaw!M23)","v":"SWKT"},{"$f":"IF(offeringsRaw!Q23=\"\",\"\",offeringsRaw!Q23)","v":"Kimball, Richard Ian"},"074 - Kimball, Richard Ian"]
["",{"$f":"IF(offeringsRaw!B24=\"\",\"\",offeringsRaw!B24)","v":""},{"$f":"IF(offeringsRaw!C24=\"\",\"\",offeringsRaw!C24)","v":""},{"$f":"IF(offeringsRaw!D24=\"\",\"\",offeringsRaw!D24)","v":""},{"$f":"IF(offeringsRaw!E24=\"\",\"\",offeringsRaw!E24)","v":""},{"$f":"IF(offeringsRaw!F24=\"\",\"\",offeringsRaw!F24)","v":""},{"$f":"IF(offeringsRaw!G24=\"\",\"\",offeringsRaw!G24)","v":""},{"$f":"IF(offeringsRaw!I24=\"\",\"\",offeringsRaw!I24)","v":""},{"$f":"IF(offeringsRaw!J24=\"\",\"\",offeringsRaw!J24)","v":"9:00a - 9:50a"},{"$f":"IF(offeringsRaw!K24=\"\",\"\",offeringsRaw!K24)","v":"F"},{"$f":"IF(offeringsRaw!L24=\"\",\"\",offeringsRaw!L24)","v":103},{"$f":"IF(offeringsRaw!M24=\"\",\"\",offeringsRaw!M24)","v":"JSB"},{"$f":"IF(offeringsRaw!Q24=\"\",\"\",offeringsRaw!Q24)","v":""}," - "]
["",{"$f":"IF(offeringsRaw!B25=\"\",\"\",offeringsRaw!B25)","v":"-"},{"$f":"IF(offeringsRaw!C25=\"\",\"\",offeringsRaw!C25)","v":""},{"$f":"IF(offeringsRaw!D25=\"\",\"\",offeringsRaw!D25)","v":76},{"$f":"IF(offeringsRaw!E25=\"\",\"\",offeringsRaw!E25)","v":" "},{"$f":"IF(offeringsRaw!F25=\"\",\"\",offeringsRaw!F25)","v":0},{"$f":"IF(offeringsRaw!G25=\"\",\"\",offeringsRaw!G25)","v":30},{"$f":"IF(offeringsRaw!I25=\"\",\"\",offeringsRaw!I25)","v":3},{"$f":"IF(offeringsRaw!J25=\"\",\"\",offeringsRaw!J25)","v":"10:00a - 10:50a"},{"$f":"IF(offeringsRaw!K25=\"\",\"\",offeringsRaw!K25)","v":"MW"},{"$f":"IF(offeringsRaw!L25=\"\",\"\",offeringsRaw!L25)","v":250},{"$f":"IF(offeringsRaw!M25=\"\",\"\",offeringsRaw!M25)","v":"SWKT"},{"$f":"IF(offeringsRaw!Q25=\"\",\"\",offeringsRaw!Q25)","v":"Kimball, Richard Ian"},"076 - Kimball, Richard Ian"]
["",{"$f":"IF(offeringsRaw!B26=\"\",\"\",offeringsRaw!B26)","v":""},{"$f":"IF(offeringsRaw!C26=\"\",\"\",offeringsRaw!C26)","v":""},{"$f":"IF(offeringsRaw!D26=\"\",\"\",offeringsRaw!D26)","v":""},{"$f":"IF(offeringsRaw!E26=\"\",\"\",offeringsRaw!E26)","v":""},{"$f":"IF(offeringsRaw!F26=\"\",\"\",offeringsRaw!F26)","v":""},{"$f":"IF(offeringsRaw!G26=\"\",\"\",offeringsRaw!G26)","v":""},{"$f":"IF(offeringsRaw!I26=\"\",\"\",offeringsRaw!I26)","v":""},{"$f":"IF(offeringsRaw!J26=\"\",\"\",offeringsRaw!J26)","v":"11:00a - 11:50a"},{"$f":"IF(offeringsRaw!K26=\"\",\"\",offeringsRaw!K26)","v":"F"},{"$f":"IF(offeringsRaw!L26=\"\",\"\",offeringsRaw!L26)","v":174},{"$f":"IF(offeringsRaw!M26=\"\",\"\",offeringsRaw!M26)","v":"JSB"},{"$f":"IF(offeringsRaw!Q26=\"\",\"\",offeringsRaw!Q26)","v":""}," - "]
["",{"$f":"IF(offeringsRaw!B27=\"\",\"\",offeringsRaw!B27)","v":"-"},{"$f":"IF(offeringsRaw!C27=\"\",\"\",offeringsRaw!C27)","v":""},{"$f":"IF(offeringsRaw!D27=\"\",\"\",offeringsRaw!D27)","v":82},{"$f":"IF(offeringsRaw!E27=\"\",\"\",offeringsRaw!E27)","v":" "},{"$f":"IF(offeringsRaw!F27=\"\",\"\",offeringsRaw!F27)","v":0},{"$f":"IF(offeringsRaw!G27=\"\",\"\",offeringsRaw!G27)","v":30},{"$f":"IF(offeringsRaw!I27=\"\",\"\",offeringsRaw!I27)","v":3},{"$f":"IF(offeringsRaw!J27=\"\",\"\",offeringsRaw!J27)","v":"10:00a - 10:50a"},{"$f":"IF(offeringsRaw!K27=\"\",\"\",offeringsRaw!K27)","v":"MW"},{"$f":"IF(offeringsRaw!L27=\"\",\"\",offeringsRaw!L27)","v":250},{"$f":"IF(offeringsRaw!M27=\"\",\"\",offeringsRaw!M27)","v":"SWKT"},{"$f":"IF(offeringsRaw!Q27=\"\",\"\",offeringsRaw!Q27)","v":"Kimball, Richard Ian"},"082 - Kimball, Richard Ian"]
["",{"$f":"IF(offeringsRaw!B28=\"\",\"\",offeringsRaw!B28)","v":""},{"$f":"IF(offeringsRaw!C28=\"\",\"\",offeringsRaw!C28)","v":""},{"$f":"IF(offeringsRaw!D28=\"\",\"\",offeringsRaw!D28)","v":""},{"$f":"IF(offeringsRaw!E28=\"\",\"\",offeringsRaw!E28)","v":""},{"$f":"IF(offeringsRaw!F28=\"\",\"\",offeringsRaw!F28)","v":""},{"$f":"IF(offeringsRaw!G28=\"\",\"\",offeringsRaw!G28)","v":""},{"$f":"IF(offeringsRaw!I28=\"\",\"\",offeringsRaw!I28)","v":""},{"$f":"IF(offeringsRaw!J28=\"\",\"\",offeringsRaw!J28)","v":"11:00a - 11:50a"},{"$f":"IF(offeringsRaw!K28=\"\",\"\",offeringsRaw!K28)","v":"F"},{"$f":"IF(offeringsRaw!L28=\"\",\"\",offeringsRaw!L28)","v":110},{"$f":"IF(offeringsRaw!M28=\"\",\"\",offeringsRaw!M28)","v":"JSB"},{"$f":"IF(offeringsRaw!Q28=\"\",\"\",offeringsRaw!Q28)","v":""}," - "]
["",{"$f":"IF(offeringsRaw!B29=\"\",\"\",offeringsRaw!B29)","v":"-"},{"$f":"IF(offeringsRaw!C29=\"\",\"\",offeringsRaw!C29)","v":""},{"$f":"IF(offeringsRaw!D29=\"\",\"\",offeringsRaw!D29)","v":84},{"$f":"IF(offeringsRaw!E29=\"\",\"\",offeringsRaw!E29)","v":" "},{"$f":"IF(offeringsRaw!F29=\"\",\"\",offeringsRaw!F29)","v":0},{"$f":"IF(offeringsRaw!G29=\"\",\"\",offeringsRaw!G29)","v":30},{"$f":"IF(offeringsRaw!I29=\"\",\"\",offeringsRaw!I29)","v":3},{"$f":"IF(offeringsRaw!J29=\"\",\"\",offeringsRaw!J29)","v":"10:00a - 10:50a"},{"$f":"IF(offeringsRaw!K29=\"\",\"\",offeringsRaw!K29)","v":"MW"},{"$f":"IF(offeringsRaw!L29=\"\",\"\",offeringsRaw!L29)","v":250},{"$f":"IF(offeringsRaw!M29=\"\",\"\",offeringsRaw!M29)","v":"SWKT"},{"$f":"IF(offeringsRaw!Q29=\"\",\"\",offeringsRaw!Q29)","v":"Kimball, Richard Ian"},"084 - Kimball, Richard Ian"]
["",{"$f":"IF(offeringsRaw!B30=\"\",\"\",offeringsRaw!B30)","v":""},{"$f":"IF(offeringsRaw!C30=\"\",\"\",offeringsRaw!C30)","v":""},{"$f":"IF(offeringsRaw!D30=\"\",\"\",offeringsRaw!D30)","v":""},{"$f":"IF(offeringsRaw!E30=\"\",\"\",offeringsRaw!E30)","v":""},{"$f":"IF(offeringsRaw!F30=\"\",\"\",offeringsRaw!F30)","v":""},{"$f":"IF(offeringsRaw!G30=\"\",\"\",offeringsRaw!G30)","v":""},{"$f":"IF(offeringsRaw!I30=\"\",\"\",offeringsRaw!I30)","v":""},{"$f":"IF(offeringsRaw!J30=\"\",\"\",offeringsRaw!J30)","v":"10:00a - 10:50a"},{"$f":"IF(offeringsRaw!K30=\"\",\"\",offeringsRaw!K30)","v":"F"},{"$f":"IF(offeringsRaw!L30=\"\",\"\",offeringsRaw!L30)","v":171},{"$f":"IF(offeringsRaw!M30=\"\",\"\",offeringsRaw!M30)","v":"JSB"},{"$f":"IF(offeringsRaw!Q30=\"\",\"\",offeringsRaw!Q30)","v":""}," - "]
["",{"$f":"IF(offeringsRaw!B31=\"\",\"\",offeringsRaw!B31)","v":"-"},{"$f":"IF(offeringsRaw!C31=\"\",\"\",offeringsRaw!C31)","v":""},{"$f":"IF(offeringsRaw!D31=\"\",\"\",offeringsRaw!D31)","v":90},{"$f":"IF(offeringsRaw!E31=\"\",\"\",offeringsRaw!E31)","v":" "},{"$f":"IF(offeringsRaw!F31=\"\",\"\",offeringsRaw!F31)","v":0},{"$f":"IF(offeringsRaw!G31=\"\",\"\",offeringsRaw!G31)","v":30},{"$f":"IF(offeringsRaw!I31=\"\",\"\",offeringsRaw!I31)","v":3},{"$f":"IF(offeringsRaw!J31=\"\",\"\",offeringsRaw!J31)","v":"10:00a - 10:50a"},{"$f":"IF(offeringsRaw!K31=\"\",\"\",offeringsRaw!K31)","v":"MW"},{"$f":"IF(offeringsRaw!L31=\"\",\"\",offeringsRaw!L31)","v":250},{"$f":"IF(offeringsRaw!M31=\"\",\"\",offeringsRaw!M31)","v":"SWKT"},{"$f":"IF(offeringsRaw!Q31=\"\",\"\",offeringsRaw!Q31)","v":"Kimball, Richard Ian"},"090 - Kimball, Richard Ian"]
["",{"$f":"IF(offeringsRaw!B32=\"\",\"\",offeringsRaw!B32)","v":""},{"$f":"IF(offeringsRaw!C32=\"\",\"\",offeringsRaw!C32)","v":""},{"$f":"IF(offeringsRaw!D32=\"\",\"\",offeringsRaw!D32)","v":""},{"$f":"IF(offeringsRaw!E32=\"\",\"\",offeringsRaw!E32)","v":""},{"$f":"IF(offeringsRaw!F32=\"\",\"\",offeringsRaw!F32)","v":""},{"$f":"IF(offeringsRaw!G32=\"\",\"\",offeringsRaw!G32)","v":""},{"$f":"IF(offeringsRaw!I32=\"\",\"\",offeringsRaw!I32)","v":""},{"$f":"IF(offeringsRaw!J32=\"\",\"\",offeringsRaw!J32)","v":"10:00a - 10:50a"},{"$f":"IF(offeringsRaw!K32=\"\",\"\",offeringsRaw!K32)","v":"F"},{"$f":"IF(offeringsRaw!L32=\"\",\"\",offeringsRaw!L32)","v":178},{"$f":"IF(offeringsRaw!M32=\"\",\"\",offeringsRaw!M32)","v":"JSB"},{"$f":"IF(offeringsRaw!Q32=\"\",\"\",offeringsRaw!Q32)","v":""}," - "]
["",{"$f":"IF(offeringsRaw!B33=\"\",\"\",offeringsRaw!B33)","v":"-"},{"$f":"IF(offeringsRaw!C33=\"\",\"\",offeringsRaw!C33)","v":""},{"$f":"IF(offeringsRaw!D33=\"\",\"\",offeringsRaw!D33)","v":93},{"$f":"IF(offeringsRaw!E33=\"\",\"\",offeringsRaw!E33)","v":" "},{"$f":"IF(offeringsRaw!F33=\"\",\"\",offeringsRaw!F33)","v":0},{"$f":"IF(offeringsRaw!G33=\"\",\"\",offeringsRaw!G33)","v":30},{"$f":"IF(offeringsRaw!I33=\"\",\"\",offeringsRaw!I33)","v":3},{"$f":"IF(offeringsRaw!J33=\"\",\"\",offeringsRaw!J33)","v":"10:00a - 10:50a"},{"$f":"IF(offeringsRaw!K33=\"\",\"\",offeringsRaw!K33)","v":"MW"},{"$f":"IF(offeringsRaw!L33=\"\",\"\",offeringsRaw!L33)","v":250},{"$f":"IF(offeringsRaw!M33=\"\",\"\",offeringsRaw!M33)","v":"SWKT"},{"$f":"IF(offeringsRaw!Q33=\"\",\"\",offeringsRaw!Q33)","v":"Kimball, Richard Ian"},"093 - Kimball, Richard Ian"]
["",{"$f":"IF(offeringsRaw!B34=\"\",\"\",offeringsRaw!B34)","v":""},{"$f":"IF(offeringsRaw!C34=\"\",\"\",offeringsRaw!C34)","v":""},{"$f":"IF(offeringsRaw!D34=\"\",\"\",offeringsRaw!D34)","v":""},{"$f":"IF(offeringsRaw!E34=\"\",\"\",offeringsRaw!E34)","v":""},{"$f":"IF(offeringsRaw!F34=\"\",\"\",offeringsRaw!F34)","v":""},{"$f":"IF(offeringsRaw!G34=\"\",\"\",offeringsRaw!G34)","v":""},{"$f":"IF(offeringsRaw!I34=\"\",\"\",offeringsRaw!I34)","v":""},{"$f":"IF(offeringsRaw!J34=\"\",\"\",offeringsRaw!J34)","v":"9:00a - 9:50a"},{"$f":"IF(offeringsRaw!K34=\"\",\"\",offeringsRaw!K34)","v":"Th"},{"$f":"IF(offeringsRaw!L34=\"\",\"\",offeringsRaw!L34)","v":406},{"$f":"IF(offeringsRaw!M34=\"\",\"\",offeringsRaw!M34)","v":"CB"},{"$f":"IF(offeringsRaw!Q34=\"\",\"\",offeringsRaw!Q34)","v":""}," - "]
["",{"$f":"IF(offeringsRaw!B35=\"\",\"\",offeringsRaw!B35)","v":"-"},{"$f":"IF(offeringsRaw!C35=\"\",\"\",offeringsRaw!C35)","v":""},{"$f":"IF(offeringsRaw!D35=\"\",\"\",offeringsRaw!D35)","v":96},{"$f":"IF(offeringsRaw!E35=\"\",\"\",offeringsRaw!E35)","v":" "},{"$f":"IF(offeringsRaw!F35=\"\",\"\",offeringsRaw!F35)","v":0},{"$f":"IF(offeringsRaw!G35=\"\",\"\",offeringsRaw!G35)","v":30},{"$f":"IF(offeringsRaw!I35=\"\",\"\",offeringsRaw!I35)","v":3},{"$f":"IF(offeringsRaw!J35=\"\",\"\",offeringsRaw!J35)","v":"10:00a - 10:50a"},{"$f":"IF(offeringsRaw!K35=\"\",\"\",offeringsRaw!K35)","v":"MW"},{"$f":"IF(offeringsRaw!L35=\"\",\"\",offeringsRaw!L35)","v":250},{"$f":"IF(offeringsRaw!M35=\"\",\"\",offeringsRaw!M35)","v":"SWKT"},{"$f":"IF(offeringsRaw!Q35=\"\",\"\",offeringsRaw!Q35)","v":"Kimball, Richard Ian"},"096 - Kimball, Richard Ian"]
["",{"$f":"IF(offeringsRaw!B36=\"\",\"\",offeringsRaw!B36)","v":""},{"$f":"IF(offeringsRaw!C36=\"\",\"\",offeringsRaw!C36)","v":""},{"$f":"IF(offeringsRaw!D36=\"\",\"\",offeringsRaw!D36)","v":""},{"$f":"IF(offeringsRaw!E36=\"\",\"\",offeringsRaw!E36)","v":""},{"$f":"IF(offeringsRaw!F36=\"\",\"\",offeringsRaw!F36)","v":""},{"$f":"IF(offeringsRaw!G36=\"\",\"\",offeringsRaw!G36)","v":""},{"$f":"IF(offeringsRaw!I36=\"\",\"\",offeringsRaw!I36)","v":""},{"$f":"IF(offeringsRaw!J36=\"\",\"\",offeringsRaw!J36)","v":"9:00a - 9:50a"},{"$f":"IF(offeringsRaw!K36=\"\",\"\",offeringsRaw!K36)","v":"Th"},{"$f":"IF(offeringsRaw!L36=\"\",\"\",offeringsRaw!L36)","v":250},{"$f":"IF(offeringsRaw!M36=\"\",\"\",offeringsRaw!M36)","v":"BRMB"},{"$f":"IF(offeringsRaw!Q36=\"\",\"\",offeringsRaw!Q36)","v":""}," - "]
["",{"$f":"IF(offeringsRaw!B37=\"\",\"\",offeringsRaw!B37)","v":"-"},{"$f":"IF(offeringsRaw!C37=\"\",\"\",offeringsRaw!C37)","v":""},{"$f":"IF(offeringsRaw!D37=\"\",\"\",offeringsRaw!D37)","v":1},{"$f":"IF(offeringsRaw!E37=\"\",\"\",offeringsRaw!E37)","v":" "},{"$f":"IF(offeringsRaw!F37=\"\",\"\",offeringsRaw!F37)","v":0},{"$f":"IF(offeringsRaw!G37=\"\",\"\",offeringsRaw!G37)","v":30},{"$f":"IF(offeringsRaw!I37=\"\",\"\",offeringsRaw!I37)","v":3},{"$f":"IF(offeringsRaw!J37=\"\",\"\",offeringsRaw!J37)","v":"11:00a - 11:50a"},{"$f":"IF(offeringsRaw!K37=\"\",\"\",offeringsRaw!K37)","v":"MW"},{"$f":"IF(offeringsRaw!L37=\"\",\"\",offeringsRaw!L37)","v":140},{"$f":"IF(offeringsRaw!M37=\"\",\"\",offeringsRaw!M37)","v":"JSB"},{"$f":"IF(offeringsRaw!Q37=\"\",\"\",offeringsRaw!Q37)","v":"Patterson, Kelly D"},"001 - Patterson, Kelly D"]
["",{"$f":"IF(offeringsRaw!B38=\"\",\"\",offeringsRaw!B38)","v":""},{"$f":"IF(offeringsRaw!C38=\"\",\"\",offeringsRaw!C38)","v":""},{"$f":"IF(offeringsRaw!D38=\"\",\"\",offeringsRaw!D38)","v":""},{"$f":"IF(offeringsRaw!E38=\"\",\"\",offeringsRaw!E38)","v":""},{"$f":"IF(offeringsRaw!F38=\"\",\"\",offeringsRaw!F38)","v":""},{"$f":"IF(offeringsRaw!G38=\"\",\"\",offeringsRaw!G38)","v":""},{"$f":"IF(offeringsRaw!I38=\"\",\"\",offeringsRaw!I38)","v":""},{"$f":"IF(offeringsRaw!J38=\"\",\"\",offeringsRaw!J38)","v":"8:00a - 8:50a"},{"$f":"IF(offeringsRaw!K38=\"\",\"\",offeringsRaw!K38)","v":"Th"},{"$f":"IF(offeringsRaw!L38=\"\",\"\",offeringsRaw!L38)","v":202},{"$f":"IF(offeringsRaw!M38=\"\",\"\",offeringsRaw!M38)","v":"JSB"},{"$f":"IF(offeringsRaw!Q38=\"\",\"\",offeringsRaw!Q38)","v":""}," - "]
["",{"$f":"IF(offeringsRaw!B39=\"\",\"\",offeringsRaw!B39)","v":"-"},{"$f":"IF(offeringsRaw!C39=\"\",\"\",offeringsRaw!C39)","v":""},{"$f":"IF(offeringsRaw!D39=\"\",\"\",offeringsRaw!D39)","v":2},{"$f":"IF(offeringsRaw!E39=\"\",\"\",offeringsRaw!E39)","v":" "},{"$f":"IF(offeringsRaw!F39=\"\",\"\",offeringsRaw!F39)","v":0},{"$f":"IF(offeringsRaw!G39=\"\",\"\",offeringsRaw!G39)","v":30},{"$f":"IF(offeringsRaw!I39=\"\",\"\",offeringsRaw!I39)","v":3},{"$f":"IF(offeringsRaw!J39=\"\",\"\",offeringsRaw!J39)","v":"11:00a - 11:50a"},{"$f":"IF(offeringsRaw!K39=\"\",\"\",offeringsRaw!K39)","v":"MW"},{"$f":"IF(offeringsRaw!L39=\"\",\"\",offeringsRaw!L39)","v":140},{"$f":"IF(offeringsRaw!M39=\"\",\"\",offeringsRaw!M39)","v":"JSB"},{"$f":"IF(offeringsRaw!Q39=\"\",\"\",offeringsRaw!Q39)","v":"Patterson, Kelly D"},"002 - Patterson, Kelly D"]
["",{"$f":"IF(offeringsRaw!B40=\"\",\"\",offeringsRaw!B40)","v":""},{"$f":"IF(offeringsRaw!C40=\"\",\"\",offeringsRaw!C40)","v":""},{"$f":"IF(offeringsRaw!D40=\"\",\"\",offeringsRaw!D40)","v":""},{"$f":"IF(offeringsRaw!E40=\"\",\"\",offeringsRaw!E40)","v":""},{"$f":"IF(offeringsRaw!F40=\"\",\"\",offeringsRaw!F40)","v":""},{"$f":"IF(offeringsRaw!G40=\"\",\"\",offeringsRaw!G40)","v":""},{"$f":"IF(offeringsRaw!I40=\"\",\"\",offeringsRaw!I40)","v":""},{"$f":"IF(offeringsRaw!J40=\"\",\"\",offeringsRaw!J40)","v":"9:00a - 9:50a"},{"$f":"IF(offeringsRaw!K40=\"\",\"\",offeringsRaw!K40)","v":"Th"},{"$f":"IF(offeringsRaw!L40=\"\",\"\",offeringsRaw!L40)","v":280},{"$f":"IF(offeringsRaw!M40=\"\",\"\",offeringsRaw!M40)","v":"MCKB"},{"$f":"IF(offeringsRaw!Q40=\"\",\"\",offeringsRaw!Q40)","v":""}," - "]
["",{"$f":"IF(offeringsRaw!B41=\"\",\"\",offeringsRaw!B41)","v":"-"},{"$f":"IF(offeringsRaw!C41=\"\",\"\",offeringsRaw!C41)","v":""},{"$f":"IF(offeringsRaw!D41=\"\",\"\",offeringsRaw!D41)","v":4},{"$f":"IF(offeringsRaw!E41=\"\",\"\",offeringsRaw!E41)","v":" "},{"$f":"IF(offeringsRaw!F41=\"\",\"\",offeringsRaw!F41)","v":0},{"$f":"IF(offeringsRaw!G41=\"\",\"\",offeringsRaw!G41)","v":30},{"$f":"IF(offeringsRaw!I41=\"\",\"\",offeringsRaw!I41)","v":3},{"$f":"IF(offeringsRaw!J41=\"\",\"\",offeringsRaw!J41)","v":"11:00a - 11:50a"},{"$f":"IF(offeringsRaw!K41=\"\",\"\",offeringsRaw!K41)","v":"MW"},{"$f":"IF(offeringsRaw!L41=\"\",\"\",offeringsRaw!L41)","v":140},{"$f":"IF(offeringsRaw!M41=\"\",\"\",offeringsRaw!M41)","v":"JSB"},{"$f":"IF(offeringsRaw!Q41=\"\",\"\",offeringsRaw!Q41)","v":"Patterson, Kelly D"},"004 - Patterson, Kelly D"]
["",{"$f":"IF(offeringsRaw!B42=\"\",\"\",offeringsRaw!B42)","v":""},{"$f":"IF(offeringsRaw!C42=\"\",\"\",offeringsRaw!C42)","v":""},{"$f":"IF(offeringsRaw!D42=\"\",\"\",offeringsRaw!D42)","v":""},{"$f":"IF(offeringsRaw!E42=\"\",\"\",offeringsRaw!E42)","v":""},{"$f":"IF(offeringsRaw!F42=\"\",\"\",offeringsRaw!F42)","v":""},{"$f":"IF(offeringsRaw!G42=\"\",\"\",offeringsRaw!G42)","v":""},{"$f":"IF(offeringsRaw!I42=\"\",\"\",offeringsRaw!I42)","v":""},{"$f":"IF(offeringsRaw!J42=\"\",\"\",offeringsRaw!J42)","v":"10:00a - 10:50a"},{"$f":"IF(offeringsRaw!K42=\"\",\"\",offeringsRaw!K42)","v":"Th"},{"$f":"IF(offeringsRaw!L42=\"\",\"\",offeringsRaw!L42)","v":107},{"$f":"IF(offeringsRaw!M42=\"\",\"\",offeringsRaw!M42)","v":"HGB"},{"$f":"IF(offeringsRaw!Q42=\"\",\"\",offeringsRaw!Q42)","v":""}," - "]
["",{"$f":"IF(offeringsRaw!B43=\"\",\"\",offeringsRaw!B43)","v":"-"},{"$f":"IF(offeringsRaw!C43=\"\",\"\",offeringsRaw!C43)","v":""},{"$f":"IF(offeringsRaw!D43=\"\",\"\",offeringsRaw!D43)","v":5},{"$f":"IF(offeringsRaw!E43=\"\",\"\",offeringsRaw!E43)","v":" "},{"$f":"IF(offeringsRaw!F43=\"\",\"\",offeringsRaw!F43)","v":0},{"$f":"IF(offeringsRaw!G43=\"\",\"\",offeringsRaw!G43)","v":30},{"$f":"IF(offeringsRaw!I43=\"\",\"\",offeringsRaw!I43)","v":3},{"$f":"IF(offeringsRaw!J43=\"\",\"\",offeringsRaw!J43)","v":"11:00a - 11:50a"},{"$f":"IF(offeringsRaw!K43=\"\",\"\",offeringsRaw!K43)","v":"MW"},{"$f":"IF(offeringsRaw!L43=\"\",\"\",offeringsRaw!L43)","v":140},{"$f":"IF(offeringsRaw!M43=\"\",\"\",offeringsRaw!M43)","v":"JSB"},{"$f":"IF(offeringsRaw!Q43=\"\",\"\",offeringsRaw!Q43)","v":"Patterson, Kelly D"},"005 - Patterson, Kelly D"]
["",{"$f":"IF(offeringsRaw!B44=\"\",\"\",offeringsRaw!B44)","v":""},{"$f":"IF(offeringsRaw!C44=\"\",\"\",offeringsRaw!C44)","v":""},{"$f":"IF(offeringsRaw!D44=\"\",\"\",offeringsRaw!D44)","v":""},{"$f":"IF(offeringsRaw!E44=\"\",\"\",offeringsRaw!E44)","v":""},{"$f":"IF(offeringsRaw!F44=\"\",\"\",offeringsRaw!F44)","v":""},{"$f":"IF(offeringsRaw!G44=\"\",\"\",offeringsRaw!G44)","v":""},{"$f":"IF(offeringsRaw!I44=\"\",\"\",offeringsRaw!I44)","v":""},{"$f":"IF(offeringsRaw!J44=\"\",\"\",offeringsRaw!J44)","v":"12:00p - 12:50p"},{"$f":"IF(offeringsRaw!K44=\"\",\"\",offeringsRaw!K44)","v":"Th"},{"$f":"IF(offeringsRaw!L44=\"\",\"\",offeringsRaw!L44)","v":160},{"$f":"IF(offeringsRaw!M44=\"\",\"\",offeringsRaw!M44)","v":"MCKB"},{"$f":"IF(offeringsRaw!Q44=\"\",\"\",offeringsRaw!Q44)","v":""}," - "]
["",{"$f":"IF(offeringsRaw!B45=\"\",\"\",offeringsRaw!B45)","v":"-"},{"$f":"IF(offeringsRaw!C45=\"\",\"\",offeringsRaw!C45)","v":""},{"$f":"IF(offeringsRaw!D45=\"\",\"\",offeringsRaw!D45)","v":6},{"$f":"IF(offeringsRaw!E45=\"\",\"\",offeringsRaw!E45)","v":" "},{"$f":"IF(offeringsRaw!F45=\"\",\"\",offeringsRaw!F45)","v":0},{"$f":"IF(offeringsRaw!G45=\"\",\"\",offeringsRaw!G45)","v":30},{"$f":"IF(offeringsRaw!I45=\"\",\"\",offeringsRaw!I45)","v":3},{"$f":"IF(offeringsRaw!J45=\"\",\"\",offeringsRaw!J45)","v":"11:00a - 11:50a"},{"$f":"IF(offeringsRaw!K45=\"\",\"\",offeringsRaw!K45)","v":"MW"},{"$f":"IF(offeringsRaw!L45=\"\",\"\",offeringsRaw!L45)","v":140},{"$f":"IF(offeringsRaw!M45=\"\",\"\",offeringsRaw!M45)","v":"JSB"},{"$f":"IF(offeringsRaw!Q45=\"\",\"\",offeringsRaw!Q45)","v":"Patterson, Kelly D"},"006 - Patterson, Kelly D"]
["",{"$f":"IF(offeringsRaw!B46=\"\",\"\",offeringsRaw!B46)","v":""},{"$f":"IF(offeringsRaw!C46=\"\",\"\",offeringsRaw!C46)","v":""},{"$f":"IF(offeringsRaw!D46=\"\",\"\",offeringsRaw!D46)","v":""},{"$f":"IF(offeringsRaw!E46=\"\",\"\",offeringsRaw!E46)","v":""},{"$f":"IF(offeringsRaw!F46=\"\",\"\",offeringsRaw!F46)","v":""},{"$f":"IF(offeringsRaw!G46=\"\",\"\",offeringsRaw!G46)","v":""},{"$f":"IF(offeringsRaw!I46=\"\",\"\",offeringsRaw!I46)","v":""},{"$f":"IF(offeringsRaw!J46=\"\",\"\",offeringsRaw!J46)","v":"10:00a - 10:50a"},{"$f":"IF(offeringsRaw!K46=\"\",\"\",offeringsRaw!K46)","v":"Th"},{"$f":"IF(offeringsRaw!L46=\"\",\"\",offeringsRaw!L46)","v":406},{"$f":"IF(offeringsRaw!M46=\"\",\"\",offeringsRaw!M46)","v":"CB"},{"$f":"IF(offeringsRaw!Q46=\"\",\"\",offeringsRaw!Q46)","v":""}," - "]
["",{"$f":"IF(offeringsRaw!B47=\"\",\"\",offeringsRaw!B47)","v":"-"},{"$f":"IF(offeringsRaw!C47=\"\",\"\",offeringsRaw!C47)","v":""},{"$f":"IF(offeringsRaw!D47=\"\",\"\",offeringsRaw!D47)","v":7},{"$f":"IF(offeringsRaw!E47=\"\",\"\",offeringsRaw!E47)","v":" "},{"$f":"IF(offeringsRaw!F47=\"\",\"\",offeringsRaw!F47)","v":0},{"$f":"IF(offeringsRaw!G47=\"\",\"\",offeringsRaw!G47)","v":30},{"$f":"IF(offeringsRaw!I47=\"\",\"\",offeringsRaw!I47)","v":3},{"$f":"IF(offeringsRaw!J47=\"\",\"\",offeringsRaw!J47)","v":"11:00a - 11:50a"},{"$f":"IF(offeringsRaw!K47=\"\",\"\",offeringsRaw!K47)","v":"MW"},{"$f":"IF(offeringsRaw!L47=\"\",\"\",offeringsRaw!L47)","v":140},{"$f":"IF(offeringsRaw!M47=\"\",\"\",offeringsRaw!M47)","v":"JSB"},{"$f":"IF(offeringsRaw!Q47=\"\",\"\",offeringsRaw!Q47)","v":"Patterson, Kelly D"},"007 - Patterson, Kelly D"]
["",{"$f":"IF(offeringsRaw!B48=\"\",\"\",offeringsRaw!B48)","v":""},{"$f":"IF(offeringsRaw!C48=\"\",\"\",offeringsRaw!C48)","v":""},{"$f":"IF(offeringsRaw!D48=\"\",\"\",offeringsRaw!D48)","v":""},{"$f":"IF(offeringsRaw!E48=\"\",\"\",offeringsRaw!E48)","v":""},{"$f":"IF(offeringsRaw!F48=\"\",\"\",offeringsRaw!F48)","v":""},{"$f":"IF(offeringsRaw!G48=\"\",\"\",offeringsRaw!G48)","v":""},{"$f":"IF(offeringsRaw!I48=\"\",\"\",offeringsRaw!I48)","v":""},{"$f":"IF(offeringsRaw!J48=\"\",\"\",offeringsRaw!J48)","v":"9:00a - 9:50a"},{"$f":"IF(offeringsRaw!K48=\"\",\"\",offeringsRaw!K48)","v":"F"},{"$f":"IF(offeringsRaw!L48=\"\",\"\",offeringsRaw!L48)","v":107},{"$f":"IF(offeringsRaw!M48=\"\",\"\",offeringsRaw!M48)","v":"JSB"},{"$f":"IF(offeringsRaw!Q48=\"\",\"\",offeringsRaw!Q48)","v":""}," - "]
["",{"$f":"IF(offeringsRaw!B49=\"\",\"\",offeringsRaw!B49)","v":"-"},{"$f":"IF(offeringsRaw!C49=\"\",\"\",offeringsRaw!C49)","v":""},{"$f":"IF(offeringsRaw!D49=\"\",\"\",offeringsRaw!D49)","v":8},{"$f":"IF(offeringsRaw!E49=\"\",\"\",offeringsRaw!E49)","v":" "},{"$f":"IF(offeringsRaw!F49=\"\",\"\",offeringsRaw!F49)","v":0},{"$f":"IF(offeringsRaw!G49=\"\",\"\",offeringsRaw!G49)","v":30},{"$f":"IF(offeringsRaw!I49=\"\",\"\",offeringsRaw!I49)","v":3},{"$f":"IF(offeringsRaw!J49=\"\",\"\",offeringsRaw!J49)","v":"11:00a - 11:50a"},{"$f":"IF(offeringsRaw!K49=\"\",\"\",offeringsRaw!K49)","v":"MW"},{"$f":"IF(offeringsRaw!L49=\"\",\"\",offeringsRaw!L49)","v":140},{"$f":"IF(offeringsRaw!M49=\"\",\"\",offeringsRaw!M49)","v":"JSB"},{"$f":"IF(offeringsRaw!Q49=\"\",\"\",offeringsRaw!Q49)","v":"Patterson, Kelly D"},"008 - Patterson, Kelly D"]
["",{"$f":"IF(offeringsRaw!B50=\"\",\"\",offeringsRaw!B50)","v":""},{"$f":"IF(offeringsRaw!C50=\"\",\"\",offeringsRaw!C50)","v":""},{"$f":"IF(offeringsRaw!D50=\"\",\"\",offeringsRaw!D50)","v":""},{"$f":"IF(offeringsRaw!E50=\"\",\"\",offeringsRaw!E50)","v":""},{"$f":"IF(offeringsRaw!F50=\"\",\"\",offeringsRaw!F50)","v":""},{"$f":"IF(offeringsRaw!G50=\"\",\"\",offeringsRaw!G50)","v":""},{"$f":"IF(offeringsRaw!I50=\"\",\"\",offeringsRaw!I50)","v":""},{"$f":"IF(offeringsRaw!J50=\"\",\"\",offeringsRaw!J50)","v":"10:00a - 10:50a"},{"$f":"IF(offeringsRaw!K50=\"\",\"\",offeringsRaw!K50)","v":"F"},{"$f":"IF(offeringsRaw!L50=\"\",\"\",offeringsRaw!L50)","v":174},{"$f":"IF(offeringsRaw!M50=\"\",\"\",offeringsRaw!M50)","v":"JSB"},{"$f":"IF(offeringsRaw!Q50=\"\",\"\",offeringsRaw!Q50)","v":""}," - "]
["",{"$f":"IF(offeringsRaw!B51=\"\",\"\",offeringsRaw!B51)","v":"-"},{"$f":"IF(offeringsRaw!C51=\"\",\"\",offeringsRaw!C51)","v":""},{"$f":"IF(offeringsRaw!D51=\"\",\"\",offeringsRaw!D51)","v":9},{"$f":"IF(offeringsRaw!E51=\"\",\"\",offeringsRaw!E51)","v":" "},{"$f":"IF(offeringsRaw!F51=\"\",\"\",offeringsRaw!F51)","v":0},{"$f":"IF(offeringsRaw!G51=\"\",\"\",offeringsRaw!G51)","v":30},{"$f":"IF(offeringsRaw!I51=\"\",\"\",offeringsRaw!I51)","v":3},{"$f":"IF(offeringsRaw!J51=\"\",\"\",offeringsRaw!J51)","v":"11:00a - 11:50a"},{"$f":"IF(offeringsRaw!K51=\"\",\"\",offeringsRaw!K51)","v":"MW"},{"$f":"IF(offeringsRaw!L51=\"\",\"\",offeringsRaw!L51)","v":140},{"$f":"IF(offeringsRaw!M51=\"\",\"\",offeringsRaw!M51)","v":"JSB"},{"$f":"IF(offeringsRaw!Q51=\"\",\"\",offeringsRaw!Q51)","v":"Patterson, Kelly D"},"009 - Patterson, Kelly D"]
["",{"$f":"IF(offeringsRaw!B52=\"\",\"\",offeringsRaw!B52)","v":""},{"$f":"IF(offeringsRaw!C52=\"\",\"\",offeringsRaw!C52)","v":""},{"$f":"IF(offeringsRaw!D52=\"\",\"\",offeringsRaw!D52)","v":""},{"$f":"IF(offeringsRaw!E52=\"\",\"\",offeringsRaw!E52)","v":""},{"$f":"IF(offeringsRaw!F52=\"\",\"\",offeringsRaw!F52)","v":""},{"$f":"IF(offeringsRaw!G52=\"\",\"\",offeringsRaw!G52)","v":""},{"$f":"IF(offeringsRaw!I52=\"\",\"\",offeringsRaw!I52)","v":""},{"$f":"IF(offeringsRaw!J52=\"\",\"\",offeringsRaw!J52)","v":"11:00a - 11:50a"},{"$f":"IF(offeringsRaw!K52=\"\",\"\",offeringsRaw!K52)","v":"F"},{"$f":"IF(offeringsRaw!L52=\"\",\"\",offeringsRaw!L52)","v":178},{"$f":"IF(offeringsRaw!M52=\"\",\"\",offeringsRaw!M52)","v":"JSB"},{"$f":"IF(offeringsRaw!Q52=\"\",\"\",offeringsRaw!Q52)","v":""}," - "]
["",{"$f":"IF(offeringsRaw!B53=\"\",\"\",offeringsRaw!B53)","v":"-"},{"$f":"IF(offeringsRaw!C53=\"\",\"\",offeringsRaw!C53)","v":""},{"$f":"IF(offeringsRaw!D53=\"\",\"\",offeringsRaw!D53)","v":21},{"$f":"IF(offeringsRaw!E53=\"\",\"\",offeringsRaw!E53)","v":" "},{"$f":"IF(offeringsRaw!F53=\"\",\"\",offeringsRaw!F53)","v":0},{"$f":"IF(offeringsRaw!G53=\"\",\"\",offeringsRaw!G53)","v":30},{"$f":"IF(offeringsRaw!I53=\"\",\"\",offeringsRaw!I53)","v":3},{"$f":"IF(offeringsRaw!J53=\"\",\"\",offeringsRaw!J53)","v":"11:00a - 11:50a"},{"$f":"IF(offeringsRaw!K53=\"\",\"\",offeringsRaw!K53)","v":"MW"},{"$f":"IF(offeringsRaw!L53=\"\",\"\",offeringsRaw!L53)","v":140},{"$f":"IF(offeringsRaw!M53=\"\",\"\",offeringsRaw!M53)","v":"JSB"},{"$f":"IF(offeringsRaw!Q53=\"\",\"\",offeringsRaw!Q53)","v":"Patterson, Kelly D"},"021 - Patterson, Kelly D"]
["",{"$f":"IF(offeringsRaw!B54=\"\",\"\",offeringsRaw!B54)","v":""},{"$f":"IF(offeringsRaw!C54=\"\",\"\",offeringsRaw!C54)","v":""},{"$f":"IF(offeringsRaw!D54=\"\",\"\",offeringsRaw!D54)","v":""},{"$f":"IF(offeringsRaw!E54=\"\",\"\",offeringsRaw!E54)","v":""},{"$f":"IF(offeringsRaw!F54=\"\",\"\",offeringsRaw!F54)","v":""},{"$f":"IF(offeringsRaw!G54=\"\",\"\",offeringsRaw!G54)","v":""},{"$f":"IF(offeringsRaw!I54=\"\",\"\",offeringsRaw!I54)","v":""},{"$f":"IF(offeringsRaw!J54=\"\",\"\",offeringsRaw!J54)","v":"10:00a - 10:50a"},{"$f":"IF(offeringsRaw!K54=\"\",\"\",offeringsRaw!K54)","v":"F"},{"$f":"IF(offeringsRaw!L54=\"\",\"\",offeringsRaw!L54)","v":175},{"$f":"IF(offeringsRaw!M54=\"\",\"\",offeringsRaw!M54)","v":"JSB"},{"$f":"IF(offeringsRaw!Q54=\"\",\"\",offeringsRaw!Q54)","v":""}," - "]
["",{"$f":"IF(offeringsRaw!B55=\"\",\"\",offeringsRaw!B55)","v":"-"},{"$f":"IF(offeringsRaw!C55=\"\",\"\",offeringsRaw!C55)","v":""},{"$f":"IF(offeringsRaw!D55=\"\",\"\",offeringsRaw!D55)","v":23},{"$f":"IF(offeringsRaw!E55=\"\",\"\",offeringsRaw!E55)","v":" "},{"$f":"IF(offeringsRaw!F55=\"\",\"\",offeringsRaw!F55)","v":0},{"$f":"IF(offeringsRaw!G55=\"\",\"\",offeringsRaw!G55)","v":30},{"$f":"IF(offeringsRaw!I55=\"\",\"\",offeringsRaw!I55)","v":3},{"$f":"IF(offeringsRaw!J55=\"\",\"\",offeringsRaw!J55)","v":"11:00a - 11:50a"},{"$f":"IF(offeringsRaw!K55=\"\",\"\",offeringsRaw!K55)","v":"MW"},{"$f":"IF(offeringsRaw!L55=\"\",\"\",offeringsRaw!L55)","v":140},{"$f":"IF(offeringsRaw!M55=\"\",\"\",offeringsRaw!M55)","v":"JSB"},{"$f":"IF(offeringsRaw!Q55=\"\",\"\",offeringsRaw!Q55)","v":"Patterson, Kelly D"},"023 - Patterson, Kelly D"]
["",{"$f":"IF(offeringsRaw!B56=\"\",\"\",offeringsRaw!B56)","v":""},{"$f":"IF(offeringsRaw!C56=\"\",\"\",offeringsRaw!C56)","v":""},{"$f":"IF(offeringsRaw!D56=\"\",\"\",offeringsRaw!D56)","v":""},{"$f":"IF(offeringsRaw!E56=\"\",\"\",offeringsRaw!E56)","v":""},{"$f":"IF(offeringsRaw!F56=\"\",\"\",offeringsRaw!F56)","v":""},{"$f":"IF(offeringsRaw!G56=\"\",\"\",offeringsRaw!G56)","v":""},{"$f":"IF(offeringsRaw!I56=\"\",\"\",offeringsRaw!I56)","v":""},{"$f":"IF(offeringsRaw!J56=\"\",\"\",offeringsRaw!J56)","v":"11:00a - 11:50a"},{"$f":"IF(offeringsRaw!K56=\"\",\"\",offeringsRaw!K56)","v":"F"},{"$f":"IF(offeringsRaw!L56=\"\",\"\",offeringsRaw!L56)","v":182},{"$f":"IF(offeringsRaw!M56=\"\",\"\",offeringsRaw!M56)","v":"JSB"},{"$f":"IF(offeringsRaw!Q56=\"\",\"\",offeringsRaw!Q56)","v":""}," - "]
["",{"$f":"IF(offeringsRaw!B57=\"\",\"\",offeringsRaw!B57)","v":"-"},{"$f":"IF(offeringsRaw!C57=\"\",\"\",offeringsRaw!C57)","v":""},{"$f":"IF(offeringsRaw!D57=\"\",\"\",offeringsRaw!D57)","v":29},{"$f":"IF(offeringsRaw!E57=\"\",\"\",offeringsRaw!E57)","v":" "},{"$f":"IF(offeringsRaw!F57=\"\",\"\",offeringsRaw!F57)","v":0},{"$f":"IF(offeringsRaw!G57=\"\",\"\",offeringsRaw!G57)","v":30},{"$f":"IF(offeringsRaw!I57=\"\",\"\",offeringsRaw!I57)","v":3},{"$f":"IF(offeringsRaw!J57=\"\",\"\",offeringsRaw!J57)","v":"11:00a - 11:50a"},{"$f":"IF(offeringsRaw!K57=\"\",\"\",offeringsRaw!K57)","v":"MW"},{"$f":"IF(offeringsRaw!L57=\"\",\"\",offeringsRaw!L57)","v":140},{"$f":"IF(offeringsRaw!M57=\"\",\"\",offeringsRaw!M57)","v":"JSB"},{"$f":"IF(offeringsRaw!Q57=\"\",\"\",offeringsRaw!Q57)","v":"Patterson, Kelly D"},"029 - Patterson, Kelly D"]
["",{"$f":"IF(offeringsRaw!B58=\"\",\"\",offeringsRaw!B58)","v":""},{"$f":"IF(offeringsRaw!C58=\"\",\"\",offeringsRaw!C58)","v":""},{"$f":"IF(offeringsRaw!D58=\"\",\"\",offeringsRaw!D58)","v":""},{"$f":"IF(offeringsRaw!E58=\"\",\"\",offeringsRaw!E58)","v":""},{"$f":"IF(offeringsRaw!F58=\"\",\"\",offeringsRaw!F58)","v":""},{"$f":"IF(offeringsRaw!G58=\"\",\"\",offeringsRaw!G58)","v":""},{"$f":"IF(offeringsRaw!I58=\"\",\"\",offeringsRaw!I58)","v":""},{"$f":"IF(offeringsRaw!J58=\"\",\"\",offeringsRaw!J58)","v":"10:00a - 10:50a"},{"$f":"IF(offeringsRaw!K58=\"\",\"\",offeringsRaw!K58)","v":"F"},{"$f":"IF(offeringsRaw!L58=\"\",\"\",offeringsRaw!L58)","v":179},{"$f":"IF(offeringsRaw!M58=\"\",\"\",offeringsRaw!M58)","v":"JSB"},{"$f":"IF(offeringsRaw!Q58=\"\",\"\",offeringsRaw!Q58)","v":""}," - "]
["",{"$f":"IF(offeringsRaw!B59=\"\",\"\",offeringsRaw!B59)","v":"-"},{"$f":"IF(offeringsRaw!C59=\"\",\"\",offeringsRaw!C59)","v":""},{"$f":"IF(offeringsRaw!D59=\"\",\"\",offeringsRaw!D59)","v":37},{"$f":"IF(offeringsRaw!E59=\"\",\"\",offeringsRaw!E59)","v":" "},{"$f":"IF(offeringsRaw!F59=\"\",\"\",offeringsRaw!F59)","v":0},{"$f":"IF(offeringsRaw!G59=\"\",\"\",offeringsRaw!G59)","v":30},{"$f":"IF(offeringsRaw!I59=\"\",\"\",offeringsRaw!I59)","v":3},{"$f":"IF(offeringsRaw!J59=\"\",\"\",offeringsRaw!J59)","v":"11:00a - 11:50a"},{"$f":"IF(offeringsRaw!K59=\"\",\"\",offeringsRaw!K59)","v":"MW"},{"$f":"IF(offeringsRaw!L59=\"\",\"\",offeringsRaw!L59)","v":140},{"$f":"IF(offeringsRaw!M59=\"\",\"\",offeringsRaw!M59)","v":"JSB"},{"$f":"IF(offeringsRaw!Q59=\"\",\"\",offeringsRaw!Q59)","v":"Patterson, Kelly D"},"037 - Patterson, Kelly D"]
["",{"$f":"IF(offeringsRaw!B60=\"\",\"\",offeringsRaw!B60)","v":""},{"$f":"IF(offeringsRaw!C60=\"\",\"\",offeringsRaw!C60)","v":""},{"$f":"IF(offeringsRaw!D60=\"\",\"\",offeringsRaw!D60)","v":""},{"$f":"IF(offeringsRaw!E60=\"\",\"\",offeringsRaw!E60)","v":""},{"$f":"IF(offeringsRaw!F60=\"\",\"\",offeringsRaw!F60)","v":""},{"$f":"IF(offeringsRaw!G60=\"\",\"\",offeringsRaw!G60)","v":""},{"$f":"IF(offeringsRaw!I60=\"\",\"\",offeringsRaw!I60)","v":""},{"$f":"IF(offeringsRaw!J60=\"\",\"\",offeringsRaw!J60)","v":"10:00a - 10:50a"},{"$f":"IF(offeringsRaw!K60=\"\",\"\",offeringsRaw!K60)","v":"F"},{"$f":"IF(offeringsRaw!L60=\"\",\"\",offeringsRaw!L60)","v":103},{"$f":"IF(offeringsRaw!M60=\"\",\"\",offeringsRaw!M60)","v":"JSB"},{"$f":"IF(offeringsRaw!Q60=\"\",\"\",offeringsRaw!Q60)","v":""}," - "]
["",{"$f":"IF(offeringsRaw!B61=\"\",\"\",offeringsRaw!B61)","v":"-"},{"$f":"IF(offeringsRaw!C61=\"\",\"\",offeringsRaw!C61)","v":""},{"$f":"IF(offeringsRaw!D61=\"\",\"\",offeringsRaw!D61)","v":38},{"$f":"IF(offeringsRaw!E61=\"\",\"\",offeringsRaw!E61)","v":" "},{"$f":"IF(offeringsRaw!F61=\"\",\"\",offeringsRaw!F61)","v":0},{"$f":"IF(offeringsRaw!G61=\"\",\"\",offeringsRaw!G61)","v":30},{"$f":"IF(offeringsRaw!I61=\"\",\"\",offeringsRaw!I61)","v":3},{"$f":"IF(offeringsRaw!J61=\"\",\"\",offeringsRaw!J61)","v":"11:00a - 11:50a"},{"$f":"IF(offeringsRaw!K61=\"\",\"\",offeringsRaw!K61)","v":"MW"},{"$f":"IF(offeringsRaw!L61=\"\",\"\",offeringsRaw!L61)","v":140},{"$f":"IF(offeringsRaw!M61=\"\",\"\",offeringsRaw!M61)","v":"JSB"},{"$f":"IF(offeringsRaw!Q61=\"\",\"\",offeringsRaw!Q61)","v":"Patterson, Kelly D"},"038 - Patterson, Kelly D"]
["",{"$f":"IF(offeringsRaw!B62=\"\",\"\",offeringsRaw!B62)","v":""},{"$f":"IF(offeringsRaw!C62=\"\",\"\",offeringsRaw!C62)","v":""},{"$f":"IF(offeringsRaw!D62=\"\",\"\",offeringsRaw!D62)","v":""},{"$f":"IF(offeringsRaw!E62=\"\",\"\",offeringsRaw!E62)","v":""},{"$f":"IF(offeringsRaw!F62=\"\",\"\",offeringsRaw!F62)","v":""},{"$f":"IF(offeringsRaw!G62=\"\",\"\",offeringsRaw!G62)","v":""},{"$f":"IF(offeringsRaw!I62=\"\",\"\",offeringsRaw!I62)","v":""},{"$f":"IF(offeringsRaw!J62=\"\",\"\",offeringsRaw!J62)","v":"10:00a - 10:50a"},{"$f":"IF(offeringsRaw!K62=\"\",\"\",offeringsRaw!K62)","v":"F"},{"$f":"IF(offeringsRaw!L62=\"\",\"\",offeringsRaw!L62)","v":110},{"$f":"IF(offeringsRaw!M62=\"\",\"\",offeringsRaw!M62)","v":"JSB"},{"$f":"IF(offeringsRaw!Q62=\"\",\"\",offeringsRaw!Q62)","v":""}," - "]
["",{"$f":"IF(offeringsRaw!B63=\"\",\"\",offeringsRaw!B63)","v":"<A href=\"javascript:addRainCheck('A HTG','100',' ','050'); \">R</A>"},{"$f":"IF(offeringsRaw!C63=\"\",\"\",offeringsRaw!C63)","v":"<A href=\"javascript:viewLims('This class can only be added by approved rainchecks.^This class is a(n) INTERNATIONAL section.^'); \">Y</A>"},{"$f":"IF(offeringsRaw!D63=\"\",\"\",offeringsRaw!D63)","v":50},{"$f":"IF(offeringsRaw!E63=\"\",\"\",offeringsRaw!E63)","v":" "},{"$f":"IF(offeringsRaw!F63=\"\",\"\",offeringsRaw!F63)","v":0},{"$f":"IF(offeringsRaw!G63=\"\",\"\",offeringsRaw!G63)","v":30},{"$f":"IF(offeringsRaw!I63=\"\",\"\",offeringsRaw!I63)","v":3},{"$f":"IF(offeringsRaw!J63=\"\",\"\",offeringsRaw!J63)","v":"11:00a - 11:50a"},{"$f":"IF(offeringsRaw!K63=\"\",\"\",offeringsRaw!K63)","v":"MW"},{"$f":"IF(offeringsRaw!L63=\"\",\"\",offeringsRaw!L63)","v":140},{"$f":"IF(offeringsRaw!M63=\"\",\"\",offeringsRaw!M63)","v":"JSB"},{"$f":"IF(offeringsRaw!Q63=\"\",\"\",offeringsRaw!Q63)","v":"Patterson, Kelly D"},"050 - Patterson, Kelly D"]
["",{"$f":"IF(offeringsRaw!B64=\"\",\"\",offeringsRaw!B64)","v":""},{"$f":"IF(offeringsRaw!C64=\"\",\"\",offeringsRaw!C64)","v":""},{"$f":"IF(offeringsRaw!D64=\"\",\"\",offeringsRaw!D64)","v":""},{"$f":"IF(offeringsRaw!E64=\"\",\"\",offeringsRaw!E64)","v":""},{"$f":"IF(offeringsRaw!F64=\"\",\"\",offeringsRaw!F64)","v":""},{"$f":"IF(offeringsRaw!G64=\"\",\"\",offeringsRaw!G64)","v":""},{"$f":"IF(offeringsRaw!I64=\"\",\"\",offeringsRaw!I64)","v":""},{"$f":"IF(offeringsRaw!J64=\"\",\"\",offeringsRaw!J64)","v":"11:00a - 11:50a"},{"$f":"IF(offeringsRaw!K64=\"\",\"\",offeringsRaw!K64)","v":"F"},{"$f":"IF(offeringsRaw!L64=\"\",\"\",offeringsRaw!L64)","v":175},{"$f":"IF(offeringsRaw!M64=\"\",\"\",offeringsRaw!M64)","v":"JSB"},{"$f":"IF(offeringsRaw!Q64=\"\",\"\",offeringsRaw!Q64)","v":""}," - "]
["",{"$f":"IF(offeringsRaw!B65=\"\",\"\",offeringsRaw!B65)","v":"-"},{"$f":"IF(offeringsRaw!C65=\"\",\"\",offeringsRaw!C65)","v":""},{"$f":"IF(offeringsRaw!D65=\"\",\"\",offeringsRaw!D65)","v":53},{"$f":"IF(offeringsRaw!E65=\"\",\"\",offeringsRaw!E65)","v":" "},{"$f":"IF(offeringsRaw!F65=\"\",\"\",offeringsRaw!F65)","v":0},{"$f":"IF(offeringsRaw!G65=\"\",\"\",offeringsRaw!G65)","v":30},{"$f":"IF(offeringsRaw!I65=\"\",\"\",offeringsRaw!I65)","v":3},{"$f":"IF(offeringsRaw!J65=\"\",\"\",offeringsRaw!J65)","v":"11:00a - 11:50a"},{"$f":"IF(offeringsRaw!K65=\"\",\"\",offeringsRaw!K65)","v":"MW"},{"$f":"IF(offeringsRaw!L65=\"\",\"\",offeringsRaw!L65)","v":140},{"$f":"IF(offeringsRaw!M65=\"\",\"\",offeringsRaw!M65)","v":"JSB"},{"$f":"IF(offeringsRaw!Q65=\"\",\"\",offeringsRaw!Q65)","v":"Patterson, Kelly D"},{"$f":"TEXT(D70,\"000\") & \" - \" &M70","v":"053 - Patterson, Kelly D"}]
[{"$f":"IF(RIGHT(B71,5)=\"A</A>\",\"A\",\"\")","v":""},{"$f":"IF(offeringsRaw!B66=\"\",\"\",offeringsRaw!B66)","v":""},{"$f":"IF(offeringsRaw!C66=\"\",\"\",offeringsRaw!C66)","v":""},{"$f":"IF(offeringsRaw!D66=\"\",\"\",offeringsRaw!D66)","v":""},{"$f":"IF(offeringsRaw!E66=\"\",\"\",offeringsRaw!E66)","v":""},{"$f":"IF(offeringsRaw!F66=\"\",\"\",offeringsRaw!F66)","v":""},{"$f":"IF(offeringsRaw!G66=\"\",\"\",offeringsRaw!G66)","v":""},{"$f":"IF(offeringsRaw!I66=\"\",\"\",offeringsRaw!I66)","v":""},{"$f":"IF(offeringsRaw!J66=\"\",\"\",offeringsRaw!J66)","v":"8:00a - 8:50a"},{"$f":"IF(offeringsRaw!K66=\"\",\"\",offeringsRaw!K66)","v":"Th"},{"$f":"IF(offeringsRaw!L66=\"\",\"\",offeringsRaw!L66)","v":178},{"$f":"IF(offeringsRaw!M66=\"\",\"\",offeringsRaw!M66)","v":"JSB"},{"$f":"IF(offeringsRaw!Q66=\"\",\"\",offeringsRaw!Q66)","v":""}," - "]
["",{"$f":"IF(offeringsRaw!B67=\"\",\"\",offeringsRaw!B67)","v":"-"},{"$f":"IF(offeringsRaw!C67=\"\",\"\",offeringsRaw!C67)","v":""},{"$f":"IF(offeringsRaw!D67=\"\",\"\",offeringsRaw!D67)","v":54},{"$f":"IF(offeringsRaw!E67=\"\",\"\",offeringsRaw!E67)","v":" "},{"$f":"IF(offeringsRaw!F67=\"\",\"\",offeringsRaw!F67)","v":0},{"$f":"IF(offeringsRaw!G67=\"\",\"\",offeringsRaw!G67)","v":30},{"$f":"IF(offeringsRaw!I67=\"\",\"\",offeringsRaw!I67)","v":3},{"$f":"IF(offeringsRaw!J67=\"\",\"\",offeringsRaw!J67)","v":"11:00a - 11:50a"},{"$f":"IF(offeringsRaw!K67=\"\",\"\",offeringsRaw!K67)","v":"MW"},{"$f":"IF(offeringsRaw!L67=\"\",\"\",offeringsRaw!L67)","v":140},{"$f":"IF(offeringsRaw!M67=\"\",\"\",offeringsRaw!M67)","v":"JSB"},{"$f":"IF(offeringsRaw!Q67=\"\",\"\",offeringsRaw!Q67)","v":"Patterson, Kelly D"},"054 - Patterson, Kelly D"]
["",{"$f":"IF(offeringsRaw!B68=\"\",\"\",offeringsRaw!B68)","v":""},{"$f":"IF(offeringsRaw!C68=\"\",\"\",offeringsRaw!C68)","v":""},{"$f":"IF(offeringsRaw!D68=\"\",\"\",offeringsRaw!D68)","v":""},{"$f":"IF(offeringsRaw!E68=\"\",\"\",offeringsRaw!E68)","v":""},{"$f":"IF(offeringsRaw!F68=\"\",\"\",offeringsRaw!F68)","v":""},{"$f":"IF(offeringsRaw!G68=\"\",\"\",offeringsRaw!G68)","v":""},{"$f":"IF(offeringsRaw!I68=\"\",\"\",offeringsRaw!I68)","v":""},{"$f":"IF(offeringsRaw!J68=\"\",\"\",offeringsRaw!J68)","v":"12:00p - 12:50p"},{"$f":"IF(offeringsRaw!K68=\"\",\"\",offeringsRaw!K68)","v":"Th"},{"$f":"IF(offeringsRaw!L68=\"\",\"\",offeringsRaw!L68)","v":"B142"},{"$f":"IF(offeringsRaw!M68=\"\",\"\",offeringsRaw!M68)","v":"JFSB"},{"$f":"IF(offeringsRaw!Q68=\"\",\"\",offeringsRaw!Q68)","v":""}," - "]
["",{"$f":"IF(offeringsRaw!B69=\"\",\"\",offeringsRaw!B69)","v":"-"},{"$f":"IF(offeringsRaw!C69=\"\",\"\",offeringsRaw!C69)","v":""},{"$f":"IF(offeringsRaw!D69=\"\",\"\",offeringsRaw!D69)","v":58},{"$f":"IF(offeringsRaw!E69=\"\",\"\",offeringsRaw!E69)","v":" "},{"$f":"IF(offeringsRaw!F69=\"\",\"\",offeringsRaw!F69)","v":0},{"$f":"IF(offeringsRaw!G69=\"\",\"\",offeringsRaw!G69)","v":30},{"$f":"IF(offeringsRaw!I69=\"\",\"\",offeringsRaw!I69)","v":3},{"$f":"IF(offeringsRaw!J69=\"\",\"\",offeringsRaw!J69)","v":"11:00a - 11:50a"},{"$f":"IF(offeringsRaw!K69=\"\",\"\",offeringsRaw!K69)","v":"MW"},{"$f":"IF(offeringsRaw!L69=\"\",\"\",offeringsRaw!L69)","v":140},{"$f":"IF(offeringsRaw!M69=\"\",\"\",offeringsRaw!M69)","v":"JSB"},{"$f":"IF(offeringsRaw!Q69=\"\",\"\",offeringsRaw!Q69)","v":"Patterson, Kelly D"},"058 - Patterson, Kelly D"]
["",{"$f":"IF(offeringsRaw!B70=\"\",\"\",offeringsRaw!B70)","v":""},{"$f":"IF(offeringsRaw!C70=\"\",\"\",offeringsRaw!C70)","v":""},{"$f":"IF(offeringsRaw!D70=\"\",\"\",offeringsRaw!D70)","v":""},{"$f":"IF(offeringsRaw!E70=\"\",\"\",offeringsRaw!E70)","v":""},{"$f":"IF(offeringsRaw!F70=\"\",\"\",offeringsRaw!F70)","v":""},{"$f":"IF(offeringsRaw!G70=\"\",\"\",offeringsRaw!G70)","v":""},{"$f":"IF(offeringsRaw!I70=\"\",\"\",offeringsRaw!I70)","v":""},{"$f":"IF(offeringsRaw!J70=\"\",\"\",offeringsRaw!J70)","v":"10:00a - 10:50a"},{"$f":"IF(offeringsRaw!K70=\"\",\"\",offeringsRaw!K70)","v":"F"},{"$f":"IF(offeringsRaw!L70=\"\",\"\",offeringsRaw!L70)","v":203},{"$f":"IF(offeringsRaw!M70=\"\",\"\",offeringsRaw!M70)","v":"JSB"},{"$f":"IF(offeringsRaw!Q70=\"\",\"\",offeringsRaw!Q70)","v":""}," - "]
["",{"$f":"IF(offeringsRaw!B71=\"\",\"\",offeringsRaw!B71)","v":"-"},{"$f":"IF(offeringsRaw!C71=\"\",\"\",offeringsRaw!C71)","v":""},{"$f":"IF(offeringsRaw!D71=\"\",\"\",offeringsRaw!D71)","v":59},{"$f":"IF(offeringsRaw!E71=\"\",\"\",offeringsRaw!E71)","v":" "},{"$f":"IF(offeringsRaw!F71=\"\",\"\",offeringsRaw!F71)","v":0},{"$f":"IF(offeringsRaw!G71=\"\",\"\",offeringsRaw!G71)","v":30},{"$f":"IF(offeringsRaw!I71=\"\",\"\",offeringsRaw!I71)","v":3},{"$f":"IF(offeringsRaw!J71=\"\",\"\",offeringsRaw!J71)","v":"11:00a - 11:50a"},{"$f":"IF(offeringsRaw!K71=\"\",\"\",offeringsRaw!K71)","v":"MW"},{"$f":"IF(offeringsRaw!L71=\"\",\"\",offeringsRaw!L71)","v":140},{"$f":"IF(offeringsRaw!M71=\"\",\"\",offeringsRaw!M71)","v":"JSB"},{"$f":"IF(offeringsRaw!Q71=\"\",\"\",offeringsRaw!Q71)","v":"Patterson, Kelly D"},"059 - Patterson, Kelly D"]
["",{"$f":"IF(offeringsRaw!B72=\"\",\"\",offeringsRaw!B72)","v":""},{"$f":"IF(offeringsRaw!C72=\"\",\"\",offeringsRaw!C72)","v":""},{"$f":"IF(offeringsRaw!D72=\"\",\"\",offeringsRaw!D72)","v":""},{"$f":"IF(offeringsRaw!E72=\"\",\"\",offeringsRaw!E72)","v":""},{"$f":"IF(offeringsRaw!F72=\"\",\"\",offeringsRaw!F72)","v":""},{"$f":"IF(offeringsRaw!G72=\"\",\"\",offeringsRaw!G72)","v":""},{"$f":"IF(offeringsRaw!I72=\"\",\"\",offeringsRaw!I72)","v":""},{"$f":"IF(offeringsRaw!J72=\"\",\"\",offeringsRaw!J72)","v":"11:00a - 11:50a"},{"$f":"IF(offeringsRaw!K72=\"\",\"\",offeringsRaw!K72)","v":"F"},{"$f":"IF(offeringsRaw!L72=\"\",\"\",offeringsRaw!L72)","v":202},{"$f":"IF(offeringsRaw!M72=\"\",\"\",offeringsRaw!M72)","v":"JSB"},{"$f":"IF(offeringsRaw!Q72=\"\",\"\",offeringsRaw!Q72)","v":""}," - "]
["",{"$f":"IF(offeringsRaw!B73=\"\",\"\",offeringsRaw!B73)","v":"-"},{"$f":"IF(offeringsRaw!C73=\"\",\"\",offeringsRaw!C73)","v":""},{"$f":"IF(offeringsRaw!D73=\"\",\"\",offeringsRaw!D73)","v":60},{"$f":"IF(offeringsRaw!E73=\"\",\"\",offeringsRaw!E73)","v":" "},{"$f":"IF(offeringsRaw!F73=\"\",\"\",offeringsRaw!F73)","v":0},{"$f":"IF(offeringsRaw!G73=\"\",\"\",offeringsRaw!G73)","v":30},{"$f":"IF(offeringsRaw!I73=\"\",\"\",offeringsRaw!I73)","v":3},{"$f":"IF(offeringsRaw!J73=\"\",\"\",offeringsRaw!J73)","v":"11:00a - 11:50a"},{"$f":"IF(offeringsRaw!K73=\"\",\"\",offeringsRaw!K73)","v":"MW"},{"$f":"IF(offeringsRaw!L73=\"\",\"\",offeringsRaw!L73)","v":140},{"$f":"IF(offeringsRaw!M73=\"\",\"\",offeringsRaw!M73)","v":"JSB"},{"$f":"IF(offeringsRaw!Q73=\"\",\"\",offeringsRaw!Q73)","v":"Patterson, Kelly D"},"060 - Patterson, Kelly D"]
["",{"$f":"IF(offeringsRaw!B74=\"\",\"\",offeringsRaw!B74)","v":""},{"$f":"IF(offeringsRaw!C74=\"\",\"\",offeringsRaw!C74)","v":""},{"$f":"IF(offeringsRaw!D74=\"\",\"\",offeringsRaw!D74)","v":""},{"$f":"IF(offeringsRaw!E74=\"\",\"\",offeringsRaw!E74)","v":""},{"$f":"IF(offeringsRaw!F74=\"\",\"\",offeringsRaw!F74)","v":""},{"$f":"IF(offeringsRaw!G74=\"\",\"\",offeringsRaw!G74)","v":""},{"$f":"IF(offeringsRaw!I74=\"\",\"\",offeringsRaw!I74)","v":""},{"$f":"IF(offeringsRaw!J74=\"\",\"\",offeringsRaw!J74)","v":"11:00a - 11:50a"},{"$f":"IF(offeringsRaw!K74=\"\",\"\",offeringsRaw!K74)","v":"F"},{"$f":"IF(offeringsRaw!L74=\"\",\"\",offeringsRaw!L74)","v":203},{"$f":"IF(offeringsRaw!M74=\"\",\"\",offeringsRaw!M74)","v":"JSB"},{"$f":"IF(offeringsRaw!Q74=\"\",\"\",offeringsRaw!Q74)","v":""}," - "]
["",{"$f":"IF(offeringsRaw!B75=\"\",\"\",offeringsRaw!B75)","v":"-"},{"$f":"IF(offeringsRaw!C75=\"\",\"\",offeringsRaw!C75)","v":""},{"$f":"IF(offeringsRaw!D75=\"\",\"\",offeringsRaw!D75)","v":62},{"$f":"IF(offeringsRaw!E75=\"\",\"\",offeringsRaw!E75)","v":" "},{"$f":"IF(offeringsRaw!F75=\"\",\"\",offeringsRaw!F75)","v":0},{"$f":"IF(offeringsRaw!G75=\"\",\"\",offeringsRaw!G75)","v":30},{"$f":"IF(offeringsRaw!I75=\"\",\"\",offeringsRaw!I75)","v":3},{"$f":"IF(offeringsRaw!J75=\"\",\"\",offeringsRaw!J75)","v":"11:00a - 11:50a"},{"$f":"IF(offeringsRaw!K75=\"\",\"\",offeringsRaw!K75)","v":"MW"},{"$f":"IF(offeringsRaw!L75=\"\",\"\",offeringsRaw!L75)","v":140},{"$f":"IF(offeringsRaw!M75=\"\",\"\",offeringsRaw!M75)","v":"JSB"},{"$f":"IF(offeringsRaw!Q75=\"\",\"\",offeringsRaw!Q75)","v":"Patterson, Kelly D"},"062 - Patterson, Kelly D"]
["",{"$f":"IF(offeringsRaw!B76=\"\",\"\",offeringsRaw!B76)","v":""},{"$f":"IF(offeringsRaw!C76=\"\",\"\",offeringsRaw!C76)","v":""},{"$f":"IF(offeringsRaw!D76=\"\",\"\",offeringsRaw!D76)","v":""},{"$f":"IF(offeringsRaw!E76=\"\",\"\",offeringsRaw!E76)","v":""},{"$f":"IF(offeringsRaw!F76=\"\",\"\",offeringsRaw!F76)","v":""},{"$f":"IF(offeringsRaw!G76=\"\",\"\",offeringsRaw!G76)","v":""},{"$f":"IF(offeringsRaw!I76=\"\",\"\",offeringsRaw!I76)","v":""},{"$f":"IF(offeringsRaw!J76=\"\",\"\",offeringsRaw!J76)","v":"10:00a - 10:50a"},{"$f":"IF(offeringsRaw!K76=\"\",\"\",offeringsRaw!K76)","v":"F"},{"$f":"IF(offeringsRaw!L76=\"\",\"\",offeringsRaw!L76)","v":182},{"$f":"IF(offeringsRaw!M76=\"\",\"\",offeringsRaw!M76)","v":"JSB"},{"$f":"IF(offeringsRaw!Q76=\"\",\"\",offeringsRaw!Q76)","v":""}," - "]
["",{"$f":"IF(offeringsRaw!B77=\"\",\"\",offeringsRaw!B77)","v":"-"},{"$f":"IF(offeringsRaw!C77=\"\",\"\",offeringsRaw!C77)","v":""},{"$f":"IF(offeringsRaw!D77=\"\",\"\",offeringsRaw!D77)","v":66},{"$f":"IF(offeringsRaw!E77=\"\",\"\",offeringsRaw!E77)","v":" "},{"$f":"IF(offeringsRaw!F77=\"\",\"\",offeringsRaw!F77)","v":0},{"$f":"IF(offeringsRaw!G77=\"\",\"\",offeringsRaw!G77)","v":30},{"$f":"IF(offeringsRaw!I77=\"\",\"\",offeringsRaw!I77)","v":3},{"$f":"IF(offeringsRaw!J77=\"\",\"\",offeringsRaw!J77)","v":"11:00a - 11:50a"},{"$f":"IF(offeringsRaw!K77=\"\",\"\",offeringsRaw!K77)","v":"MW"},{"$f":"IF(offeringsRaw!L77=\"\",\"\",offeringsRaw!L77)","v":140},{"$f":"IF(offeringsRaw!M77=\"\",\"\",offeringsRaw!M77)","v":"JSB"},{"$f":"IF(offeringsRaw!Q77=\"\",\"\",offeringsRaw!Q77)","v":"Patterson, Kelly D"},"066 - Patterson, Kelly D"]
["",{"$f":"IF(offeringsRaw!B78=\"\",\"\",offeringsRaw!B78)","v":""},{"$f":"IF(offeringsRaw!C78=\"\",\"\",offeringsRaw!C78)","v":""},{"$f":"IF(offeringsRaw!D78=\"\",\"\",offeringsRaw!D78)","v":""},{"$f":"IF(offeringsRaw!E78=\"\",\"\",offeringsRaw!E78)","v":""},{"$f":"IF(offeringsRaw!F78=\"\",\"\",offeringsRaw!F78)","v":""},{"$f":"IF(offeringsRaw!G78=\"\",\"\",offeringsRaw!G78)","v":""},{"$f":"IF(offeringsRaw!I78=\"\",\"\",offeringsRaw!I78)","v":""},{"$f":"IF(offeringsRaw!J78=\"\",\"\",offeringsRaw!J78)","v":"11:00a - 11:50a"},{"$f":"IF(offeringsRaw!K78=\"\",\"\",offeringsRaw!K78)","v":"F"},{"$f":"IF(offeringsRaw!L78=\"\",\"\",offeringsRaw!L78)","v":171},{"$f":"IF(offeringsRaw!M78=\"\",\"\",offeringsRaw!M78)","v":"JSB"},{"$f":"IF(offeringsRaw!Q78=\"\",\"\",offeringsRaw!Q78)","v":""}," - "]
["",{"$f":"IF(offeringsRaw!B79=\"\",\"\",offeringsRaw!B79)","v":"-"},{"$f":"IF(offeringsRaw!C79=\"\",\"\",offeringsRaw!C79)","v":""},{"$f":"IF(offeringsRaw!D79=\"\",\"\",offeringsRaw!D79)","v":70},{"$f":"IF(offeringsRaw!E79=\"\",\"\",offeringsRaw!E79)","v":" "},{"$f":"IF(offeringsRaw!F79=\"\",\"\",offeringsRaw!F79)","v":0},{"$f":"IF(offeringsRaw!G79=\"\",\"\",offeringsRaw!G79)","v":30},{"$f":"IF(offeringsRaw!I79=\"\",\"\",offeringsRaw!I79)","v":3},{"$f":"IF(offeringsRaw!J79=\"\",\"\",offeringsRaw!J79)","v":"11:00a - 11:50a"},{"$f":"IF(offeringsRaw!K79=\"\",\"\",offeringsRaw!K79)","v":"MW"},{"$f":"IF(offeringsRaw!L79=\"\",\"\",offeringsRaw!L79)","v":140},{"$f":"IF(offeringsRaw!M79=\"\",\"\",offeringsRaw!M79)","v":"JSB"},{"$f":"IF(offeringsRaw!Q79=\"\",\"\",offeringsRaw!Q79)","v":"Patterson, Kelly D"},"070 - Patterson, Kelly D"]
["",{"$f":"IF(offeringsRaw!B80=\"\",\"\",offeringsRaw!B80)","v":""},{"$f":"IF(offeringsRaw!C80=\"\",\"\",offeringsRaw!C80)","v":""},{"$f":"IF(offeringsRaw!D80=\"\",\"\",offeringsRaw!D80)","v":""},{"$f":"IF(offeringsRaw!E80=\"\",\"\",offeringsRaw!E80)","v":""},{"$f":"IF(offeringsRaw!F80=\"\",\"\",offeringsRaw!F80)","v":""},{"$f":"IF(offeringsRaw!G80=\"\",\"\",offeringsRaw!G80)","v":""},{"$f":"IF(offeringsRaw!I80=\"\",\"\",offeringsRaw!I80)","v":""},{"$f":"IF(offeringsRaw!J80=\"\",\"\",offeringsRaw!J80)","v":"11:00a - 11:50a"},{"$f":"IF(offeringsRaw!K80=\"\",\"\",offeringsRaw!K80)","v":"F"},{"$f":"IF(offeringsRaw!L80=\"\",\"\",offeringsRaw!L80)","v":170},{"$f":"IF(offeringsRaw!M80=\"\",\"\",offeringsRaw!M80)","v":"JSB"},{"$f":"IF(offeringsRaw!Q80=\"\",\"\",offeringsRaw!Q80)","v":""}," - "]
["",{"$f":"IF(offeringsRaw!B81=\"\",\"\",offeringsRaw!B81)","v":"-"},{"$f":"IF(offeringsRaw!C81=\"\",\"\",offeringsRaw!C81)","v":""},{"$f":"IF(offeringsRaw!D81=\"\",\"\",offeringsRaw!D81)","v":73},{"$f":"IF(offeringsRaw!E81=\"\",\"\",offeringsRaw!E81)","v":" "},{"$f":"IF(offeringsRaw!F81=\"\",\"\",offeringsRaw!F81)","v":0},{"$f":"IF(offeringsRaw!G81=\"\",\"\",offeringsRaw!G81)","v":30},{"$f":"IF(offeringsRaw!I81=\"\",\"\",offeringsRaw!I81)","v":3},{"$f":"IF(offeringsRaw!J81=\"\",\"\",offeringsRaw!J81)","v":"11:00a - 11:50a"},{"$f":"IF(offeringsRaw!K81=\"\",\"\",offeringsRaw!K81)","v":"MW"},{"$f":"IF(offeringsRaw!L81=\"\",\"\",offeringsRaw!L81)","v":140},{"$f":"IF(offeringsRaw!M81=\"\",\"\",offeringsRaw!M81)","v":"JSB"},{"$f":"IF(offeringsRaw!Q81=\"\",\"\",offeringsRaw!Q81)","v":"Patterson, Kelly D"},"073 - Patterson, Kelly D"]
["",{"$f":"IF(offeringsRaw!B82=\"\",\"\",offeringsRaw!B82)","v":""},{"$f":"IF(offeringsRaw!C82=\"\",\"\",offeringsRaw!C82)","v":""},{"$f":"IF(offeringsRaw!D82=\"\",\"\",offeringsRaw!D82)","v":""},{"$f":"IF(offeringsRaw!E82=\"\",\"\",offeringsRaw!E82)","v":""},{"$f":"IF(offeringsRaw!F82=\"\",\"\",offeringsRaw!F82)","v":""},{"$f":"IF(offeringsRaw!G82=\"\",\"\",offeringsRaw!G82)","v":""},{"$f":"IF(offeringsRaw!I82=\"\",\"\",offeringsRaw!I82)","v":""},{"$f":"IF(offeringsRaw!J82=\"\",\"\",offeringsRaw!J82)","v":"8:00a - 8:50a"},{"$f":"IF(offeringsRaw!K82=\"\",\"\",offeringsRaw!K82)","v":"F"},{"$f":"IF(offeringsRaw!L82=\"\",\"\",offeringsRaw!L82)","v":103},{"$f":"IF(offeringsRaw!M82=\"\",\"\",offeringsRaw!M82)","v":"JSB"},{"$f":"IF(offeringsRaw!Q82=\"\",\"\",offeringsRaw!Q82)","v":""}," - "]
["",{"$f":"IF(offeringsRaw!B83=\"\",\"\",offeringsRaw!B83)","v":"-"},{"$f":"IF(offeringsRaw!C83=\"\",\"\",offeringsRaw!C83)","v":""},{"$f":"IF(offeringsRaw!D83=\"\",\"\",offeringsRaw!D83)","v":75},{"$f":"IF(offeringsRaw!E83=\"\",\"\",offeringsRaw!E83)","v":" "},{"$f":"IF(offeringsRaw!F83=\"\",\"\",offeringsRaw!F83)","v":0},{"$f":"IF(offeringsRaw!G83=\"\",\"\",offeringsRaw!G83)","v":30},{"$f":"IF(offeringsRaw!I83=\"\",\"\",offeringsRaw!I83)","v":3},{"$f":"IF(offeringsRaw!J83=\"\",\"\",offeringsRaw!J83)","v":"11:00a - 11:50a"},{"$f":"IF(offeringsRaw!K83=\"\",\"\",offeringsRaw!K83)","v":"MW"},{"$f":"IF(offeringsRaw!L83=\"\",\"\",offeringsRaw!L83)","v":140},{"$f":"IF(offeringsRaw!M83=\"\",\"\",offeringsRaw!M83)","v":"JSB"},{"$f":"IF(offeringsRaw!Q83=\"\",\"\",offeringsRaw!Q83)","v":"Patterson, Kelly D"},"075 - Patterson, Kelly D"]
["",{"$f":"IF(offeringsRaw!B84=\"\",\"\",offeringsRaw!B84)","v":""},{"$f":"IF(offeringsRaw!C84=\"\",\"\",offeringsRaw!C84)","v":""},{"$f":"IF(offeringsRaw!D84=\"\",\"\",offeringsRaw!D84)","v":""},{"$f":"IF(offeringsRaw!E84=\"\",\"\",offeringsRaw!E84)","v":""},{"$f":"IF(offeringsRaw!F84=\"\",\"\",offeringsRaw!F84)","v":""},{"$f":"IF(offeringsRaw!G84=\"\",\"\",offeringsRaw!G84)","v":""},{"$f":"IF(offeringsRaw!I84=\"\",\"\",offeringsRaw!I84)","v":""},{"$f":"IF(offeringsRaw!J84=\"\",\"\",offeringsRaw!J84)","v":"10:00a - 10:50a"},{"$f":"IF(offeringsRaw!K84=\"\",\"\",offeringsRaw!K84)","v":"F"},{"$f":"IF(offeringsRaw!L84=\"\",\"\",offeringsRaw!L84)","v":107},{"$f":"IF(offeringsRaw!M84=\"\",\"\",offeringsRaw!M84)","v":"JSB"},{"$f":"IF(offeringsRaw!Q84=\"\",\"\",offeringsRaw!Q84)","v":""}," - "]
["",{"$f":"IF(offeringsRaw!B85=\"\",\"\",offeringsRaw!B85)","v":"-"},{"$f":"IF(offeringsRaw!C85=\"\",\"\",offeringsRaw!C85)","v":""},{"$f":"IF(offeringsRaw!D85=\"\",\"\",offeringsRaw!D85)","v":12},{"$f":"IF(offeringsRaw!E85=\"\",\"\",offeringsRaw!E85)","v":" "},{"$f":"IF(offeringsRaw!F85=\"\",\"\",offeringsRaw!F85)","v":0},{"$f":"IF(offeringsRaw!G85=\"\",\"\",offeringsRaw!G85)","v":30},{"$f":"IF(offeringsRaw!I85=\"\",\"\",offeringsRaw!I85)","v":3},{"$f":"IF(offeringsRaw!J85=\"\",\"\",offeringsRaw!J85)","v":"12:00p - 12:50p"},{"$f":"IF(offeringsRaw!K85=\"\",\"\",offeringsRaw!K85)","v":"MW"},{"$f":"IF(offeringsRaw!L85=\"\",\"\",offeringsRaw!L85)","v":140},{"$f":"IF(offeringsRaw!M85=\"\",\"\",offeringsRaw!M85)","v":"JSB"},{"$f":"IF(offeringsRaw!Q85=\"\",\"\",offeringsRaw!Q85)","v":"Patterson, Kelly D"},"012 - Patterson, Kelly D"]
["",{"$f":"IF(offeringsRaw!B86=\"\",\"\",offeringsRaw!B86)","v":""},{"$f":"IF(offeringsRaw!C86=\"\",\"\",offeringsRaw!C86)","v":""},{"$f":"IF(offeringsRaw!D86=\"\",\"\",offeringsRaw!D86)","v":""},{"$f":"IF(offeringsRaw!E86=\"\",\"\",offeringsRaw!E86)","v":""},{"$f":"IF(offeringsRaw!F86=\"\",\"\",offeringsRaw!F86)","v":""},{"$f":"IF(offeringsRaw!G86=\"\",\"\",offeringsRaw!G86)","v":""},{"$f":"IF(offeringsRaw!I86=\"\",\"\",offeringsRaw!I86)","v":""},{"$f":"IF(offeringsRaw!J86=\"\",\"\",offeringsRaw!J86)","v":"1:00p - 1:50p"},{"$f":"IF(offeringsRaw!K86=\"\",\"\",offeringsRaw!K86)","v":"Th"},{"$f":"IF(offeringsRaw!L86=\"\",\"\",offeringsRaw!L86)","v":160},{"$f":"IF(offeringsRaw!M86=\"\",\"\",offeringsRaw!M86)","v":"MCKB"},{"$f":"IF(offeringsRaw!Q86=\"\",\"\",offeringsRaw!Q86)","v":""}," - "]
["",{"$f":"IF(offeringsRaw!B87=\"\",\"\",offeringsRaw!B87)","v":"-"},{"$f":"IF(offeringsRaw!C87=\"\",\"\",offeringsRaw!C87)","v":""},{"$f":"IF(offeringsRaw!D87=\"\",\"\",offeringsRaw!D87)","v":13},{"$f":"IF(offeringsRaw!E87=\"\",\"\",offeringsRaw!E87)","v":" "},{"$f":"IF(offeringsRaw!F87=\"\",\"\",offeringsRaw!F87)","v":0},{"$f":"IF(offeringsRaw!G87=\"\",\"\",offeringsRaw!G87)","v":30},{"$f":"IF(offeringsRaw!I87=\"\",\"\",offeringsRaw!I87)","v":3},{"$f":"IF(offeringsRaw!J87=\"\",\"\",offeringsRaw!J87)","v":"12:00p - 12:50p"},{"$f":"IF(offeringsRaw!K87=\"\",\"\",offeringsRaw!K87)","v":"MW"},{"$f":"IF(offeringsRaw!L87=\"\",\"\",offeringsRaw!L87)","v":140},{"$f":"IF(offeringsRaw!M87=\"\",\"\",offeringsRaw!M87)","v":"JSB"},{"$f":"IF(offeringsRaw!Q87=\"\",\"\",offeringsRaw!Q87)","v":"Patterson, Kelly D"},"013 - Patterson, Kelly D"]
["",{"$f":"IF(offeringsRaw!B88=\"\",\"\",offeringsRaw!B88)","v":""},{"$f":"IF(offeringsRaw!C88=\"\",\"\",offeringsRaw!C88)","v":""},{"$f":"IF(offeringsRaw!D88=\"\",\"\",offeringsRaw!D88)","v":""},{"$f":"IF(offeringsRaw!E88=\"\",\"\",offeringsRaw!E88)","v":""},{"$f":"IF(offeringsRaw!F88=\"\",\"\",offeringsRaw!F88)","v":""},{"$f":"IF(offeringsRaw!G88=\"\",\"\",offeringsRaw!G88)","v":""},{"$f":"IF(offeringsRaw!I88=\"\",\"\",offeringsRaw!I88)","v":""},{"$f":"IF(offeringsRaw!J88=\"\",\"\",offeringsRaw!J88)","v":"11:00a - 11:50a"},{"$f":"IF(offeringsRaw!K88=\"\",\"\",offeringsRaw!K88)","v":"F"},{"$f":"IF(offeringsRaw!L88=\"\",\"\",offeringsRaw!L88)","v":103},{"$f":"IF(offeringsRaw!M88=\"\",\"\",offeringsRaw!M88)","v":"JSB"},{"$f":"IF(offeringsRaw!Q88=\"\",\"\",offeringsRaw!Q88)","v":""}," - "]
["",{"$f":"IF(offeringsRaw!B89=\"\",\"\",offeringsRaw!B89)","v":"-"},{"$f":"IF(offeringsRaw!C89=\"\",\"\",offeringsRaw!C89)","v":""},{"$f":"IF(offeringsRaw!D89=\"\",\"\",offeringsRaw!D89)","v":14},{"$f":"IF(offeringsRaw!E89=\"\",\"\",offeringsRaw!E89)","v":" "},{"$f":"IF(offeringsRaw!F89=\"\",\"\",offeringsRaw!F89)","v":0},{"$f":"IF(offeringsRaw!G89=\"\",\"\",offeringsRaw!G89)","v":30},{"$f":"IF(offeringsRaw!I89=\"\",\"\",offeringsRaw!I89)","v":3},{"$f":"IF(offeringsRaw!J89=\"\",\"\",offeringsRaw!J89)","v":"12:00p - 12:50p"},{"$f":"IF(offeringsRaw!K89=\"\",\"\",offeringsRaw!K89)","v":"MW"},{"$f":"IF(offeringsRaw!L89=\"\",\"\",offeringsRaw!L89)","v":140},{"$f":"IF(offeringsRaw!M89=\"\",\"\",offeringsRaw!M89)","v":"JSB"},{"$f":"IF(offeringsRaw!Q89=\"\",\"\",offeringsRaw!Q89)","v":"Patterson, Kelly D"},"014 - Patterson, Kelly D"]
["",{"$f":"IF(offeringsRaw!B90=\"\",\"\",offeringsRaw!B90)","v":""},{"$f":"IF(offeringsRaw!C90=\"\",\"\",offeringsRaw!C90)","v":""},{"$f":"IF(offeringsRaw!D90=\"\",\"\",offeringsRaw!D90)","v":""},{"$f":"IF(offeringsRaw!E90=\"\",\"\",offeringsRaw!E90)","v":""},{"$f":"IF(offeringsRaw!F90=\"\",\"\",offeringsRaw!F90)","v":""},{"$f":"IF(offeringsRaw!G90=\"\",\"\",offeringsRaw!G90)","v":""},{"$f":"IF(offeringsRaw!I90=\"\",\"\",offeringsRaw!I90)","v":""},{"$f":"IF(offeringsRaw!J90=\"\",\"\",offeringsRaw!J90)","v":"12:00p - 12:50p"},{"$f":"IF(offeringsRaw!K90=\"\",\"\",offeringsRaw!K90)","v":"F"},{"$f":"IF(offeringsRaw!L90=\"\",\"\",offeringsRaw!L90)","v":175},{"$f":"IF(offeringsRaw!M90=\"\",\"\",offeringsRaw!M90)","v":"JSB"},{"$f":"IF(offeringsRaw!Q90=\"\",\"\",offeringsRaw!Q90)","v":""}," - "]
["",{"$f":"IF(offeringsRaw!B91=\"\",\"\",offeringsRaw!B91)","v":"-"},{"$f":"IF(offeringsRaw!C91=\"\",\"\",offeringsRaw!C91)","v":""},{"$f":"IF(offeringsRaw!D91=\"\",\"\",offeringsRaw!D91)","v":15},{"$f":"IF(offeringsRaw!E91=\"\",\"\",offeringsRaw!E91)","v":" "},{"$f":"IF(offeringsRaw!F91=\"\",\"\",offeringsRaw!F91)","v":0},{"$f":"IF(offeringsRaw!G91=\"\",\"\",offeringsRaw!G91)","v":30},{"$f":"IF(offeringsRaw!I91=\"\",\"\",offeringsRaw!I91)","v":3},{"$f":"IF(offeringsRaw!J91=\"\",\"\",offeringsRaw!J91)","v":"12:00p - 12:50p"},{"$f":"IF(offeringsRaw!K91=\"\",\"\",offeringsRaw!K91)","v":"MW"},{"$f":"IF(offeringsRaw!L91=\"\",\"\",offeringsRaw!L91)","v":140},{"$f":"IF(offeringsRaw!M91=\"\",\"\",offeringsRaw!M91)","v":"JSB"},{"$f":"IF(offeringsRaw!Q91=\"\",\"\",offeringsRaw!Q91)","v":"Patterson, Kelly D"},"015 - Patterson, Kelly D"]
["",{"$f":"IF(offeringsRaw!B92=\"\",\"\",offeringsRaw!B92)","v":""},{"$f":"IF(offeringsRaw!C92=\"\",\"\",offeringsRaw!C92)","v":""},{"$f":"IF(offeringsRaw!D92=\"\",\"\",offeringsRaw!D92)","v":""},{"$f":"IF(offeringsRaw!E92=\"\",\"\",offeringsRaw!E92)","v":""},{"$f":"IF(offeringsRaw!F92=\"\",\"\",offeringsRaw!F92)","v":""},{"$f":"IF(offeringsRaw!G92=\"\",\"\",offeringsRaw!G92)","v":""},{"$f":"IF(offeringsRaw!I92=\"\",\"\",offeringsRaw!I92)","v":""},{"$f":"IF(offeringsRaw!J92=\"\",\"\",offeringsRaw!J92)","v":"1:00p - 1:50p"},{"$f":"IF(offeringsRaw!K92=\"\",\"\",offeringsRaw!K92)","v":"Th"},{"$f":"IF(offeringsRaw!L92=\"\",\"\",offeringsRaw!L92)","v":341},{"$f":"IF(offeringsRaw!M92=\"\",\"\",offeringsRaw!M92)","v":"MCKB"},{"$f":"IF(offeringsRaw!Q92=\"\",\"\",offeringsRaw!Q92)","v":""}," - "]
["",{"$f":"IF(offeringsRaw!B93=\"\",\"\",offeringsRaw!B93)","v":"-"},{"$f":"IF(offeringsRaw!C93=\"\",\"\",offeringsRaw!C93)","v":""},{"$f":"IF(offeringsRaw!D93=\"\",\"\",offeringsRaw!D93)","v":16},{"$f":"IF(offeringsRaw!E93=\"\",\"\",offeringsRaw!E93)","v":" "},{"$f":"IF(offeringsRaw!F93=\"\",\"\",offeringsRaw!F93)","v":0},{"$f":"IF(offeringsRaw!G93=\"\",\"\",offeringsRaw!G93)","v":30},{"$f":"IF(offeringsRaw!I93=\"\",\"\",offeringsRaw!I93)","v":3},{"$f":"IF(offeringsRaw!J93=\"\",\"\",offeringsRaw!J93)","v":"12:00p - 12:50p"},{"$f":"IF(offeringsRaw!K93=\"\",\"\",offeringsRaw!K93)","v":"MW"},{"$f":"IF(offeringsRaw!L93=\"\",\"\",offeringsRaw!L93)","v":140},{"$f":"IF(offeringsRaw!M93=\"\",\"\",offeringsRaw!M93)","v":"JSB"},{"$f":"IF(offeringsRaw!Q93=\"\",\"\",offeringsRaw!Q93)","v":"Patterson, Kelly D"},"016 - Patterson, Kelly D"]
["",{"$f":"IF(offeringsRaw!B94=\"\",\"\",offeringsRaw!B94)","v":""},{"$f":"IF(offeringsRaw!C94=\"\",\"\",offeringsRaw!C94)","v":""},{"$f":"IF(offeringsRaw!D94=\"\",\"\",offeringsRaw!D94)","v":""},{"$f":"IF(offeringsRaw!E94=\"\",\"\",offeringsRaw!E94)","v":""},{"$f":"IF(offeringsRaw!F94=\"\",\"\",offeringsRaw!F94)","v":""},{"$f":"IF(offeringsRaw!G94=\"\",\"\",offeringsRaw!G94)","v":""},{"$f":"IF(offeringsRaw!I94=\"\",\"\",offeringsRaw!I94)","v":""},{"$f":"IF(offeringsRaw!J94=\"\",\"\",offeringsRaw!J94)","v":"1:00p - 1:50p"},{"$f":"IF(offeringsRaw!K94=\"\",\"\",offeringsRaw!K94)","v":"Th"},{"$f":"IF(offeringsRaw!L94=\"\",\"\",offeringsRaw!L94)","v":393},{"$f":"IF(offeringsRaw!M94=\"\",\"\",offeringsRaw!M94)","v":"CB"},{"$f":"IF(offeringsRaw!Q94=\"\",\"\",offeringsRaw!Q94)","v":""}," - "]
["",{"$f":"IF(offeringsRaw!B95=\"\",\"\",offeringsRaw!B95)","v":"-"},{"$f":"IF(offeringsRaw!C95=\"\",\"\",offeringsRaw!C95)","v":""},{"$f":"IF(offeringsRaw!D95=\"\",\"\",offeringsRaw!D95)","v":17},{"$f":"IF(offeringsRaw!E95=\"\",\"\",offeringsRaw!E95)","v":" "},{"$f":"IF(offeringsRaw!F95=\"\",\"\",offeringsRaw!F95)","v":0},{"$f":"IF(offeringsRaw!G95=\"\",\"\",offeringsRaw!G95)","v":30},{"$f":"IF(offeringsRaw!I95=\"\",\"\",offeringsRaw!I95)","v":3},{"$f":"IF(offeringsRaw!J95=\"\",\"\",offeringsRaw!J95)","v":"12:00p - 12:50p"},{"$f":"IF(offeringsRaw!K95=\"\",\"\",offeringsRaw!K95)","v":"MW"},{"$f":"IF(offeringsRaw!L95=\"\",\"\",offeringsRaw!L95)","v":140},{"$f":"IF(offeringsRaw!M95=\"\",\"\",offeringsRaw!M95)","v":"JSB"},{"$f":"IF(offeringsRaw!Q95=\"\",\"\",offeringsRaw!Q95)","v":"Patterson, Kelly D"},"017 - Patterson, Kelly D"]
["",{"$f":"IF(offeringsRaw!B96=\"\",\"\",offeringsRaw!B96)","v":""},{"$f":"IF(offeringsRaw!C96=\"\",\"\",offeringsRaw!C96)","v":""},{"$f":"IF(offeringsRaw!D96=\"\",\"\",offeringsRaw!D96)","v":""},{"$f":"IF(offeringsRaw!E96=\"\",\"\",offeringsRaw!E96)","v":""},{"$f":"IF(offeringsRaw!F96=\"\",\"\",offeringsRaw!F96)","v":""},{"$f":"IF(offeringsRaw!G96=\"\",\"\",offeringsRaw!G96)","v":""},{"$f":"IF(offeringsRaw!I96=\"\",\"\",offeringsRaw!I96)","v":""},{"$f":"IF(offeringsRaw!J96=\"\",\"\",offeringsRaw!J96)","v":"3:00p - 3:50p"},{"$f":"IF(offeringsRaw!K96=\"\",\"\",offeringsRaw!K96)","v":"Th"},{"$f":"IF(offeringsRaw!L96=\"\",\"\",offeringsRaw!L96)","v":240},{"$f":"IF(offeringsRaw!M96=\"\",\"\",offeringsRaw!M96)","v":"SWKT"},{"$f":"IF(offeringsRaw!Q96=\"\",\"\",offeringsRaw!Q96)","v":""}," - "]
["",{"$f":"IF(offeringsRaw!B97=\"\",\"\",offeringsRaw!B97)","v":"-"},{"$f":"IF(offeringsRaw!C97=\"\",\"\",offeringsRaw!C97)","v":""},{"$f":"IF(offeringsRaw!D97=\"\",\"\",offeringsRaw!D97)","v":18},{"$f":"IF(offeringsRaw!E97=\"\",\"\",offeringsRaw!E97)","v":" "},{"$f":"IF(offeringsRaw!F97=\"\",\"\",offeringsRaw!F97)","v":0},{"$f":"IF(offeringsRaw!G97=\"\",\"\",offeringsRaw!G97)","v":30},{"$f":"IF(offeringsRaw!I97=\"\",\"\",offeringsRaw!I97)","v":3},{"$f":"IF(offeringsRaw!J97=\"\",\"\",offeringsRaw!J97)","v":"12:00p - 12:50p"},{"$f":"IF(offeringsRaw!K97=\"\",\"\",offeringsRaw!K97)","v":"MW"},{"$f":"IF(offeringsRaw!L97=\"\",\"\",offeringsRaw!L97)","v":140},{"$f":"IF(offeringsRaw!M97=\"\",\"\",offeringsRaw!M97)","v":"JSB"},{"$f":"IF(offeringsRaw!Q97=\"\",\"\",offeringsRaw!Q97)","v":"Patterson, Kelly D"},"018 - Patterson, Kelly D"]
["",{"$f":"IF(offeringsRaw!B98=\"\",\"\",offeringsRaw!B98)","v":""},{"$f":"IF(offeringsRaw!C98=\"\",\"\",offeringsRaw!C98)","v":""},{"$f":"IF(offeringsRaw!D98=\"\",\"\",offeringsRaw!D98)","v":""},{"$f":"IF(offeringsRaw!E98=\"\",\"\",offeringsRaw!E98)","v":""},{"$f":"IF(offeringsRaw!F98=\"\",\"\",offeringsRaw!F98)","v":""},{"$f":"IF(offeringsRaw!G98=\"\",\"\",offeringsRaw!G98)","v":""},{"$f":"IF(offeringsRaw!I98=\"\",\"\",offeringsRaw!I98)","v":""},{"$f":"IF(offeringsRaw!J98=\"\",\"\",offeringsRaw!J98)","v":"8:00a - 8:50a"},{"$f":"IF(offeringsRaw!K98=\"\",\"\",offeringsRaw!K98)","v":"F"},{"$f":"IF(offeringsRaw!L98=\"\",\"\",offeringsRaw!L98)","v":106},{"$f":"IF(offeringsRaw!M98=\"\",\"\",offeringsRaw!M98)","v":"JSB"},{"$f":"IF(offeringsRaw!Q98=\"\",\"\",offeringsRaw!Q98)","v":""}," - "]
["",{"$f":"IF(offeringsRaw!B99=\"\",\"\",offeringsRaw!B99)","v":"-"},{"$f":"IF(offeringsRaw!C99=\"\",\"\",offeringsRaw!C99)","v":""},{"$f":"IF(offeringsRaw!D99=\"\",\"\",offeringsRaw!D99)","v":19},{"$f":"IF(offeringsRaw!E99=\"\",\"\",offeringsRaw!E99)","v":" "},{"$f":"IF(offeringsRaw!F99=\"\",\"\",offeringsRaw!F99)","v":0},{"$f":"IF(offeringsRaw!G99=\"\",\"\",offeringsRaw!G99)","v":30},{"$f":"IF(offeringsRaw!I99=\"\",\"\",offeringsRaw!I99)","v":3},{"$f":"IF(offeringsRaw!J99=\"\",\"\",offeringsRaw!J99)","v":"12:00p - 12:50p"},{"$f":"IF(offeringsRaw!K99=\"\",\"\",offeringsRaw!K99)","v":"MW"},{"$f":"IF(offeringsRaw!L99=\"\",\"\",offeringsRaw!L99)","v":140},{"$f":"IF(offeringsRaw!M99=\"\",\"\",offeringsRaw!M99)","v":"JSB"},{"$f":"IF(offeringsRaw!Q99=\"\",\"\",offeringsRaw!Q99)","v":"Patterson, Kelly D"},"019 - Patterson, Kelly D"]
["",{"$f":"IF(offeringsRaw!B100=\"\",\"\",offeringsRaw!B100)","v":""},{"$f":"IF(offeringsRaw!C100=\"\",\"\",offeringsRaw!C100)","v":""},{"$f":"IF(offeringsRaw!D100=\"\",\"\",offeringsRaw!D100)","v":""},{"$f":"IF(offeringsRaw!E100=\"\",\"\",offeringsRaw!E100)","v":""},{"$f":"IF(offeringsRaw!F100=\"\",\"\",offeringsRaw!F100)","v":""},{"$f":"IF(offeringsRaw!G100=\"\",\"\",offeringsRaw!G100)","v":""},{"$f":"IF(offeringsRaw!I100=\"\",\"\",offeringsRaw!I100)","v":""},{"$f":"IF(offeringsRaw!J100=\"\",\"\",offeringsRaw!J100)","v":"11:00a - 11:50a"},{"$f":"IF(offeringsRaw!K100=\"\",\"\",offeringsRaw!K100)","v":"F"},{"$f":"IF(offeringsRaw!L100=\"\",\"\",offeringsRaw!L100)","v":106},{"$f":"IF(offeringsRaw!M100=\"\",\"\",offeringsRaw!M100)","v":"JSB"},{"$f":"IF(offeringsRaw!Q100=\"\",\"\",offeringsRaw!Q100)","v":""}," - "]
["",{"$f":"IF(offeringsRaw!B101=\"\",\"\",offeringsRaw!B101)","v":"-"},{"$f":"IF(offeringsRaw!C101=\"\",\"\",offeringsRaw!C101)","v":""},{"$f":"IF(offeringsRaw!D101=\"\",\"\",offeringsRaw!D101)","v":20},{"$f":"IF(offeringsRaw!E101=\"\",\"\",offeringsRaw!E101)","v":" "},{"$f":"IF(offeringsRaw!F101=\"\",\"\",offeringsRaw!F101)","v":0},{"$f":"IF(offeringsRaw!G101=\"\",\"\",offeringsRaw!G101)","v":30},{"$f":"IF(offeringsRaw!I101=\"\",\"\",offeringsRaw!I101)","v":3},{"$f":"IF(offeringsRaw!J101=\"\",\"\",offeringsRaw!J101)","v":"12:00p - 12:50p"},{"$f":"IF(offeringsRaw!K101=\"\",\"\",offeringsRaw!K101)","v":"MW"},{"$f":"IF(offeringsRaw!L101=\"\",\"\",offeringsRaw!L101)","v":140},{"$f":"IF(offeringsRaw!M101=\"\",\"\",offeringsRaw!M101)","v":"JSB"},{"$f":"IF(offeringsRaw!Q101=\"\",\"\",offeringsRaw!Q101)","v":"Patterson, Kelly D"},"020 - Patterson, Kelly D"]
["",{"$f":"IF(offeringsRaw!B102=\"\",\"\",offeringsRaw!B102)","v":""},{"$f":"IF(offeringsRaw!C102=\"\",\"\",offeringsRaw!C102)","v":""},{"$f":"IF(offeringsRaw!D102=\"\",\"\",offeringsRaw!D102)","v":""},{"$f":"IF(offeringsRaw!E102=\"\",\"\",offeringsRaw!E102)","v":""},{"$f":"IF(offeringsRaw!F102=\"\",\"\",offeringsRaw!F102)","v":""},{"$f":"IF(offeringsRaw!G102=\"\",\"\",offeringsRaw!G102)","v":""},{"$f":"IF(offeringsRaw!I102=\"\",\"\",offeringsRaw!I102)","v":""},{"$f":"IF(offeringsRaw!J102=\"\",\"\",offeringsRaw!J102)","v":"9:00a - 9:50a"},{"$f":"IF(offeringsRaw!K102=\"\",\"\",offeringsRaw!K102)","v":"F"},{"$f":"IF(offeringsRaw!L102=\"\",\"\",offeringsRaw!L102)","v":110},{"$f":"IF(offeringsRaw!M102=\"\",\"\",offeringsRaw!M102)","v":"JSB"},{"$f":"IF(offeringsRaw!Q102=\"\",\"\",offeringsRaw!Q102)","v":""}," - "]
["",{"$f":"IF(offeringsRaw!B103=\"\",\"\",offeringsRaw!B103)","v":"-"},{"$f":"IF(offeringsRaw!C103=\"\",\"\",offeringsRaw!C103)","v":""},{"$f":"IF(offeringsRaw!D103=\"\",\"\",offeringsRaw!D103)","v":22},{"$f":"IF(offeringsRaw!E103=\"\",\"\",offeringsRaw!E103)","v":" "},{"$f":"IF(offeringsRaw!F103=\"\",\"\",offeringsRaw!F103)","v":0},{"$f":"IF(offeringsRaw!G103=\"\",\"\",offeringsRaw!G103)","v":30},{"$f":"IF(offeringsRaw!I103=\"\",\"\",offeringsRaw!I103)","v":3},{"$f":"IF(offeringsRaw!J103=\"\",\"\",offeringsRaw!J103)","v":"12:00p - 12:50p"},{"$f":"IF(offeringsRaw!K103=\"\",\"\",offeringsRaw!K103)","v":"MW"},{"$f":"IF(offeringsRaw!L103=\"\",\"\",offeringsRaw!L103)","v":140},{"$f":"IF(offeringsRaw!M103=\"\",\"\",offeringsRaw!M103)","v":"JSB"},{"$f":"IF(offeringsRaw!Q103=\"\",\"\",offeringsRaw!Q103)","v":"Patterson, Kelly D"},"022 - Patterson, Kelly D"]
["",{"$f":"IF(offeringsRaw!B104=\"\",\"\",offeringsRaw!B104)","v":""},{"$f":"IF(offeringsRaw!C104=\"\",\"\",offeringsRaw!C104)","v":""},{"$f":"IF(offeringsRaw!D104=\"\",\"\",offeringsRaw!D104)","v":""},{"$f":"IF(offeringsRaw!E104=\"\",\"\",offeringsRaw!E104)","v":""},{"$f":"IF(offeringsRaw!F104=\"\",\"\",offeringsRaw!F104)","v":""},{"$f":"IF(offeringsRaw!G104=\"\",\"\",offeringsRaw!G104)","v":""},{"$f":"IF(offeringsRaw!I104=\"\",\"\",offeringsRaw!I104)","v":""},{"$f":"IF(offeringsRaw!J104=\"\",\"\",offeringsRaw!J104)","v":"11:00a - 11:50a"},{"$f":"IF(offeringsRaw!K104=\"\",\"\",offeringsRaw!K104)","v":"F"},{"$f":"IF(offeringsRaw!L104=\"\",\"\",offeringsRaw!L104)","v":179},{"$f":"IF(offeringsRaw!M104=\"\",\"\",offeringsRaw!M104)","v":"JSB"},{"$f":"IF(offeringsRaw!Q104=\"\",\"\",offeringsRaw!Q104)","v":""}," - "]
["",{"$f":"IF(offeringsRaw!B105=\"\",\"\",offeringsRaw!B105)","v":"-"},{"$f":"IF(offeringsRaw!C105=\"\",\"\",offeringsRaw!C105)","v":""},{"$f":"IF(offeringsRaw!D105=\"\",\"\",offeringsRaw!D105)","v":24},{"$f":"IF(offeringsRaw!E105=\"\",\"\",offeringsRaw!E105)","v":" "},{"$f":"IF(offeringsRaw!F105=\"\",\"\",offeringsRaw!F105)","v":0},{"$f":"IF(offeringsRaw!G105=\"\",\"\",offeringsRaw!G105)","v":30},{"$f":"IF(offeringsRaw!I105=\"\",\"\",offeringsRaw!I105)","v":3},{"$f":"IF(offeringsRaw!J105=\"\",\"\",offeringsRaw!J105)","v":"12:00p - 12:50p"},{"$f":"IF(offeringsRaw!K105=\"\",\"\",offeringsRaw!K105)","v":"MW"},{"$f":"IF(offeringsRaw!L105=\"\",\"\",offeringsRaw!L105)","v":140},{"$f":"IF(offeringsRaw!M105=\"\",\"\",offeringsRaw!M105)","v":"JSB"},{"$f":"IF(offeringsRaw!Q105=\"\",\"\",offeringsRaw!Q105)","v":"Patterson, Kelly D"},"024 - Patterson, Kelly D"]
["",{"$f":"IF(offeringsRaw!B106=\"\",\"\",offeringsRaw!B106)","v":""},{"$f":"IF(offeringsRaw!C106=\"\",\"\",offeringsRaw!C106)","v":""},{"$f":"IF(offeringsRaw!D106=\"\",\"\",offeringsRaw!D106)","v":""},{"$f":"IF(offeringsRaw!E106=\"\",\"\",offeringsRaw!E106)","v":""},{"$f":"IF(offeringsRaw!F106=\"\",\"\",offeringsRaw!F106)","v":""},{"$f":"IF(offeringsRaw!G106=\"\",\"\",offeringsRaw!G106)","v":""},{"$f":"IF(offeringsRaw!I106=\"\",\"\",offeringsRaw!I106)","v":""},{"$f":"IF(offeringsRaw!J106=\"\",\"\",offeringsRaw!J106)","v":"12:00p - 12:50p"},{"$f":"IF(offeringsRaw!K106=\"\",\"\",offeringsRaw!K106)","v":"F"},{"$f":"IF(offeringsRaw!L106=\"\",\"\",offeringsRaw!L106)","v":171},{"$f":"IF(offeringsRaw!M106=\"\",\"\",offeringsRaw!M106)","v":"JSB"},{"$f":"IF(offeringsRaw!Q106=\"\",\"\",offeringsRaw!Q106)","v":""}," - "]
["",{"$f":"IF(offeringsRaw!B107=\"\",\"\",offeringsRaw!B107)","v":"-"},{"$f":"IF(offeringsRaw!C107=\"\",\"\",offeringsRaw!C107)","v":""},{"$f":"IF(offeringsRaw!D107=\"\",\"\",offeringsRaw!D107)","v":27},{"$f":"IF(offeringsRaw!E107=\"\",\"\",offeringsRaw!E107)","v":" "},{"$f":"IF(offeringsRaw!F107=\"\",\"\",offeringsRaw!F107)","v":0},{"$f":"IF(offeringsRaw!G107=\"\",\"\",offeringsRaw!G107)","v":30},{"$f":"IF(offeringsRaw!I107=\"\",\"\",offeringsRaw!I107)","v":3},{"$f":"IF(offeringsRaw!J107=\"\",\"\",offeringsRaw!J107)","v":"12:00p - 12:50p"},{"$f":"IF(offeringsRaw!K107=\"\",\"\",offeringsRaw!K107)","v":"MW"},{"$f":"IF(offeringsRaw!L107=\"\",\"\",offeringsRaw!L107)","v":140},{"$f":"IF(offeringsRaw!M107=\"\",\"\",offeringsRaw!M107)","v":"JSB"},{"$f":"IF(offeringsRaw!Q107=\"\",\"\",offeringsRaw!Q107)","v":"Patterson, Kelly D"},"027 - Patterson, Kelly D"]
["",{"$f":"IF(offeringsRaw!B108=\"\",\"\",offeringsRaw!B108)","v":""},{"$f":"IF(offeringsRaw!C108=\"\",\"\",offeringsRaw!C108)","v":""},{"$f":"IF(offeringsRaw!D108=\"\",\"\",offeringsRaw!D108)","v":""},{"$f":"IF(offeringsRaw!E108=\"\",\"\",offeringsRaw!E108)","v":""},{"$f":"IF(offeringsRaw!F108=\"\",\"\",offeringsRaw!F108)","v":""},{"$f":"IF(offeringsRaw!G108=\"\",\"\",offeringsRaw!G108)","v":""},{"$f":"IF(offeringsRaw!I108=\"\",\"\",offeringsRaw!I108)","v":""},{"$f":"IF(offeringsRaw!J108=\"\",\"\",offeringsRaw!J108)","v":"1:00p - 1:50p"},{"$f":"IF(offeringsRaw!K108=\"\",\"\",offeringsRaw!K108)","v":"Th"},{"$f":"IF(offeringsRaw!L108=\"\",\"\",offeringsRaw!L108)","v":230},{"$f":"IF(offeringsRaw!M108=\"\",\"\",offeringsRaw!M108)","v":"MCKB"},{"$f":"IF(offeringsRaw!Q108=\"\",\"\",offeringsRaw!Q108)","v":""}," - "]
["",{"$f":"IF(offeringsRaw!B109=\"\",\"\",offeringsRaw!B109)","v":"-"},{"$f":"IF(offeringsRaw!C109=\"\",\"\",offeringsRaw!C109)","v":""},{"$f":"IF(offeringsRaw!D109=\"\",\"\",offeringsRaw!D109)","v":36},{"$f":"IF(offeringsRaw!E109=\"\",\"\",offeringsRaw!E109)","v":" "},{"$f":"IF(offeringsRaw!F109=\"\",\"\",offeringsRaw!F109)","v":0},{"$f":"IF(offeringsRaw!G109=\"\",\"\",offeringsRaw!G109)","v":30},{"$f":"IF(offeringsRaw!I109=\"\",\"\",offeringsRaw!I109)","v":3},{"$f":"IF(offeringsRaw!J109=\"\",\"\",offeringsRaw!J109)","v":"12:00p - 12:50p"},{"$f":"IF(offeringsRaw!K109=\"\",\"\",offeringsRaw!K109)","v":"MW"},{"$f":"IF(offeringsRaw!L109=\"\",\"\",offeringsRaw!L109)","v":140},{"$f":"IF(offeringsRaw!M109=\"\",\"\",offeringsRaw!M109)","v":"JSB"},{"$f":"IF(offeringsRaw!Q109=\"\",\"\",offeringsRaw!Q109)","v":"Patterson, Kelly D"},"036 - Patterson, Kelly D"]
["",{"$f":"IF(offeringsRaw!B110=\"\",\"\",offeringsRaw!B110)","v":""},{"$f":"IF(offeringsRaw!C110=\"\",\"\",offeringsRaw!C110)","v":""},{"$f":"IF(offeringsRaw!D110=\"\",\"\",offeringsRaw!D110)","v":""},{"$f":"IF(offeringsRaw!E110=\"\",\"\",offeringsRaw!E110)","v":""},{"$f":"IF(offeringsRaw!F110=\"\",\"\",offeringsRaw!F110)","v":""},{"$f":"IF(offeringsRaw!G110=\"\",\"\",offeringsRaw!G110)","v":""},{"$f":"IF(offeringsRaw!I110=\"\",\"\",offeringsRaw!I110)","v":""},{"$f":"IF(offeringsRaw!J110=\"\",\"\",offeringsRaw!J110)","v":"1:00p - 1:50p"},{"$f":"IF(offeringsRaw!K110=\"\",\"\",offeringsRaw!K110)","v":"Th"},{"$f":"IF(offeringsRaw!L110=\"\",\"\",offeringsRaw!L110)","v":"W142"},{"$f":"IF(offeringsRaw!M110=\"\",\"\",offeringsRaw!M110)","v":"BNSN"},{"$f":"IF(offeringsRaw!Q110=\"\",\"\",offeringsRaw!Q110)","v":""}," - "]
["",{"$f":"IF(offeringsRaw!B111=\"\",\"\",offeringsRaw!B111)","v":"-"},{"$f":"IF(offeringsRaw!C111=\"\",\"\",offeringsRaw!C111)","v":""},{"$f":"IF(offeringsRaw!D111=\"\",\"\",offeringsRaw!D111)","v":39},{"$f":"IF(offeringsRaw!E111=\"\",\"\",offeringsRaw!E111)","v":" "},{"$f":"IF(offeringsRaw!F111=\"\",\"\",offeringsRaw!F111)","v":0},{"$f":"IF(offeringsRaw!G111=\"\",\"\",offeringsRaw!G111)","v":30},{"$f":"IF(offeringsRaw!I111=\"\",\"\",offeringsRaw!I111)","v":3},{"$f":"IF(offeringsRaw!J111=\"\",\"\",offeringsRaw!J111)","v":"12:00p - 12:50p"},{"$f":"IF(offeringsRaw!K111=\"\",\"\",offeringsRaw!K111)","v":"MW"},{"$f":"IF(offeringsRaw!L111=\"\",\"\",offeringsRaw!L111)","v":140},{"$f":"IF(offeringsRaw!M111=\"\",\"\",offeringsRaw!M111)","v":"JSB"},{"$f":"IF(offeringsRaw!Q111=\"\",\"\",offeringsRaw!Q111)","v":"Patterson, Kelly D"},"039 - Patterson, Kelly D"]
["",{"$f":"IF(offeringsRaw!B112=\"\",\"\",offeringsRaw!B112)","v":""},{"$f":"IF(offeringsRaw!C112=\"\",\"\",offeringsRaw!C112)","v":""},{"$f":"IF(offeringsRaw!D112=\"\",\"\",offeringsRaw!D112)","v":""},{"$f":"IF(offeringsRaw!E112=\"\",\"\",offeringsRaw!E112)","v":""},{"$f":"IF(offeringsRaw!F112=\"\",\"\",offeringsRaw!F112)","v":""},{"$f":"IF(offeringsRaw!G112=\"\",\"\",offeringsRaw!G112)","v":""},{"$f":"IF(offeringsRaw!I112=\"\",\"\",offeringsRaw!I112)","v":""},{"$f":"IF(offeringsRaw!J112=\"\",\"\",offeringsRaw!J112)","v":"12:00p - 12:50p"},{"$f":"IF(offeringsRaw!K112=\"\",\"\",offeringsRaw!K112)","v":"F"},{"$f":"IF(offeringsRaw!L112=\"\",\"\",offeringsRaw!L112)","v":107},{"$f":"IF(offeringsRaw!M112=\"\",\"\",offeringsRaw!M112)","v":"JSB"},{"$f":"IF(offeringsRaw!Q112=\"\",\"\",offeringsRaw!Q112)","v":""}," - "]
["",{"$f":"IF(offeringsRaw!B113=\"\",\"\",offeringsRaw!B113)","v":"-"},{"$f":"IF(offeringsRaw!C113=\"\",\"\",offeringsRaw!C113)","v":""},{"$f":"IF(offeringsRaw!D113=\"\",\"\",offeringsRaw!D113)","v":42},{"$f":"IF(offeringsRaw!E113=\"\",\"\",offeringsRaw!E113)","v":" "},{"$f":"IF(offeringsRaw!F113=\"\",\"\",offeringsRaw!F113)","v":0},{"$f":"IF(offeringsRaw!G113=\"\",\"\",offeringsRaw!G113)","v":30},{"$f":"IF(offeringsRaw!I113=\"\",\"\",offeringsRaw!I113)","v":3},{"$f":"IF(offeringsRaw!J113=\"\",\"\",offeringsRaw!J113)","v":"12:00p - 12:50p"},{"$f":"IF(offeringsRaw!K113=\"\",\"\",offeringsRaw!K113)","v":"MW"},{"$f":"IF(offeringsRaw!L113=\"\",\"\",offeringsRaw!L113)","v":140},{"$f":"IF(offeringsRaw!M113=\"\",\"\",offeringsRaw!M113)","v":"JSB"},{"$f":"IF(offeringsRaw!Q113=\"\",\"\",offeringsRaw!Q113)","v":"Patterson, Kelly D"},"042 - Patterson, Kelly D"]
["",{"$f":"IF(offeringsRaw!B114=\"\",\"\",offeringsRaw!B114)","v":""},{"$f":"IF(offeringsRaw!C114=\"\",\"\",offeringsRaw!C114)","v":""},{"$f":"IF(offeringsRaw!D114=\"\",\"\",offeringsRaw!D114)","v":""},{"$f":"IF(offeringsRaw!E114=\"\",\"\",offeringsRaw!E114)","v":""},{"$f":"IF(offeringsRaw!F114=\"\",\"\",offeringsRaw!F114)","v":""},{"$f":"IF(offeringsRaw!G114=\"\",\"\",offeringsRaw!G114)","v":""},{"$f":"IF(offeringsRaw!I114=\"\",\"\",offeringsRaw!I114)","v":""},{"$f":"IF(offeringsRaw!J114=\"\",\"\",offeringsRaw!J114)","v":"12:00p - 12:50p"},{"$f":"IF(offeringsRaw!K114=\"\",\"\",offeringsRaw!K114)","v":"F"},{"$f":"IF(offeringsRaw!L114=\"\",\"\",offeringsRaw!L114)","v":110},{"$f":"IF(offeringsRaw!M114=\"\",\"\",offeringsRaw!M114)","v":"JSB"},{"$f":"IF(offeringsRaw!Q114=\"\",\"\",offeringsRaw!Q114)","v":""}," - "]
["",{"$f":"IF(offeringsRaw!B115=\"\",\"\",offeringsRaw!B115)","v":"-"},{"$f":"IF(offeringsRaw!C115=\"\",\"\",offeringsRaw!C115)","v":""},{"$f":"IF(offeringsRaw!D115=\"\",\"\",offeringsRaw!D115)","v":45},{"$f":"IF(offeringsRaw!E115=\"\",\"\",offeringsRaw!E115)","v":" "},{"$f":"IF(offeringsRaw!F115=\"\",\"\",offeringsRaw!F115)","v":0},{"$f":"IF(offeringsRaw!G115=\"\",\"\",offeringsRaw!G115)","v":30},{"$f":"IF(offeringsRaw!I115=\"\",\"\",offeringsRaw!I115)","v":3},{"$f":"IF(offeringsRaw!J115=\"\",\"\",offeringsRaw!J115)","v":"12:00p - 12:50p"},{"$f":"IF(offeringsRaw!K115=\"\",\"\",offeringsRaw!K115)","v":"MW"},{"$f":"IF(offeringsRaw!L115=\"\",\"\",offeringsRaw!L115)","v":140},{"$f":"IF(offeringsRaw!M115=\"\",\"\",offeringsRaw!M115)","v":"JSB"},{"$f":"IF(offeringsRaw!Q115=\"\",\"\",offeringsRaw!Q115)","v":"Patterson, Kelly D"},"045 - Patterson, Kelly D"]
["",{"$f":"IF(offeringsRaw!B116=\"\",\"\",offeringsRaw!B116)","v":""},{"$f":"IF(offeringsRaw!C116=\"\",\"\",offeringsRaw!C116)","v":""},{"$f":"IF(offeringsRaw!D116=\"\",\"\",offeringsRaw!D116)","v":""},{"$f":"IF(offeringsRaw!E116=\"\",\"\",offeringsRaw!E116)","v":""},{"$f":"IF(offeringsRaw!F116=\"\",\"\",offeringsRaw!F116)","v":""},{"$f":"IF(offeringsRaw!G116=\"\",\"\",offeringsRaw!G116)","v":""},{"$f":"IF(offeringsRaw!I116=\"\",\"\",offeringsRaw!I116)","v":""},{"$f":"IF(offeringsRaw!J116=\"\",\"\",offeringsRaw!J116)","v":"12:00p - 12:50p"},{"$f":"IF(offeringsRaw!K116=\"\",\"\",offeringsRaw!K116)","v":"F"},{"$f":"IF(offeringsRaw!L116=\"\",\"\",offeringsRaw!L116)","v":114},{"$f":"IF(offeringsRaw!M116=\"\",\"\",offeringsRaw!M116)","v":"JSB"},{"$f":"IF(offeringsRaw!Q116=\"\",\"\",offeringsRaw!Q116)","v":""}," - "]
["",{"$f":"IF(offeringsRaw!B117=\"\",\"\",offeringsRaw!B117)","v":"-"},{"$f":"IF(offeringsRaw!C117=\"\",\"\",offeringsRaw!C117)","v":""},{"$f":"IF(offeringsRaw!D117=\"\",\"\",offeringsRaw!D117)","v":48},{"$f":"IF(offeringsRaw!E117=\"\",\"\",offeringsRaw!E117)","v":" "},{"$f":"IF(offeringsRaw!F117=\"\",\"\",offeringsRaw!F117)","v":0},{"$f":"IF(offeringsRaw!G117=\"\",\"\",offeringsRaw!G117)","v":30},{"$f":"IF(offeringsRaw!I117=\"\",\"\",offeringsRaw!I117)","v":3},{"$f":"IF(offeringsRaw!J117=\"\",\"\",offeringsRaw!J117)","v":"12:00p - 12:50p"},{"$f":"IF(offeringsRaw!K117=\"\",\"\",offeringsRaw!K117)","v":"MW"},{"$f":"IF(offeringsRaw!L117=\"\",\"\",offeringsRaw!L117)","v":140},{"$f":"IF(offeringsRaw!M117=\"\",\"\",offeringsRaw!M117)","v":"JSB"},{"$f":"IF(offeringsRaw!Q117=\"\",\"\",offeringsRaw!Q117)","v":"Patterson, Kelly D"},"048 - Patterson, Kelly D"]
["",{"$f":"IF(offeringsRaw!B118=\"\",\"\",offeringsRaw!B118)","v":""},{"$f":"IF(offeringsRaw!C118=\"\",\"\",offeringsRaw!C118)","v":""},{"$f":"IF(offeringsRaw!D118=\"\",\"\",offeringsRaw!D118)","v":""},{"$f":"IF(offeringsRaw!E118=\"\",\"\",offeringsRaw!E118)","v":""},{"$f":"IF(offeringsRaw!F118=\"\",\"\",offeringsRaw!F118)","v":""},{"$f":"IF(offeringsRaw!G118=\"\",\"\",offeringsRaw!G118)","v":""},{"$f":"IF(offeringsRaw!I118=\"\",\"\",offeringsRaw!I118)","v":""},{"$f":"IF(offeringsRaw!J118=\"\",\"\",offeringsRaw!J118)","v":"12:00p - 12:50p"},{"$f":"IF(offeringsRaw!K118=\"\",\"\",offeringsRaw!K118)","v":"Th"},{"$f":"IF(offeringsRaw!L118=\"\",\"\",offeringsRaw!L118)","v":150},{"$f":"IF(offeringsRaw!M118=\"\",\"\",offeringsRaw!M118)","v":"HRCB"},{"$f":"IF(offeringsRaw!Q118=\"\",\"\",offeringsRaw!Q118)","v":""}," - "]
["",{"$f":"IF(offeringsRaw!B119=\"\",\"\",offeringsRaw!B119)","v":"<A href=\"javascript:addRainCheck('A HTG','100',' ','051'); \">R</A>"},{"$f":"IF(offeringsRaw!C119=\"\",\"\",offeringsRaw!C119)","v":"<A href=\"javascript:viewLims('This class can only be added by approved rainchecks.^This class is a(n) INTERNATIONAL section.^'); \">Y</A>"},{"$f":"IF(offeringsRaw!D119=\"\",\"\",offeringsRaw!D119)","v":51},{"$f":"IF(offeringsRaw!E119=\"\",\"\",offeringsRaw!E119)","v":" "},{"$f":"IF(offeringsRaw!F119=\"\",\"\",offeringsRaw!F119)","v":0},{"$f":"IF(offeringsRaw!G119=\"\",\"\",offeringsRaw!G119)","v":30},{"$f":"IF(offeringsRaw!I119=\"\",\"\",offeringsRaw!I119)","v":3},{"$f":"IF(offeringsRaw!J119=\"\",\"\",offeringsRaw!J119)","v":"12:00p - 12:50p"},{"$f":"IF(offeringsRaw!K119=\"\",\"\",offeringsRaw!K119)","v":"MW"},{"$f":"IF(offeringsRaw!L119=\"\",\"\",offeringsRaw!L119)","v":140},{"$f":"IF(offeringsRaw!M119=\"\",\"\",offeringsRaw!M119)","v":"JSB"},{"$f":"IF(offeringsRaw!Q119=\"\",\"\",offeringsRaw!Q119)","v":"Patterson, Kelly D"},"051 - Patterson, Kelly D"]
["",{"$f":"IF(offeringsRaw!B120=\"\",\"\",offeringsRaw!B120)","v":""},{"$f":"IF(offeringsRaw!C120=\"\",\"\",offeringsRaw!C120)","v":""},{"$f":"IF(offeringsRaw!D120=\"\",\"\",offeringsRaw!D120)","v":""},{"$f":"IF(offeringsRaw!E120=\"\",\"\",offeringsRaw!E120)","v":""},{"$f":"IF(offeringsRaw!F120=\"\",\"\",offeringsRaw!F120)","v":""},{"$f":"IF(offeringsRaw!G120=\"\",\"\",offeringsRaw!G120)","v":""},{"$f":"IF(offeringsRaw!I120=\"\",\"\",offeringsRaw!I120)","v":""},{"$f":"IF(offeringsRaw!J120=\"\",\"\",offeringsRaw!J120)","v":"12:00p - 12:50p"},{"$f":"IF(offeringsRaw!K120=\"\",\"\",offeringsRaw!K120)","v":"F"},{"$f":"IF(offeringsRaw!L120=\"\",\"\",offeringsRaw!L120)","v":170},{"$f":"IF(offeringsRaw!M120=\"\",\"\",offeringsRaw!M120)","v":"JSB"},{"$f":"IF(offeringsRaw!Q120=\"\",\"\",offeringsRaw!Q120)","v":""}," - "]
["",{"$f":"IF(offeringsRaw!B121=\"\",\"\",offeringsRaw!B121)","v":"-"},{"$f":"IF(offeringsRaw!C121=\"\",\"\",offeringsRaw!C121)","v":""},{"$f":"IF(offeringsRaw!D121=\"\",\"\",offeringsRaw!D121)","v":55},{"$f":"IF(offeringsRaw!E121=\"\",\"\",offeringsRaw!E121)","v":" "},{"$f":"IF(offeringsRaw!F121=\"\",\"\",offeringsRaw!F121)","v":0},{"$f":"IF(offeringsRaw!G121=\"\",\"\",offeringsRaw!G121)","v":30},{"$f":"IF(offeringsRaw!I121=\"\",\"\",offeringsRaw!I121)","v":3},{"$f":"IF(offeringsRaw!J121=\"\",\"\",offeringsRaw!J121)","v":"12:00p - 12:50p"},{"$f":"IF(offeringsRaw!K121=\"\",\"\",offeringsRaw!K121)","v":"MW"},{"$f":"IF(offeringsRaw!L121=\"\",\"\",offeringsRaw!L121)","v":140},{"$f":"IF(offeringsRaw!M121=\"\",\"\",offeringsRaw!M121)","v":"JSB"},{"$f":"IF(offeringsRaw!Q121=\"\",\"\",offeringsRaw!Q121)","v":"Patterson, Kelly D"},"055 - Patterson, Kelly D"]
["",{"$f":"IF(offeringsRaw!B122=\"\",\"\",offeringsRaw!B122)","v":""},{"$f":"IF(offeringsRaw!C122=\"\",\"\",offeringsRaw!C122)","v":""},{"$f":"IF(offeringsRaw!D122=\"\",\"\",offeringsRaw!D122)","v":""},{"$f":"IF(offeringsRaw!E122=\"\",\"\",offeringsRaw!E122)","v":""},{"$f":"IF(offeringsRaw!F122=\"\",\"\",offeringsRaw!F122)","v":""},{"$f":"IF(offeringsRaw!G122=\"\",\"\",offeringsRaw!G122)","v":""},{"$f":"IF(offeringsRaw!I122=\"\",\"\",offeringsRaw!I122)","v":""},{"$f":"IF(offeringsRaw!J122=\"\",\"\",offeringsRaw!J122)","v":"1:00p - 1:50p"},{"$f":"IF(offeringsRaw!K122=\"\",\"\",offeringsRaw!K122)","v":"Th"},{"$f":"IF(offeringsRaw!L122=\"\",\"\",offeringsRaw!L122)","v":366},{"$f":"IF(offeringsRaw!M122=\"\",\"\",offeringsRaw!M122)","v":"MARB"},{"$f":"IF(offeringsRaw!Q122=\"\",\"\",offeringsRaw!Q122)","v":""}," - "]
["",{"$f":"IF(offeringsRaw!B123=\"\",\"\",offeringsRaw!B123)","v":"-"},{"$f":"IF(offeringsRaw!C123=\"\",\"\",offeringsRaw!C123)","v":""},{"$f":"IF(offeringsRaw!D123=\"\",\"\",offeringsRaw!D123)","v":57},{"$f":"IF(offeringsRaw!E123=\"\",\"\",offeringsRaw!E123)","v":" "},{"$f":"IF(offeringsRaw!F123=\"\",\"\",offeringsRaw!F123)","v":0},{"$f":"IF(offeringsRaw!G123=\"\",\"\",offeringsRaw!G123)","v":30},{"$f":"IF(offeringsRaw!I123=\"\",\"\",offeringsRaw!I123)","v":3},{"$f":"IF(offeringsRaw!J123=\"\",\"\",offeringsRaw!J123)","v":"12:00p - 12:50p"},{"$f":"IF(offeringsRaw!K123=\"\",\"\",offeringsRaw!K123)","v":"MW"},{"$f":"IF(offeringsRaw!L123=\"\",\"\",offeringsRaw!L123)","v":140},{"$f":"IF(offeringsRaw!M123=\"\",\"\",offeringsRaw!M123)","v":"JSB"},{"$f":"IF(offeringsRaw!Q123=\"\",\"\",offeringsRaw!Q123)","v":"Patterson, Kelly D"},"057 - Patterson, Kelly D"]
["",{"$f":"IF(offeringsRaw!B124=\"\",\"\",offeringsRaw!B124)","v":""},{"$f":"IF(offeringsRaw!C124=\"\",\"\",offeringsRaw!C124)","v":""},{"$f":"IF(offeringsRaw!D124=\"\",\"\",offeringsRaw!D124)","v":""},{"$f":"IF(offeringsRaw!E124=\"\",\"\",offeringsRaw!E124)","v":""},{"$f":"IF(offeringsRaw!F124=\"\",\"\",offeringsRaw!F124)","v":""},{"$f":"IF(offeringsRaw!G124=\"\",\"\",offeringsRaw!G124)","v":""},{"$f":"IF(offeringsRaw!I124=\"\",\"\",offeringsRaw!I124)","v":""},{"$f":"IF(offeringsRaw!J124=\"\",\"\",offeringsRaw!J124)","v":"8:00a - 8:50a"},{"$f":"IF(offeringsRaw!K124=\"\",\"\",offeringsRaw!K124)","v":"F"},{"$f":"IF(offeringsRaw!L124=\"\",\"\",offeringsRaw!L124)","v":107},{"$f":"IF(offeringsRaw!M124=\"\",\"\",offeringsRaw!M124)","v":"JSB"},{"$f":"IF(offeringsRaw!Q124=\"\",\"\",offeringsRaw!Q124)","v":""}," - "]
["",{"$f":"IF(offeringsRaw!B125=\"\",\"\",offeringsRaw!B125)","v":"-"},{"$f":"IF(offeringsRaw!C125=\"\",\"\",offeringsRaw!C125)","v":""},{"$f":"IF(offeringsRaw!D125=\"\",\"\",offeringsRaw!D125)","v":64},{"$f":"IF(offeringsRaw!E125=\"\",\"\",offeringsRaw!E125)","v":" "},{"$f":"IF(offeringsRaw!F125=\"\",\"\",offeringsRaw!F125)","v":0},{"$f":"IF(offeringsRaw!G125=\"\",\"\",offeringsRaw!G125)","v":30},{"$f":"IF(offeringsRaw!I125=\"\",\"\",offeringsRaw!I125)","v":3},{"$f":"IF(offeringsRaw!J125=\"\",\"\",offeringsRaw!J125)","v":"12:00p - 12:50p"},{"$f":"IF(offeringsRaw!K125=\"\",\"\",offeringsRaw!K125)","v":"MW"},{"$f":"IF(offeringsRaw!L125=\"\",\"\",offeringsRaw!L125)","v":140},{"$f":"IF(offeringsRaw!M125=\"\",\"\",offeringsRaw!M125)","v":"JSB"},{"$f":"IF(offeringsRaw!Q125=\"\",\"\",offeringsRaw!Q125)","v":"Patterson, Kelly D"},"064 - Patterson, Kelly D"]
["",{"$f":"IF(offeringsRaw!B126=\"\",\"\",offeringsRaw!B126)","v":""},{"$f":"IF(offeringsRaw!C126=\"\",\"\",offeringsRaw!C126)","v":""},{"$f":"IF(offeringsRaw!D126=\"\",\"\",offeringsRaw!D126)","v":""},{"$f":"IF(offeringsRaw!E126=\"\",\"\",offeringsRaw!E126)","v":""},{"$f":"IF(offeringsRaw!F126=\"\",\"\",offeringsRaw!F126)","v":""},{"$f":"IF(offeringsRaw!G126=\"\",\"\",offeringsRaw!G126)","v":""},{"$f":"IF(offeringsRaw!I126=\"\",\"\",offeringsRaw!I126)","v":""},{"$f":"IF(offeringsRaw!J126=\"\",\"\",offeringsRaw!J126)","v":"12:00p - 12:50p"},{"$f":"IF(offeringsRaw!K126=\"\",\"\",offeringsRaw!K126)","v":"F"},{"$f":"IF(offeringsRaw!L126=\"\",\"\",offeringsRaw!L126)","v":174},{"$f":"IF(offeringsRaw!M126=\"\",\"\",offeringsRaw!M126)","v":"JSB"},{"$f":"IF(offeringsRaw!Q126=\"\",\"\",offeringsRaw!Q126)","v":""}," - "]
["",{"$f":"IF(offeringsRaw!B127=\"\",\"\",offeringsRaw!B127)","v":"-"},{"$f":"IF(offeringsRaw!C127=\"\",\"\",offeringsRaw!C127)","v":""},{"$f":"IF(offeringsRaw!D127=\"\",\"\",offeringsRaw!D127)","v":69},{"$f":"IF(offeringsRaw!E127=\"\",\"\",offeringsRaw!E127)","v":" "},{"$f":"IF(offeringsRaw!F127=\"\",\"\",offeringsRaw!F127)","v":0},{"$f":"IF(offeringsRaw!G127=\"\",\"\",offeringsRaw!G127)","v":30},{"$f":"IF(offeringsRaw!I127=\"\",\"\",offeringsRaw!I127)","v":3},{"$f":"IF(offeringsRaw!J127=\"\",\"\",offeringsRaw!J127)","v":"12:00p - 12:50p"},{"$f":"IF(offeringsRaw!K127=\"\",\"\",offeringsRaw!K127)","v":"MW"},{"$f":"IF(offeringsRaw!L127=\"\",\"\",offeringsRaw!L127)","v":140},{"$f":"IF(offeringsRaw!M127=\"\",\"\",offeringsRaw!M127)","v":"JSB"},{"$f":"IF(offeringsRaw!Q127=\"\",\"\",offeringsRaw!Q127)","v":"Patterson, Kelly D"},"069 - Patterson, Kelly D"]
["",{"$f":"IF(offeringsRaw!B128=\"\",\"\",offeringsRaw!B128)","v":""},{"$f":"IF(offeringsRaw!C128=\"\",\"\",offeringsRaw!C128)","v":""},{"$f":"IF(offeringsRaw!D128=\"\",\"\",offeringsRaw!D128)","v":""},{"$f":"IF(offeringsRaw!E128=\"\",\"\",offeringsRaw!E128)","v":""},{"$f":"IF(offeringsRaw!F128=\"\",\"\",offeringsRaw!F128)","v":""},{"$f":"IF(offeringsRaw!G128=\"\",\"\",offeringsRaw!G128)","v":""},{"$f":"IF(offeringsRaw!I128=\"\",\"\",offeringsRaw!I128)","v":""},{"$f":"IF(offeringsRaw!J128=\"\",\"\",offeringsRaw!J128)","v":"12:00p - 12:50p"},{"$f":"IF(offeringsRaw!K128=\"\",\"\",offeringsRaw!K128)","v":"F"},{"$f":"IF(offeringsRaw!L128=\"\",\"\",offeringsRaw!L128)","v":103},{"$f":"IF(offeringsRaw!M128=\"\",\"\",offeringsRaw!M128)","v":"JSB"},{"$f":"IF(offeringsRaw!Q128=\"\",\"\",offeringsRaw!Q128)","v":""}," - "]
["",{"$f":"IF(offeringsRaw!B129=\"\",\"\",offeringsRaw!B129)","v":"-"},{"$f":"IF(offeringsRaw!C129=\"\",\"\",offeringsRaw!C129)","v":""},{"$f":"IF(offeringsRaw!D129=\"\",\"\",offeringsRaw!D129)","v":71},{"$f":"IF(offeringsRaw!E129=\"\",\"\",offeringsRaw!E129)","v":" "},{"$f":"IF(offeringsRaw!F129=\"\",\"\",offeringsRaw!F129)","v":0},{"$f":"IF(offeringsRaw!G129=\"\",\"\",offeringsRaw!G129)","v":30},{"$f":"IF(offeringsRaw!I129=\"\",\"\",offeringsRaw!I129)","v":3},{"$f":"IF(offeringsRaw!J129=\"\",\"\",offeringsRaw!J129)","v":"12:00p - 12:50p"},{"$f":"IF(offeringsRaw!K129=\"\",\"\",offeringsRaw!K129)","v":"MW"},{"$f":"IF(offeringsRaw!L129=\"\",\"\",offeringsRaw!L129)","v":140},{"$f":"IF(offeringsRaw!M129=\"\",\"\",offeringsRaw!M129)","v":"JSB"},{"$f":"IF(offeringsRaw!Q129=\"\",\"\",offeringsRaw!Q129)","v":"Patterson, Kelly D"},{"$f":"TEXT(D134,\"000\") & \" - \" &M134","v":"071 - Patterson, Kelly D"}]
[{"$f":"IF(RIGHT(B135,5)=\"A</A>\",\"A\",\"\")","v":""},{"$f":"IF(offeringsRaw!B130=\"\",\"\",offeringsRaw!B130)","v":""},{"$f":"IF(offeringsRaw!C130=\"\",\"\",offeringsRaw!C130)","v":""},{"$f":"IF(offeringsRaw!D130=\"\",\"\",offeringsRaw!D130)","v":""},{"$f":"IF(offeringsRaw!E130=\"\",\"\",offeringsRaw!E130)","v":""},{"$f":"IF(offeringsRaw!F130=\"\",\"\",offeringsRaw!F130)","v":""},{"$f":"IF(offeringsRaw!G130=\"\",\"\",offeringsRaw!G130)","v":""},{"$f":"IF(offeringsRaw!I130=\"\",\"\",offeringsRaw!I130)","v":""},{"$f":"IF(offeringsRaw!J130=\"\",\"\",offeringsRaw!J130)","v":"12:00p - 12:50p"},{"$f":"IF(offeringsRaw!K130=\"\",\"\",offeringsRaw!K130)","v":"F"},{"$f":"IF(offeringsRaw!L130=\"\",\"\",offeringsRaw!L130)","v":106},{"$f":"IF(offeringsRaw!M130=\"\",\"\",offeringsRaw!M130)","v":"JSB"},{"$f":"IF(offeringsRaw!Q130=\"\",\"\",offeringsRaw!Q130)","v":""}," - "]
["",{"$f":"IF(offeringsRaw!B131=\"\",\"\",offeringsRaw!B131)","v":"-"},{"$f":"IF(offeringsRaw!C131=\"\",\"\",offeringsRaw!C131)","v":""},{"$f":"IF(offeringsRaw!D131=\"\",\"\",offeringsRaw!D131)","v":72},{"$f":"IF(offeringsRaw!E131=\"\",\"\",offeringsRaw!E131)","v":" "},{"$f":"IF(offeringsRaw!F131=\"\",\"\",offeringsRaw!F131)","v":0},{"$f":"IF(offeringsRaw!G131=\"\",\"\",offeringsRaw!G131)","v":30},{"$f":"IF(offeringsRaw!I131=\"\",\"\",offeringsRaw!I131)","v":3},{"$f":"IF(offeringsRaw!J131=\"\",\"\",offeringsRaw!J131)","v":"12:00p - 12:50p"},{"$f":"IF(offeringsRaw!K131=\"\",\"\",offeringsRaw!K131)","v":"MW"},{"$f":"IF(offeringsRaw!L131=\"\",\"\",offeringsRaw!L131)","v":140},{"$f":"IF(offeringsRaw!M131=\"\",\"\",offeringsRaw!M131)","v":"JSB"},{"$f":"IF(offeringsRaw!Q131=\"\",\"\",offeringsRaw!Q131)","v":"Patterson, Kelly D"},"072 - Patterson, Kelly D"]
["",{"$f":"IF(offeringsRaw!B132=\"\",\"\",offeringsRaw!B132)","v":""},{"$f":"IF(offeringsRaw!C132=\"\",\"\",offeringsRaw!C132)","v":""},{"$f":"IF(offeringsRaw!D132=\"\",\"\",offeringsRaw!D132)","v":""},{"$f":"IF(offeringsRaw!E132=\"\",\"\",offeringsRaw!E132)","v":""},{"$f":"IF(offeringsRaw!F132=\"\",\"\",offeringsRaw!F132)","v":""},{"$f":"IF(offeringsRaw!G132=\"\",\"\",offeringsRaw!G132)","v":""},{"$f":"IF(offeringsRaw!I132=\"\",\"\",offeringsRaw!I132)","v":""},{"$f":"IF(offeringsRaw!J132=\"\",\"\",offeringsRaw!J132)","v":"1:00p - 1:50p"},{"$f":"IF(offeringsRaw!K132=\"\",\"\",offeringsRaw!K132)","v":"F"},{"$f":"IF(offeringsRaw!L132=\"\",\"\",offeringsRaw!L132)","v":103},{"$f":"IF(offeringsRaw!M132=\"\",\"\",offeringsRaw!M132)","v":"JSB"},{"$f":"IF(offeringsRaw!Q132=\"\",\"\",offeringsRaw!Q132)","v":""}," - "]
["",{"$f":"IF(offeringsRaw!B133=\"\",\"\",offeringsRaw!B133)","v":"-"},{"$f":"IF(offeringsRaw!C133=\"\",\"\",offeringsRaw!C133)","v":""},{"$f":"IF(offeringsRaw!D133=\"\",\"\",offeringsRaw!D133)","v":10},{"$f":"IF(offeringsRaw!E133=\"\",\"\",offeringsRaw!E133)","v":" "},{"$f":"IF(offeringsRaw!F133=\"\",\"\",offeringsRaw!F133)","v":0},{"$f":"IF(offeringsRaw!G133=\"\",\"\",offeringsRaw!G133)","v":30},{"$f":"IF(offeringsRaw!I133=\"\",\"\",offeringsRaw!I133)","v":3},{"$f":"IF(offeringsRaw!J133=\"\",\"\",offeringsRaw!J133)","v":"1:00p - 1:50p"},{"$f":"IF(offeringsRaw!K133=\"\",\"\",offeringsRaw!K133)","v":"MW"},{"$f":"IF(offeringsRaw!L133=\"\",\"\",offeringsRaw!L133)","v":140},{"$f":"IF(offeringsRaw!M133=\"\",\"\",offeringsRaw!M133)","v":"JSB"},{"$f":"IF(offeringsRaw!Q133=\"\",\"\",offeringsRaw!Q133)","v":"Patterson, Kelly D"},"010 - Patterson, Kelly D"]
["",{"$f":"IF(offeringsRaw!B134=\"\",\"\",offeringsRaw!B134)","v":""},{"$f":"IF(offeringsRaw!C134=\"\",\"\",offeringsRaw!C134)","v":""},{"$f":"IF(offeringsRaw!D134=\"\",\"\",offeringsRaw!D134)","v":""},{"$f":"IF(offeringsRaw!E134=\"\",\"\",offeringsRaw!E134)","v":""},{"$f":"IF(offeringsRaw!F134=\"\",\"\",offeringsRaw!F134)","v":""},{"$f":"IF(offeringsRaw!G134=\"\",\"\",offeringsRaw!G134)","v":""},{"$f":"IF(offeringsRaw!I134=\"\",\"\",offeringsRaw!I134)","v":""},{"$f":"IF(offeringsRaw!J134=\"\",\"\",offeringsRaw!J134)","v":"1:00p - 1:50p"},{"$f":"IF(offeringsRaw!K134=\"\",\"\",offeringsRaw!K134)","v":"F"},{"$f":"IF(offeringsRaw!L134=\"\",\"\",offeringsRaw!L134)","v":114},{"$f":"IF(offeringsRaw!M134=\"\",\"\",offeringsRaw!M134)","v":"JSB"},{"$f":"IF(offeringsRaw!Q134=\"\",\"\",offeringsRaw!Q134)","v":""}," - "]
["",{"$f":"IF(offeringsRaw!B135=\"\",\"\",offeringsRaw!B135)","v":"-"},{"$f":"IF(offeringsRaw!C135=\"\",\"\",offeringsRaw!C135)","v":""},{"$f":"IF(offeringsRaw!D135=\"\",\"\",offeringsRaw!D135)","v":11},{"$f":"IF(offeringsRaw!E135=\"\",\"\",offeringsRaw!E135)","v":" "},{"$f":"IF(offeringsRaw!F135=\"\",\"\",offeringsRaw!F135)","v":0},{"$f":"IF(offeringsRaw!G135=\"\",\"\",offeringsRaw!G135)","v":30},{"$f":"IF(offeringsRaw!I135=\"\",\"\",offeringsRaw!I135)","v":3},{"$f":"IF(offeringsRaw!J135=\"\",\"\",offeringsRaw!J135)","v":"1:00p - 1:50p"},{"$f":"IF(offeringsRaw!K135=\"\",\"\",offeringsRaw!K135)","v":"MW"},{"$f":"IF(offeringsRaw!L135=\"\",\"\",offeringsRaw!L135)","v":140},{"$f":"IF(offeringsRaw!M135=\"\",\"\",offeringsRaw!M135)","v":"JSB"},{"$f":"IF(offeringsRaw!Q135=\"\",\"\",offeringsRaw!Q135)","v":"Patterson, Kelly D"},"011 - Patterson, Kelly D"]
["",{"$f":"IF(offeringsRaw!B136=\"\",\"\",offeringsRaw!B136)","v":""},{"$f":"IF(offeringsRaw!C136=\"\",\"\",offeringsRaw!C136)","v":""},{"$f":"IF(offeringsRaw!D136=\"\",\"\",offeringsRaw!D136)","v":""},{"$f":"IF(offeringsRaw!E136=\"\",\"\",offeringsRaw!E136)","v":""},{"$f":"IF(offeringsRaw!F136=\"\",\"\",offeringsRaw!F136)","v":""},{"$f":"IF(offeringsRaw!G136=\"\",\"\",offeringsRaw!G136)","v":""},{"$f":"IF(offeringsRaw!I136=\"\",\"\",offeringsRaw!I136)","v":""},{"$f":"IF(offeringsRaw!J136=\"\",\"\",offeringsRaw!J136)","v":"2:00p - 2:50p"},{"$f":"IF(offeringsRaw!K136=\"\",\"\",offeringsRaw!K136)","v":"F"},{"$f":"IF(offeringsRaw!L136=\"\",\"\",offeringsRaw!L136)","v":203},{"$f":"IF(offeringsRaw!M136=\"\",\"\",offeringsRaw!M136)","v":"JSB"},{"$f":"IF(offeringsRaw!Q136=\"\",\"\",offeringsRaw!Q136)","v":""}," - "]
["",{"$f":"IF(offeringsRaw!B137=\"\",\"\",offeringsRaw!B137)","v":"-"},{"$f":"IF(offeringsRaw!C137=\"\",\"\",offeringsRaw!C137)","v":""},{"$f":"IF(offeringsRaw!D137=\"\",\"\",offeringsRaw!D137)","v":25},{"$f":"IF(offeringsRaw!E137=\"\",\"\",offeringsRaw!E137)","v":" "},{"$f":"IF(offeringsRaw!F137=\"\",\"\",offeringsRaw!F137)","v":0},{"$f":"IF(offeringsRaw!G137=\"\",\"\",offeringsRaw!G137)","v":30},{"$f":"IF(offeringsRaw!I137=\"\",\"\",offeringsRaw!I137)","v":3},{"$f":"IF(offeringsRaw!J137=\"\",\"\",offeringsRaw!J137)","v":"1:00p - 1:50p"},{"$f":"IF(offeringsRaw!K137=\"\",\"\",offeringsRaw!K137)","v":"MW"},{"$f":"IF(offeringsRaw!L137=\"\",\"\",offeringsRaw!L137)","v":140},{"$f":"IF(offeringsRaw!M137=\"\",\"\",offeringsRaw!M137)","v":"JSB"},{"$f":"IF(offeringsRaw!Q137=\"\",\"\",offeringsRaw!Q137)","v":"Patterson, Kelly D"},"025 - Patterson, Kelly D"]
["",{"$f":"IF(offeringsRaw!B138=\"\",\"\",offeringsRaw!B138)","v":""},{"$f":"IF(offeringsRaw!C138=\"\",\"\",offeringsRaw!C138)","v":""},{"$f":"IF(offeringsRaw!D138=\"\",\"\",offeringsRaw!D138)","v":""},{"$f":"IF(offeringsRaw!E138=\"\",\"\",offeringsRaw!E138)","v":""},{"$f":"IF(offeringsRaw!F138=\"\",\"\",offeringsRaw!F138)","v":""},{"$f":"IF(offeringsRaw!G138=\"\",\"\",offeringsRaw!G138)","v":""},{"$f":"IF(offeringsRaw!I138=\"\",\"\",offeringsRaw!I138)","v":""},{"$f":"IF(offeringsRaw!J138=\"\",\"\",offeringsRaw!J138)","v":"1:00p - 1:50p"},{"$f":"IF(offeringsRaw!K138=\"\",\"\",offeringsRaw!K138)","v":"F"},{"$f":"IF(offeringsRaw!L138=\"\",\"\",offeringsRaw!L138)","v":170},{"$f":"IF(offeringsRaw!M138=\"\",\"\",offeringsRaw!M138)","v":"JSB"},{"$f":"IF(offeringsRaw!Q138=\"\",\"\",offeringsRaw!Q138)","v":""}," - "]
["",{"$f":"IF(offeringsRaw!B139=\"\",\"\",offeringsRaw!B139)","v":"-"},{"$f":"IF(offeringsRaw!C139=\"\",\"\",offeringsRaw!C139)","v":""},{"$f":"IF(offeringsRaw!D139=\"\",\"\",offeringsRaw!D139)","v":26},{"$f":"IF(offeringsRaw!E139=\"\",\"\",offeringsRaw!E139)","v":" "},{"$f":"IF(offeringsRaw!F139=\"\",\"\",offeringsRaw!F139)","v":0},{"$f":"IF(offeringsRaw!G139=\"\",\"\",offeringsRaw!G139)","v":30},{"$f":"IF(offeringsRaw!I139=\"\",\"\",offeringsRaw!I139)","v":3},{"$f":"IF(offeringsRaw!J139=\"\",\"\",offeringsRaw!J139)","v":"1:00p - 1:50p"},{"$f":"IF(offeringsRaw!K139=\"\",\"\",offeringsRaw!K139)","v":"MW"},{"$f":"IF(offeringsRaw!L139=\"\",\"\",offeringsRaw!L139)","v":140},{"$f":"IF(offeringsRaw!M139=\"\",\"\",offeringsRaw!M139)","v":"JSB"},{"$f":"IF(offeringsRaw!Q139=\"\",\"\",offeringsRaw!Q139)","v":"Patterson, Kelly D"},"026 - Patterson, Kelly D"]
["",{"$f":"IF(offeringsRaw!B140=\"\",\"\",offeringsRaw!B140)","v":""},{"$f":"IF(offeringsRaw!C140=\"\",\"\",offeringsRaw!C140)","v":""},{"$f":"IF(offeringsRaw!D140=\"\",\"\",offeringsRaw!D140)","v":""},{"$f":"IF(offeringsRaw!E140=\"\",\"\",offeringsRaw!E140)","v":""},{"$f":"IF(offeringsRaw!F140=\"\",\"\",offeringsRaw!F140)","v":""},{"$f":"IF(offeringsRaw!G140=\"\",\"\",offeringsRaw!G140)","v":""},{"$f":"IF(offeringsRaw!I140=\"\",\"\",offeringsRaw!I140)","v":""},{"$f":"IF(offeringsRaw!J140=\"\",\"\",offeringsRaw!J140)","v":"2:00p - 2:50p"},{"$f":"IF(offeringsRaw!K140=\"\",\"\",offeringsRaw!K140)","v":"F"},{"$f":"IF(offeringsRaw!L140=\"\",\"\",offeringsRaw!L140)","v":103},{"$f":"IF(offeringsRaw!M140=\"\",\"\",offeringsRaw!M140)","v":"JSB"},{"$f":"IF(offeringsRaw!Q140=\"\",\"\",offeringsRaw!Q140)","v":""}," - "]
["",{"$f":"IF(offeringsRaw!B141=\"\",\"\",offeringsRaw!B141)","v":"-"},{"$f":"IF(offeringsRaw!C141=\"\",\"\",offeringsRaw!C141)","v":""},{"$f":"IF(offeringsRaw!D141=\"\",\"\",offeringsRaw!D141)","v":28},{"$f":"IF(offeringsRaw!E141=\"\",\"\",offeringsRaw!E141)","v":" "},{"$f":"IF(offeringsRaw!F141=\"\",\"\",offeringsRaw!F141)","v":0},{"$f":"IF(offeringsRaw!G141=\"\",\"\",offeringsRaw!G141)","v":30},{"$f":"IF(offeringsRaw!I141=\"\",\"\",offeringsRaw!I141)","v":3},{"$f":"IF(offeringsRaw!J141=\"\",\"\",offeringsRaw!J141)","v":"1:00p - 1:50p"},{"$f":"IF(offeringsRaw!K141=\"\",\"\",offeringsRaw!K141)","v":"MW"},{"$f":"IF(offeringsRaw!L141=\"\",\"\",offeringsRaw!L141)","v":140},{"$f":"IF(offeringsRaw!M141=\"\",\"\",offeringsRaw!M141)","v":"JSB"},{"$f":"IF(offeringsRaw!Q141=\"\",\"\",offeringsRaw!Q141)","v":"Patterson, Kelly D"},"028 - Patterson, Kelly D"]
["",{"$f":"IF(offeringsRaw!B142=\"\",\"\",offeringsRaw!B142)","v":""},{"$f":"IF(offeringsRaw!C142=\"\",\"\",offeringsRaw!C142)","v":""},{"$f":"IF(offeringsRaw!D142=\"\",\"\",offeringsRaw!D142)","v":""},{"$f":"IF(offeringsRaw!E142=\"\",\"\",offeringsRaw!E142)","v":""},{"$f":"IF(offeringsRaw!F142=\"\",\"\",offeringsRaw!F142)","v":""},{"$f":"IF(offeringsRaw!G142=\"\",\"\",offeringsRaw!G142)","v":""},{"$f":"IF(offeringsRaw!I142=\"\",\"\",offeringsRaw!I142)","v":""},{"$f":"IF(offeringsRaw!J142=\"\",\"\",offeringsRaw!J142)","v":"9:00a - 9:50a"},{"$f":"IF(offeringsRaw!K142=\"\",\"\",offeringsRaw!K142)","v":"F"},{"$f":"IF(offeringsRaw!L142=\"\",\"\",offeringsRaw!L142)","v":179},{"$f":"IF(offeringsRaw!M142=\"\",\"\",offeringsRaw!M142)","v":"JSB"},{"$f":"IF(offeringsRaw!Q142=\"\",\"\",offeringsRaw!Q142)","v":""}," - "]
["",{"$f":"IF(offeringsRaw!B143=\"\",\"\",offeringsRaw!B143)","v":"-"},{"$f":"IF(offeringsRaw!C143=\"\",\"\",offeringsRaw!C143)","v":""},{"$f":"IF(offeringsRaw!D143=\"\",\"\",offeringsRaw!D143)","v":30},{"$f":"IF(offeringsRaw!E143=\"\",\"\",offeringsRaw!E143)","v":" "},{"$f":"IF(offeringsRaw!F143=\"\",\"\",offeringsRaw!F143)","v":0},{"$f":"IF(offeringsRaw!G143=\"\",\"\",offeringsRaw!G143)","v":30},{"$f":"IF(offeringsRaw!I143=\"\",\"\",offeringsRaw!I143)","v":3},{"$f":"IF(offeringsRaw!J143=\"\",\"\",offeringsRaw!J143)","v":"1:00p - 1:50p"},{"$f":"IF(offeringsRaw!K143=\"\",\"\",offeringsRaw!K143)","v":"MW"},{"$f":"IF(offeringsRaw!L143=\"\",\"\",offeringsRaw!L143)","v":140},{"$f":"IF(offeringsRaw!M143=\"\",\"\",offeringsRaw!M143)","v":"JSB"},{"$f":"IF(offeringsRaw!Q143=\"\",\"\",offeringsRaw!Q143)","v":"Patterson, Kelly D"},"030 - Patterson, Kelly D"]
["",{"$f":"IF(offeringsRaw!B144=\"\",\"\",offeringsRaw!B144)","v":""},{"$f":"IF(offeringsRaw!C144=\"\",\"\",offeringsRaw!C144)","v":""},{"$f":"IF(offeringsRaw!D144=\"\",\"\",offeringsRaw!D144)","v":""},{"$f":"IF(offeringsRaw!E144=\"\",\"\",offeringsRaw!E144)","v":""},{"$f":"IF(offeringsRaw!F144=\"\",\"\",offeringsRaw!F144)","v":""},{"$f":"IF(offeringsRaw!G144=\"\",\"\",offeringsRaw!G144)","v":""},{"$f":"IF(offeringsRaw!I144=\"\",\"\",offeringsRaw!I144)","v":""},{"$f":"IF(offeringsRaw!J144=\"\",\"\",offeringsRaw!J144)","v":"12:00p - 12:50p"},{"$f":"IF(offeringsRaw!K144=\"\",\"\",offeringsRaw!K144)","v":"Th"},{"$f":"IF(offeringsRaw!L144=\"\",\"\",offeringsRaw!L144)","v":1004},{"$f":"IF(offeringsRaw!M144=\"\",\"\",offeringsRaw!M144)","v":"JKB"},{"$f":"IF(offeringsRaw!Q144=\"\",\"\",offeringsRaw!Q144)","v":""}," - "]
["",{"$f":"IF(offeringsRaw!B145=\"\",\"\",offeringsRaw!B145)","v":"-"},{"$f":"IF(offeringsRaw!C145=\"\",\"\",offeringsRaw!C145)","v":""},{"$f":"IF(offeringsRaw!D145=\"\",\"\",offeringsRaw!D145)","v":31},{"$f":"IF(offeringsRaw!E145=\"\",\"\",offeringsRaw!E145)","v":" "},{"$f":"IF(offeringsRaw!F145=\"\",\"\",offeringsRaw!F145)","v":0},{"$f":"IF(offeringsRaw!G145=\"\",\"\",offeringsRaw!G145)","v":30},{"$f":"IF(offeringsRaw!I145=\"\",\"\",offeringsRaw!I145)","v":3},{"$f":"IF(offeringsRaw!J145=\"\",\"\",offeringsRaw!J145)","v":"1:00p - 1:50p"},{"$f":"IF(offeringsRaw!K145=\"\",\"\",offeringsRaw!K145)","v":"MW"},{"$f":"IF(offeringsRaw!L145=\"\",\"\",offeringsRaw!L145)","v":140},{"$f":"IF(offeringsRaw!M145=\"\",\"\",offeringsRaw!M145)","v":"JSB"},{"$f":"IF(offeringsRaw!Q145=\"\",\"\",offeringsRaw!Q145)","v":"Patterson, Kelly D"},"031 - Patterson, Kelly D"]
["",{"$f":"IF(offeringsRaw!B146=\"\",\"\",offeringsRaw!B146)","v":""},{"$f":"IF(offeringsRaw!C146=\"\",\"\",offeringsRaw!C146)","v":""},{"$f":"IF(offeringsRaw!D146=\"\",\"\",offeringsRaw!D146)","v":""},{"$f":"IF(offeringsRaw!E146=\"\",\"\",offeringsRaw!E146)","v":""},{"$f":"IF(offeringsRaw!F146=\"\",\"\",offeringsRaw!F146)","v":""},{"$f":"IF(offeringsRaw!G146=\"\",\"\",offeringsRaw!G146)","v":""},{"$f":"IF(offeringsRaw!I146=\"\",\"\",offeringsRaw!I146)","v":""},{"$f":"IF(offeringsRaw!J146=\"\",\"\",offeringsRaw!J146)","v":"12:00p - 12:50p"},{"$f":"IF(offeringsRaw!K146=\"\",\"\",offeringsRaw!K146)","v":"Th"},{"$f":"IF(offeringsRaw!L146=\"\",\"\",offeringsRaw!L146)","v":1006},{"$f":"IF(offeringsRaw!M146=\"\",\"\",offeringsRaw!M146)","v":"JKB"},{"$f":"IF(offeringsRaw!Q146=\"\",\"\",offeringsRaw!Q146)","v":""}," - "]
["",{"$f":"IF(offeringsRaw!B147=\"\",\"\",offeringsRaw!B147)","v":"-"},{"$f":"IF(offeringsRaw!C147=\"\",\"\",offeringsRaw!C147)","v":""},{"$f":"IF(offeringsRaw!D147=\"\",\"\",offeringsRaw!D147)","v":32},{"$f":"IF(offeringsRaw!E147=\"\",\"\",offeringsRaw!E147)","v":" "},{"$f":"IF(offeringsRaw!F147=\"\",\"\",offeringsRaw!F147)","v":0},{"$f":"IF(offeringsRaw!G147=\"\",\"\",offeringsRaw!G147)","v":30},{"$f":"IF(offeringsRaw!I147=\"\",\"\",offeringsRaw!I147)","v":3},{"$f":"IF(offeringsRaw!J147=\"\",\"\",offeringsRaw!J147)","v":"1:00p - 1:50p"},{"$f":"IF(offeringsRaw!K147=\"\",\"\",offeringsRaw!K147)","v":"MW"},{"$f":"IF(offeringsRaw!L147=\"\",\"\",offeringsRaw!L147)","v":140},{"$f":"IF(offeringsRaw!M147=\"\",\"\",offeringsRaw!M147)","v":"JSB"},{"$f":"IF(offeringsRaw!Q147=\"\",\"\",offeringsRaw!Q147)","v":"Patterson, Kelly D"},"032 - Patterson, Kelly D"]
["",{"$f":"IF(offeringsRaw!B148=\"\",\"\",offeringsRaw!B148)","v":""},{"$f":"IF(offeringsRaw!C148=\"\",\"\",offeringsRaw!C148)","v":""},{"$f":"IF(offeringsRaw!D148=\"\",\"\",offeringsRaw!D148)","v":""},{"$f":"IF(offeringsRaw!E148=\"\",\"\",offeringsRaw!E148)","v":""},{"$f":"IF(offeringsRaw!F148=\"\",\"\",offeringsRaw!F148)","v":""},{"$f":"IF(offeringsRaw!G148=\"\",\"\",offeringsRaw!G148)","v":""},{"$f":"IF(offeringsRaw!I148=\"\",\"\",offeringsRaw!I148)","v":""},{"$f":"IF(offeringsRaw!J148=\"\",\"\",offeringsRaw!J148)","v":"1:00p - 1:50p"},{"$f":"IF(offeringsRaw!K148=\"\",\"\",offeringsRaw!K148)","v":"Th"},{"$f":"IF(offeringsRaw!L148=\"\",\"\",offeringsRaw!L148)","v":191},{"$f":"IF(offeringsRaw!M148=\"\",\"\",offeringsRaw!M148)","v":"SFH"},{"$f":"IF(offeringsRaw!Q148=\"\",\"\",offeringsRaw!Q148)","v":""}," - "]
["",{"$f":"IF(offeringsRaw!B149=\"\",\"\",offeringsRaw!B149)","v":"-"},{"$f":"IF(offeringsRaw!C149=\"\",\"\",offeringsRaw!C149)","v":""},{"$f":"IF(offeringsRaw!D149=\"\",\"\",offeringsRaw!D149)","v":34},{"$f":"IF(offeringsRaw!E149=\"\",\"\",offeringsRaw!E149)","v":" "},{"$f":"IF(offeringsRaw!F149=\"\",\"\",offeringsRaw!F149)","v":0},{"$f":"IF(offeringsRaw!G149=\"\",\"\",offeringsRaw!G149)","v":30},{"$f":"IF(offeringsRaw!I149=\"\",\"\",offeringsRaw!I149)","v":3},{"$f":"IF(offeringsRaw!J149=\"\",\"\",offeringsRaw!J149)","v":"1:00p - 1:50p"},{"$f":"IF(offeringsRaw!K149=\"\",\"\",offeringsRaw!K149)","v":"MW"},{"$f":"IF(offeringsRaw!L149=\"\",\"\",offeringsRaw!L149)","v":140},{"$f":"IF(offeringsRaw!M149=\"\",\"\",offeringsRaw!M149)","v":"JSB"},{"$f":"IF(offeringsRaw!Q149=\"\",\"\",offeringsRaw!Q149)","v":"Patterson, Kelly D"},"034 - Patterson, Kelly D"]
["",{"$f":"IF(offeringsRaw!B150=\"\",\"\",offeringsRaw!B150)","v":""},{"$f":"IF(offeringsRaw!C150=\"\",\"\",offeringsRaw!C150)","v":""},{"$f":"IF(offeringsRaw!D150=\"\",\"\",offeringsRaw!D150)","v":""},{"$f":"IF(offeringsRaw!E150=\"\",\"\",offeringsRaw!E150)","v":""},{"$f":"IF(offeringsRaw!F150=\"\",\"\",offeringsRaw!F150)","v":""},{"$f":"IF(offeringsRaw!G150=\"\",\"\",offeringsRaw!G150)","v":""},{"$f":"IF(offeringsRaw!I150=\"\",\"\",offeringsRaw!I150)","v":""},{"$f":"IF(offeringsRaw!J150=\"\",\"\",offeringsRaw!J150)","v":"3:00p - 3:50p"},{"$f":"IF(offeringsRaw!K150=\"\",\"\",offeringsRaw!K150)","v":"Th"},{"$f":"IF(offeringsRaw!L150=\"\",\"\",offeringsRaw!L150)","v":361},{"$f":"IF(offeringsRaw!M150=\"\",\"\",offeringsRaw!M150)","v":"MARB"},{"$f":"IF(offeringsRaw!Q150=\"\",\"\",offeringsRaw!Q150)","v":""}," - "]
["",{"$f":"IF(offeringsRaw!B151=\"\",\"\",offeringsRaw!B151)","v":"-"},{"$f":"IF(offeringsRaw!C151=\"\",\"\",offeringsRaw!C151)","v":""},{"$f":"IF(offeringsRaw!D151=\"\",\"\",offeringsRaw!D151)","v":35},{"$f":"IF(offeringsRaw!E151=\"\",\"\",offeringsRaw!E151)","v":" "},{"$f":"IF(offeringsRaw!F151=\"\",\"\",offeringsRaw!F151)","v":0},{"$f":"IF(offeringsRaw!G151=\"\",\"\",offeringsRaw!G151)","v":30},{"$f":"IF(offeringsRaw!I151=\"\",\"\",offeringsRaw!I151)","v":3},{"$f":"IF(offeringsRaw!J151=\"\",\"\",offeringsRaw!J151)","v":"1:00p - 1:50p"},{"$f":"IF(offeringsRaw!K151=\"\",\"\",offeringsRaw!K151)","v":"MW"},{"$f":"IF(offeringsRaw!L151=\"\",\"\",offeringsRaw!L151)","v":140},{"$f":"IF(offeringsRaw!M151=\"\",\"\",offeringsRaw!M151)","v":"JSB"},{"$f":"IF(offeringsRaw!Q151=\"\",\"\",offeringsRaw!Q151)","v":"Patterson, Kelly D"},"035 - Patterson, Kelly D"]
["",{"$f":"IF(offeringsRaw!B152=\"\",\"\",offeringsRaw!B152)","v":""},{"$f":"IF(offeringsRaw!C152=\"\",\"\",offeringsRaw!C152)","v":""},{"$f":"IF(offeringsRaw!D152=\"\",\"\",offeringsRaw!D152)","v":""},{"$f":"IF(offeringsRaw!E152=\"\",\"\",offeringsRaw!E152)","v":""},{"$f":"IF(offeringsRaw!F152=\"\",\"\",offeringsRaw!F152)","v":""},{"$f":"IF(offeringsRaw!G152=\"\",\"\",offeringsRaw!G152)","v":""},{"$f":"IF(offeringsRaw!I152=\"\",\"\",offeringsRaw!I152)","v":""},{"$f":"IF(offeringsRaw!J152=\"\",\"\",offeringsRaw!J152)","v":"8:00a - 8:50a"},{"$f":"IF(offeringsRaw!K152=\"\",\"\",offeringsRaw!K152)","v":"F"},{"$f":"IF(offeringsRaw!L152=\"\",\"\",offeringsRaw!L152)","v":114},{"$f":"IF(offeringsRaw!M152=\"\",\"\",offeringsRaw!M152)","v":"JSB"},{"$f":"IF(offeringsRaw!Q152=\"\",\"\",offeringsRaw!Q152)","v":""}," - "]
["",{"$f":"IF(offeringsRaw!B153=\"\",\"\",offeringsRaw!B153)","v":"-"},{"$f":"IF(offeringsRaw!C153=\"\",\"\",offeringsRaw!C153)","v":""},{"$f":"IF(offeringsRaw!D153=\"\",\"\",offeringsRaw!D153)","v":40},{"$f":"IF(offeringsRaw!E153=\"\",\"\",offeringsRaw!E153)","v":" "},{"$f":"IF(offeringsRaw!F153=\"\",\"\",offeringsRaw!F153)","v":0},{"$f":"IF(offeringsRaw!G153=\"\",\"\",offeringsRaw!G153)","v":30},{"$f":"IF(offeringsRaw!I153=\"\",\"\",offeringsRaw!I153)","v":3},{"$f":"IF(offeringsRaw!J153=\"\",\"\",offeringsRaw!J153)","v":"1:00p - 1:50p"},{"$f":"IF(offeringsRaw!K153=\"\",\"\",offeringsRaw!K153)","v":"MW"},{"$f":"IF(offeringsRaw!L153=\"\",\"\",offeringsRaw!L153)","v":140},{"$f":"IF(offeringsRaw!M153=\"\",\"\",offeringsRaw!M153)","v":"JSB"},{"$f":"IF(offeringsRaw!Q153=\"\",\"\",offeringsRaw!Q153)","v":"Patterson, Kelly D"},"040 - Patterson, Kelly D"]
["",{"$f":"IF(offeringsRaw!B154=\"\",\"\",offeringsRaw!B154)","v":""},{"$f":"IF(offeringsRaw!C154=\"\",\"\",offeringsRaw!C154)","v":""},{"$f":"IF(offeringsRaw!D154=\"\",\"\",offeringsRaw!D154)","v":""},{"$f":"IF(offeringsRaw!E154=\"\",\"\",offeringsRaw!E154)","v":""},{"$f":"IF(offeringsRaw!F154=\"\",\"\",offeringsRaw!F154)","v":""},{"$f":"IF(offeringsRaw!G154=\"\",\"\",offeringsRaw!G154)","v":""},{"$f":"IF(offeringsRaw!I154=\"\",\"\",offeringsRaw!I154)","v":""},{"$f":"IF(offeringsRaw!J154=\"\",\"\",offeringsRaw!J154)","v":"1:00p - 1:50p"},{"$f":"IF(offeringsRaw!K154=\"\",\"\",offeringsRaw!K154)","v":"F"},{"$f":"IF(offeringsRaw!L154=\"\",\"\",offeringsRaw!L154)","v":106},{"$f":"IF(offeringsRaw!M154=\"\",\"\",offeringsRaw!M154)","v":"JSB"},{"$f":"IF(offeringsRaw!Q154=\"\",\"\",offeringsRaw!Q154)","v":""}," - "]
["",{"$f":"IF(offeringsRaw!B155=\"\",\"\",offeringsRaw!B155)","v":"-"},{"$f":"IF(offeringsRaw!C155=\"\",\"\",offeringsRaw!C155)","v":""},{"$f":"IF(offeringsRaw!D155=\"\",\"\",offeringsRaw!D155)","v":41},{"$f":"IF(offeringsRaw!E155=\"\",\"\",offeringsRaw!E155)","v":" "},{"$f":"IF(offeringsRaw!F155=\"\",\"\",offeringsRaw!F155)","v":0},{"$f":"IF(offeringsRaw!G155=\"\",\"\",offeringsRaw!G155)","v":30},{"$f":"IF(offeringsRaw!I155=\"\",\"\",offeringsRaw!I155)","v":3},{"$f":"IF(offeringsRaw!J155=\"\",\"\",offeringsRaw!J155)","v":"1:00p - 1:50p"},{"$f":"IF(offeringsRaw!K155=\"\",\"\",offeringsRaw!K155)","v":"MW"},{"$f":"IF(offeringsRaw!L155=\"\",\"\",offeringsRaw!L155)","v":140},{"$f":"IF(offeringsRaw!M155=\"\",\"\",offeringsRaw!M155)","v":"JSB"},{"$f":"IF(offeringsRaw!Q155=\"\",\"\",offeringsRaw!Q155)","v":"Patterson, Kelly D"},"041 - Patterson, Kelly D"]
["",{"$f":"IF(offeringsRaw!B156=\"\",\"\",offeringsRaw!B156)","v":""},{"$f":"IF(offeringsRaw!C156=\"\",\"\",offeringsRaw!C156)","v":""},{"$f":"IF(offeringsRaw!D156=\"\",\"\",offeringsRaw!D156)","v":""},{"$f":"IF(offeringsRaw!E156=\"\",\"\",offeringsRaw!E156)","v":""},{"$f":"IF(offeringsRaw!F156=\"\",\"\",offeringsRaw!F156)","v":""},{"$f":"IF(offeringsRaw!G156=\"\",\"\",offeringsRaw!G156)","v":""},{"$f":"IF(offeringsRaw!I156=\"\",\"\",offeringsRaw!I156)","v":""},{"$f":"IF(offeringsRaw!J156=\"\",\"\",offeringsRaw!J156)","v":"2:00p - 2:50p"},{"$f":"IF(offeringsRaw!K156=\"\",\"\",offeringsRaw!K156)","v":"F"},{"$f":"IF(offeringsRaw!L156=\"\",\"\",offeringsRaw!L156)","v":174},{"$f":"IF(offeringsRaw!M156=\"\",\"\",offeringsRaw!M156)","v":"JSB"},{"$f":"IF(offeringsRaw!Q156=\"\",\"\",offeringsRaw!Q156)","v":""}," - "]
["",{"$f":"IF(offeringsRaw!B157=\"\",\"\",offeringsRaw!B157)","v":"-"},{"$f":"IF(offeringsRaw!C157=\"\",\"\",offeringsRaw!C157)","v":""},{"$f":"IF(offeringsRaw!D157=\"\",\"\",offeringsRaw!D157)","v":43},{"$f":"IF(offeringsRaw!E157=\"\",\"\",offeringsRaw!E157)","v":" "},{"$f":"IF(offeringsRaw!F157=\"\",\"\",offeringsRaw!F157)","v":0},{"$f":"IF(offeringsRaw!G157=\"\",\"\",offeringsRaw!G157)","v":30},{"$f":"IF(offeringsRaw!I157=\"\",\"\",offeringsRaw!I157)","v":3},{"$f":"IF(offeringsRaw!J157=\"\",\"\",offeringsRaw!J157)","v":"1:00p - 1:50p"},{"$f":"IF(offeringsRaw!K157=\"\",\"\",offeringsRaw!K157)","v":"MW"},{"$f":"IF(offeringsRaw!L157=\"\",\"\",offeringsRaw!L157)","v":140},{"$f":"IF(offeringsRaw!M157=\"\",\"\",offeringsRaw!M157)","v":"JSB"},{"$f":"IF(offeringsRaw!Q157=\"\",\"\",offeringsRaw!Q157)","v":"Patterson, Kelly D"},"043 - Patterson, Kelly D"]
["",{"$f":"IF(offeringsRaw!B158=\"\",\"\",offeringsRaw!B158)","v":""},{"$f":"IF(offeringsRaw!C158=\"\",\"\",offeringsRaw!C158)","v":""},{"$f":"IF(offeringsRaw!D158=\"\",\"\",offeringsRaw!D158)","v":""},{"$f":"IF(offeringsRaw!E158=\"\",\"\",offeringsRaw!E158)","v":""},{"$f":"IF(offeringsRaw!F158=\"\",\"\",offeringsRaw!F158)","v":""},{"$f":"IF(offeringsRaw!G158=\"\",\"\",offeringsRaw!G158)","v":""},{"$f":"IF(offeringsRaw!I158=\"\",\"\",offeringsRaw!I158)","v":""},{"$f":"IF(offeringsRaw!J158=\"\",\"\",offeringsRaw!J158)","v":"1:00p - 1:50p"},{"$f":"IF(offeringsRaw!K158=\"\",\"\",offeringsRaw!K158)","v":"F"},{"$f":"IF(offeringsRaw!L158=\"\",\"\",offeringsRaw!L158)","v":107},{"$f":"IF(offeringsRaw!M158=\"\",\"\",offeringsRaw!M158)","v":"JSB"},{"$f":"IF(offeringsRaw!Q158=\"\",\"\",offeringsRaw!Q158)","v":""}," - "]
["",{"$f":"IF(offeringsRaw!B159=\"\",\"\",offeringsRaw!B159)","v":"-"},{"$f":"IF(offeringsRaw!C159=\"\",\"\",offeringsRaw!C159)","v":""},{"$f":"IF(offeringsRaw!D159=\"\",\"\",offeringsRaw!D159)","v":44},{"$f":"IF(offeringsRaw!E159=\"\",\"\",offeringsRaw!E159)","v":" "},{"$f":"IF(offeringsRaw!F159=\"\",\"\",offeringsRaw!F159)","v":0},{"$f":"IF(offeringsRaw!G159=\"\",\"\",offeringsRaw!G159)","v":30},{"$f":"IF(offeringsRaw!I159=\"\",\"\",offeringsRaw!I159)","v":3},{"$f":"IF(offeringsRaw!J159=\"\",\"\",offeringsRaw!J159)","v":"1:00p - 1:50p"},{"$f":"IF(offeringsRaw!K159=\"\",\"\",offeringsRaw!K159)","v":"MW"},{"$f":"IF(offeringsRaw!L159=\"\",\"\",offeringsRaw!L159)","v":140},{"$f":"IF(offeringsRaw!M159=\"\",\"\",offeringsRaw!M159)","v":"JSB"},{"$f":"IF(offeringsRaw!Q159=\"\",\"\",offeringsRaw!Q159)","v":"Patterson, Kelly D"},"044 - Patterson, Kelly D"]
["",{"$f":"IF(offeringsRaw!B160=\"\",\"\",offeringsRaw!B160)","v":""},{"$f":"IF(offeringsRaw!C160=\"\",\"\",offeringsRaw!C160)","v":""},{"$f":"IF(offeringsRaw!D160=\"\",\"\",offeringsRaw!D160)","v":""},{"$f":"IF(offeringsRaw!E160=\"\",\"\",offeringsRaw!E160)","v":""},{"$f":"IF(offeringsRaw!F160=\"\",\"\",offeringsRaw!F160)","v":""},{"$f":"IF(offeringsRaw!G160=\"\",\"\",offeringsRaw!G160)","v":""},{"$f":"IF(offeringsRaw!I160=\"\",\"\",offeringsRaw!I160)","v":""},{"$f":"IF(offeringsRaw!J160=\"\",\"\",offeringsRaw!J160)","v":"12:00p - 12:50p"},{"$f":"IF(offeringsRaw!K160=\"\",\"\",offeringsRaw!K160)","v":"Th"},{"$f":"IF(offeringsRaw!L160=\"\",\"\",offeringsRaw!L160)","v":170},{"$f":"IF(offeringsRaw!M160=\"\",\"\",offeringsRaw!M160)","v":"JSB"},{"$f":"IF(offeringsRaw!Q160=\"\",\"\",offeringsRaw!Q160)","v":""}," - "]
["",{"$f":"IF(offeringsRaw!B161=\"\",\"\",offeringsRaw!B161)","v":"-"},{"$f":"IF(offeringsRaw!C161=\"\",\"\",offeringsRaw!C161)","v":""},{"$f":"IF(offeringsRaw!D161=\"\",\"\",offeringsRaw!D161)","v":46},{"$f":"IF(offeringsRaw!E161=\"\",\"\",offeringsRaw!E161)","v":" "},{"$f":"IF(offeringsRaw!F161=\"\",\"\",offeringsRaw!F161)","v":0},{"$f":"IF(offeringsRaw!G161=\"\",\"\",offeringsRaw!G161)","v":30},{"$f":"IF(offeringsRaw!I161=\"\",\"\",offeringsRaw!I161)","v":3},{"$f":"IF(offeringsRaw!J161=\"\",\"\",offeringsRaw!J161)","v":"1:00p - 1:50p"},{"$f":"IF(offeringsRaw!K161=\"\",\"\",offeringsRaw!K161)","v":"MW"},{"$f":"IF(offeringsRaw!L161=\"\",\"\",offeringsRaw!L161)","v":140},{"$f":"IF(offeringsRaw!M161=\"\",\"\",offeringsRaw!M161)","v":"JSB"},{"$f":"IF(offeringsRaw!Q161=\"\",\"\",offeringsRaw!Q161)","v":"Patterson, Kelly D"},"046 - Patterson, Kelly D"]
["",{"$f":"IF(offeringsRaw!B162=\"\",\"\",offeringsRaw!B162)","v":""},{"$f":"IF(offeringsRaw!C162=\"\",\"\",offeringsRaw!C162)","v":""},{"$f":"IF(offeringsRaw!D162=\"\",\"\",offeringsRaw!D162)","v":""},{"$f":"IF(offeringsRaw!E162=\"\",\"\",offeringsRaw!E162)","v":""},{"$f":"IF(offeringsRaw!F162=\"\",\"\",offeringsRaw!F162)","v":""},{"$f":"IF(offeringsRaw!G162=\"\",\"\",offeringsRaw!G162)","v":""},{"$f":"IF(offeringsRaw!I162=\"\",\"\",offeringsRaw!I162)","v":""},{"$f":"IF(offeringsRaw!J162=\"\",\"\",offeringsRaw!J162)","v":"2:00p - 2:50p"},{"$f":"IF(offeringsRaw!K162=\"\",\"\",offeringsRaw!K162)","v":"F"},{"$f":"IF(offeringsRaw!L162=\"\",\"\",offeringsRaw!L162)","v":175},{"$f":"IF(offeringsRaw!M162=\"\",\"\",offeringsRaw!M162)","v":"JSB"},{"$f":"IF(offeringsRaw!Q162=\"\",\"\",offeringsRaw!Q162)","v":""}," - "]
["",{"$f":"IF(offeringsRaw!B163=\"\",\"\",offeringsRaw!B163)","v":"<A href=\"javascript:addRainCheck('A HTG','100',' ','052'); \">R</A>"},{"$f":"IF(offeringsRaw!C163=\"\",\"\",offeringsRaw!C163)","v":"<A href=\"javascript:viewLims('This class can only be added by approved rainchecks.^This class is a(n) INTERNATIONAL section.^'); \">Y</A>"},{"$f":"IF(offeringsRaw!D163=\"\",\"\",offeringsRaw!D163)","v":52},{"$f":"IF(offeringsRaw!E163=\"\",\"\",offeringsRaw!E163)","v":" "},{"$f":"IF(offeringsRaw!F163=\"\",\"\",offeringsRaw!F163)","v":0},{"$f":"IF(offeringsRaw!G163=\"\",\"\",offeringsRaw!G163)","v":30},{"$f":"IF(offeringsRaw!I163=\"\",\"\",offeringsRaw!I163)","v":3},{"$f":"IF(offeringsRaw!J163=\"\",\"\",offeringsRaw!J163)","v":"1:00p - 1:50p"},{"$f":"IF(offeringsRaw!K163=\"\",\"\",offeringsRaw!K163)","v":"MW"},{"$f":"IF(offeringsRaw!L163=\"\",\"\",offeringsRaw!L163)","v":140},{"$f":"IF(offeringsRaw!M163=\"\",\"\",offeringsRaw!M163)","v":"JSB"},{"$f":"IF(offeringsRaw!Q163=\"\",\"\",offeringsRaw!Q163)","v":"Patterson, Kelly D"},"052 - Patterson, Kelly D"]
["",{"$f":"IF(offeringsRaw!B164=\"\",\"\",offeringsRaw!B164)","v":""},{"$f":"IF(offeringsRaw!C164=\"\",\"\",offeringsRaw!C164)","v":""},{"$f":"IF(offeringsRaw!D164=\"\",\"\",offeringsRaw!D164)","v":""},{"$f":"IF(offeringsRaw!E164=\"\",\"\",offeringsRaw!E164)","v":""},{"$f":"IF(offeringsRaw!F164=\"\",\"\",offeringsRaw!F164)","v":""},{"$f":"IF(offeringsRaw!G164=\"\",\"\",offeringsRaw!G164)","v":""},{"$f":"IF(offeringsRaw!I164=\"\",\"\",offeringsRaw!I164)","v":""},{"$f":"IF(offeringsRaw!J164=\"\",\"\",offeringsRaw!J164)","v":"1:00p - 1:50p"},{"$f":"IF(offeringsRaw!K164=\"\",\"\",offeringsRaw!K164)","v":"F"},{"$f":"IF(offeringsRaw!L164=\"\",\"\",offeringsRaw!L164)","v":110},{"$f":"IF(offeringsRaw!M164=\"\",\"\",offeringsRaw!M164)","v":"JSB"},{"$f":"IF(offeringsRaw!Q164=\"\",\"\",offeringsRaw!Q164)","v":""}," - "]
["",{"$f":"IF(offeringsRaw!B165=\"\",\"\",offeringsRaw!B165)","v":"-"},{"$f":"IF(offeringsRaw!C165=\"\",\"\",offeringsRaw!C165)","v":""},{"$f":"IF(offeringsRaw!D165=\"\",\"\",offeringsRaw!D165)","v":56},{"$f":"IF(offeringsRaw!E165=\"\",\"\",offeringsRaw!E165)","v":" "},{"$f":"IF(offeringsRaw!F165=\"\",\"\",offeringsRaw!F165)","v":0},{"$f":"IF(offeringsRaw!G165=\"\",\"\",offeringsRaw!G165)","v":30},{"$f":"IF(offeringsRaw!I165=\"\",\"\",offeringsRaw!I165)","v":3},{"$f":"IF(offeringsRaw!J165=\"\",\"\",offeringsRaw!J165)","v":"1:00p - 1:50p"},{"$f":"IF(offeringsRaw!K165=\"\",\"\",offeringsRaw!K165)","v":"MW"},{"$f":"IF(offeringsRaw!L165=\"\",\"\",offeringsRaw!L165)","v":140},{"$f":"IF(offeringsRaw!M165=\"\",\"\",offeringsRaw!M165)","v":"JSB"},{"$f":"IF(offeringsRaw!Q165=\"\",\"\",offeringsRaw!Q165)","v":"Patterson, Kelly D"},"056 - Patterson, Kelly D"]
["",{"$f":"IF(offeringsRaw!B166=\"\",\"\",offeringsRaw!B166)","v":""},{"$f":"IF(offeringsRaw!C166=\"\",\"\",offeringsRaw!C166)","v":""},{"$f":"IF(offeringsRaw!D166=\"\",\"\",offeringsRaw!D166)","v":""},{"$f":"IF(offeringsRaw!E166=\"\",\"\",offeringsRaw!E166)","v":""},{"$f":"IF(offeringsRaw!F166=\"\",\"\",offeringsRaw!F166)","v":""},{"$f":"IF(offeringsRaw!G166=\"\",\"\",offeringsRaw!G166)","v":""},{"$f":"IF(offeringsRaw!I166=\"\",\"\",offeringsRaw!I166)","v":""},{"$f":"IF(offeringsRaw!J166=\"\",\"\",offeringsRaw!J166)","v":"2:00p - 2:50p"},{"$f":"IF(offeringsRaw!K166=\"\",\"\",offeringsRaw!K166)","v":"Th"},{"$f":"IF(offeringsRaw!L166=\"\",\"\",offeringsRaw!L166)","v":160},{"$f":"IF(offeringsRaw!M166=\"\",\"\",offeringsRaw!M166)","v":"MCKB"},{"$f":"IF(offeringsRaw!Q166=\"\",\"\",offeringsRaw!Q166)","v":""}," - "]
["",{"$f":"IF(offeringsRaw!B167=\"\",\"\",offeringsRaw!B167)","v":"-"},{"$f":"IF(offeringsRaw!C167=\"\",\"\",offeringsRaw!C167)","v":""},{"$f":"IF(offeringsRaw!D167=\"\",\"\",offeringsRaw!D167)","v":61},{"$f":"IF(offeringsRaw!E167=\"\",\"\",offeringsRaw!E167)","v":" "},{"$f":"IF(offeringsRaw!F167=\"\",\"\",offeringsRaw!F167)","v":0},{"$f":"IF(offeringsRaw!G167=\"\",\"\",offeringsRaw!G167)","v":30},{"$f":"IF(offeringsRaw!I167=\"\",\"\",offeringsRaw!I167)","v":3},{"$f":"IF(offeringsRaw!J167=\"\",\"\",offeringsRaw!J167)","v":"1:00p - 1:50p"},{"$f":"IF(offeringsRaw!K167=\"\",\"\",offeringsRaw!K167)","v":"MW"},{"$f":"IF(offeringsRaw!L167=\"\",\"\",offeringsRaw!L167)","v":140},{"$f":"IF(offeringsRaw!M167=\"\",\"\",offeringsRaw!M167)","v":"JSB"},{"$f":"IF(offeringsRaw!Q167=\"\",\"\",offeringsRaw!Q167)","v":"Patterson, Kelly D"},"061 - Patterson, Kelly D"]
["",{"$f":"IF(offeringsRaw!B168=\"\",\"\",offeringsRaw!B168)","v":""},{"$f":"IF(offeringsRaw!C168=\"\",\"\",offeringsRaw!C168)","v":""},{"$f":"IF(offeringsRaw!D168=\"\",\"\",offeringsRaw!D168)","v":""},{"$f":"IF(offeringsRaw!E168=\"\",\"\",offeringsRaw!E168)","v":""},{"$f":"IF(offeringsRaw!F168=\"\",\"\",offeringsRaw!F168)","v":""},{"$f":"IF(offeringsRaw!G168=\"\",\"\",offeringsRaw!G168)","v":""},{"$f":"IF(offeringsRaw!I168=\"\",\"\",offeringsRaw!I168)","v":""},{"$f":"IF(offeringsRaw!J168=\"\",\"\",offeringsRaw!J168)","v":"2:00p - 2:50p"},{"$f":"IF(offeringsRaw!K168=\"\",\"\",offeringsRaw!K168)","v":"Th"},{"$f":"IF(offeringsRaw!L168=\"\",\"\",offeringsRaw!L168)","v":341},{"$f":"IF(offeringsRaw!M168=\"\",\"\",offeringsRaw!M168)","v":"MCKB"},{"$f":"IF(offeringsRaw!Q168=\"\",\"\",offeringsRaw!Q168)","v":""}," - "]
["",{"$f":"IF(offeringsRaw!B169=\"\",\"\",offeringsRaw!B169)","v":"-"},{"$f":"IF(offeringsRaw!C169=\"\",\"\",offeringsRaw!C169)","v":""},{"$f":"IF(offeringsRaw!D169=\"\",\"\",offeringsRaw!D169)","v":63},{"$f":"IF(offeringsRaw!E169=\"\",\"\",offeringsRaw!E169)","v":" "},{"$f":"IF(offeringsRaw!F169=\"\",\"\",offeringsRaw!F169)","v":0},{"$f":"IF(offeringsRaw!G169=\"\",\"\",offeringsRaw!G169)","v":30},{"$f":"IF(offeringsRaw!I169=\"\",\"\",offeringsRaw!I169)","v":3},{"$f":"IF(offeringsRaw!J169=\"\",\"\",offeringsRaw!J169)","v":"1:00p - 1:50p"},{"$f":"IF(offeringsRaw!K169=\"\",\"\",offeringsRaw!K169)","v":"MW"},{"$f":"IF(offeringsRaw!L169=\"\",\"\",offeringsRaw!L169)","v":140},{"$f":"IF(offeringsRaw!M169=\"\",\"\",offeringsRaw!M169)","v":"JSB"},{"$f":"IF(offeringsRaw!Q169=\"\",\"\",offeringsRaw!Q169)","v":"Patterson, Kelly D"},"063 - Patterson, Kelly D"]
["",{"$f":"IF(offeringsRaw!B170=\"\",\"\",offeringsRaw!B170)","v":""},{"$f":"IF(offeringsRaw!C170=\"\",\"\",offeringsRaw!C170)","v":""},{"$f":"IF(offeringsRaw!D170=\"\",\"\",offeringsRaw!D170)","v":""},{"$f":"IF(offeringsRaw!E170=\"\",\"\",offeringsRaw!E170)","v":""},{"$f":"IF(offeringsRaw!F170=\"\",\"\",offeringsRaw!F170)","v":""},{"$f":"IF(offeringsRaw!G170=\"\",\"\",offeringsRaw!G170)","v":""},{"$f":"IF(offeringsRaw!I170=\"\",\"\",offeringsRaw!I170)","v":""},{"$f":"IF(offeringsRaw!J170=\"\",\"\",offeringsRaw!J170)","v":"12:00p - 12:50p"},{"$f":"IF(offeringsRaw!K170=\"\",\"\",offeringsRaw!K170)","v":"Th"},{"$f":"IF(offeringsRaw!L170=\"\",\"\",offeringsRaw!L170)","v":1012},{"$f":"IF(offeringsRaw!M170=\"\",\"\",offeringsRaw!M170)","v":"JKB"},{"$f":"IF(offeringsRaw!Q170=\"\",\"\",offeringsRaw!Q170)","v":""}," - "]
["",{"$f":"IF(offeringsRaw!B171=\"\",\"\",offeringsRaw!B171)","v":"-"},{"$f":"IF(offeringsRaw!C171=\"\",\"\",offeringsRaw!C171)","v":""},{"$f":"IF(offeringsRaw!D171=\"\",\"\",offeringsRaw!D171)","v":65},{"$f":"IF(offeringsRaw!E171=\"\",\"\",offeringsRaw!E171)","v":" "},{"$f":"IF(offeringsRaw!F171=\"\",\"\",offeringsRaw!F171)","v":0},{"$f":"IF(offeringsRaw!G171=\"\",\"\",offeringsRaw!G171)","v":30},{"$f":"IF(offeringsRaw!I171=\"\",\"\",offeringsRaw!I171)","v":3},{"$f":"IF(offeringsRaw!J171=\"\",\"\",offeringsRaw!J171)","v":"1:00p - 1:50p"},{"$f":"IF(offeringsRaw!K171=\"\",\"\",offeringsRaw!K171)","v":"MW"},{"$f":"IF(offeringsRaw!L171=\"\",\"\",offeringsRaw!L171)","v":140},{"$f":"IF(offeringsRaw!M171=\"\",\"\",offeringsRaw!M171)","v":"JSB"},{"$f":"IF(offeringsRaw!Q171=\"\",\"\",offeringsRaw!Q171)","v":"Patterson, Kelly D"},"065 - Patterson, Kelly D"]
["",{"$f":"IF(offeringsRaw!B172=\"\",\"\",offeringsRaw!B172)","v":""},{"$f":"IF(offeringsRaw!C172=\"\",\"\",offeringsRaw!C172)","v":""},{"$f":"IF(offeringsRaw!D172=\"\",\"\",offeringsRaw!D172)","v":""},{"$f":"IF(offeringsRaw!E172=\"\",\"\",offeringsRaw!E172)","v":""},{"$f":"IF(offeringsRaw!F172=\"\",\"\",offeringsRaw!F172)","v":""},{"$f":"IF(offeringsRaw!G172=\"\",\"\",offeringsRaw!G172)","v":""},{"$f":"IF(offeringsRaw!I172=\"\",\"\",offeringsRaw!I172)","v":""},{"$f":"IF(offeringsRaw!J172=\"\",\"\",offeringsRaw!J172)","v":"1:00p - 1:50p"},{"$f":"IF(offeringsRaw!K172=\"\",\"\",offeringsRaw!K172)","v":"F"},{"$f":"IF(offeringsRaw!L172=\"\",\"\",offeringsRaw!L172)","v":171},{"$f":"IF(offeringsRaw!M172=\"\",\"\",offeringsRaw!M172)","v":"JSB"},{"$f":"IF(offeringsRaw!Q172=\"\",\"\",offeringsRaw!Q172)","v":""}," - "]
["",{"$f":"IF(offeringsRaw!B173=\"\",\"\",offeringsRaw!B173)","v":"-"},{"$f":"IF(offeringsRaw!C173=\"\",\"\",offeringsRaw!C173)","v":""},{"$f":"IF(offeringsRaw!D173=\"\",\"\",offeringsRaw!D173)","v":67},{"$f":"IF(offeringsRaw!E173=\"\",\"\",offeringsRaw!E173)","v":" "},{"$f":"IF(offeringsRaw!F173=\"\",\"\",offeringsRaw!F173)","v":0},{"$f":"IF(offeringsRaw!G173=\"\",\"\",offeringsRaw!G173)","v":30},{"$f":"IF(offeringsRaw!I173=\"\",\"\",offeringsRaw!I173)","v":3},{"$f":"IF(offeringsRaw!J173=\"\",\"\",offeringsRaw!J173)","v":"1:00p - 1:50p"},{"$f":"IF(offeringsRaw!K173=\"\",\"\",offeringsRaw!K173)","v":"MW"},{"$f":"IF(offeringsRaw!L173=\"\",\"\",offeringsRaw!L173)","v":140},{"$f":"IF(offeringsRaw!M173=\"\",\"\",offeringsRaw!M173)","v":"JSB"},{"$f":"IF(offeringsRaw!Q173=\"\",\"\",offeringsRaw!Q173)","v":"Patterson, Kelly D"},"067 - Patterson, Kelly D"]
["",{"$f":"IF(offeringsRaw!B174=\"\",\"\",offeringsRaw!B174)","v":""},{"$f":"IF(offeringsRaw!C174=\"\",\"\",offeringsRaw!C174)","v":""},{"$f":"IF(offeringsRaw!D174=\"\",\"\",offeringsRaw!D174)","v":""},{"$f":"IF(offeringsRaw!E174=\"\",\"\",offeringsRaw!E174)","v":""},{"$f":"IF(offeringsRaw!F174=\"\",\"\",offeringsRaw!F174)","v":""},{"$f":"IF(offeringsRaw!G174=\"\",\"\",offeringsRaw!G174)","v":""},{"$f":"IF(offeringsRaw!I174=\"\",\"\",offeringsRaw!I174)","v":""},{"$f":"IF(offeringsRaw!J174=\"\",\"\",offeringsRaw!J174)","v":"1:00p - 1:50p"},{"$f":"IF(offeringsRaw!K174=\"\",\"\",offeringsRaw!K174)","v":"F"},{"$f":"IF(offeringsRaw!L174=\"\",\"\",offeringsRaw!L174)","v":174},{"$f":"IF(offeringsRaw!M174=\"\",\"\",offeringsRaw!M174)","v":"JSB"},{"$f":"IF(offeringsRaw!Q174=\"\",\"\",offeringsRaw!Q174)","v":""}," - "]
["",{"$f":"IF(offeringsRaw!B175=\"\",\"\",offeringsRaw!B175)","v":"-"},{"$f":"IF(offeringsRaw!C175=\"\",\"\",offeringsRaw!C175)","v":""},{"$f":"IF(offeringsRaw!D175=\"\",\"\",offeringsRaw!D175)","v":68},{"$f":"IF(offeringsRaw!E175=\"\",\"\",offeringsRaw!E175)","v":" "},{"$f":"IF(offeringsRaw!F175=\"\",\"\",offeringsRaw!F175)","v":0},{"$f":"IF(offeringsRaw!G175=\"\",\"\",offeringsRaw!G175)","v":30},{"$f":"IF(offeringsRaw!I175=\"\",\"\",offeringsRaw!I175)","v":3},{"$f":"IF(offeringsRaw!J175=\"\",\"\",offeringsRaw!J175)","v":"1:00p - 1:50p"},{"$f":"IF(offeringsRaw!K175=\"\",\"\",offeringsRaw!K175)","v":"MW"},{"$f":"IF(offeringsRaw!L175=\"\",\"\",offeringsRaw!L175)","v":140},{"$f":"IF(offeringsRaw!M175=\"\",\"\",offeringsRaw!M175)","v":"JSB"},{"$f":"IF(offeringsRaw!Q175=\"\",\"\",offeringsRaw!Q175)","v":"Patterson, Kelly D"},"068 - Patterson, Kelly D"]
["",{"$f":"IF(offeringsRaw!B176=\"\",\"\",offeringsRaw!B176)","v":""},{"$f":"IF(offeringsRaw!C176=\"\",\"\",offeringsRaw!C176)","v":""},{"$f":"IF(offeringsRaw!D176=\"\",\"\",offeringsRaw!D176)","v":""},{"$f":"IF(offeringsRaw!E176=\"\",\"\",offeringsRaw!E176)","v":""},{"$f":"IF(offeringsRaw!F176=\"\",\"\",offeringsRaw!F176)","v":""},{"$f":"IF(offeringsRaw!G176=\"\",\"\",offeringsRaw!G176)","v":""},{"$f":"IF(offeringsRaw!I176=\"\",\"\",offeringsRaw!I176)","v":""},{"$f":"IF(offeringsRaw!J176=\"\",\"\",offeringsRaw!J176)","v":"2:00p - 2:50p"},{"$f":"IF(offeringsRaw!K176=\"\",\"\",offeringsRaw!K176)","v":"F"},{"$f":"IF(offeringsRaw!L176=\"\",\"\",offeringsRaw!L176)","v":106},{"$f":"IF(offeringsRaw!M176=\"\",\"\",offeringsRaw!M176)","v":"JSB"},{"$f":"IF(offeringsRaw!Q176=\"\",\"\",offeringsRaw!Q176)","v":""}," - "]
["",{"$f":"IF(offeringsRaw!B177=\"\",\"\",offeringsRaw!B177)","v":"-"},{"$f":"IF(offeringsRaw!C177=\"\",\"\",offeringsRaw!C177)","v":""},{"$f":"IF(offeringsRaw!D177=\"\",\"\",offeringsRaw!D177)","v":33},{"$f":"IF(offeringsRaw!E177=\"\",\"\",offeringsRaw!E177)","v":" "},{"$f":"IF(offeringsRaw!F177=\"\",\"\",offeringsRaw!F177)","v":0},{"$f":"IF(offeringsRaw!G177=\"\",\"\",offeringsRaw!G177)","v":30},{"$f":"IF(offeringsRaw!I177=\"\",\"\",offeringsRaw!I177)","v":3},{"$f":"IF(offeringsRaw!J177=\"\",\"\",offeringsRaw!J177)","v":"2:00p - 2:50p"},{"$f":"IF(offeringsRaw!K177=\"\",\"\",offeringsRaw!K177)","v":"MW"},{"$f":"IF(offeringsRaw!L177=\"\",\"\",offeringsRaw!L177)","v":250},{"$f":"IF(offeringsRaw!M177=\"\",\"\",offeringsRaw!M177)","v":"SWKT"},{"$f":"IF(offeringsRaw!Q177=\"\",\"\",offeringsRaw!Q177)","v":"Kimball, Richard Ian"},"033 - Kimball, Richard Ian"]
["",{"$f":"IF(offeringsRaw!B178=\"\",\"\",offeringsRaw!B178)","v":""},{"$f":"IF(offeringsRaw!C178=\"\",\"\",offeringsRaw!C178)","v":""},{"$f":"IF(offeringsRaw!D178=\"\",\"\",offeringsRaw!D178)","v":""},{"$f":"IF(offeringsRaw!E178=\"\",\"\",offeringsRaw!E178)","v":""},{"$f":"IF(offeringsRaw!F178=\"\",\"\",offeringsRaw!F178)","v":""},{"$f":"IF(offeringsRaw!G178=\"\",\"\",offeringsRaw!G178)","v":""},{"$f":"IF(offeringsRaw!I178=\"\",\"\",offeringsRaw!I178)","v":""},{"$f":"IF(offeringsRaw!J178=\"\",\"\",offeringsRaw!J178)","v":"2:00p - 2:50p"},{"$f":"IF(offeringsRaw!K178=\"\",\"\",offeringsRaw!K178)","v":"Th"},{"$f":"IF(offeringsRaw!L178=\"\",\"\",offeringsRaw!L178)","v":280},{"$f":"IF(offeringsRaw!M178=\"\",\"\",offeringsRaw!M178)","v":"MCKB"},{"$f":"IF(offeringsRaw!Q178=\"\",\"\",offeringsRaw!Q178)","v":""}," - "]
["",{"$f":"IF(offeringsRaw!B179=\"\",\"\",offeringsRaw!B179)","v":"-"},{"$f":"IF(offeringsRaw!C179=\"\",\"\",offeringsRaw!C179)","v":""},{"$f":"IF(offeringsRaw!D179=\"\",\"\",offeringsRaw!D179)","v":79},{"$f":"IF(offeringsRaw!E179=\"\",\"\",offeringsRaw!E179)","v":" "},{"$f":"IF(offeringsRaw!F179=\"\",\"\",offeringsRaw!F179)","v":0},{"$f":"IF(offeringsRaw!G179=\"\",\"\",offeringsRaw!G179)","v":30},{"$f":"IF(offeringsRaw!I179=\"\",\"\",offeringsRaw!I179)","v":3},{"$f":"IF(offeringsRaw!J179=\"\",\"\",offeringsRaw!J179)","v":"2:00p - 2:50p"},{"$f":"IF(offeringsRaw!K179=\"\",\"\",offeringsRaw!K179)","v":"MW"},{"$f":"IF(offeringsRaw!L179=\"\",\"\",offeringsRaw!L179)","v":250},{"$f":"IF(offeringsRaw!M179=\"\",\"\",offeringsRaw!M179)","v":"SWKT"},{"$f":"IF(offeringsRaw!Q179=\"\",\"\",offeringsRaw!Q179)","v":"Kimball, Richard Ian"},"079 - Kimball, Richard Ian"]
["",{"$f":"IF(offeringsRaw!B180=\"\",\"\",offeringsRaw!B180)","v":""},{"$f":"IF(offeringsRaw!C180=\"\",\"\",offeringsRaw!C180)","v":""},{"$f":"IF(offeringsRaw!D180=\"\",\"\",offeringsRaw!D180)","v":""},{"$f":"IF(offeringsRaw!E180=\"\",\"\",offeringsRaw!E180)","v":""},{"$f":"IF(offeringsRaw!F180=\"\",\"\",offeringsRaw!F180)","v":""},{"$f":"IF(offeringsRaw!G180=\"\",\"\",offeringsRaw!G180)","v":""},{"$f":"IF(offeringsRaw!I180=\"\",\"\",offeringsRaw!I180)","v":""},{"$f":"IF(offeringsRaw!J180=\"\",\"\",offeringsRaw!J180)","v":"1:00p - 1:50p"},{"$f":"IF(offeringsRaw!K180=\"\",\"\",offeringsRaw!K180)","v":"Th"},{"$f":"IF(offeringsRaw!L180=\"\",\"\",offeringsRaw!L180)","v":250},{"$f":"IF(offeringsRaw!M180=\"\",\"\",offeringsRaw!M180)","v":"BRMB"},{"$f":"IF(offeringsRaw!Q180=\"\",\"\",offeringsRaw!Q180)","v":""}," - "]
["",{"$f":"IF(offeringsRaw!B181=\"\",\"\",offeringsRaw!B181)","v":"-"},{"$f":"IF(offeringsRaw!C181=\"\",\"\",offeringsRaw!C181)","v":""},{"$f":"IF(offeringsRaw!D181=\"\",\"\",offeringsRaw!D181)","v":80},{"$f":"IF(offeringsRaw!E181=\"\",\"\",offeringsRaw!E181)","v":" "},{"$f":"IF(offeringsRaw!F181=\"\",\"\",offeringsRaw!F181)","v":0},{"$f":"IF(offeringsRaw!G181=\"\",\"\",offeringsRaw!G181)","v":30},{"$f":"IF(offeringsRaw!I181=\"\",\"\",offeringsRaw!I181)","v":3},{"$f":"IF(offeringsRaw!J181=\"\",\"\",offeringsRaw!J181)","v":"2:00p - 2:50p"},{"$f":"IF(offeringsRaw!K181=\"\",\"\",offeringsRaw!K181)","v":"MW"},{"$f":"IF(offeringsRaw!L181=\"\",\"\",offeringsRaw!L181)","v":250},{"$f":"IF(offeringsRaw!M181=\"\",\"\",offeringsRaw!M181)","v":"SWKT"},{"$f":"IF(offeringsRaw!Q181=\"\",\"\",offeringsRaw!Q181)","v":"Kimball, Richard Ian"},"080 - Kimball, Richard Ian"]
["",{"$f":"IF(offeringsRaw!B182=\"\",\"\",offeringsRaw!B182)","v":""},{"$f":"IF(offeringsRaw!C182=\"\",\"\",offeringsRaw!C182)","v":""},{"$f":"IF(offeringsRaw!D182=\"\",\"\",offeringsRaw!D182)","v":""},{"$f":"IF(offeringsRaw!E182=\"\",\"\",offeringsRaw!E182)","v":""},{"$f":"IF(offeringsRaw!F182=\"\",\"\",offeringsRaw!F182)","v":""},{"$f":"IF(offeringsRaw!G182=\"\",\"\",offeringsRaw!G182)","v":""},{"$f":"IF(offeringsRaw!I182=\"\",\"\",offeringsRaw!I182)","v":""},{"$f":"IF(offeringsRaw!J182=\"\",\"\",offeringsRaw!J182)","v":"2:00p - 2:50p"},{"$f":"IF(offeringsRaw!K182=\"\",\"\",offeringsRaw!K182)","v":"F"},{"$f":"IF(offeringsRaw!L182=\"\",\"\",offeringsRaw!L182)","v":178},{"$f":"IF(offeringsRaw!M182=\"\",\"\",offeringsRaw!M182)","v":"JSB"},{"$f":"IF(offeringsRaw!Q182=\"\",\"\",offeringsRaw!Q182)","v":""}," - "]
["",{"$f":"IF(offeringsRaw!B183=\"\",\"\",offeringsRaw!B183)","v":"-"},{"$f":"IF(offeringsRaw!C183=\"\",\"\",offeringsRaw!C183)","v":""},{"$f":"IF(offeringsRaw!D183=\"\",\"\",offeringsRaw!D183)","v":81},{"$f":"IF(offeringsRaw!E183=\"\",\"\",offeringsRaw!E183)","v":" "},{"$f":"IF(offeringsRaw!F183=\"\",\"\",offeringsRaw!F183)","v":0},{"$f":"IF(offeringsRaw!G183=\"\",\"\",offeringsRaw!G183)","v":30},{"$f":"IF(offeringsRaw!I183=\"\",\"\",offeringsRaw!I183)","v":3},{"$f":"IF(offeringsRaw!J183=\"\",\"\",offeringsRaw!J183)","v":"2:00p - 2:50p"},{"$f":"IF(offeringsRaw!K183=\"\",\"\",offeringsRaw!K183)","v":"MW"},{"$f":"IF(offeringsRaw!L183=\"\",\"\",offeringsRaw!L183)","v":250},{"$f":"IF(offeringsRaw!M183=\"\",\"\",offeringsRaw!M183)","v":"SWKT"},{"$f":"IF(offeringsRaw!Q183=\"\",\"\",offeringsRaw!Q183)","v":"Kimball, Richard Ian"},"081 - Kimball, Richard Ian"]
["",{"$f":"IF(offeringsRaw!B184=\"\",\"\",offeringsRaw!B184)","v":""},{"$f":"IF(offeringsRaw!C184=\"\",\"\",offeringsRaw!C184)","v":""},{"$f":"IF(offeringsRaw!D184=\"\",\"\",offeringsRaw!D184)","v":""},{"$f":"IF(offeringsRaw!E184=\"\",\"\",offeringsRaw!E184)","v":""},{"$f":"IF(offeringsRaw!F184=\"\",\"\",offeringsRaw!F184)","v":""},{"$f":"IF(offeringsRaw!G184=\"\",\"\",offeringsRaw!G184)","v":""},{"$f":"IF(offeringsRaw!I184=\"\",\"\",offeringsRaw!I184)","v":""},{"$f":"IF(offeringsRaw!J184=\"\",\"\",offeringsRaw!J184)","v":"3:00p - 3:50p"},{"$f":"IF(offeringsRaw!K184=\"\",\"\",offeringsRaw!K184)","v":"Th"},{"$f":"IF(offeringsRaw!L184=\"\",\"\",offeringsRaw!L184)","v":174},{"$f":"IF(offeringsRaw!M184=\"\",\"\",offeringsRaw!M184)","v":"JSB"},{"$f":"IF(offeringsRaw!Q184=\"\",\"\",offeringsRaw!Q184)","v":""}," - "]
["",{"$f":"IF(offeringsRaw!B185=\"\",\"\",offeringsRaw!B185)","v":"-"},{"$f":"IF(offeringsRaw!C185=\"\",\"\",offeringsRaw!C185)","v":""},{"$f":"IF(offeringsRaw!D185=\"\",\"\",offeringsRaw!D185)","v":83},{"$f":"IF(offeringsRaw!E185=\"\",\"\",offeringsRaw!E185)","v":" "},{"$f":"IF(offeringsRaw!F185=\"\",\"\",offeringsRaw!F185)","v":0},{"$f":"IF(offeringsRaw!G185=\"\",\"\",offeringsRaw!G185)","v":30},{"$f":"IF(offeringsRaw!I185=\"\",\"\",offeringsRaw!I185)","v":3},{"$f":"IF(offeringsRaw!J185=\"\",\"\",offeringsRaw!J185)","v":"2:00p - 2:50p"},{"$f":"IF(offeringsRaw!K185=\"\",\"\",offeringsRaw!K185)","v":"MW"},{"$f":"IF(offeringsRaw!L185=\"\",\"\",offeringsRaw!L185)","v":250},{"$f":"IF(offeringsRaw!M185=\"\",\"\",offeringsRaw!M185)","v":"SWKT"},{"$f":"IF(offeringsRaw!Q185=\"\",\"\",offeringsRaw!Q185)","v":"Kimball, Richard Ian"},"083 - Kimball, Richard Ian"]
["",{"$f":"IF(offeringsRaw!B186=\"\",\"\",offeringsRaw!B186)","v":""},{"$f":"IF(offeringsRaw!C186=\"\",\"\",offeringsRaw!C186)","v":""},{"$f":"IF(offeringsRaw!D186=\"\",\"\",offeringsRaw!D186)","v":""},{"$f":"IF(offeringsRaw!E186=\"\",\"\",offeringsRaw!E186)","v":""},{"$f":"IF(offeringsRaw!F186=\"\",\"\",offeringsRaw!F186)","v":""},{"$f":"IF(offeringsRaw!G186=\"\",\"\",offeringsRaw!G186)","v":""},{"$f":"IF(offeringsRaw!I186=\"\",\"\",offeringsRaw!I186)","v":""},{"$f":"IF(offeringsRaw!J186=\"\",\"\",offeringsRaw!J186)","v":"2:00p - 2:50p"},{"$f":"IF(offeringsRaw!K186=\"\",\"\",offeringsRaw!K186)","v":"F"},{"$f":"IF(offeringsRaw!L186=\"\",\"\",offeringsRaw!L186)","v":179},{"$f":"IF(offeringsRaw!M186=\"\",\"\",offeringsRaw!M186)","v":"JSB"},{"$f":"IF(offeringsRaw!Q186=\"\",\"\",offeringsRaw!Q186)","v":""}," - "]
["",{"$f":"IF(offeringsRaw!B187=\"\",\"\",offeringsRaw!B187)","v":"-"},{"$f":"IF(offeringsRaw!C187=\"\",\"\",offeringsRaw!C187)","v":""},{"$f":"IF(offeringsRaw!D187=\"\",\"\",offeringsRaw!D187)","v":85},{"$f":"IF(offeringsRaw!E187=\"\",\"\",offeringsRaw!E187)","v":" "},{"$f":"IF(offeringsRaw!F187=\"\",\"\",offeringsRaw!F187)","v":0},{"$f":"IF(offeringsRaw!G187=\"\",\"\",offeringsRaw!G187)","v":30},{"$f":"IF(offeringsRaw!I187=\"\",\"\",offeringsRaw!I187)","v":3},{"$f":"IF(offeringsRaw!J187=\"\",\"\",offeringsRaw!J187)","v":"2:00p - 2:50p"},{"$f":"IF(offeringsRaw!K187=\"\",\"\",offeringsRaw!K187)","v":"MW"},{"$f":"IF(offeringsRaw!L187=\"\",\"\",offeringsRaw!L187)","v":250},{"$f":"IF(offeringsRaw!M187=\"\",\"\",offeringsRaw!M187)","v":"SWKT"},{"$f":"IF(offeringsRaw!Q187=\"\",\"\",offeringsRaw!Q187)","v":"Kimball, Richard Ian"},"085 - Kimball, Richard Ian"]
["",{"$f":"IF(offeringsRaw!B188=\"\",\"\",offeringsRaw!B188)","v":""},{"$f":"IF(offeringsRaw!C188=\"\",\"\",offeringsRaw!C188)","v":""},{"$f":"IF(offeringsRaw!D188=\"\",\"\",offeringsRaw!D188)","v":""},{"$f":"IF(offeringsRaw!E188=\"\",\"\",offeringsRaw!E188)","v":""},{"$f":"IF(offeringsRaw!F188=\"\",\"\",offeringsRaw!F188)","v":""},{"$f":"IF(offeringsRaw!G188=\"\",\"\",offeringsRaw!G188)","v":""},{"$f":"IF(offeringsRaw!I188=\"\",\"\",offeringsRaw!I188)","v":""},{"$f":"IF(offeringsRaw!J188=\"\",\"\",offeringsRaw!J188)","v":"2:00p - 2:50p"},{"$f":"IF(offeringsRaw!K188=\"\",\"\",offeringsRaw!K188)","v":"F"},{"$f":"IF(offeringsRaw!L188=\"\",\"\",offeringsRaw!L188)","v":182},{"$f":"IF(offeringsRaw!M188=\"\",\"\",offeringsRaw!M188)","v":"JSB"},{"$f":"IF(offeringsRaw!Q188=\"\",\"\",offeringsRaw!Q188)","v":""}," - "]
["",{"$f":"IF(offeringsRaw!B189=\"\",\"\",offeringsRaw!B189)","v":"-"},{"$f":"IF(offeringsRaw!C189=\"\",\"\",offeringsRaw!C189)","v":""},{"$f":"IF(offeringsRaw!D189=\"\",\"\",offeringsRaw!D189)","v":86},{"$f":"IF(offeringsRaw!E189=\"\",\"\",offeringsRaw!E189)","v":" "},{"$f":"IF(offeringsRaw!F189=\"\",\"\",offeringsRaw!F189)","v":0},{"$f":"IF(offeringsRaw!G189=\"\",\"\",offeringsRaw!G189)","v":30},{"$f":"IF(offeringsRaw!I189=\"\",\"\",offeringsRaw!I189)","v":3},{"$f":"IF(offeringsRaw!J189=\"\",\"\",offeringsRaw!J189)","v":"2:00p - 2:50p"},{"$f":"IF(offeringsRaw!K189=\"\",\"\",offeringsRaw!K189)","v":"MW"},{"$f":"IF(offeringsRaw!L189=\"\",\"\",offeringsRaw!L189)","v":250},{"$f":"IF(offeringsRaw!M189=\"\",\"\",offeringsRaw!M189)","v":"SWKT"},{"$f":"IF(offeringsRaw!Q189=\"\",\"\",offeringsRaw!Q189)","v":"Kimball, Richard Ian"},"086 - Kimball, Richard Ian"]
["",{"$f":"IF(offeringsRaw!B190=\"\",\"\",offeringsRaw!B190)","v":""},{"$f":"IF(offeringsRaw!C190=\"\",\"\",offeringsRaw!C190)","v":""},{"$f":"IF(offeringsRaw!D190=\"\",\"\",offeringsRaw!D190)","v":""},{"$f":"IF(offeringsRaw!E190=\"\",\"\",offeringsRaw!E190)","v":""},{"$f":"IF(offeringsRaw!F190=\"\",\"\",offeringsRaw!F190)","v":""},{"$f":"IF(offeringsRaw!G190=\"\",\"\",offeringsRaw!G190)","v":""},{"$f":"IF(offeringsRaw!I190=\"\",\"\",offeringsRaw!I190)","v":""},{"$f":"IF(offeringsRaw!J190=\"\",\"\",offeringsRaw!J190)","v":"2:00p - 2:50p"},{"$f":"IF(offeringsRaw!K190=\"\",\"\",offeringsRaw!K190)","v":"F"},{"$f":"IF(offeringsRaw!L190=\"\",\"\",offeringsRaw!L190)","v":202},{"$f":"IF(offeringsRaw!M190=\"\",\"\",offeringsRaw!M190)","v":"JSB"},{"$f":"IF(offeringsRaw!Q190=\"\",\"\",offeringsRaw!Q190)","v":""}," - "]
["",{"$f":"IF(offeringsRaw!B191=\"\",\"\",offeringsRaw!B191)","v":"-"},{"$f":"IF(offeringsRaw!C191=\"\",\"\",offeringsRaw!C191)","v":""},{"$f":"IF(offeringsRaw!D191=\"\",\"\",offeringsRaw!D191)","v":89},{"$f":"IF(offeringsRaw!E191=\"\",\"\",offeringsRaw!E191)","v":" "},{"$f":"IF(offeringsRaw!F191=\"\",\"\",offeringsRaw!F191)","v":0},{"$f":"IF(offeringsRaw!G191=\"\",\"\",offeringsRaw!G191)","v":30},{"$f":"IF(offeringsRaw!I191=\"\",\"\",offeringsRaw!I191)","v":3},{"$f":"IF(offeringsRaw!J191=\"\",\"\",offeringsRaw!J191)","v":"2:00p - 2:50p"},{"$f":"IF(offeringsRaw!K191=\"\",\"\",offeringsRaw!K191)","v":"MW"},{"$f":"IF(offeringsRaw!L191=\"\",\"\",offeringsRaw!L191)","v":250},{"$f":"IF(offeringsRaw!M191=\"\",\"\",offeringsRaw!M191)","v":"SWKT"},{"$f":"IF(offeringsRaw!Q191=\"\",\"\",offeringsRaw!Q191)","v":"Kimball, Richard Ian"},"089 - Kimball, Richard Ian"]
["",{"$f":"IF(offeringsRaw!B192=\"\",\"\",offeringsRaw!B192)","v":""},{"$f":"IF(offeringsRaw!C192=\"\",\"\",offeringsRaw!C192)","v":""},{"$f":"IF(offeringsRaw!D192=\"\",\"\",offeringsRaw!D192)","v":""},{"$f":"IF(offeringsRaw!E192=\"\",\"\",offeringsRaw!E192)","v":""},{"$f":"IF(offeringsRaw!F192=\"\",\"\",offeringsRaw!F192)","v":""},{"$f":"IF(offeringsRaw!G192=\"\",\"\",offeringsRaw!G192)","v":""},{"$f":"IF(offeringsRaw!I192=\"\",\"\",offeringsRaw!I192)","v":""},{"$f":"IF(offeringsRaw!J192=\"\",\"\",offeringsRaw!J192)","v":"3:00p - 3:50p"},{"$f":"IF(offeringsRaw!K192=\"\",\"\",offeringsRaw!K192)","v":"F"},{"$f":"IF(offeringsRaw!L192=\"\",\"\",offeringsRaw!L192)","v":170},{"$f":"IF(offeringsRaw!M192=\"\",\"\",offeringsRaw!M192)","v":"JSB"},{"$f":"IF(offeringsRaw!Q192=\"\",\"\",offeringsRaw!Q192)","v":""}," - "]
["",{"$f":"IF(offeringsRaw!B193=\"\",\"\",offeringsRaw!B193)","v":"-"},{"$f":"IF(offeringsRaw!C193=\"\",\"\",offeringsRaw!C193)","v":""},{"$f":"IF(offeringsRaw!D193=\"\",\"\",offeringsRaw!D193)","v":97},{"$f":"IF(offeringsRaw!E193=\"\",\"\",offeringsRaw!E193)","v":" "},{"$f":"IF(offeringsRaw!F193=\"\",\"\",offeringsRaw!F193)","v":0},{"$f":"IF(offeringsRaw!G193=\"\",\"\",offeringsRaw!G193)","v":30},{"$f":"IF(offeringsRaw!I193=\"\",\"\",offeringsRaw!I193)","v":3},{"$f":"IF(offeringsRaw!J193=\"\",\"\",offeringsRaw!J193)","v":"2:00p - 2:50p"},{"$f":"IF(offeringsRaw!K193=\"\",\"\",offeringsRaw!K193)","v":"MW"},{"$f":"IF(offeringsRaw!L193=\"\",\"\",offeringsRaw!L193)","v":250},{"$f":"IF(offeringsRaw!M193=\"\",\"\",offeringsRaw!M193)","v":"SWKT"},{"$f":"IF(offeringsRaw!Q193=\"\",\"\",offeringsRaw!Q193)","v":"Kimball, Richard Ian"},{"$f":"TEXT(D198,\"000\") & \" - \" &M198","v":"097 - Kimball, Richard Ian"}]
[{"$f":"IF(RIGHT(B199,5)=\"A</A>\",\"A\",\"\")","v":""},{"$f":"IF(offeringsRaw!B194=\"\",\"\",offeringsRaw!B194)","v":""},{"$f":"IF(offeringsRaw!C194=\"\",\"\",offeringsRaw!C194)","v":""},{"$f":"IF(offeringsRaw!D194=\"\",\"\",offeringsRaw!D194)","v":""},{"$f":"IF(offeringsRaw!E194=\"\",\"\",offeringsRaw!E194)","v":""},{"$f":"IF(offeringsRaw!F194=\"\",\"\",offeringsRaw!F194)","v":""},{"$f":"IF(offeringsRaw!G194=\"\",\"\",offeringsRaw!G194)","v":""},{"$f":"IF(offeringsRaw!I194=\"\",\"\",offeringsRaw!I194)","v":""},{"$f":"IF(offeringsRaw!J194=\"\",\"\",offeringsRaw!J194)","v":"1:00p - 1:50p"},{"$f":"IF(offeringsRaw!K194=\"\",\"\",offeringsRaw!K194)","v":"F"},{"$f":"IF(offeringsRaw!L194=\"\",\"\",offeringsRaw!L194)","v":175},{"$f":"IF(offeringsRaw!M194=\"\",\"\",offeringsRaw!M194)","v":"JSB"},{"$f":"IF(offeringsRaw!Q194=\"\",\"\",offeringsRaw!Q194)","v":""}," - "]
["A",{"$f":"IF(offeringsRaw!B195=\"\",\"\",offeringsRaw!B195)","v":"<A href=\"javascript:addClass('F','3.0','3.0','A HTG','100',' ','103','SALT LAKE'); \">A</A>"},{"$f":"IF(offeringsRaw!C195=\"\",\"\",offeringsRaw!C195)","v":""},{"$f":"IF(offeringsRaw!D195=\"\",\"\",offeringsRaw!D195)","v":103},{"$f":"IF(offeringsRaw!E195=\"\",\"\",offeringsRaw!E195)","v":"SALT LAKE"},{"$f":"IF(offeringsRaw!F195=\"\",\"\",offeringsRaw!F195)","v":40},{"$f":"IF(offeringsRaw!G195=\"\",\"\",offeringsRaw!G195)","v":40},{"$f":"IF(offeringsRaw!I195=\"\",\"\",offeringsRaw!I195)","v":3},{"$f":"IF(offeringsRaw!J195=\"\",\"\",offeringsRaw!J195)","v":"8:30a - 10:55a"},{"$f":"IF(offeringsRaw!K195=\"\",\"\",offeringsRaw!K195)","v":"T"},{"$f":"IF(offeringsRaw!L195=\"\",\"\",offeringsRaw!L195)","v":313},{"$f":"IF(offeringsRaw!M195=\"\",\"\",offeringsRaw!M195)","v":"SLC"},{"$f":"IF(offeringsRaw!Q195=\"\",\"\",offeringsRaw!Q195)","v":"Fish, Rick Jay"},"103 - Fish, Rick Jay"]
["A",{"$f":"IF(offeringsRaw!B196=\"\",\"\",offeringsRaw!B196)","v":"<A href=\"javascript:addClass('F','3.0','3.0','A HTG','100',' ','102','SALT LAKE'); \">A</A>"},{"$f":"IF(offeringsRaw!C196=\"\",\"\",offeringsRaw!C196)","v":""},{"$f":"IF(offeringsRaw!D196=\"\",\"\",offeringsRaw!D196)","v":102},{"$f":"IF(offeringsRaw!E196=\"\",\"\",offeringsRaw!E196)","v":"SALT LAKE"},{"$f":"IF(offeringsRaw!F196=\"\",\"\",offeringsRaw!F196)","v":30},{"$f":"IF(offeringsRaw!G196=\"\",\"\",offeringsRaw!G196)","v":40},{"$f":"IF(offeringsRaw!I196=\"\",\"\",offeringsRaw!I196)","v":3},{"$f":"IF(offeringsRaw!J196=\"\",\"\",offeringsRaw!J196)","v":"9:30a - 11:55a"},{"$f":"IF(offeringsRaw!K196=\"\",\"\",offeringsRaw!K196)","v":"W"},{"$f":"IF(offeringsRaw!L196=\"\",\"\",offeringsRaw!L196)","v":316},{"$f":"IF(offeringsRaw!M196=\"\",\"\",offeringsRaw!M196)","v":"SLC"},{"$f":"IF(offeringsRaw!Q196=\"\",\"\",offeringsRaw!Q196)","v":"Shrum, Joan H"},"102 - Shrum, Joan H"]
["A",{"$f":"IF(offeringsRaw!B197=\"\",\"\",offeringsRaw!B197)","v":"<A href=\"javascript:addClass('F','3.0','3.0','A HTG','100',' ','100','SALT LAKE'); \">A</A>"},{"$f":"IF(offeringsRaw!C197=\"\",\"\",offeringsRaw!C197)","v":""},{"$f":"IF(offeringsRaw!D197=\"\",\"\",offeringsRaw!D197)","v":100},{"$f":"IF(offeringsRaw!E197=\"\",\"\",offeringsRaw!E197)","v":"SALT LAKE"},{"$f":"IF(offeringsRaw!F197=\"\",\"\",offeringsRaw!F197)","v":38},{"$f":"IF(offeringsRaw!G197=\"\",\"\",offeringsRaw!G197)","v":40},{"$f":"IF(offeringsRaw!I197=\"\",\"\",offeringsRaw!I197)","v":3},{"$f":"IF(offeringsRaw!J197=\"\",\"\",offeringsRaw!J197)","v":"9:30a - 11:55a"},{"$f":"IF(offeringsRaw!K197=\"\",\"\",offeringsRaw!K197)","v":"Th"},{"$f":"IF(offeringsRaw!L197=\"\",\"\",offeringsRaw!L197)","v":316},{"$f":"IF(offeringsRaw!M197=\"\",\"\",offeringsRaw!M197)","v":"SLC"},{"$f":"IF(offeringsRaw!Q197=\"\",\"\",offeringsRaw!Q197)","v":"Shrum, Joan H"},"100 - Shrum, Joan H"]
["A",{"$f":"IF(offeringsRaw!B198=\"\",\"\",offeringsRaw!B198)","v":"<A href=\"javascript:addClass('F','3.0','3.0','A HTG','100',' ','098','SALT LAKE'); \">A</A>"},{"$f":"IF(offeringsRaw!C198=\"\",\"\",offeringsRaw!C198)","v":""},{"$f":"IF(offeringsRaw!D198=\"\",\"\",offeringsRaw!D198)","v":98},{"$f":"IF(offeringsRaw!E198=\"\",\"\",offeringsRaw!E198)","v":"SALT LAKE"},{"$f":"IF(offeringsRaw!F198=\"\",\"\",offeringsRaw!F198)","v":40},{"$f":"IF(offeringsRaw!G198=\"\",\"\",offeringsRaw!G198)","v":40},{"$f":"IF(offeringsRaw!I198=\"\",\"\",offeringsRaw!I198)","v":3},{"$f":"IF(offeringsRaw!J198=\"\",\"\",offeringsRaw!J198)","v":"2:30p - 4:55p"},{"$f":"IF(offeringsRaw!K198=\"\",\"\",offeringsRaw!K198)","v":"M"},{"$f":"IF(offeringsRaw!L198=\"\",\"\",offeringsRaw!L198)","v":411},{"$f":"IF(offeringsRaw!M198=\"\",\"\",offeringsRaw!M198)","v":"SLC"},{"$f":"IF(offeringsRaw!Q198=\"\",\"\",offeringsRaw!Q198)","v":"Sargent, Kathryn Pon"},"098 - Sargent, Kathryn Pon"]
["A",{"$f":"IF(offeringsRaw!B199=\"\",\"\",offeringsRaw!B199)","v":"<A href=\"javascript:addClass('F','3.0','3.0','A HTG','100',' ','101','SALT LAKE'); \">A</A>"},{"$f":"IF(offeringsRaw!C199=\"\",\"\",offeringsRaw!C199)","v":""},{"$f":"IF(offeringsRaw!D199=\"\",\"\",offeringsRaw!D199)","v":101},{"$f":"IF(offeringsRaw!E199=\"\",\"\",offeringsRaw!E199)","v":"SALT LAKE"},{"$f":"IF(offeringsRaw!F199=\"\",\"\",offeringsRaw!F199)","v":33},{"$f":"IF(offeringsRaw!G199=\"\",\"\",offeringsRaw!G199)","v":40},{"$f":"IF(offeringsRaw!I199=\"\",\"\",offeringsRaw!I199)","v":3},{"$f":"IF(offeringsRaw!J199=\"\",\"\",offeringsRaw!J199)","v":"5:00p - 7:25p"},{"$f":"IF(offeringsRaw!K199=\"\",\"\",offeringsRaw!K199)","v":"M"},{"$f":"IF(offeringsRaw!L199=\"\",\"\",offeringsRaw!L199)","v":306},{"$f":"IF(offeringsRaw!M199=\"\",\"\",offeringsRaw!M199)","v":"SLC"},{"$f":"IF(offeringsRaw!Q199=\"\",\"\",offeringsRaw!Q199)","v":"Fish, Rick Jay"},"101 - Fish, Rick Jay"]
["A",{"$f":"IF(offeringsRaw!B200=\"\",\"\",offeringsRaw!B200)","v":"<A href=\"javascript:addClass('F','3.0','3.0','A HTG','100',' ','099','SALT LAKE'); \">A</A>"},{"$f":"IF(offeringsRaw!C200=\"\",\"\",offeringsRaw!C200)","v":""},{"$f":"IF(offeringsRaw!D200=\"\",\"\",offeringsRaw!D200)","v":99},{"$f":"IF(offeringsRaw!E200=\"\",\"\",offeringsRaw!E200)","v":"SALT LAKE"},{"$f":"IF(offeringsRaw!F200=\"\",\"\",offeringsRaw!F200)","v":4},{"$f":"IF(offeringsRaw!G200=\"\",\"\",offeringsRaw!G200)","v":40},{"$f":"IF(offeringsRaw!I200=\"\",\"\",offeringsRaw!I200)","v":3},{"$f":"IF(offeringsRaw!J200=\"\",\"\",offeringsRaw!J200)","v":"5:00p - 7:25p"},{"$f":"IF(offeringsRaw!K200=\"\",\"\",offeringsRaw!K200)","v":"W"},{"$f":"IF(offeringsRaw!L200=\"\",\"\",offeringsRaw!L200)","v":411},{"$f":"IF(offeringsRaw!M200=\"\",\"\",offeringsRaw!M200)","v":"SLC"},{"$f":"IF(offeringsRaw!Q200=\"\",\"\",offeringsRaw!Q200)","v":"Latimer, Brett Hugh"},"099 - Latimer, Brett Hugh"]
["",{"$f":"IF(offeringsRaw!B201=\"\",\"\",offeringsRaw!B201)","v":""},{"$f":"IF(offeringsRaw!C201=\"\",\"\",offeringsRaw!C201)","v":""},{"$f":"IF(offeringsRaw!D201=\"\",\"\",offeringsRaw!D201)","v":""},{"$f":"IF(offeringsRaw!E201=\"\",\"\",offeringsRaw!E201)","v":""},{"$f":"IF(offeringsRaw!F201=\"\",\"\",offeringsRaw!F201)","v":""},{"$f":"IF(offeringsRaw!G201=\"\",\"\",offeringsRaw!G201)","v":""},{"$f":"IF(offeringsRaw!I201=\"\",\"\",offeringsRaw!I201)","v":""},{"$f":"IF(offeringsRaw!J201=\"\",\"\",offeringsRaw!J201)","v":"5:00p - 7:25p"},{"$f":"IF(offeringsRaw!K201=\"\",\"\",offeringsRaw!K201)","v":"W"},{"$f":"IF(offeringsRaw!L201=\"\",\"\",offeringsRaw!L201)","v":411},{"$f":"IF(offeringsRaw!M201=\"\",\"\",offeringsRaw!M201)","v":"SLC"},{"$f":"IF(offeringsRaw!Q201=\"\",\"\",offeringsRaw!Q201)","v":""}," - "]
["",{"$f":"IF(offeringsRaw!B202=\"\",\"\",offeringsRaw!B202)","v":""},{"$f":"IF(offeringsRaw!C202=\"\",\"\",offeringsRaw!C202)","v":""},{"$f":"IF(offeringsRaw!D202=\"\",\"\",offeringsRaw!D202)","v":""},{"$f":"IF(offeringsRaw!E202=\"\",\"\",offeringsRaw!E202)","v":""},{"$f":"IF(offeringsRaw!F202=\"\",\"\",offeringsRaw!F202)","v":""},{"$f":"IF(offeringsRaw!G202=\"\",\"\",offeringsRaw!G202)","v":""},{"$f":"IF(offeringsRaw!I202=\"\",\"\",offeringsRaw!I202)","v":""},{"$f":"IF(offeringsRaw!J202=\"\",\"\",offeringsRaw!J202)","v":""},{"$f":"IF(offeringsRaw!K202=\"\",\"\",offeringsRaw!K202)","v":""},{"$f":"IF(offeringsRaw!L202=\"\",\"\",offeringsRaw!L202)","v":""},{"$f":"IF(offeringsRaw!M202=\"\",\"\",offeringsRaw!M202)","v":""},{"$f":"IF(offeringsRaw!Q202=\"\",\"\",offeringsRaw!Q202)","v":""}," - "]
["",{"$f":"IF(offeringsRaw!B203=\"\",\"\",offeringsRaw!B203)","v":""},{"$f":"IF(offeringsRaw!C203=\"\",\"\",offeringsRaw!C203)","v":""},{"$f":"IF(offeringsRaw!D203=\"\",\"\",offeringsRaw!D203)","v":""},{"$f":"IF(offeringsRaw!E203=\"\",\"\",offeringsRaw!E203)","v":""},{"$f":"IF(offeringsRaw!F203=\"\",\"\",offeringsRaw!F203)","v":""},{"$f":"IF(offeringsRaw!G203=\"\",\"\",offeringsRaw!G203)","v":""},{"$f":"IF(offeringsRaw!I203=\"\",\"\",offeringsRaw!I203)","v":""},{"$f":"IF(offeringsRaw!J203=\"\",\"\",offeringsRaw!J203)","v":""},{"$f":"IF(offeringsRaw!K203=\"\",\"\",offeringsRaw!K203)","v":""},{"$f":"IF(offeringsRaw!L203=\"\",\"\",offeringsRaw!L203)","v":""},{"$f":"IF(offeringsRaw!M203=\"\",\"\",offeringsRaw!M203)","v":""},{"$f":"IF(offeringsRaw!Q203=\"\",\"\",offeringsRaw!Q203)","v":""}," - "]
["",{"$f":"IF(offeringsRaw!B204=\"\",\"\",offeringsRaw!B204)","v":""},{"$f":"IF(offeringsRaw!C204=\"\",\"\",offeringsRaw!C204)","v":""},{"$f":"IF(offeringsRaw!D204=\"\",\"\",offeringsRaw!D204)","v":""},{"$f":"IF(offeringsRaw!E204=\"\",\"\",offeringsRaw!E204)","v":""},{"$f":"IF(offeringsRaw!F204=\"\",\"\",offeringsRaw!F204)","v":""},{"$f":"IF(offeringsRaw!G204=\"\",\"\",offeringsRaw!G204)","v":""},{"$f":"IF(offeringsRaw!I204=\"\",\"\",offeringsRaw!I204)","v":""},{"$f":"IF(offeringsRaw!J204=\"\",\"\",offeringsRaw!J204)","v":""},{"$f":"IF(offeringsRaw!K204=\"\",\"\",offeringsRaw!K204)","v":""},{"$f":"IF(offeringsRaw!L204=\"\",\"\",offeringsRaw!L204)","v":""},{"$f":"IF(offeringsRaw!M204=\"\",\"\",offeringsRaw!M204)","v":""},{"$f":"IF(offeringsRaw!Q204=\"\",\"\",offeringsRaw!Q204)","v":""}," - "]
["",{"$f":"IF(offeringsRaw!B205=\"\",\"\",offeringsRaw!B205)","v":""},{"$f":"IF(offeringsRaw!C205=\"\",\"\",offeringsRaw!C205)","v":""},{"$f":"IF(offeringsRaw!D205=\"\",\"\",offeringsRaw!D205)","v":""},{"$f":"IF(offeringsRaw!E205=\"\",\"\",offeringsRaw!E205)","v":""},{"$f":"IF(offeringsRaw!F205=\"\",\"\",offeringsRaw!F205)","v":""},{"$f":"IF(offeringsRaw!G205=\"\",\"\",offeringsRaw!G205)","v":""},{"$f":"IF(offeringsRaw!I205=\"\",\"\",offeringsRaw!I205)","v":""},{"$f":"IF(offeringsRaw!J205=\"\",\"\",offeringsRaw!J205)","v":""},{"$f":"IF(offeringsRaw!K205=\"\",\"\",offeringsRaw!K205)","v":""},{"$f":"IF(offeringsRaw!L205=\"\",\"\",offeringsRaw!L205)","v":""},{"$f":"IF(offeringsRaw!M205=\"\",\"\",offeringsRaw!M205)","v":""},{"$f":"IF(offeringsRaw!Q205=\"\",\"\",offeringsRaw!Q205)","v":""}," - "]
["",{"$f":"IF(offeringsRaw!B206=\"\",\"\",offeringsRaw!B206)","v":""},{"$f":"IF(offeringsRaw!C206=\"\",\"\",offeringsRaw!C206)","v":""},{"$f":"IF(offeringsRaw!D206=\"\",\"\",offeringsRaw!D206)","v":""},{"$f":"IF(offeringsRaw!E206=\"\",\"\",offeringsRaw!E206)","v":""},{"$f":"IF(offeringsRaw!F206=\"\",\"\",offeringsRaw!F206)","v":""},{"$f":"IF(offeringsRaw!G206=\"\",\"\",offeringsRaw!G206)","v":""},{"$f":"IF(offeringsRaw!I206=\"\",\"\",offeringsRaw!I206)","v":""},{"$f":"IF(offeringsRaw!J206=\"\",\"\",offeringsRaw!J206)","v":""},{"$f":"IF(offeringsRaw!K206=\"\",\"\",offeringsRaw!K206)","v":""},{"$f":"IF(offeringsRaw!L206=\"\",\"\",offeringsRaw!L206)","v":""},{"$f":"IF(offeringsRaw!M206=\"\",\"\",offeringsRaw!M206)","v":""},{"$f":"IF(offeringsRaw!Q206=\"\",\"\",offeringsRaw!Q206)","v":""}," - "]
["",{"$f":"IF(offeringsRaw!B207=\"\",\"\",offeringsRaw!B207)","v":""},{"$f":"IF(offeringsRaw!C207=\"\",\"\",offeringsRaw!C207)","v":""},{"$f":"IF(offeringsRaw!D207=\"\",\"\",offeringsRaw!D207)","v":""},{"$f":"IF(offeringsRaw!E207=\"\",\"\",offeringsRaw!E207)","v":""},{"$f":"IF(offeringsRaw!F207=\"\",\"\",offeringsRaw!F207)","v":""},{"$f":"IF(offeringsRaw!G207=\"\",\"\",offeringsRaw!G207)","v":""},{"$f":"IF(offeringsRaw!I207=\"\",\"\",offeringsRaw!I207)","v":""},{"$f":"IF(offeringsRaw!J207=\"\",\"\",offeringsRaw!J207)","v":""},{"$f":"IF(offeringsRaw!K207=\"\",\"\",offeringsRaw!K207)","v":""},{"$f":"IF(offeringsRaw!L207=\"\",\"\",offeringsRaw!L207)","v":""},{"$f":"IF(offeringsRaw!M207=\"\",\"\",offeringsRaw!M207)","v":""},{"$f":"IF(offeringsRaw!Q207=\"\",\"\",offeringsRaw!Q207)","v":""}," - "]
["",{"$f":"IF(offeringsRaw!B208=\"\",\"\",offeringsRaw!B208)","v":""},{"$f":"IF(offeringsRaw!C208=\"\",\"\",offeringsRaw!C208)","v":""},{"$f":"IF(offeringsRaw!D208=\"\",\"\",offeringsRaw!D208)","v":""},{"$f":"IF(offeringsRaw!E208=\"\",\"\",offeringsRaw!E208)","v":""},{"$f":"IF(offeringsRaw!F208=\"\",\"\",offeringsRaw!F208)","v":""},{"$f":"IF(offeringsRaw!G208=\"\",\"\",offeringsRaw!G208)","v":""},{"$f":"IF(offeringsRaw!I208=\"\",\"\",offeringsRaw!I208)","v":""},{"$f":"IF(offeringsRaw!J208=\"\",\"\",offeringsRaw!J208)","v":""},{"$f":"IF(offeringsRaw!K208=\"\",\"\",offeringsRaw!K208)","v":""},{"$f":"IF(offeringsRaw!L208=\"\",\"\",offeringsRaw!L208)","v":""},{"$f":"IF(offeringsRaw!M208=\"\",\"\",offeringsRaw!M208)","v":""},{"$f":"IF(offeringsRaw!Q208=\"\",\"\",offeringsRaw!Q208)","v":""}," - "]
["",{"$f":"IF(offeringsRaw!B209=\"\",\"\",offeringsRaw!B209)","v":""},{"$f":"IF(offeringsRaw!C209=\"\",\"\",offeringsRaw!C209)","v":""},{"$f":"IF(offeringsRaw!D209=\"\",\"\",offeringsRaw!D209)","v":""},{"$f":"IF(offeringsRaw!E209=\"\",\"\",offeringsRaw!E209)","v":""},{"$f":"IF(offeringsRaw!F209=\"\",\"\",offeringsRaw!F209)","v":""},{"$f":"IF(offeringsRaw!G209=\"\",\"\",offeringsRaw!G209)","v":""},{"$f":"IF(offeringsRaw!I209=\"\",\"\",offeringsRaw!I209)","v":""},{"$f":"IF(offeringsRaw!J209=\"\",\"\",offeringsRaw!J209)","v":""},{"$f":"IF(offeringsRaw!K209=\"\",\"\",offeringsRaw!K209)","v":""},{"$f":"IF(offeringsRaw!L209=\"\",\"\",offeringsRaw!L209)","v":""},{"$f":"IF(offeringsRaw!M209=\"\",\"\",offeringsRaw!M209)","v":""},{"$f":"IF(offeringsRaw!Q209=\"\",\"\",offeringsRaw!Q209)","v":""}," - "]
["",{"$f":"IF(offeringsRaw!B210=\"\",\"\",offeringsRaw!B210)","v":""},{"$f":"IF(offeringsRaw!C210=\"\",\"\",offeringsRaw!C210)","v":""},{"$f":"IF(offeringsRaw!D210=\"\",\"\",offeringsRaw!D210)","v":""},{"$f":"IF(offeringsRaw!E210=\"\",\"\",offeringsRaw!E210)","v":""},{"$f":"IF(offeringsRaw!F210=\"\",\"\",offeringsRaw!F210)","v":""},{"$f":"IF(offeringsRaw!G210=\"\",\"\",offeringsRaw!G210)","v":""},{"$f":"IF(offeringsRaw!I210=\"\",\"\",offeringsRaw!I210)","v":""},{"$f":"IF(offeringsRaw!J210=\"\",\"\",offeringsRaw!J210)","v":""},{"$f":"IF(offeringsRaw!K210=\"\",\"\",offeringsRaw!K210)","v":""},{"$f":"IF(offeringsRaw!L210=\"\",\"\",offeringsRaw!L210)","v":""},{"$f":"IF(offeringsRaw!M210=\"\",\"\",offeringsRaw!M210)","v":""},{"$f":"IF(offeringsRaw!Q210=\"\",\"\",offeringsRaw!Q210)","v":""}," - "]
["",{"$f":"IF(offeringsRaw!B211=\"\",\"\",offeringsRaw!B211)","v":""},{"$f":"IF(offeringsRaw!C211=\"\",\"\",offeringsRaw!C211)","v":""},{"$f":"IF(offeringsRaw!D211=\"\",\"\",offeringsRaw!D211)","v":""},{"$f":"IF(offeringsRaw!E211=\"\",\"\",offeringsRaw!E211)","v":""},{"$f":"IF(offeringsRaw!F211=\"\",\"\",offeringsRaw!F211)","v":""},{"$f":"IF(offeringsRaw!G211=\"\",\"\",offeringsRaw!G211)","v":""},{"$f":"IF(offeringsRaw!I211=\"\",\"\",offeringsRaw!I211)","v":""},{"$f":"IF(offeringsRaw!J211=\"\",\"\",offeringsRaw!J211)","v":""},{"$f":"IF(offeringsRaw!K211=\"\",\"\",offeringsRaw!K211)","v":""},{"$f":"IF(offeringsRaw!L211=\"\",\"\",offeringsRaw!L211)","v":""},{"$f":"IF(offeringsRaw!M211=\"\",\"\",offeringsRaw!M211)","v":""},{"$f":"IF(offeringsRaw!Q211=\"\",\"\",offeringsRaw!Q211)","v":""}," - "]
["",{"$f":"IF(offeringsRaw!B212=\"\",\"\",offeringsRaw!B212)","v":""},{"$f":"IF(offeringsRaw!C212=\"\",\"\",offeringsRaw!C212)","v":""},{"$f":"IF(offeringsRaw!D212=\"\",\"\",offeringsRaw!D212)","v":""},{"$f":"IF(offeringsRaw!E212=\"\",\"\",offeringsRaw!E212)","v":""},{"$f":"IF(offeringsRaw!F212=\"\",\"\",offeringsRaw!F212)","v":""},{"$f":"IF(offeringsRaw!G212=\"\",\"\",offeringsRaw!G212)","v":""},{"$f":"IF(offeringsRaw!I212=\"\",\"\",offeringsRaw!I212)","v":""},{"$f":"IF(offeringsRaw!J212=\"\",\"\",offeringsRaw!J212)","v":""},{"$f":"IF(offeringsRaw!K212=\"\",\"\",offeringsRaw!K212)","v":""},{"$f":"IF(offeringsRaw!L212=\"\",\"\",offeringsRaw!L212)","v":""},{"$f":"IF(offeringsRaw!M212=\"\",\"\",offeringsRaw!M212)","v":""},{"$f":"IF(offeringsRaw!Q212=\"\",\"\",offeringsRaw!Q212)","v":""}," - "]
["",{"$f":"IF(offeringsRaw!B213=\"\",\"\",offeringsRaw!B213)","v":""},{"$f":"IF(offeringsRaw!C213=\"\",\"\",offeringsRaw!C213)","v":""},{"$f":"IF(offeringsRaw!D213=\"\",\"\",offeringsRaw!D213)","v":""},{"$f":"IF(offeringsRaw!E213=\"\",\"\",offeringsRaw!E213)","v":""},{"$f":"IF(offeringsRaw!F213=\"\",\"\",offeringsRaw!F213)","v":""},{"$f":"IF(offeringsRaw!G213=\"\",\"\",offeringsRaw!G213)","v":""},{"$f":"IF(offeringsRaw!I213=\"\",\"\",offeringsRaw!I213)","v":""},{"$f":"IF(offeringsRaw!J213=\"\",\"\",offeringsRaw!J213)","v":""},{"$f":"IF(offeringsRaw!K213=\"\",\"\",offeringsRaw!K213)","v":""},{"$f":"IF(offeringsRaw!L213=\"\",\"\",offeringsRaw!L213)","v":""},{"$f":"IF(offeringsRaw!M213=\"\",\"\",offeringsRaw!M213)","v":""},{"$f":"IF(offeringsRaw!Q213=\"\",\"\",offeringsRaw!Q213)","v":""}," - "]
["",{"$f":"IF(offeringsRaw!B214=\"\",\"\",offeringsRaw!B214)","v":""},{"$f":"IF(offeringsRaw!C214=\"\",\"\",offeringsRaw!C214)","v":""},{"$f":"IF(offeringsRaw!D214=\"\",\"\",offeringsRaw!D214)","v":""},{"$f":"IF(offeringsRaw!E214=\"\",\"\",offeringsRaw!E214)","v":""},{"$f":"IF(offeringsRaw!F214=\"\",\"\",offeringsRaw!F214)","v":""},{"$f":"IF(offeringsRaw!G214=\"\",\"\",offeringsRaw!G214)","v":""},{"$f":"IF(offeringsRaw!I214=\"\",\"\",offeringsRaw!I214)","v":""},{"$f":"IF(offeringsRaw!J214=\"\",\"\",offeringsRaw!J214)","v":""},{"$f":"IF(offeringsRaw!K214=\"\",\"\",offeringsRaw!K214)","v":""},{"$f":"IF(offeringsRaw!L214=\"\",\"\",offeringsRaw!L214)","v":""},{"$f":"IF(offeringsRaw!M214=\"\",\"\",offeringsRaw!M214)","v":""},{"$f":"IF(offeringsRaw!Q214=\"\",\"\",offeringsRaw!Q214)","v":""}," - "]
["",{"$f":"IF(offeringsRaw!B215=\"\",\"\",offeringsRaw!B215)","v":""},{"$f":"IF(offeringsRaw!C215=\"\",\"\",offeringsRaw!C215)","v":""},{"$f":"IF(offeringsRaw!D215=\"\",\"\",offeringsRaw!D215)","v":""},{"$f":"IF(offeringsRaw!E215=\"\",\"\",offeringsRaw!E215)","v":""},{"$f":"IF(offeringsRaw!F215=\"\",\"\",offeringsRaw!F215)","v":""},{"$f":"IF(offeringsRaw!G215=\"\",\"\",offeringsRaw!G215)","v":""},{"$f":"IF(offeringsRaw!I215=\"\",\"\",offeringsRaw!I215)","v":""},{"$f":"IF(offeringsRaw!J215=\"\",\"\",offeringsRaw!J215)","v":""},{"$f":"IF(offeringsRaw!K215=\"\",\"\",offeringsRaw!K215)","v":""},{"$f":"IF(offeringsRaw!L215=\"\",\"\",offeringsRaw!L215)","v":""},{"$f":"IF(offeringsRaw!M215=\"\",\"\",offeringsRaw!M215)","v":""},{"$f":"IF(offeringsRaw!Q215=\"\",\"\",offeringsRaw!Q215)","v":""}," - "]
["",{"$f":"IF(offeringsRaw!B216=\"\",\"\",offeringsRaw!B216)","v":""},{"$f":"IF(offeringsRaw!C216=\"\",\"\",offeringsRaw!C216)","v":""},{"$f":"IF(offeringsRaw!D216=\"\",\"\",offeringsRaw!D216)","v":""},{"$f":"IF(offeringsRaw!E216=\"\",\"\",offeringsRaw!E216)","v":""},{"$f":"IF(offeringsRaw!F216=\"\",\"\",offeringsRaw!F216)","v":""},{"$f":"IF(offeringsRaw!G216=\"\",\"\",offeringsRaw!G216)","v":""},{"$f":"IF(offeringsRaw!I216=\"\",\"\",offeringsRaw!I216)","v":""},{"$f":"IF(offeringsRaw!J216=\"\",\"\",offeringsRaw!J216)","v":""},{"$f":"IF(offeringsRaw!K216=\"\",\"\",offeringsRaw!K216)","v":""},{"$f":"IF(offeringsRaw!L216=\"\",\"\",offeringsRaw!L216)","v":""},{"$f":"IF(offeringsRaw!M216=\"\",\"\",offeringsRaw!M216)","v":""},{"$f":"IF(offeringsRaw!Q216=\"\",\"\",offeringsRaw!Q216)","v":""}," - "]
["",{"$f":"IF(offeringsRaw!B217=\"\",\"\",offeringsRaw!B217)","v":""},{"$f":"IF(offeringsRaw!C217=\"\",\"\",offeringsRaw!C217)","v":""},{"$f":"IF(offeringsRaw!D217=\"\",\"\",offeringsRaw!D217)","v":""},{"$f":"IF(offeringsRaw!E217=\"\",\"\",offeringsRaw!E217)","v":""},{"$f":"IF(offeringsRaw!F217=\"\",\"\",offeringsRaw!F217)","v":""},{"$f":"IF(offeringsRaw!G217=\"\",\"\",offeringsRaw!G217)","v":""},{"$f":"IF(offeringsRaw!I217=\"\",\"\",offeringsRaw!I217)","v":""},{"$f":"IF(offeringsRaw!J217=\"\",\"\",offeringsRaw!J217)","v":""},{"$f":"IF(offeringsRaw!K217=\"\",\"\",offeringsRaw!K217)","v":""},{"$f":"IF(offeringsRaw!L217=\"\",\"\",offeringsRaw!L217)","v":""},{"$f":"IF(offeringsRaw!M217=\"\",\"\",offeringsRaw!M217)","v":""},{"$f":"IF(offeringsRaw!Q217=\"\",\"\",offeringsRaw!Q217)","v":""}," - "]
["",{"$f":"IF(offeringsRaw!B218=\"\",\"\",offeringsRaw!B218)","v":""},{"$f":"IF(offeringsRaw!C218=\"\",\"\",offeringsRaw!C218)","v":""},{"$f":"IF(offeringsRaw!D218=\"\",\"\",offeringsRaw!D218)","v":""},{"$f":"IF(offeringsRaw!E218=\"\",\"\",offeringsRaw!E218)","v":""},{"$f":"IF(offeringsRaw!F218=\"\",\"\",offeringsRaw!F218)","v":""},{"$f":"IF(offeringsRaw!G218=\"\",\"\",offeringsRaw!G218)","v":""},{"$f":"IF(offeringsRaw!I218=\"\",\"\",offeringsRaw!I218)","v":""},{"$f":"IF(offeringsRaw!J218=\"\",\"\",offeringsRaw!J218)","v":""},{"$f":"IF(offeringsRaw!K218=\"\",\"\",offeringsRaw!K218)","v":""},{"$f":"IF(offeringsRaw!L218=\"\",\"\",offeringsRaw!L218)","v":""},{"$f":"IF(offeringsRaw!M218=\"\",\"\",offeringsRaw!M218)","v":""},{"$f":"IF(offeringsRaw!Q218=\"\",\"\",offeringsRaw!Q218)","v":""}," - "]
["",{"$f":"IF(offeringsRaw!B219=\"\",\"\",offeringsRaw!B219)","v":""},{"$f":"IF(offeringsRaw!C219=\"\",\"\",offeringsRaw!C219)","v":""},{"$f":"IF(offeringsRaw!D219=\"\",\"\",offeringsRaw!D219)","v":""},{"$f":"IF(offeringsRaw!E219=\"\",\"\",offeringsRaw!E219)","v":""},{"$f":"IF(offeringsRaw!F219=\"\",\"\",offeringsRaw!F219)","v":""},{"$f":"IF(offeringsRaw!G219=\"\",\"\",offeringsRaw!G219)","v":""},{"$f":"IF(offeringsRaw!I219=\"\",\"\",offeringsRaw!I219)","v":""},{"$f":"IF(offeringsRaw!J219=\"\",\"\",offeringsRaw!J219)","v":""},{"$f":"IF(offeringsRaw!K219=\"\",\"\",offeringsRaw!K219)","v":""},{"$f":"IF(offeringsRaw!L219=\"\",\"\",offeringsRaw!L219)","v":""},{"$f":"IF(offeringsRaw!M219=\"\",\"\",offeringsRaw!M219)","v":""},{"$f":"IF(offeringsRaw!Q219=\"\",\"\",offeringsRaw!Q219)","v":""}," - "]
["",{"$f":"IF(offeringsRaw!B220=\"\",\"\",offeringsRaw!B220)","v":""},{"$f":"IF(offeringsRaw!C220=\"\",\"\",offeringsRaw!C220)","v":""},{"$f":"IF(offeringsRaw!D220=\"\",\"\",offeringsRaw!D220)","v":""},{"$f":"IF(offeringsRaw!E220=\"\",\"\",offeringsRaw!E220)","v":""},{"$f":"IF(offeringsRaw!F220=\"\",\"\",offeringsRaw!F220)","v":""},{"$f":"IF(offeringsRaw!G220=\"\",\"\",offeringsRaw!G220)","v":""},{"$f":"IF(offeringsRaw!I220=\"\",\"\",offeringsRaw!I220)","v":""},{"$f":"IF(offeringsRaw!J220=\"\",\"\",offeringsRaw!J220)","v":""},{"$f":"IF(offeringsRaw!K220=\"\",\"\",offeringsRaw!K220)","v":""},{"$f":"IF(offeringsRaw!L220=\"\",\"\",offeringsRaw!L220)","v":""},{"$f":"IF(offeringsRaw!M220=\"\",\"\",offeringsRaw!M220)","v":""},{"$f":"IF(offeringsRaw!Q220=\"\",\"\",offeringsRaw!Q220)","v":""}," - "]
["",{"$f":"IF(offeringsRaw!B221=\"\",\"\",offeringsRaw!B221)","v":""},{"$f":"IF(offeringsRaw!C221=\"\",\"\",offeringsRaw!C221)","v":""},{"$f":"IF(offeringsRaw!D221=\"\",\"\",offeringsRaw!D221)","v":""},{"$f":"IF(offeringsRaw!E221=\"\",\"\",offeringsRaw!E221)","v":""},{"$f":"IF(offeringsRaw!F221=\"\",\"\",offeringsRaw!F221)","v":""},{"$f":"IF(offeringsRaw!G221=\"\",\"\",offeringsRaw!G221)","v":""},{"$f":"IF(offeringsRaw!I221=\"\",\"\",offeringsRaw!I221)","v":""},{"$f":"IF(offeringsRaw!J221=\"\",\"\",offeringsRaw!J221)","v":""},{"$f":"IF(offeringsRaw!K221=\"\",\"\",offeringsRaw!K221)","v":""},{"$f":"IF(offeringsRaw!L221=\"\",\"\",offeringsRaw!L221)","v":""},{"$f":"IF(offeringsRaw!M221=\"\",\"\",offeringsRaw!M221)","v":""},{"$f":"IF(offeringsRaw!Q221=\"\",\"\",offeringsRaw!Q221)","v":""}," - "]
["",{"$f":"IF(offeringsRaw!B222=\"\",\"\",offeringsRaw!B222)","v":""},{"$f":"IF(offeringsRaw!C222=\"\",\"\",offeringsRaw!C222)","v":""},{"$f":"IF(offeringsRaw!D222=\"\",\"\",offeringsRaw!D222)","v":""},{"$f":"IF(offeringsRaw!E222=\"\",\"\",offeringsRaw!E222)","v":""},{"$f":"IF(offeringsRaw!F222=\"\",\"\",offeringsRaw!F222)","v":""},{"$f":"IF(offeringsRaw!G222=\"\",\"\",offeringsRaw!G222)","v":""},{"$f":"IF(offeringsRaw!I222=\"\",\"\",offeringsRaw!I222)","v":""},{"$f":"IF(offeringsRaw!J222=\"\",\"\",offeringsRaw!J222)","v":""},{"$f":"IF(offeringsRaw!K222=\"\",\"\",offeringsRaw!K222)","v":""},{"$f":"IF(offeringsRaw!L222=\"\",\"\",offeringsRaw!L222)","v":""},{"$f":"IF(offeringsRaw!M222=\"\",\"\",offeringsRaw!M222)","v":""},{"$f":"IF(offeringsRaw!Q222=\"\",\"\",offeringsRaw!Q222)","v":""}," - "]
["",{"$f":"IF(offeringsRaw!B223=\"\",\"\",offeringsRaw!B223)","v":""},{"$f":"IF(offeringsRaw!C223=\"\",\"\",offeringsRaw!C223)","v":""},{"$f":"IF(offeringsRaw!D223=\"\",\"\",offeringsRaw!D223)","v":""},{"$f":"IF(offeringsRaw!E223=\"\",\"\",offeringsRaw!E223)","v":""},{"$f":"IF(offeringsRaw!F223=\"\",\"\",offeringsRaw!F223)","v":""},{"$f":"IF(offeringsRaw!G223=\"\",\"\",offeringsRaw!G223)","v":""},{"$f":"IF(offeringsRaw!I223=\"\",\"\",offeringsRaw!I223)","v":""},{"$f":"IF(offeringsRaw!J223=\"\",\"\",offeringsRaw!J223)","v":""},{"$f":"IF(offeringsRaw!K223=\"\",\"\",offeringsRaw!K223)","v":""},{"$f":"IF(offeringsRaw!L223=\"\",\"\",offeringsRaw!L223)","v":""},{"$f":"IF(offeringsRaw!M223=\"\",\"\",offeringsRaw!M223)","v":""},{"$f":"IF(offeringsRaw!Q223=\"\",\"\",offeringsRaw!Q223)","v":""}," - "]
["",{"$f":"IF(offeringsRaw!B224=\"\",\"\",offeringsRaw!B224)","v":""},{"$f":"IF(offeringsRaw!C224=\"\",\"\",offeringsRaw!C224)","v":""},{"$f":"IF(offeringsRaw!D224=\"\",\"\",offeringsRaw!D224)","v":""},{"$f":"IF(offeringsRaw!E224=\"\",\"\",offeringsRaw!E224)","v":""},{"$f":"IF(offeringsRaw!F224=\"\",\"\",offeringsRaw!F224)","v":""},{"$f":"IF(offeringsRaw!G224=\"\",\"\",offeringsRaw!G224)","v":""},{"$f":"IF(offeringsRaw!I224=\"\",\"\",offeringsRaw!I224)","v":""},{"$f":"IF(offeringsRaw!J224=\"\",\"\",offeringsRaw!J224)","v":""},{"$f":"IF(offeringsRaw!K224=\"\",\"\",offeringsRaw!K224)","v":""},{"$f":"IF(offeringsRaw!L224=\"\",\"\",offeringsRaw!L224)","v":""},{"$f":"IF(offeringsRaw!M224=\"\",\"\",offeringsRaw!M224)","v":""},{"$f":"IF(offeringsRaw!Q224=\"\",\"\",offeringsRaw!Q224)","v":""}," - "]
["",{"$f":"IF(offeringsRaw!B225=\"\",\"\",offeringsRaw!B225)","v":""},{"$f":"IF(offeringsRaw!C225=\"\",\"\",offeringsRaw!C225)","v":""},{"$f":"IF(offeringsRaw!D225=\"\",\"\",offeringsRaw!D225)","v":""},{"$f":"IF(offeringsRaw!E225=\"\",\"\",offeringsRaw!E225)","v":""},{"$f":"IF(offeringsRaw!F225=\"\",\"\",offeringsRaw!F225)","v":""},{"$f":"IF(offeringsRaw!G225=\"\",\"\",offeringsRaw!G225)","v":""},{"$f":"IF(offeringsRaw!I225=\"\",\"\",offeringsRaw!I225)","v":""},{"$f":"IF(offeringsRaw!J225=\"\",\"\",offeringsRaw!J225)","v":""},{"$f":"IF(offeringsRaw!K225=\"\",\"\",offeringsRaw!K225)","v":""},{"$f":"IF(offeringsRaw!L225=\"\",\"\",offeringsRaw!L225)","v":""},{"$f":"IF(offeringsRaw!M225=\"\",\"\",offeringsRaw!M225)","v":""},{"$f":"IF(offeringsRaw!Q225=\"\",\"\",offeringsRaw!Q225)","v":""}," - "]
["",{"$f":"IF(offeringsRaw!B226=\"\",\"\",offeringsRaw!B226)","v":""},{"$f":"IF(offeringsRaw!C226=\"\",\"\",offeringsRaw!C226)","v":""},{"$f":"IF(offeringsRaw!D226=\"\",\"\",offeringsRaw!D226)","v":""},{"$f":"IF(offeringsRaw!E226=\"\",\"\",offeringsRaw!E226)","v":""},{"$f":"IF(offeringsRaw!F226=\"\",\"\",offeringsRaw!F226)","v":""},{"$f":"IF(offeringsRaw!G226=\"\",\"\",offeringsRaw!G226)","v":""},{"$f":"IF(offeringsRaw!I226=\"\",\"\",offeringsRaw!I226)","v":""},{"$f":"IF(offeringsRaw!J226=\"\",\"\",offeringsRaw!J226)","v":""},{"$f":"IF(offeringsRaw!K226=\"\",\"\",offeringsRaw!K226)","v":""},{"$f":"IF(offeringsRaw!L226=\"\",\"\",offeringsRaw!L226)","v":""},{"$f":"IF(offeringsRaw!M226=\"\",\"\",offeringsRaw!M226)","v":""},{"$f":"IF(offeringsRaw!Q226=\"\",\"\",offeringsRaw!Q226)","v":""}," - "]
["",{"$f":"IF(offeringsRaw!B227=\"\",\"\",offeringsRaw!B227)","v":""},{"$f":"IF(offeringsRaw!C227=\"\",\"\",offeringsRaw!C227)","v":""},{"$f":"IF(offeringsRaw!D227=\"\",\"\",offeringsRaw!D227)","v":""},{"$f":"IF(offeringsRaw!E227=\"\",\"\",offeringsRaw!E227)","v":""},{"$f":"IF(offeringsRaw!F227=\"\",\"\",offeringsRaw!F227)","v":""},{"$f":"IF(offeringsRaw!G227=\"\",\"\",offeringsRaw!G227)","v":""},{"$f":"IF(offeringsRaw!I227=\"\",\"\",offeringsRaw!I227)","v":""},{"$f":"IF(offeringsRaw!J227=\"\",\"\",offeringsRaw!J227)","v":""},{"$f":"IF(offeringsRaw!K227=\"\",\"\",offeringsRaw!K227)","v":""},{"$f":"IF(offeringsRaw!L227=\"\",\"\",offeringsRaw!L227)","v":""},{"$f":"IF(offeringsRaw!M227=\"\",\"\",offeringsRaw!M227)","v":""},{"$f":"IF(offeringsRaw!Q227=\"\",\"\",offeringsRaw!Q227)","v":""}," - "]
["",{"$f":"IF(offeringsRaw!B228=\"\",\"\",offeringsRaw!B228)","v":""},{"$f":"IF(offeringsRaw!C228=\"\",\"\",offeringsRaw!C228)","v":""},{"$f":"IF(offeringsRaw!D228=\"\",\"\",offeringsRaw!D228)","v":""},{"$f":"IF(offeringsRaw!E228=\"\",\"\",offeringsRaw!E228)","v":""},{"$f":"IF(offeringsRaw!F228=\"\",\"\",offeringsRaw!F228)","v":""},{"$f":"IF(offeringsRaw!G228=\"\",\"\",offeringsRaw!G228)","v":""},{"$f":"IF(offeringsRaw!I228=\"\",\"\",offeringsRaw!I228)","v":""},{"$f":"IF(offeringsRaw!J228=\"\",\"\",offeringsRaw!J228)","v":""},{"$f":"IF(offeringsRaw!K228=\"\",\"\",offeringsRaw!K228)","v":""},{"$f":"IF(offeringsRaw!L228=\"\",\"\",offeringsRaw!L228)","v":""},{"$f":"IF(offeringsRaw!M228=\"\",\"\",offeringsRaw!M228)","v":""},{"$f":"IF(offeringsRaw!Q228=\"\",\"\",offeringsRaw!Q228)","v":""}," - "]
["",{"$f":"IF(offeringsRaw!B229=\"\",\"\",offeringsRaw!B229)","v":""},{"$f":"IF(offeringsRaw!C229=\"\",\"\",offeringsRaw!C229)","v":""},{"$f":"IF(offeringsRaw!D229=\"\",\"\",offeringsRaw!D229)","v":""},{"$f":"IF(offeringsRaw!E229=\"\",\"\",offeringsRaw!E229)","v":""},{"$f":"IF(offeringsRaw!F229=\"\",\"\",offeringsRaw!F229)","v":""},{"$f":"IF(offeringsRaw!G229=\"\",\"\",offeringsRaw!G229)","v":""},{"$f":"IF(offeringsRaw!I229=\"\",\"\",offeringsRaw!I229)","v":""},{"$f":"IF(offeringsRaw!J229=\"\",\"\",offeringsRaw!J229)","v":""},{"$f":"IF(offeringsRaw!K229=\"\",\"\",offeringsRaw!K229)","v":""},{"$f":"IF(offeringsRaw!L229=\"\",\"\",offeringsRaw!L229)","v":""},{"$f":"IF(offeringsRaw!M229=\"\",\"\",offeringsRaw!M229)","v":""},{"$f":"IF(offeringsRaw!Q229=\"\",\"\",offeringsRaw!Q229)","v":""}," - "]
["",{"$f":"IF(offeringsRaw!B230=\"\",\"\",offeringsRaw!B230)","v":""},{"$f":"IF(offeringsRaw!C230=\"\",\"\",offeringsRaw!C230)","v":""},{"$f":"IF(offeringsRaw!D230=\"\",\"\",offeringsRaw!D230)","v":""},{"$f":"IF(offeringsRaw!E230=\"\",\"\",offeringsRaw!E230)","v":""},{"$f":"IF(offeringsRaw!F230=\"\",\"\",offeringsRaw!F230)","v":""},{"$f":"IF(offeringsRaw!G230=\"\",\"\",offeringsRaw!G230)","v":""},{"$f":"IF(offeringsRaw!I230=\"\",\"\",offeringsRaw!I230)","v":""},{"$f":"IF(offeringsRaw!J230=\"\",\"\",offeringsRaw!J230)","v":""},{"$f":"IF(offeringsRaw!K230=\"\",\"\",offeringsRaw!K230)","v":""},{"$f":"IF(offeringsRaw!L230=\"\",\"\",offeringsRaw!L230)","v":""},{"$f":"IF(offeringsRaw!M230=\"\",\"\",offeringsRaw!M230)","v":""},{"$f":"IF(offeringsRaw!Q230=\"\",\"\",offeringsRaw!Q230)","v":""}," - "]
["",{"$f":"IF(offeringsRaw!B231=\"\",\"\",offeringsRaw!B231)","v":""},{"$f":"IF(offeringsRaw!C231=\"\",\"\",offeringsRaw!C231)","v":""},{"$f":"IF(offeringsRaw!D231=\"\",\"\",offeringsRaw!D231)","v":""},{"$f":"IF(offeringsRaw!E231=\"\",\"\",offeringsRaw!E231)","v":""},{"$f":"IF(offeringsRaw!F231=\"\",\"\",offeringsRaw!F231)","v":""},{"$f":"IF(offeringsRaw!G231=\"\",\"\",offeringsRaw!G231)","v":""},{"$f":"IF(offeringsRaw!I231=\"\",\"\",offeringsRaw!I231)","v":""},{"$f":"IF(offeringsRaw!J231=\"\",\"\",offeringsRaw!J231)","v":""},{"$f":"IF(offeringsRaw!K231=\"\",\"\",offeringsRaw!K231)","v":""},{"$f":"IF(offeringsRaw!L231=\"\",\"\",offeringsRaw!L231)","v":""},{"$f":"IF(offeringsRaw!M231=\"\",\"\",offeringsRaw!M231)","v":""},{"$f":"IF(offeringsRaw!Q231=\"\",\"\",offeringsRaw!Q231)","v":""}," - "]
["",{"$f":"IF(offeringsRaw!B232=\"\",\"\",offeringsRaw!B232)","v":""},{"$f":"IF(offeringsRaw!C232=\"\",\"\",offeringsRaw!C232)","v":""},{"$f":"IF(offeringsRaw!D232=\"\",\"\",offeringsRaw!D232)","v":""},{"$f":"IF(offeringsRaw!E232=\"\",\"\",offeringsRaw!E232)","v":""},{"$f":"IF(offeringsRaw!F232=\"\",\"\",offeringsRaw!F232)","v":""},{"$f":"IF(offeringsRaw!G232=\"\",\"\",offeringsRaw!G232)","v":""},{"$f":"IF(offeringsRaw!I232=\"\",\"\",offeringsRaw!I232)","v":""},{"$f":"IF(offeringsRaw!J232=\"\",\"\",offeringsRaw!J232)","v":""},{"$f":"IF(offeringsRaw!K232=\"\",\"\",offeringsRaw!K232)","v":""},{"$f":"IF(offeringsRaw!L232=\"\",\"\",offeringsRaw!L232)","v":""},{"$f":"IF(offeringsRaw!M232=\"\",\"\",offeringsRaw!M232)","v":""},{"$f":"IF(offeringsRaw!Q232=\"\",\"\",offeringsRaw!Q232)","v":""}," - "]
["",{"$f":"IF(offeringsRaw!B233=\"\",\"\",offeringsRaw!B233)","v":""},{"$f":"IF(offeringsRaw!C233=\"\",\"\",offeringsRaw!C233)","v":""},{"$f":"IF(offeringsRaw!D233=\"\",\"\",offeringsRaw!D233)","v":""},{"$f":"IF(offeringsRaw!E233=\"\",\"\",offeringsRaw!E233)","v":""},{"$f":"IF(offeringsRaw!F233=\"\",\"\",offeringsRaw!F233)","v":""},{"$f":"IF(offeringsRaw!G233=\"\",\"\",offeringsRaw!G233)","v":""},{"$f":"IF(offeringsRaw!I233=\"\",\"\",offeringsRaw!I233)","v":""},{"$f":"IF(offeringsRaw!J233=\"\",\"\",offeringsRaw!J233)","v":""},{"$f":"IF(offeringsRaw!K233=\"\",\"\",offeringsRaw!K233)","v":""},{"$f":"IF(offeringsRaw!L233=\"\",\"\",offeringsRaw!L233)","v":""},{"$f":"IF(offeringsRaw!M233=\"\",\"\",offeringsRaw!M233)","v":""},{"$f":"IF(offeringsRaw!Q233=\"\",\"\",offeringsRaw!Q233)","v":""}," - "]
["",{"$f":"IF(offeringsRaw!B234=\"\",\"\",offeringsRaw!B234)","v":""},{"$f":"IF(offeringsRaw!C234=\"\",\"\",offeringsRaw!C234)","v":""},{"$f":"IF(offeringsRaw!D234=\"\",\"\",offeringsRaw!D234)","v":""},{"$f":"IF(offeringsRaw!E234=\"\",\"\",offeringsRaw!E234)","v":""},{"$f":"IF(offeringsRaw!F234=\"\",\"\",offeringsRaw!F234)","v":""},{"$f":"IF(offeringsRaw!G234=\"\",\"\",offeringsRaw!G234)","v":""},{"$f":"IF(offeringsRaw!I234=\"\",\"\",offeringsRaw!I234)","v":""},{"$f":"IF(offeringsRaw!J234=\"\",\"\",offeringsRaw!J234)","v":""},{"$f":"IF(offeringsRaw!K234=\"\",\"\",offeringsRaw!K234)","v":""},{"$f":"IF(offeringsRaw!L234=\"\",\"\",offeringsRaw!L234)","v":""},{"$f":"IF(offeringsRaw!M234=\"\",\"\",offeringsRaw!M234)","v":""},{"$f":"IF(offeringsRaw!Q234=\"\",\"\",offeringsRaw!Q234)","v":""}," - "]
["",{"$f":"IF(offeringsRaw!B235=\"\",\"\",offeringsRaw!B235)","v":""},{"$f":"IF(offeringsRaw!C235=\"\",\"\",offeringsRaw!C235)","v":""},{"$f":"IF(offeringsRaw!D235=\"\",\"\",offeringsRaw!D235)","v":""},{"$f":"IF(offeringsRaw!E235=\"\",\"\",offeringsRaw!E235)","v":""},{"$f":"IF(offeringsRaw!F235=\"\",\"\",offeringsRaw!F235)","v":""},{"$f":"IF(offeringsRaw!G235=\"\",\"\",offeringsRaw!G235)","v":""},{"$f":"IF(offeringsRaw!I235=\"\",\"\",offeringsRaw!I235)","v":""},{"$f":"IF(offeringsRaw!J235=\"\",\"\",offeringsRaw!J235)","v":""},{"$f":"IF(offeringsRaw!K235=\"\",\"\",offeringsRaw!K235)","v":""},{"$f":"IF(offeringsRaw!L235=\"\",\"\",offeringsRaw!L235)","v":""},{"$f":"IF(offeringsRaw!M235=\"\",\"\",offeringsRaw!M235)","v":""},{"$f":"IF(offeringsRaw!Q235=\"\",\"\",offeringsRaw!Q235)","v":""}," - "]
["",{"$f":"IF(offeringsRaw!B236=\"\",\"\",offeringsRaw!B236)","v":""},{"$f":"IF(offeringsRaw!C236=\"\",\"\",offeringsRaw!C236)","v":""},{"$f":"IF(offeringsRaw!D236=\"\",\"\",offeringsRaw!D236)","v":""},{"$f":"IF(offeringsRaw!E236=\"\",\"\",offeringsRaw!E236)","v":""},{"$f":"IF(offeringsRaw!F236=\"\",\"\",offeringsRaw!F236)","v":""},{"$f":"IF(offeringsRaw!G236=\"\",\"\",offeringsRaw!G236)","v":""},{"$f":"IF(offeringsRaw!I236=\"\",\"\",offeringsRaw!I236)","v":""},{"$f":"IF(offeringsRaw!J236=\"\",\"\",offeringsRaw!J236)","v":""},{"$f":"IF(offeringsRaw!K236=\"\",\"\",offeringsRaw!K236)","v":""},{"$f":"IF(offeringsRaw!L236=\"\",\"\",offeringsRaw!L236)","v":""},{"$f":"IF(offeringsRaw!M236=\"\",\"\",offeringsRaw!M236)","v":""},{"$f":"IF(offeringsRaw!Q236=\"\",\"\",offeringsRaw!Q236)","v":""}," - "]
["",{"$f":"IF(offeringsRaw!B237=\"\",\"\",offeringsRaw!B237)","v":""},{"$f":"IF(offeringsRaw!C237=\"\",\"\",offeringsRaw!C237)","v":""},{"$f":"IF(offeringsRaw!D237=\"\",\"\",offeringsRaw!D237)","v":""},{"$f":"IF(offeringsRaw!E237=\"\",\"\",offeringsRaw!E237)","v":""},{"$f":"IF(offeringsRaw!F237=\"\",\"\",offeringsRaw!F237)","v":""},{"$f":"IF(offeringsRaw!G237=\"\",\"\",offeringsRaw!G237)","v":""},{"$f":"IF(offeringsRaw!I237=\"\",\"\",offeringsRaw!I237)","v":""},{"$f":"IF(offeringsRaw!J237=\"\",\"\",offeringsRaw!J237)","v":""},{"$f":"IF(offeringsRaw!K237=\"\",\"\",offeringsRaw!K237)","v":""},{"$f":"IF(offeringsRaw!L237=\"\",\"\",offeringsRaw!L237)","v":""},{"$f":"IF(offeringsRaw!M237=\"\",\"\",offeringsRaw!M237)","v":""},{"$f":"IF(offeringsRaw!Q237=\"\",\"\",offeringsRaw!Q237)","v":""}," - "]
["",{"$f":"IF(offeringsRaw!B238=\"\",\"\",offeringsRaw!B238)","v":""},{"$f":"IF(offeringsRaw!C238=\"\",\"\",offeringsRaw!C238)","v":""},{"$f":"IF(offeringsRaw!D238=\"\",\"\",offeringsRaw!D238)","v":""},{"$f":"IF(offeringsRaw!E238=\"\",\"\",offeringsRaw!E238)","v":""},{"$f":"IF(offeringsRaw!F238=\"\",\"\",offeringsRaw!F238)","v":""},{"$f":"IF(offeringsRaw!G238=\"\",\"\",offeringsRaw!G238)","v":""},{"$f":"IF(offeringsRaw!I238=\"\",\"\",offeringsRaw!I238)","v":""},{"$f":"IF(offeringsRaw!J238=\"\",\"\",offeringsRaw!J238)","v":""},{"$f":"IF(offeringsRaw!K238=\"\",\"\",offeringsRaw!K238)","v":""},{"$f":"IF(offeringsRaw!L238=\"\",\"\",offeringsRaw!L238)","v":""},{"$f":"IF(offeringsRaw!M238=\"\",\"\",offeringsRaw!M238)","v":""},{"$f":"IF(offeringsRaw!Q238=\"\",\"\",offeringsRaw!Q238)","v":""}," - "]
["",{"$f":"IF(offeringsRaw!B239=\"\",\"\",offeringsRaw!B239)","v":""},{"$f":"IF(offeringsRaw!C239=\"\",\"\",offeringsRaw!C239)","v":""},{"$f":"IF(offeringsRaw!D239=\"\",\"\",offeringsRaw!D239)","v":""},{"$f":"IF(offeringsRaw!E239=\"\",\"\",offeringsRaw!E239)","v":""},{"$f":"IF(offeringsRaw!F239=\"\",\"\",offeringsRaw!F239)","v":""},{"$f":"IF(offeringsRaw!G239=\"\",\"\",offeringsRaw!G239)","v":""},{"$f":"IF(offeringsRaw!I239=\"\",\"\",offeringsRaw!I239)","v":""},{"$f":"IF(offeringsRaw!J239=\"\",\"\",offeringsRaw!J239)","v":""},{"$f":"IF(offeringsRaw!K239=\"\",\"\",offeringsRaw!K239)","v":""},{"$f":"IF(offeringsRaw!L239=\"\",\"\",offeringsRaw!L239)","v":""},{"$f":"IF(offeringsRaw!M239=\"\",\"\",offeringsRaw!M239)","v":""},{"$f":"IF(offeringsRaw!Q239=\"\",\"\",offeringsRaw!Q239)","v":""}," - "]
["",{"$f":"IF(offeringsRaw!B240=\"\",\"\",offeringsRaw!B240)","v":""},{"$f":"IF(offeringsRaw!C240=\"\",\"\",offeringsRaw!C240)","v":""},{"$f":"IF(offeringsRaw!D240=\"\",\"\",offeringsRaw!D240)","v":""},{"$f":"IF(offeringsRaw!E240=\"\",\"\",offeringsRaw!E240)","v":""},{"$f":"IF(offeringsRaw!F240=\"\",\"\",offeringsRaw!F240)","v":""},{"$f":"IF(offeringsRaw!G240=\"\",\"\",offeringsRaw!G240)","v":""},{"$f":"IF(offeringsRaw!I240=\"\",\"\",offeringsRaw!I240)","v":""},{"$f":"IF(offeringsRaw!J240=\"\",\"\",offeringsRaw!J240)","v":""},{"$f":"IF(offeringsRaw!K240=\"\",\"\",offeringsRaw!K240)","v":""},{"$f":"IF(offeringsRaw!L240=\"\",\"\",offeringsRaw!L240)","v":""},{"$f":"IF(offeringsRaw!M240=\"\",\"\",offeringsRaw!M240)","v":""},{"$f":"IF(offeringsRaw!Q240=\"\",\"\",offeringsRaw!Q240)","v":""}," - "]
["",{"$f":"IF(offeringsRaw!B241=\"\",\"\",offeringsRaw!B241)","v":""},{"$f":"IF(offeringsRaw!C241=\"\",\"\",offeringsRaw!C241)","v":""},{"$f":"IF(offeringsRaw!D241=\"\",\"\",offeringsRaw!D241)","v":""},{"$f":"IF(offeringsRaw!E241=\"\",\"\",offeringsRaw!E241)","v":""},{"$f":"IF(offeringsRaw!F241=\"\",\"\",offeringsRaw!F241)","v":""},{"$f":"IF(offeringsRaw!G241=\"\",\"\",offeringsRaw!G241)","v":""},{"$f":"IF(offeringsRaw!I241=\"\",\"\",offeringsRaw!I241)","v":""},{"$f":"IF(offeringsRaw!J241=\"\",\"\",offeringsRaw!J241)","v":""},{"$f":"IF(offeringsRaw!K241=\"\",\"\",offeringsRaw!K241)","v":""},{"$f":"IF(offeringsRaw!L241=\"\",\"\",offeringsRaw!L241)","v":""},{"$f":"IF(offeringsRaw!M241=\"\",\"\",offeringsRaw!M241)","v":""},{"$f":"IF(offeringsRaw!Q241=\"\",\"\",offeringsRaw!Q241)","v":""}," - "]
["",{"$f":"IF(offeringsRaw!B242=\"\",\"\",offeringsRaw!B242)","v":""},{"$f":"IF(offeringsRaw!C242=\"\",\"\",offeringsRaw!C242)","v":""},{"$f":"IF(offeringsRaw!D242=\"\",\"\",offeringsRaw!D242)","v":""},{"$f":"IF(offeringsRaw!E242=\"\",\"\",offeringsRaw!E242)","v":""},{"$f":"IF(offeringsRaw!F242=\"\",\"\",offeringsRaw!F242)","v":""},{"$f":"IF(offeringsRaw!G242=\"\",\"\",offeringsRaw!G242)","v":""},{"$f":"IF(offeringsRaw!I242=\"\",\"\",offeringsRaw!I242)","v":""},{"$f":"IF(offeringsRaw!J242=\"\",\"\",offeringsRaw!J242)","v":""},{"$f":"IF(offeringsRaw!K242=\"\",\"\",offeringsRaw!K242)","v":""},{"$f":"IF(offeringsRaw!L242=\"\",\"\",offeringsRaw!L242)","v":""},{"$f":"IF(offeringsRaw!M242=\"\",\"\",offeringsRaw!M242)","v":""},{"$f":"IF(offeringsRaw!Q242=\"\",\"\",offeringsRaw!Q242)","v":""}," - "]
["",{"$f":"IF(offeringsRaw!B243=\"\",\"\",offeringsRaw!B243)","v":""},{"$f":"IF(offeringsRaw!C243=\"\",\"\",offeringsRaw!C243)","v":""},{"$f":"IF(offeringsRaw!D243=\"\",\"\",offeringsRaw!D243)","v":""},{"$f":"IF(offeringsRaw!E243=\"\",\"\",offeringsRaw!E243)","v":""},{"$f":"IF(offeringsRaw!F243=\"\",\"\",offeringsRaw!F243)","v":""},{"$f":"IF(offeringsRaw!G243=\"\",\"\",offeringsRaw!G243)","v":""},{"$f":"IF(offeringsRaw!I243=\"\",\"\",offeringsRaw!I243)","v":""},{"$f":"IF(offeringsRaw!J243=\"\",\"\",offeringsRaw!J243)","v":""},{"$f":"IF(offeringsRaw!K243=\"\",\"\",offeringsRaw!K243)","v":""},{"$f":"IF(offeringsRaw!L243=\"\",\"\",offeringsRaw!L243)","v":""},{"$f":"IF(offeringsRaw!M243=\"\",\"\",offeringsRaw!M243)","v":""},{"$f":"IF(offeringsRaw!Q243=\"\",\"\",offeringsRaw!Q243)","v":""}," - "]
["",{"$f":"IF(offeringsRaw!B244=\"\",\"\",offeringsRaw!B244)","v":""},{"$f":"IF(offeringsRaw!C244=\"\",\"\",offeringsRaw!C244)","v":""},{"$f":"IF(offeringsRaw!D244=\"\",\"\",offeringsRaw!D244)","v":""},{"$f":"IF(offeringsRaw!E244=\"\",\"\",offeringsRaw!E244)","v":""},{"$f":"IF(offeringsRaw!F244=\"\",\"\",offeringsRaw!F244)","v":""},{"$f":"IF(offeringsRaw!G244=\"\",\"\",offeringsRaw!G244)","v":""},{"$f":"IF(offeringsRaw!I244=\"\",\"\",offeringsRaw!I244)","v":""},{"$f":"IF(offeringsRaw!J244=\"\",\"\",offeringsRaw!J244)","v":""},{"$f":"IF(offeringsRaw!K244=\"\",\"\",offeringsRaw!K244)","v":""},{"$f":"IF(offeringsRaw!L244=\"\",\"\",offeringsRaw!L244)","v":""},{"$f":"IF(offeringsRaw!M244=\"\",\"\",offeringsRaw!M244)","v":""},{"$f":"IF(offeringsRaw!Q244=\"\",\"\",offeringsRaw!Q244)","v":""}," - "]
["",{"$f":"IF(offeringsRaw!B245=\"\",\"\",offeringsRaw!B245)","v":""},{"$f":"IF(offeringsRaw!C245=\"\",\"\",offeringsRaw!C245)","v":""},{"$f":"IF(offeringsRaw!D245=\"\",\"\",offeringsRaw!D245)","v":""},{"$f":"IF(offeringsRaw!E245=\"\",\"\",offeringsRaw!E245)","v":""},{"$f":"IF(offeringsRaw!F245=\"\",\"\",offeringsRaw!F245)","v":""},{"$f":"IF(offeringsRaw!G245=\"\",\"\",offeringsRaw!G245)","v":""},{"$f":"IF(offeringsRaw!I245=\"\",\"\",offeringsRaw!I245)","v":""},{"$f":"IF(offeringsRaw!J245=\"\",\"\",offeringsRaw!J245)","v":""},{"$f":"IF(offeringsRaw!K245=\"\",\"\",offeringsRaw!K245)","v":""},{"$f":"IF(offeringsRaw!L245=\"\",\"\",offeringsRaw!L245)","v":""},{"$f":"IF(offeringsRaw!M245=\"\",\"\",offeringsRaw!M245)","v":""},{"$f":"IF(offeringsRaw!Q245=\"\",\"\",offeringsRaw!Q245)","v":""}," - "]
["",{"$f":"IF(offeringsRaw!B246=\"\",\"\",offeringsRaw!B246)","v":""},{"$f":"IF(offeringsRaw!C246=\"\",\"\",offeringsRaw!C246)","v":""},{"$f":"IF(offeringsRaw!D246=\"\",\"\",offeringsRaw!D246)","v":""},{"$f":"IF(offeringsRaw!E246=\"\",\"\",offeringsRaw!E246)","v":""},{"$f":"IF(offeringsRaw!F246=\"\",\"\",offeringsRaw!F246)","v":""},{"$f":"IF(offeringsRaw!G246=\"\",\"\",offeringsRaw!G246)","v":""},{"$f":"IF(offeringsRaw!I246=\"\",\"\",offeringsRaw!I246)","v":""},{"$f":"IF(offeringsRaw!J246=\"\",\"\",offeringsRaw!J246)","v":""},{"$f":"IF(offeringsRaw!K246=\"\",\"\",offeringsRaw!K246)","v":""},{"$f":"IF(offeringsRaw!L246=\"\",\"\",offeringsRaw!L246)","v":""},{"$f":"IF(offeringsRaw!M246=\"\",\"\",offeringsRaw!M246)","v":""},{"$f":"IF(offeringsRaw!Q246=\"\",\"\",offeringsRaw!Q246)","v":""}," - "]
["",{"$f":"IF(offeringsRaw!B247=\"\",\"\",offeringsRaw!B247)","v":""},{"$f":"IF(offeringsRaw!C247=\"\",\"\",offeringsRaw!C247)","v":""},{"$f":"IF(offeringsRaw!D247=\"\",\"\",offeringsRaw!D247)","v":""},{"$f":"IF(offeringsRaw!E247=\"\",\"\",offeringsRaw!E247)","v":""},{"$f":"IF(offeringsRaw!F247=\"\",\"\",offeringsRaw!F247)","v":""},{"$f":"IF(offeringsRaw!G247=\"\",\"\",offeringsRaw!G247)","v":""},{"$f":"IF(offeringsRaw!I247=\"\",\"\",offeringsRaw!I247)","v":""},{"$f":"IF(offeringsRaw!J247=\"\",\"\",offeringsRaw!J247)","v":""},{"$f":"IF(offeringsRaw!K247=\"\",\"\",offeringsRaw!K247)","v":""},{"$f":"IF(offeringsRaw!L247=\"\",\"\",offeringsRaw!L247)","v":""},{"$f":"IF(offeringsRaw!M247=\"\",\"\",offeringsRaw!M247)","v":""},{"$f":"IF(offeringsRaw!Q247=\"\",\"\",offeringsRaw!Q247)","v":""}," - "]
["",{"$f":"IF(offeringsRaw!B248=\"\",\"\",offeringsRaw!B248)","v":""},{"$f":"IF(offeringsRaw!C248=\"\",\"\",offeringsRaw!C248)","v":""},{"$f":"IF(offeringsRaw!D248=\"\",\"\",offeringsRaw!D248)","v":""},{"$f":"IF(offeringsRaw!E248=\"\",\"\",offeringsRaw!E248)","v":""},{"$f":"IF(offeringsRaw!F248=\"\",\"\",offeringsRaw!F248)","v":""},{"$f":"IF(offeringsRaw!G248=\"\",\"\",offeringsRaw!G248)","v":""},{"$f":"IF(offeringsRaw!I248=\"\",\"\",offeringsRaw!I248)","v":""},{"$f":"IF(offeringsRaw!J248=\"\",\"\",offeringsRaw!J248)","v":""},{"$f":"IF(offeringsRaw!K248=\"\",\"\",offeringsRaw!K248)","v":""},{"$f":"IF(offeringsRaw!L248=\"\",\"\",offeringsRaw!L248)","v":""},{"$f":"IF(offeringsRaw!M248=\"\",\"\",offeringsRaw!M248)","v":""},{"$f":"IF(offeringsRaw!Q248=\"\",\"\",offeringsRaw!Q248)","v":""}," - "]
["",{"$f":"IF(offeringsRaw!B249=\"\",\"\",offeringsRaw!B249)","v":""},{"$f":"IF(offeringsRaw!C249=\"\",\"\",offeringsRaw!C249)","v":""},{"$f":"IF(offeringsRaw!D249=\"\",\"\",offeringsRaw!D249)","v":""},{"$f":"IF(offeringsRaw!E249=\"\",\"\",offeringsRaw!E249)","v":""},{"$f":"IF(offeringsRaw!F249=\"\",\"\",offeringsRaw!F249)","v":""},{"$f":"IF(offeringsRaw!G249=\"\",\"\",offeringsRaw!G249)","v":""},{"$f":"IF(offeringsRaw!I249=\"\",\"\",offeringsRaw!I249)","v":""},{"$f":"IF(offeringsRaw!J249=\"\",\"\",offeringsRaw!J249)","v":""},{"$f":"IF(offeringsRaw!K249=\"\",\"\",offeringsRaw!K249)","v":""},{"$f":"IF(offeringsRaw!L249=\"\",\"\",offeringsRaw!L249)","v":""},{"$f":"IF(offeringsRaw!M249=\"\",\"\",offeringsRaw!M249)","v":""},{"$f":"IF(offeringsRaw!Q249=\"\",\"\",offeringsRaw!Q249)","v":""}," - "]
["",{"$f":"IF(offeringsRaw!B250=\"\",\"\",offeringsRaw!B250)","v":""},{"$f":"IF(offeringsRaw!C250=\"\",\"\",offeringsRaw!C250)","v":""},{"$f":"IF(offeringsRaw!D250=\"\",\"\",offeringsRaw!D250)","v":""},{"$f":"IF(offeringsRaw!E250=\"\",\"\",offeringsRaw!E250)","v":""},{"$f":"IF(offeringsRaw!F250=\"\",\"\",offeringsRaw!F250)","v":""},{"$f":"IF(offeringsRaw!G250=\"\",\"\",offeringsRaw!G250)","v":""},{"$f":"IF(offeringsRaw!I250=\"\",\"\",offeringsRaw!I250)","v":""},{"$f":"IF(offeringsRaw!J250=\"\",\"\",offeringsRaw!J250)","v":""},{"$f":"IF(offeringsRaw!K250=\"\",\"\",offeringsRaw!K250)","v":""},{"$f":"IF(offeringsRaw!L250=\"\",\"\",offeringsRaw!L250)","v":""},{"$f":"IF(offeringsRaw!M250=\"\",\"\",offeringsRaw!M250)","v":""},{"$f":"IF(offeringsRaw!Q250=\"\",\"\",offeringsRaw!Q250)","v":""}," - "]
["",{"$f":"IF(offeringsRaw!B251=\"\",\"\",offeringsRaw!B251)","v":""},{"$f":"IF(offeringsRaw!C251=\"\",\"\",offeringsRaw!C251)","v":""},{"$f":"IF(offeringsRaw!D251=\"\",\"\",offeringsRaw!D251)","v":""},{"$f":"IF(offeringsRaw!E251=\"\",\"\",offeringsRaw!E251)","v":""},{"$f":"IF(offeringsRaw!F251=\"\",\"\",offeringsRaw!F251)","v":""},{"$f":"IF(offeringsRaw!G251=\"\",\"\",offeringsRaw!G251)","v":""},{"$f":"IF(offeringsRaw!I251=\"\",\"\",offeringsRaw!I251)","v":""},{"$f":"IF(offeringsRaw!J251=\"\",\"\",offeringsRaw!J251)","v":""},{"$f":"IF(offeringsRaw!K251=\"\",\"\",offeringsRaw!K251)","v":""},{"$f":"IF(offeringsRaw!L251=\"\",\"\",offeringsRaw!L251)","v":""},{"$f":"IF(offeringsRaw!M251=\"\",\"\",offeringsRaw!M251)","v":""},{"$f":"IF(offeringsRaw!Q251=\"\",\"\",offeringsRaw!Q251)","v":""}," - "]
["",{"$f":"IF(offeringsRaw!B252=\"\",\"\",offeringsRaw!B252)","v":""},{"$f":"IF(offeringsRaw!C252=\"\",\"\",offeringsRaw!C252)","v":""},{"$f":"IF(offeringsRaw!D252=\"\",\"\",offeringsRaw!D252)","v":""},{"$f":"IF(offeringsRaw!E252=\"\",\"\",offeringsRaw!E252)","v":""},{"$f":"IF(offeringsRaw!F252=\"\",\"\",offeringsRaw!F252)","v":""},{"$f":"IF(offeringsRaw!G252=\"\",\"\",offeringsRaw!G252)","v":""},{"$f":"IF(offeringsRaw!I252=\"\",\"\",offeringsRaw!I252)","v":""},{"$f":"IF(offeringsRaw!J252=\"\",\"\",offeringsRaw!J252)","v":""},{"$f":"IF(offeringsRaw!K252=\"\",\"\",offeringsRaw!K252)","v":""},{"$f":"IF(offeringsRaw!L252=\"\",\"\",offeringsRaw!L252)","v":""},{"$f":"IF(offeringsRaw!M252=\"\",\"\",offeringsRaw!M252)","v":""},{"$f":"IF(offeringsRaw!Q252=\"\",\"\",offeringsRaw!Q252)","v":""}," - "]
["",{"$f":"IF(offeringsRaw!B253=\"\",\"\",offeringsRaw!B253)","v":""},{"$f":"IF(offeringsRaw!C253=\"\",\"\",offeringsRaw!C253)","v":""},{"$f":"IF(offeringsRaw!D253=\"\",\"\",offeringsRaw!D253)","v":""},{"$f":"IF(offeringsRaw!E253=\"\",\"\",offeringsRaw!E253)","v":""},{"$f":"IF(offeringsRaw!F253=\"\",\"\",offeringsRaw!F253)","v":""},{"$f":"IF(offeringsRaw!G253=\"\",\"\",offeringsRaw!G253)","v":""},{"$f":"IF(offeringsRaw!I253=\"\",\"\",offeringsRaw!I253)","v":""},{"$f":"IF(offeringsRaw!J253=\"\",\"\",offeringsRaw!J253)","v":""},{"$f":"IF(offeringsRaw!K253=\"\",\"\",offeringsRaw!K253)","v":""},{"$f":"IF(offeringsRaw!L253=\"\",\"\",offeringsRaw!L253)","v":""},{"$f":"IF(offeringsRaw!M253=\"\",\"\",offeringsRaw!M253)","v":""},{"$f":"IF(offeringsRaw!Q253=\"\",\"\",offeringsRaw!Q253)","v":""}," - "]
["",{"$f":"IF(offeringsRaw!B254=\"\",\"\",offeringsRaw!B254)","v":""},{"$f":"IF(offeringsRaw!C254=\"\",\"\",offeringsRaw!C254)","v":""},{"$f":"IF(offeringsRaw!D254=\"\",\"\",offeringsRaw!D254)","v":""},{"$f":"IF(offeringsRaw!E254=\"\",\"\",offeringsRaw!E254)","v":""},{"$f":"IF(offeringsRaw!F254=\"\",\"\",offeringsRaw!F254)","v":""},{"$f":"IF(offeringsRaw!G254=\"\",\"\",offeringsRaw!G254)","v":""},{"$f":"IF(offeringsRaw!I254=\"\",\"\",offeringsRaw!I254)","v":""},{"$f":"IF(offeringsRaw!J254=\"\",\"\",offeringsRaw!J254)","v":""},{"$f":"IF(offeringsRaw!K254=\"\",\"\",offeringsRaw!K254)","v":""},{"$f":"IF(offeringsRaw!L254=\"\",\"\",offeringsRaw!L254)","v":""},{"$f":"IF(offeringsRaw!M254=\"\",\"\",offeringsRaw!M254)","v":""},{"$f":"IF(offeringsRaw!Q254=\"\",\"\",offeringsRaw!Q254)","v":""}," - "]
["",{"$f":"IF(offeringsRaw!B255=\"\",\"\",offeringsRaw!B255)","v":""},{"$f":"IF(offeringsRaw!C255=\"\",\"\",offeringsRaw!C255)","v":""},{"$f":"IF(offeringsRaw!D255=\"\",\"\",offeringsRaw!D255)","v":""},{"$f":"IF(offeringsRaw!E255=\"\",\"\",offeringsRaw!E255)","v":""},{"$f":"IF(offeringsRaw!F255=\"\",\"\",offeringsRaw!F255)","v":""},{"$f":"IF(offeringsRaw!G255=\"\",\"\",offeringsRaw!G255)","v":""},{"$f":"IF(offeringsRaw!I255=\"\",\"\",offeringsRaw!I255)","v":""},{"$f":"IF(offeringsRaw!J255=\"\",\"\",offeringsRaw!J255)","v":""},{"$f":"IF(offeringsRaw!K255=\"\",\"\",offeringsRaw!K255)","v":""},{"$f":"IF(offeringsRaw!L255=\"\",\"\",offeringsRaw!L255)","v":""},{"$f":"IF(offeringsRaw!M255=\"\",\"\",offeringsRaw!M255)","v":""},{"$f":"IF(offeringsRaw!Q255=\"\",\"\",offeringsRaw!Q255)","v":""}," - "]
["",{"$f":"IF(offeringsRaw!B256=\"\",\"\",offeringsRaw!B256)","v":""},{"$f":"IF(offeringsRaw!C256=\"\",\"\",offeringsRaw!C256)","v":""},{"$f":"IF(offeringsRaw!D256=\"\",\"\",offeringsRaw!D256)","v":""},{"$f":"IF(offeringsRaw!E256=\"\",\"\",offeringsRaw!E256)","v":""},{"$f":"IF(offeringsRaw!F256=\"\",\"\",offeringsRaw!F256)","v":""},{"$f":"IF(offeringsRaw!G256=\"\",\"\",offeringsRaw!G256)","v":""},{"$f":"IF(offeringsRaw!I256=\"\",\"\",offeringsRaw!I256)","v":""},{"$f":"IF(offeringsRaw!J256=\"\",\"\",offeringsRaw!J256)","v":""},{"$f":"IF(offeringsRaw!K256=\"\",\"\",offeringsRaw!K256)","v":""},{"$f":"IF(offeringsRaw!L256=\"\",\"\",offeringsRaw!L256)","v":""},{"$f":"IF(offeringsRaw!M256=\"\",\"\",offeringsRaw!M256)","v":""},{"$f":"IF(offeringsRaw!Q256=\"\",\"\",offeringsRaw!Q256)","v":""}," - "]
["",{"$f":"IF(offeringsRaw!B257=\"\",\"\",offeringsRaw!B257)","v":""},{"$f":"IF(offeringsRaw!C257=\"\",\"\",offeringsRaw!C257)","v":""},{"$f":"IF(offeringsRaw!D257=\"\",\"\",offeringsRaw!D257)","v":""},{"$f":"IF(offeringsRaw!E257=\"\",\"\",offeringsRaw!E257)","v":""},{"$f":"IF(offeringsRaw!F257=\"\",\"\",offeringsRaw!F257)","v":""},{"$f":"IF(offeringsRaw!G257=\"\",\"\",offeringsRaw!G257)","v":""},{"$f":"IF(offeringsRaw!I257=\"\",\"\",offeringsRaw!I257)","v":""},{"$f":"IF(offeringsRaw!J257=\"\",\"\",offeringsRaw!J257)","v":""},{"$f":"IF(offeringsRaw!K257=\"\",\"\",offeringsRaw!K257)","v":""},{"$f":"IF(offeringsRaw!L257=\"\",\"\",offeringsRaw!L257)","v":""},{"$f":"IF(offeringsRaw!M257=\"\",\"\",offeringsRaw!M257)","v":""},{"$f":"IF(offeringsRaw!Q257=\"\",\"\",offeringsRaw!Q257)","v":""},{"$f":"TEXT(D262,\"000\") & \" - \" &M262","v":" - "}]
[{"$f":"IF(RIGHT(B263,5)=\"A</A>\",\"A\",\"\")","v":""},{"$f":"IF(offeringsRaw!B258=\"\",\"\",offeringsRaw!B258)","v":""},{"$f":"IF(offeringsRaw!C258=\"\",\"\",offeringsRaw!C258)","v":""},{"$f":"IF(offeringsRaw!D258=\"\",\"\",offeringsRaw!D258)","v":""},{"$f":"IF(offeringsRaw!E258=\"\",\"\",offeringsRaw!E258)","v":""},{"$f":"IF(offeringsRaw!F258=\"\",\"\",offeringsRaw!F258)","v":""},{"$f":"IF(offeringsRaw!G258=\"\",\"\",offeringsRaw!G258)","v":""},{"$f":"IF(offeringsRaw!I258=\"\",\"\",offeringsRaw!I258)","v":""},{"$f":"IF(offeringsRaw!J258=\"\",\"\",offeringsRaw!J258)","v":""},{"$f":"IF(offeringsRaw!K258=\"\",\"\",offeringsRaw!K258)","v":""},{"$f":"IF(offeringsRaw!L258=\"\",\"\",offeringsRaw!L258)","v":""},{"$f":"IF(offeringsRaw!M258=\"\",\"\",offeringsRaw!M258)","v":""},{"$f":"IF(offeringsRaw!Q258=\"\",\"\",offeringsRaw!Q258)","v":""}," - "]
["",{"$f":"IF(offeringsRaw!B259=\"\",\"\",offeringsRaw!B259)","v":""},{"$f":"IF(offeringsRaw!C259=\"\",\"\",offeringsRaw!C259)","v":""},{"$f":"IF(offeringsRaw!D259=\"\",\"\",offeringsRaw!D259)","v":""},{"$f":"IF(offeringsRaw!E259=\"\",\"\",offeringsRaw!E259)","v":""},{"$f":"IF(offeringsRaw!F259=\"\",\"\",offeringsRaw!F259)","v":""},{"$f":"IF(offeringsRaw!G259=\"\",\"\",offeringsRaw!G259)","v":""},{"$f":"IF(offeringsRaw!I259=\"\",\"\",offeringsRaw!I259)","v":""},{"$f":"IF(offeringsRaw!J259=\"\",\"\",offeringsRaw!J259)","v":""},{"$f":"IF(offeringsRaw!K259=\"\",\"\",offeringsRaw!K259)","v":""},{"$f":"IF(offeringsRaw!L259=\"\",\"\",offeringsRaw!L259)","v":""},{"$f":"IF(offeringsRaw!M259=\"\",\"\",offeringsRaw!M259)","v":""},{"$f":"IF(offeringsRaw!Q259=\"\",\"\",offeringsRaw!Q259)","v":""}," - "]
["",{"$f":"IF(offeringsRaw!B260=\"\",\"\",offeringsRaw!B260)","v":""},{"$f":"IF(offeringsRaw!C260=\"\",\"\",offeringsRaw!C260)","v":""},{"$f":"IF(offeringsRaw!D260=\"\",\"\",offeringsRaw!D260)","v":""},{"$f":"IF(offeringsRaw!E260=\"\",\"\",offeringsRaw!E260)","v":""},{"$f":"IF(offeringsRaw!F260=\"\",\"\",offeringsRaw!F260)","v":""},{"$f":"IF(offeringsRaw!G260=\"\",\"\",offeringsRaw!G260)","v":""},{"$f":"IF(offeringsRaw!I260=\"\",\"\",offeringsRaw!I260)","v":""},{"$f":"IF(offeringsRaw!J260=\"\",\"\",offeringsRaw!J260)","v":""},{"$f":"IF(offeringsRaw!K260=\"\",\"\",offeringsRaw!K260)","v":""},{"$f":"IF(offeringsRaw!L260=\"\",\"\",offeringsRaw!L260)","v":""},{"$f":"IF(offeringsRaw!M260=\"\",\"\",offeringsRaw!M260)","v":""},{"$f":"IF(offeringsRaw!Q260=\"\",\"\",offeringsRaw!Q260)","v":""}," - "]
["",{"$f":"IF(offeringsRaw!B261=\"\",\"\",offeringsRaw!B261)","v":""},{"$f":"IF(offeringsRaw!C261=\"\",\"\",offeringsRaw!C261)","v":""},{"$f":"IF(offeringsRaw!D261=\"\",\"\",offeringsRaw!D261)","v":""},{"$f":"IF(offeringsRaw!E261=\"\",\"\",offeringsRaw!E261)","v":""},{"$f":"IF(offeringsRaw!F261=\"\",\"\",offeringsRaw!F261)","v":""},{"$f":"IF(offeringsRaw!G261=\"\",\"\",offeringsRaw!G261)","v":""},{"$f":"IF(offeringsRaw!I261=\"\",\"\",offeringsRaw!I261)","v":""},{"$f":"IF(offeringsRaw!J261=\"\",\"\",offeringsRaw!J261)","v":""},{"$f":"IF(offeringsRaw!K261=\"\",\"\",offeringsRaw!K261)","v":""},{"$f":"IF(offeringsRaw!L261=\"\",\"\",offeringsRaw!L261)","v":""},{"$f":"IF(offeringsRaw!M261=\"\",\"\",offeringsRaw!M261)","v":""},{"$f":"IF(offeringsRaw!Q261=\"\",\"\",offeringsRaw!Q261)","v":""}," - "]
["",{"$f":"IF(offeringsRaw!B262=\"\",\"\",offeringsRaw!B262)","v":""},{"$f":"IF(offeringsRaw!C262=\"\",\"\",offeringsRaw!C262)","v":""},{"$f":"IF(offeringsRaw!D262=\"\",\"\",offeringsRaw!D262)","v":""},{"$f":"IF(offeringsRaw!E262=\"\",\"\",offeringsRaw!E262)","v":""},{"$f":"IF(offeringsRaw!F262=\"\",\"\",offeringsRaw!F262)","v":""},{"$f":"IF(offeringsRaw!G262=\"\",\"\",offeringsRaw!G262)","v":""},{"$f":"IF(offeringsRaw!I262=\"\",\"\",offeringsRaw!I262)","v":""},{"$f":"IF(offeringsRaw!J262=\"\",\"\",offeringsRaw!J262)","v":""},{"$f":"IF(offeringsRaw!K262=\"\",\"\",offeringsRaw!K262)","v":""},{"$f":"IF(offeringsRaw!L262=\"\",\"\",offeringsRaw!L262)","v":""},{"$f":"IF(offeringsRaw!M262=\"\",\"\",offeringsRaw!M262)","v":""},{"$f":"IF(offeringsRaw!Q262=\"\",\"\",offeringsRaw!Q262)","v":""}," - "]
["",{"$f":"IF(offeringsRaw!B263=\"\",\"\",offeringsRaw!B263)","v":""},{"$f":"IF(offeringsRaw!C263=\"\",\"\",offeringsRaw!C263)","v":""},{"$f":"IF(offeringsRaw!D263=\"\",\"\",offeringsRaw!D263)","v":""},{"$f":"IF(offeringsRaw!E263=\"\",\"\",offeringsRaw!E263)","v":""},{"$f":"IF(offeringsRaw!F263=\"\",\"\",offeringsRaw!F263)","v":""},{"$f":"IF(offeringsRaw!G263=\"\",\"\",offeringsRaw!G263)","v":""},{"$f":"IF(offeringsRaw!I263=\"\",\"\",offeringsRaw!I263)","v":""},{"$f":"IF(offeringsRaw!J263=\"\",\"\",offeringsRaw!J263)","v":""},{"$f":"IF(offeringsRaw!K263=\"\",\"\",offeringsRaw!K263)","v":""},{"$f":"IF(offeringsRaw!L263=\"\",\"\",offeringsRaw!L263)","v":""},{"$f":"IF(offeringsRaw!M263=\"\",\"\",offeringsRaw!M263)","v":""},{"$f":"IF(offeringsRaw!Q263=\"\",\"\",offeringsRaw!Q263)","v":""}," - "]
["",{"$f":"IF(offeringsRaw!B264=\"\",\"\",offeringsRaw!B264)","v":""},{"$f":"IF(offeringsRaw!C264=\"\",\"\",offeringsRaw!C264)","v":""},{"$f":"IF(offeringsRaw!D264=\"\",\"\",offeringsRaw!D264)","v":""},{"$f":"IF(offeringsRaw!E264=\"\",\"\",offeringsRaw!E264)","v":""},{"$f":"IF(offeringsRaw!F264=\"\",\"\",offeringsRaw!F264)","v":""},{"$f":"IF(offeringsRaw!G264=\"\",\"\",offeringsRaw!G264)","v":""},{"$f":"IF(offeringsRaw!I264=\"\",\"\",offeringsRaw!I264)","v":""},{"$f":"IF(offeringsRaw!J264=\"\",\"\",offeringsRaw!J264)","v":""},{"$f":"IF(offeringsRaw!K264=\"\",\"\",offeringsRaw!K264)","v":""},{"$f":"IF(offeringsRaw!L264=\"\",\"\",offeringsRaw!L264)","v":""},{"$f":"IF(offeringsRaw!M264=\"\",\"\",offeringsRaw!M264)","v":""},{"$f":"IF(offeringsRaw!Q264=\"\",\"\",offeringsRaw!Q264)","v":""}," - "]
["",{"$f":"IF(offeringsRaw!B265=\"\",\"\",offeringsRaw!B265)","v":""},{"$f":"IF(offeringsRaw!C265=\"\",\"\",offeringsRaw!C265)","v":""},{"$f":"IF(offeringsRaw!D265=\"\",\"\",offeringsRaw!D265)","v":""},{"$f":"IF(offeringsRaw!E265=\"\",\"\",offeringsRaw!E265)","v":""},{"$f":"IF(offeringsRaw!F265=\"\",\"\",offeringsRaw!F265)","v":""},{"$f":"IF(offeringsRaw!G265=\"\",\"\",offeringsRaw!G265)","v":""},{"$f":"IF(offeringsRaw!I265=\"\",\"\",offeringsRaw!I265)","v":""},{"$f":"IF(offeringsRaw!J265=\"\",\"\",offeringsRaw!J265)","v":""},{"$f":"IF(offeringsRaw!K265=\"\",\"\",offeringsRaw!K265)","v":""},{"$f":"IF(offeringsRaw!L265=\"\",\"\",offeringsRaw!L265)","v":""},{"$f":"IF(offeringsRaw!M265=\"\",\"\",offeringsRaw!M265)","v":""},{"$f":"IF(offeringsRaw!Q265=\"\",\"\",offeringsRaw!Q265)","v":""}," - "]
["",{"$f":"IF(offeringsRaw!B266=\"\",\"\",offeringsRaw!B266)","v":""},{"$f":"IF(offeringsRaw!C266=\"\",\"\",offeringsRaw!C266)","v":""},{"$f":"IF(offeringsRaw!D266=\"\",\"\",offeringsRaw!D266)","v":""},{"$f":"IF(offeringsRaw!E266=\"\",\"\",offeringsRaw!E266)","v":""},{"$f":"IF(offeringsRaw!F266=\"\",\"\",offeringsRaw!F266)","v":""},{"$f":"IF(offeringsRaw!G266=\"\",\"\",offeringsRaw!G266)","v":""},{"$f":"IF(offeringsRaw!I266=\"\",\"\",offeringsRaw!I266)","v":""},{"$f":"IF(offeringsRaw!J266=\"\",\"\",offeringsRaw!J266)","v":""},{"$f":"IF(offeringsRaw!K266=\"\",\"\",offeringsRaw!K266)","v":""},{"$f":"IF(offeringsRaw!L266=\"\",\"\",offeringsRaw!L266)","v":""},{"$f":"IF(offeringsRaw!M266=\"\",\"\",offeringsRaw!M266)","v":""},{"$f":"IF(offeringsRaw!Q266=\"\",\"\",offeringsRaw!Q266)","v":""}," - "]
["",{"$f":"IF(offeringsRaw!B267=\"\",\"\",offeringsRaw!B267)","v":""},{"$f":"IF(offeringsRaw!C267=\"\",\"\",offeringsRaw!C267)","v":""},{"$f":"IF(offeringsRaw!D267=\"\",\"\",offeringsRaw!D267)","v":""},{"$f":"IF(offeringsRaw!E267=\"\",\"\",offeringsRaw!E267)","v":""},{"$f":"IF(offeringsRaw!F267=\"\",\"\",offeringsRaw!F267)","v":""},{"$f":"IF(offeringsRaw!G267=\"\",\"\",offeringsRaw!G267)","v":""},{"$f":"IF(offeringsRaw!I267=\"\",\"\",offeringsRaw!I267)","v":""},{"$f":"IF(offeringsRaw!J267=\"\",\"\",offeringsRaw!J267)","v":""},{"$f":"IF(offeringsRaw!K267=\"\",\"\",offeringsRaw!K267)","v":""},{"$f":"IF(offeringsRaw!L267=\"\",\"\",offeringsRaw!L267)","v":""},{"$f":"IF(offeringsRaw!M267=\"\",\"\",offeringsRaw!M267)","v":""},{"$f":"IF(offeringsRaw!Q267=\"\",\"\",offeringsRaw!Q267)","v":""}," - "]
["",{"$f":"IF(offeringsRaw!B268=\"\",\"\",offeringsRaw!B268)","v":""},{"$f":"IF(offeringsRaw!C268=\"\",\"\",offeringsRaw!C268)","v":""},{"$f":"IF(offeringsRaw!D268=\"\",\"\",offeringsRaw!D268)","v":""},{"$f":"IF(offeringsRaw!E268=\"\",\"\",offeringsRaw!E268)","v":""},{"$f":"IF(offeringsRaw!F268=\"\",\"\",offeringsRaw!F268)","v":""},{"$f":"IF(offeringsRaw!G268=\"\",\"\",offeringsRaw!G268)","v":""},{"$f":"IF(offeringsRaw!I268=\"\",\"\",offeringsRaw!I268)","v":""},{"$f":"IF(offeringsRaw!J268=\"\",\"\",offeringsRaw!J268)","v":""},{"$f":"IF(offeringsRaw!K268=\"\",\"\",offeringsRaw!K268)","v":""},{"$f":"IF(offeringsRaw!L268=\"\",\"\",offeringsRaw!L268)","v":""},{"$f":"IF(offeringsRaw!M268=\"\",\"\",offeringsRaw!M268)","v":""},{"$f":"IF(offeringsRaw!Q268=\"\",\"\",offeringsRaw!Q268)","v":""}," - "]
["",{"$f":"IF(offeringsRaw!B269=\"\",\"\",offeringsRaw!B269)","v":""},{"$f":"IF(offeringsRaw!C269=\"\",\"\",offeringsRaw!C269)","v":""},{"$f":"IF(offeringsRaw!D269=\"\",\"\",offeringsRaw!D269)","v":""},{"$f":"IF(offeringsRaw!E269=\"\",\"\",offeringsRaw!E269)","v":""},{"$f":"IF(offeringsRaw!F269=\"\",\"\",offeringsRaw!F269)","v":""},{"$f":"IF(offeringsRaw!G269=\"\",\"\",offeringsRaw!G269)","v":""},{"$f":"IF(offeringsRaw!I269=\"\",\"\",offeringsRaw!I269)","v":""},{"$f":"IF(offeringsRaw!J269=\"\",\"\",offeringsRaw!J269)","v":""},{"$f":"IF(offeringsRaw!K269=\"\",\"\",offeringsRaw!K269)","v":""},{"$f":"IF(offeringsRaw!L269=\"\",\"\",offeringsRaw!L269)","v":""},{"$f":"IF(offeringsRaw!M269=\"\",\"\",offeringsRaw!M269)","v":""},{"$f":"IF(offeringsRaw!Q269=\"\",\"\",offeringsRaw!Q269)","v":""}," - "]
["",{"$f":"IF(offeringsRaw!B270=\"\",\"\",offeringsRaw!B270)","v":""},{"$f":"IF(offeringsRaw!C270=\"\",\"\",offeringsRaw!C270)","v":""},{"$f":"IF(offeringsRaw!D270=\"\",\"\",offeringsRaw!D270)","v":""},{"$f":"IF(offeringsRaw!E270=\"\",\"\",offeringsRaw!E270)","v":""},{"$f":"IF(offeringsRaw!F270=\"\",\"\",offeringsRaw!F270)","v":""},{"$f":"IF(offeringsRaw!G270=\"\",\"\",offeringsRaw!G270)","v":""},{"$f":"IF(offeringsRaw!I270=\"\",\"\",offeringsRaw!I270)","v":""},{"$f":"IF(offeringsRaw!J270=\"\",\"\",offeringsRaw!J270)","v":""},{"$f":"IF(offeringsRaw!K270=\"\",\"\",offeringsRaw!K270)","v":""},{"$f":"IF(offeringsRaw!L270=\"\",\"\",offeringsRaw!L270)","v":""},{"$f":"IF(offeringsRaw!M270=\"\",\"\",offeringsRaw!M270)","v":""},{"$f":"IF(offeringsRaw!Q270=\"\",\"\",offeringsRaw!Q270)","v":""}," - "]
["",{"$f":"IF(offeringsRaw!B271=\"\",\"\",offeringsRaw!B271)","v":""},{"$f":"IF(offeringsRaw!C271=\"\",\"\",offeringsRaw!C271)","v":""},{"$f":"IF(offeringsRaw!D271=\"\",\"\",offeringsRaw!D271)","v":""},{"$f":"IF(offeringsRaw!E271=\"\",\"\",offeringsRaw!E271)","v":""},{"$f":"IF(offeringsRaw!F271=\"\",\"\",offeringsRaw!F271)","v":""},{"$f":"IF(offeringsRaw!G271=\"\",\"\",offeringsRaw!G271)","v":""},{"$f":"IF(offeringsRaw!I271=\"\",\"\",offeringsRaw!I271)","v":""},{"$f":"IF(offeringsRaw!J271=\"\",\"\",offeringsRaw!J271)","v":""},{"$f":"IF(offeringsRaw!K271=\"\",\"\",offeringsRaw!K271)","v":""},{"$f":"IF(offeringsRaw!L271=\"\",\"\",offeringsRaw!L271)","v":""},{"$f":"IF(offeringsRaw!M271=\"\",\"\",offeringsRaw!M271)","v":""},{"$f":"IF(offeringsRaw!Q271=\"\",\"\",offeringsRaw!Q271)","v":""}," - "]
["",{"$f":"IF(offeringsRaw!B272=\"\",\"\",offeringsRaw!B272)","v":""},{"$f":"IF(offeringsRaw!C272=\"\",\"\",offeringsRaw!C272)","v":""},{"$f":"IF(offeringsRaw!D272=\"\",\"\",offeringsRaw!D272)","v":""},{"$f":"IF(offeringsRaw!E272=\"\",\"\",offeringsRaw!E272)","v":""},{"$f":"IF(offeringsRaw!F272=\"\",\"\",offeringsRaw!F272)","v":""},{"$f":"IF(offeringsRaw!G272=\"\",\"\",offeringsRaw!G272)","v":""},{"$f":"IF(offeringsRaw!I272=\"\",\"\",offeringsRaw!I272)","v":""},{"$f":"IF(offeringsRaw!J272=\"\",\"\",offeringsRaw!J272)","v":""},{"$f":"IF(offeringsRaw!K272=\"\",\"\",offeringsRaw!K272)","v":""},{"$f":"IF(offeringsRaw!L272=\"\",\"\",offeringsRaw!L272)","v":""},{"$f":"IF(offeringsRaw!M272=\"\",\"\",offeringsRaw!M272)","v":""},{"$f":"IF(offeringsRaw!Q272=\"\",\"\",offeringsRaw!Q272)","v":""}," - "]
["",{"$f":"IF(offeringsRaw!B273=\"\",\"\",offeringsRaw!B273)","v":""},{"$f":"IF(offeringsRaw!C273=\"\",\"\",offeringsRaw!C273)","v":""},{"$f":"IF(offeringsRaw!D273=\"\",\"\",offeringsRaw!D273)","v":""},{"$f":"IF(offeringsRaw!E273=\"\",\"\",offeringsRaw!E273)","v":""},{"$f":"IF(offeringsRaw!F273=\"\",\"\",offeringsRaw!F273)","v":""},{"$f":"IF(offeringsRaw!G273=\"\",\"\",offeringsRaw!G273)","v":""},{"$f":"IF(offeringsRaw!I273=\"\",\"\",offeringsRaw!I273)","v":""},{"$f":"IF(offeringsRaw!J273=\"\",\"\",offeringsRaw!J273)","v":""},{"$f":"IF(offeringsRaw!K273=\"\",\"\",offeringsRaw!K273)","v":""},{"$f":"IF(offeringsRaw!L273=\"\",\"\",offeringsRaw!L273)","v":""},{"$f":"IF(offeringsRaw!M273=\"\",\"\",offeringsRaw!M273)","v":""},{"$f":"IF(offeringsRaw!Q273=\"\",\"\",offeringsRaw!Q273)","v":""}," - "]
["",{"$f":"IF(offeringsRaw!B274=\"\",\"\",offeringsRaw!B274)","v":""},{"$f":"IF(offeringsRaw!C274=\"\",\"\",offeringsRaw!C274)","v":""},{"$f":"IF(offeringsRaw!D274=\"\",\"\",offeringsRaw!D274)","v":""},{"$f":"IF(offeringsRaw!E274=\"\",\"\",offeringsRaw!E274)","v":""},{"$f":"IF(offeringsRaw!F274=\"\",\"\",offeringsRaw!F274)","v":""},{"$f":"IF(offeringsRaw!G274=\"\",\"\",offeringsRaw!G274)","v":""},{"$f":"IF(offeringsRaw!I274=\"\",\"\",offeringsRaw!I274)","v":""},{"$f":"IF(offeringsRaw!J274=\"\",\"\",offeringsRaw!J274)","v":""},{"$f":"IF(offeringsRaw!K274=\"\",\"\",offeringsRaw!K274)","v":""},{"$f":"IF(offeringsRaw!L274=\"\",\"\",offeringsRaw!L274)","v":""},{"$f":"IF(offeringsRaw!M274=\"\",\"\",offeringsRaw!M274)","v":""},{"$f":"IF(offeringsRaw!Q274=\"\",\"\",offeringsRaw!Q274)","v":""}," - "]
["",{"$f":"IF(offeringsRaw!B275=\"\",\"\",offeringsRaw!B275)","v":""},{"$f":"IF(offeringsRaw!C275=\"\",\"\",offeringsRaw!C275)","v":""},{"$f":"IF(offeringsRaw!D275=\"\",\"\",offeringsRaw!D275)","v":""},{"$f":"IF(offeringsRaw!E275=\"\",\"\",offeringsRaw!E275)","v":""},{"$f":"IF(offeringsRaw!F275=\"\",\"\",offeringsRaw!F275)","v":""},{"$f":"IF(offeringsRaw!G275=\"\",\"\",offeringsRaw!G275)","v":""},{"$f":"IF(offeringsRaw!I275=\"\",\"\",offeringsRaw!I275)","v":""},{"$f":"IF(offeringsRaw!J275=\"\",\"\",offeringsRaw!J275)","v":""},{"$f":"IF(offeringsRaw!K275=\"\",\"\",offeringsRaw!K275)","v":""},{"$f":"IF(offeringsRaw!L275=\"\",\"\",offeringsRaw!L275)","v":""},{"$f":"IF(offeringsRaw!M275=\"\",\"\",offeringsRaw!M275)","v":""},{"$f":"IF(offeringsRaw!Q275=\"\",\"\",offeringsRaw!Q275)","v":""}," - "]
["",{"$f":"IF(offeringsRaw!B276=\"\",\"\",offeringsRaw!B276)","v":""},{"$f":"IF(offeringsRaw!C276=\"\",\"\",offeringsRaw!C276)","v":""},{"$f":"IF(offeringsRaw!D276=\"\",\"\",offeringsRaw!D276)","v":""},{"$f":"IF(offeringsRaw!E276=\"\",\"\",offeringsRaw!E276)","v":""},{"$f":"IF(offeringsRaw!F276=\"\",\"\",offeringsRaw!F276)","v":""},{"$f":"IF(offeringsRaw!G276=\"\",\"\",offeringsRaw!G276)","v":""},{"$f":"IF(offeringsRaw!I276=\"\",\"\",offeringsRaw!I276)","v":""},{"$f":"IF(offeringsRaw!J276=\"\",\"\",offeringsRaw!J276)","v":""},{"$f":"IF(offeringsRaw!K276=\"\",\"\",offeringsRaw!K276)","v":""},{"$f":"IF(offeringsRaw!L276=\"\",\"\",offeringsRaw!L276)","v":""},{"$f":"IF(offeringsRaw!M276=\"\",\"\",offeringsRaw!M276)","v":""},{"$f":"IF(offeringsRaw!Q276=\"\",\"\",offeringsRaw!Q276)","v":""}," - "]
["",{"$f":"IF(offeringsRaw!B277=\"\",\"\",offeringsRaw!B277)","v":""},{"$f":"IF(offeringsRaw!C277=\"\",\"\",offeringsRaw!C277)","v":""},{"$f":"IF(offeringsRaw!D277=\"\",\"\",offeringsRaw!D277)","v":""},{"$f":"IF(offeringsRaw!E277=\"\",\"\",offeringsRaw!E277)","v":""},{"$f":"IF(offeringsRaw!F277=\"\",\"\",offeringsRaw!F277)","v":""},{"$f":"IF(offeringsRaw!G277=\"\",\"\",offeringsRaw!G277)","v":""},{"$f":"IF(offeringsRaw!I277=\"\",\"\",offeringsRaw!I277)","v":""},{"$f":"IF(offeringsRaw!J277=\"\",\"\",offeringsRaw!J277)","v":""},{"$f":"IF(offeringsRaw!K277=\"\",\"\",offeringsRaw!K277)","v":""},{"$f":"IF(offeringsRaw!L277=\"\",\"\",offeringsRaw!L277)","v":""},{"$f":"IF(offeringsRaw!M277=\"\",\"\",offeringsRaw!M277)","v":""},{"$f":"IF(offeringsRaw!Q277=\"\",\"\",offeringsRaw!Q277)","v":""}," - "]
["",{"$f":"IF(offeringsRaw!B278=\"\",\"\",offeringsRaw!B278)","v":""},{"$f":"IF(offeringsRaw!C278=\"\",\"\",offeringsRaw!C278)","v":""},{"$f":"IF(offeringsRaw!D278=\"\",\"\",offeringsRaw!D278)","v":""},{"$f":"IF(offeringsRaw!E278=\"\",\"\",offeringsRaw!E278)","v":""},{"$f":"IF(offeringsRaw!F278=\"\",\"\",offeringsRaw!F278)","v":""},{"$f":"IF(offeringsRaw!G278=\"\",\"\",offeringsRaw!G278)","v":""},{"$f":"IF(offeringsRaw!I278=\"\",\"\",offeringsRaw!I278)","v":""},{"$f":"IF(offeringsRaw!J278=\"\",\"\",offeringsRaw!J278)","v":""},{"$f":"IF(offeringsRaw!K278=\"\",\"\",offeringsRaw!K278)","v":""},{"$f":"IF(offeringsRaw!L278=\"\",\"\",offeringsRaw!L278)","v":""},{"$f":"IF(offeringsRaw!M278=\"\",\"\",offeringsRaw!M278)","v":""},{"$f":"IF(offeringsRaw!Q278=\"\",\"\",offeringsRaw!Q278)","v":""}," - "]
["",{"$f":"IF(offeringsRaw!B279=\"\",\"\",offeringsRaw!B279)","v":""},{"$f":"IF(offeringsRaw!C279=\"\",\"\",offeringsRaw!C279)","v":""},{"$f":"IF(offeringsRaw!D279=\"\",\"\",offeringsRaw!D279)","v":""},{"$f":"IF(offeringsRaw!E279=\"\",\"\",offeringsRaw!E279)","v":""},{"$f":"IF(offeringsRaw!F279=\"\",\"\",offeringsRaw!F279)","v":""},{"$f":"IF(offeringsRaw!G279=\"\",\"\",offeringsRaw!G279)","v":""},{"$f":"IF(offeringsRaw!I279=\"\",\"\",offeringsRaw!I279)","v":""},{"$f":"IF(offeringsRaw!J279=\"\",\"\",offeringsRaw!J279)","v":""},{"$f":"IF(offeringsRaw!K279=\"\",\"\",offeringsRaw!K279)","v":""},{"$f":"IF(offeringsRaw!L279=\"\",\"\",offeringsRaw!L279)","v":""},{"$f":"IF(offeringsRaw!M279=\"\",\"\",offeringsRaw!M279)","v":""},{"$f":"IF(offeringsRaw!Q279=\"\",\"\",offeringsRaw!Q279)","v":""}," - "]
["",{"$f":"IF(offeringsRaw!B280=\"\",\"\",offeringsRaw!B280)","v":""},{"$f":"IF(offeringsRaw!C280=\"\",\"\",offeringsRaw!C280)","v":""},{"$f":"IF(offeringsRaw!D280=\"\",\"\",offeringsRaw!D280)","v":""},{"$f":"IF(offeringsRaw!E280=\"\",\"\",offeringsRaw!E280)","v":""},{"$f":"IF(offeringsRaw!F280=\"\",\"\",offeringsRaw!F280)","v":""},{"$f":"IF(offeringsRaw!G280=\"\",\"\",offeringsRaw!G280)","v":""},{"$f":"IF(offeringsRaw!I280=\"\",\"\",offeringsRaw!I280)","v":""},{"$f":"IF(offeringsRaw!J280=\"\",\"\",offeringsRaw!J280)","v":""},{"$f":"IF(offeringsRaw!K280=\"\",\"\",offeringsRaw!K280)","v":""},{"$f":"IF(offeringsRaw!L280=\"\",\"\",offeringsRaw!L280)","v":""},{"$f":"IF(offeringsRaw!M280=\"\",\"\",offeringsRaw!M280)","v":""},{"$f":"IF(offeringsRaw!Q280=\"\",\"\",offeringsRaw!Q280)","v":""}," - "]
["",{"$f":"IF(offeringsRaw!B281=\"\",\"\",offeringsRaw!B281)","v":""},{"$f":"IF(offeringsRaw!C281=\"\",\"\",offeringsRaw!C281)","v":""},{"$f":"IF(offeringsRaw!D281=\"\",\"\",offeringsRaw!D281)","v":""},{"$f":"IF(offeringsRaw!E281=\"\",\"\",offeringsRaw!E281)","v":""},{"$f":"IF(offeringsRaw!F281=\"\",\"\",offeringsRaw!F281)","v":""},{"$f":"IF(offeringsRaw!G281=\"\",\"\",offeringsRaw!G281)","v":""},{"$f":"IF(offeringsRaw!I281=\"\",\"\",offeringsRaw!I281)","v":""},{"$f":"IF(offeringsRaw!J281=\"\",\"\",offeringsRaw!J281)","v":""},{"$f":"IF(offeringsRaw!K281=\"\",\"\",offeringsRaw!K281)","v":""},{"$f":"IF(offeringsRaw!L281=\"\",\"\",offeringsRaw!L281)","v":""},{"$f":"IF(offeringsRaw!M281=\"\",\"\",offeringsRaw!M281)","v":""},{"$f":"IF(offeringsRaw!Q281=\"\",\"\",offeringsRaw!Q281)","v":""}," - "]
["",{"$f":"IF(offeringsRaw!B282=\"\",\"\",offeringsRaw!B282)","v":""},{"$f":"IF(offeringsRaw!C282=\"\",\"\",offeringsRaw!C282)","v":""},{"$f":"IF(offeringsRaw!D282=\"\",\"\",offeringsRaw!D282)","v":""},{"$f":"IF(offeringsRaw!E282=\"\",\"\",offeringsRaw!E282)","v":""},{"$f":"IF(offeringsRaw!F282=\"\",\"\",offeringsRaw!F282)","v":""},{"$f":"IF(offeringsRaw!G282=\"\",\"\",offeringsRaw!G282)","v":""},{"$f":"IF(offeringsRaw!I282=\"\",\"\",offeringsRaw!I282)","v":""},{"$f":"IF(offeringsRaw!J282=\"\",\"\",offeringsRaw!J282)","v":""},{"$f":"IF(offeringsRaw!K282=\"\",\"\",offeringsRaw!K282)","v":""},{"$f":"IF(offeringsRaw!L282=\"\",\"\",offeringsRaw!L282)","v":""},{"$f":"IF(offeringsRaw!M282=\"\",\"\",offeringsRaw!M282)","v":""},{"$f":"IF(offeringsRaw!Q282=\"\",\"\",offeringsRaw!Q282)","v":""}," - "]
["",{"$f":"IF(offeringsRaw!B283=\"\",\"\",offeringsRaw!B283)","v":""},{"$f":"IF(offeringsRaw!C283=\"\",\"\",offeringsRaw!C283)","v":""},{"$f":"IF(offeringsRaw!D283=\"\",\"\",offeringsRaw!D283)","v":""},{"$f":"IF(offeringsRaw!E283=\"\",\"\",offeringsRaw!E283)","v":""},{"$f":"IF(offeringsRaw!F283=\"\",\"\",offeringsRaw!F283)","v":""},{"$f":"IF(offeringsRaw!G283=\"\",\"\",offeringsRaw!G283)","v":""},{"$f":"IF(offeringsRaw!I283=\"\",\"\",offeringsRaw!I283)","v":""},{"$f":"IF(offeringsRaw!J283=\"\",\"\",offeringsRaw!J283)","v":""},{"$f":"IF(offeringsRaw!K283=\"\",\"\",offeringsRaw!K283)","v":""},{"$f":"IF(offeringsRaw!L283=\"\",\"\",offeringsRaw!L283)","v":""},{"$f":"IF(offeringsRaw!M283=\"\",\"\",offeringsRaw!M283)","v":""},{"$f":"IF(offeringsRaw!Q283=\"\",\"\",offeringsRaw!Q283)","v":""}," - "]
["",{"$f":"IF(offeringsRaw!B284=\"\",\"\",offeringsRaw!B284)","v":""},{"$f":"IF(offeringsRaw!C284=\"\",\"\",offeringsRaw!C284)","v":""},{"$f":"IF(offeringsRaw!D284=\"\",\"\",offeringsRaw!D284)","v":""},{"$f":"IF(offeringsRaw!E284=\"\",\"\",offeringsRaw!E284)","v":""},{"$f":"IF(offeringsRaw!F284=\"\",\"\",offeringsRaw!F284)","v":""},{"$f":"IF(offeringsRaw!G284=\"\",\"\",offeringsRaw!G284)","v":""},{"$f":"IF(offeringsRaw!I284=\"\",\"\",offeringsRaw!I284)","v":""},{"$f":"IF(offeringsRaw!J284=\"\",\"\",offeringsRaw!J284)","v":""},{"$f":"IF(offeringsRaw!K284=\"\",\"\",offeringsRaw!K284)","v":""},{"$f":"IF(offeringsRaw!L284=\"\",\"\",offeringsRaw!L284)","v":""},{"$f":"IF(offeringsRaw!M284=\"\",\"\",offeringsRaw!M284)","v":""},{"$f":"IF(offeringsRaw!Q284=\"\",\"\",offeringsRaw!Q284)","v":""}," - "]
["",{"$f":"IF(offeringsRaw!B285=\"\",\"\",offeringsRaw!B285)","v":""},{"$f":"IF(offeringsRaw!C285=\"\",\"\",offeringsRaw!C285)","v":""},{"$f":"IF(offeringsRaw!D285=\"\",\"\",offeringsRaw!D285)","v":""},{"$f":"IF(offeringsRaw!E285=\"\",\"\",offeringsRaw!E285)","v":""},{"$f":"IF(offeringsRaw!F285=\"\",\"\",offeringsRaw!F285)","v":""},{"$f":"IF(offeringsRaw!G285=\"\",\"\",offeringsRaw!G285)","v":""},{"$f":"IF(offeringsRaw!I285=\"\",\"\",offeringsRaw!I285)","v":""},{"$f":"IF(offeringsRaw!J285=\"\",\"\",offeringsRaw!J285)","v":""},{"$f":"IF(offeringsRaw!K285=\"\",\"\",offeringsRaw!K285)","v":""},{"$f":"IF(offeringsRaw!L285=\"\",\"\",offeringsRaw!L285)","v":""},{"$f":"IF(offeringsRaw!M285=\"\",\"\",offeringsRaw!M285)","v":""},{"$f":"IF(offeringsRaw!Q285=\"\",\"\",offeringsRaw!Q285)","v":""}," - "]
["",{"$f":"IF(offeringsRaw!B286=\"\",\"\",offeringsRaw!B286)","v":""},{"$f":"IF(offeringsRaw!C286=\"\",\"\",offeringsRaw!C286)","v":""},{"$f":"IF(offeringsRaw!D286=\"\",\"\",offeringsRaw!D286)","v":""},{"$f":"IF(offeringsRaw!E286=\"\",\"\",offeringsRaw!E286)","v":""},{"$f":"IF(offeringsRaw!F286=\"\",\"\",offeringsRaw!F286)","v":""},{"$f":"IF(offeringsRaw!G286=\"\",\"\",offeringsRaw!G286)","v":""},{"$f":"IF(offeringsRaw!I286=\"\",\"\",offeringsRaw!I286)","v":""},{"$f":"IF(offeringsRaw!J286=\"\",\"\",offeringsRaw!J286)","v":""},{"$f":"IF(offeringsRaw!K286=\"\",\"\",offeringsRaw!K286)","v":""},{"$f":"IF(offeringsRaw!L286=\"\",\"\",offeringsRaw!L286)","v":""},{"$f":"IF(offeringsRaw!M286=\"\",\"\",offeringsRaw!M286)","v":""},{"$f":"IF(offeringsRaw!Q286=\"\",\"\",offeringsRaw!Q286)","v":""}," - "]
["",{"$f":"IF(offeringsRaw!B287=\"\",\"\",offeringsRaw!B287)","v":""},{"$f":"IF(offeringsRaw!C287=\"\",\"\",offeringsRaw!C287)","v":""},{"$f":"IF(offeringsRaw!D287=\"\",\"\",offeringsRaw!D287)","v":""},{"$f":"IF(offeringsRaw!E287=\"\",\"\",offeringsRaw!E287)","v":""},{"$f":"IF(offeringsRaw!F287=\"\",\"\",offeringsRaw!F287)","v":""},{"$f":"IF(offeringsRaw!G287=\"\",\"\",offeringsRaw!G287)","v":""},{"$f":"IF(offeringsRaw!I287=\"\",\"\",offeringsRaw!I287)","v":""},{"$f":"IF(offeringsRaw!J287=\"\",\"\",offeringsRaw!J287)","v":""},{"$f":"IF(offeringsRaw!K287=\"\",\"\",offeringsRaw!K287)","v":""},{"$f":"IF(offeringsRaw!L287=\"\",\"\",offeringsRaw!L287)","v":""},{"$f":"IF(offeringsRaw!M287=\"\",\"\",offeringsRaw!M287)","v":""},{"$f":"IF(offeringsRaw!Q287=\"\",\"\",offeringsRaw!Q287)","v":""}," - "]
["",{"$f":"IF(offeringsRaw!B288=\"\",\"\",offeringsRaw!B288)","v":""},{"$f":"IF(offeringsRaw!C288=\"\",\"\",offeringsRaw!C288)","v":""},{"$f":"IF(offeringsRaw!D288=\"\",\"\",offeringsRaw!D288)","v":""},{"$f":"IF(offeringsRaw!E288=\"\",\"\",offeringsRaw!E288)","v":""},{"$f":"IF(offeringsRaw!F288=\"\",\"\",offeringsRaw!F288)","v":""},{"$f":"IF(offeringsRaw!G288=\"\",\"\",offeringsRaw!G288)","v":""},{"$f":"IF(offeringsRaw!I288=\"\",\"\",offeringsRaw!I288)","v":""},{"$f":"IF(offeringsRaw!J288=\"\",\"\",offeringsRaw!J288)","v":""},{"$f":"IF(offeringsRaw!K288=\"\",\"\",offeringsRaw!K288)","v":""},{"$f":"IF(offeringsRaw!L288=\"\",\"\",offeringsRaw!L288)","v":""},{"$f":"IF(offeringsRaw!M288=\"\",\"\",offeringsRaw!M288)","v":""},{"$f":"IF(offeringsRaw!Q288=\"\",\"\",offeringsRaw!Q288)","v":""}," - "]
["",{"$f":"IF(offeringsRaw!B289=\"\",\"\",offeringsRaw!B289)","v":""},{"$f":"IF(offeringsRaw!C289=\"\",\"\",offeringsRaw!C289)","v":""},{"$f":"IF(offeringsRaw!D289=\"\",\"\",offeringsRaw!D289)","v":""},{"$f":"IF(offeringsRaw!E289=\"\",\"\",offeringsRaw!E289)","v":""},{"$f":"IF(offeringsRaw!F289=\"\",\"\",offeringsRaw!F289)","v":""},{"$f":"IF(offeringsRaw!G289=\"\",\"\",offeringsRaw!G289)","v":""},{"$f":"IF(offeringsRaw!I289=\"\",\"\",offeringsRaw!I289)","v":""},{"$f":"IF(offeringsRaw!J289=\"\",\"\",offeringsRaw!J289)","v":""},{"$f":"IF(offeringsRaw!K289=\"\",\"\",offeringsRaw!K289)","v":""},{"$f":"IF(offeringsRaw!L289=\"\",\"\",offeringsRaw!L289)","v":""},{"$f":"IF(offeringsRaw!M289=\"\",\"\",offeringsRaw!M289)","v":""},{"$f":"IF(offeringsRaw!Q289=\"\",\"\",offeringsRaw!Q289)","v":""}," - "]
["",{"$f":"IF(offeringsRaw!B290=\"\",\"\",offeringsRaw!B290)","v":""},{"$f":"IF(offeringsRaw!C290=\"\",\"\",offeringsRaw!C290)","v":""},{"$f":"IF(offeringsRaw!D290=\"\",\"\",offeringsRaw!D290)","v":""},{"$f":"IF(offeringsRaw!E290=\"\",\"\",offeringsRaw!E290)","v":""},{"$f":"IF(offeringsRaw!F290=\"\",\"\",offeringsRaw!F290)","v":""},{"$f":"IF(offeringsRaw!G290=\"\",\"\",offeringsRaw!G290)","v":""},{"$f":"IF(offeringsRaw!I290=\"\",\"\",offeringsRaw!I290)","v":""},{"$f":"IF(offeringsRaw!J290=\"\",\"\",offeringsRaw!J290)","v":""},{"$f":"IF(offeringsRaw!K290=\"\",\"\",offeringsRaw!K290)","v":""},{"$f":"IF(offeringsRaw!L290=\"\",\"\",offeringsRaw!L290)","v":""},{"$f":"IF(offeringsRaw!M290=\"\",\"\",offeringsRaw!M290)","v":""},{"$f":"IF(offeringsRaw!Q290=\"\",\"\",offeringsRaw!Q290)","v":""}," - "]
["",{"$f":"IF(offeringsRaw!B291=\"\",\"\",offeringsRaw!B291)","v":""},{"$f":"IF(offeringsRaw!C291=\"\",\"\",offeringsRaw!C291)","v":""},{"$f":"IF(offeringsRaw!D291=\"\",\"\",offeringsRaw!D291)","v":""},{"$f":"IF(offeringsRaw!E291=\"\",\"\",offeringsRaw!E291)","v":""},{"$f":"IF(offeringsRaw!F291=\"\",\"\",offeringsRaw!F291)","v":""},{"$f":"IF(offeringsRaw!G291=\"\",\"\",offeringsRaw!G291)","v":""},{"$f":"IF(offeringsRaw!I291=\"\",\"\",offeringsRaw!I291)","v":""},{"$f":"IF(offeringsRaw!J291=\"\",\"\",offeringsRaw!J291)","v":""},{"$f":"IF(offeringsRaw!K291=\"\",\"\",offeringsRaw!K291)","v":""},{"$f":"IF(offeringsRaw!L291=\"\",\"\",offeringsRaw!L291)","v":""},{"$f":"IF(offeringsRaw!M291=\"\",\"\",offeringsRaw!M291)","v":""},{"$f":"IF(offeringsRaw!Q291=\"\",\"\",offeringsRaw!Q291)","v":""}," - "]
["",{"$f":"IF(offeringsRaw!B292=\"\",\"\",offeringsRaw!B292)","v":""},{"$f":"IF(offeringsRaw!C292=\"\",\"\",offeringsRaw!C292)","v":""},{"$f":"IF(offeringsRaw!D292=\"\",\"\",offeringsRaw!D292)","v":""},{"$f":"IF(offeringsRaw!E292=\"\",\"\",offeringsRaw!E292)","v":""},{"$f":"IF(offeringsRaw!F292=\"\",\"\",offeringsRaw!F292)","v":""},{"$f":"IF(offeringsRaw!G292=\"\",\"\",offeringsRaw!G292)","v":""},{"$f":"IF(offeringsRaw!I292=\"\",\"\",offeringsRaw!I292)","v":""},{"$f":"IF(offeringsRaw!J292=\"\",\"\",offeringsRaw!J292)","v":""},{"$f":"IF(offeringsRaw!K292=\"\",\"\",offeringsRaw!K292)","v":""},{"$f":"IF(offeringsRaw!L292=\"\",\"\",offeringsRaw!L292)","v":""},{"$f":"IF(offeringsRaw!M292=\"\",\"\",offeringsRaw!M292)","v":""},{"$f":"IF(offeringsRaw!Q292=\"\",\"\",offeringsRaw!Q292)","v":""}," - "]
["",{"$f":"IF(offeringsRaw!B293=\"\",\"\",offeringsRaw!B293)","v":""},{"$f":"IF(offeringsRaw!C293=\"\",\"\",offeringsRaw!C293)","v":""},{"$f":"IF(offeringsRaw!D293=\"\",\"\",offeringsRaw!D293)","v":""},{"$f":"IF(offeringsRaw!E293=\"\",\"\",offeringsRaw!E293)","v":""},{"$f":"IF(offeringsRaw!F293=\"\",\"\",offeringsRaw!F293)","v":""},{"$f":"IF(offeringsRaw!G293=\"\",\"\",offeringsRaw!G293)","v":""},{"$f":"IF(offeringsRaw!I293=\"\",\"\",offeringsRaw!I293)","v":""},{"$f":"IF(offeringsRaw!J293=\"\",\"\",offeringsRaw!J293)","v":""},{"$f":"IF(offeringsRaw!K293=\"\",\"\",offeringsRaw!K293)","v":""},{"$f":"IF(offeringsRaw!L293=\"\",\"\",offeringsRaw!L293)","v":""},{"$f":"IF(offeringsRaw!M293=\"\",\"\",offeringsRaw!M293)","v":""},{"$f":"IF(offeringsRaw!Q293=\"\",\"\",offeringsRaw!Q293)","v":""}," - "]
["",{"$f":"IF(offeringsRaw!B294=\"\",\"\",offeringsRaw!B294)","v":""},{"$f":"IF(offeringsRaw!C294=\"\",\"\",offeringsRaw!C294)","v":""},{"$f":"IF(offeringsRaw!D294=\"\",\"\",offeringsRaw!D294)","v":""},{"$f":"IF(offeringsRaw!E294=\"\",\"\",offeringsRaw!E294)","v":""},{"$f":"IF(offeringsRaw!F294=\"\",\"\",offeringsRaw!F294)","v":""},{"$f":"IF(offeringsRaw!G294=\"\",\"\",offeringsRaw!G294)","v":""},{"$f":"IF(offeringsRaw!I294=\"\",\"\",offeringsRaw!I294)","v":""},{"$f":"IF(offeringsRaw!J294=\"\",\"\",offeringsRaw!J294)","v":""},{"$f":"IF(offeringsRaw!K294=\"\",\"\",offeringsRaw!K294)","v":""},{"$f":"IF(offeringsRaw!L294=\"\",\"\",offeringsRaw!L294)","v":""},{"$f":"IF(offeringsRaw!M294=\"\",\"\",offeringsRaw!M294)","v":""},{"$f":"IF(offeringsRaw!Q294=\"\",\"\",offeringsRaw!Q294)","v":""}," - "]
["",{"$f":"IF(offeringsRaw!B295=\"\",\"\",offeringsRaw!B295)","v":""},{"$f":"IF(offeringsRaw!C295=\"\",\"\",offeringsRaw!C295)","v":""},{"$f":"IF(offeringsRaw!D295=\"\",\"\",offeringsRaw!D295)","v":""},{"$f":"IF(offeringsRaw!E295=\"\",\"\",offeringsRaw!E295)","v":""},{"$f":"IF(offeringsRaw!F295=\"\",\"\",offeringsRaw!F295)","v":""},{"$f":"IF(offeringsRaw!G295=\"\",\"\",offeringsRaw!G295)","v":""},{"$f":"IF(offeringsRaw!I295=\"\",\"\",offeringsRaw!I295)","v":""},{"$f":"IF(offeringsRaw!J295=\"\",\"\",offeringsRaw!J295)","v":""},{"$f":"IF(offeringsRaw!K295=\"\",\"\",offeringsRaw!K295)","v":""},{"$f":"IF(offeringsRaw!L295=\"\",\"\",offeringsRaw!L295)","v":""},{"$f":"IF(offeringsRaw!M295=\"\",\"\",offeringsRaw!M295)","v":""},{"$f":"IF(offeringsRaw!Q295=\"\",\"\",offeringsRaw!Q295)","v":""}," - "]
["",{"$f":"IF(offeringsRaw!B296=\"\",\"\",offeringsRaw!B296)","v":""},{"$f":"IF(offeringsRaw!C296=\"\",\"\",offeringsRaw!C296)","v":""},{"$f":"IF(offeringsRaw!D296=\"\",\"\",offeringsRaw!D296)","v":""},{"$f":"IF(offeringsRaw!E296=\"\",\"\",offeringsRaw!E296)","v":""},{"$f":"IF(offeringsRaw!F296=\"\",\"\",offeringsRaw!F296)","v":""},{"$f":"IF(offeringsRaw!G296=\"\",\"\",offeringsRaw!G296)","v":""},{"$f":"IF(offeringsRaw!I296=\"\",\"\",offeringsRaw!I296)","v":""},{"$f":"IF(offeringsRaw!J296=\"\",\"\",offeringsRaw!J296)","v":""},{"$f":"IF(offeringsRaw!K296=\"\",\"\",offeringsRaw!K296)","v":""},{"$f":"IF(offeringsRaw!L296=\"\",\"\",offeringsRaw!L296)","v":""},{"$f":"IF(offeringsRaw!M296=\"\",\"\",offeringsRaw!M296)","v":""},{"$f":"IF(offeringsRaw!Q296=\"\",\"\",offeringsRaw!Q296)","v":""}," - "]
["",{"$f":"IF(offeringsRaw!B297=\"\",\"\",offeringsRaw!B297)","v":""},{"$f":"IF(offeringsRaw!C297=\"\",\"\",offeringsRaw!C297)","v":""},{"$f":"IF(offeringsRaw!D297=\"\",\"\",offeringsRaw!D297)","v":""},{"$f":"IF(offeringsRaw!E297=\"\",\"\",offeringsRaw!E297)","v":""},{"$f":"IF(offeringsRaw!F297=\"\",\"\",offeringsRaw!F297)","v":""},{"$f":"IF(offeringsRaw!G297=\"\",\"\",offeringsRaw!G297)","v":""},{"$f":"IF(offeringsRaw!I297=\"\",\"\",offeringsRaw!I297)","v":""},{"$f":"IF(offeringsRaw!J297=\"\",\"\",offeringsRaw!J297)","v":""},{"$f":"IF(offeringsRaw!K297=\"\",\"\",offeringsRaw!K297)","v":""},{"$f":"IF(offeringsRaw!L297=\"\",\"\",offeringsRaw!L297)","v":""},{"$f":"IF(offeringsRaw!M297=\"\",\"\",offeringsRaw!M297)","v":""},{"$f":"IF(offeringsRaw!Q297=\"\",\"\",offeringsRaw!Q297)","v":""}," - "]
["",{"$f":"IF(offeringsRaw!B298=\"\",\"\",offeringsRaw!B298)","v":""},{"$f":"IF(offeringsRaw!C298=\"\",\"\",offeringsRaw!C298)","v":""},{"$f":"IF(offeringsRaw!D298=\"\",\"\",offeringsRaw!D298)","v":""},{"$f":"IF(offeringsRaw!E298=\"\",\"\",offeringsRaw!E298)","v":""},{"$f":"IF(offeringsRaw!F298=\"\",\"\",offeringsRaw!F298)","v":""},{"$f":"IF(offeringsRaw!G298=\"\",\"\",offeringsRaw!G298)","v":""},{"$f":"IF(offeringsRaw!I298=\"\",\"\",offeringsRaw!I298)","v":""},{"$f":"IF(offeringsRaw!J298=\"\",\"\",offeringsRaw!J298)","v":""},{"$f":"IF(offeringsRaw!K298=\"\",\"\",offeringsRaw!K298)","v":""},{"$f":"IF(offeringsRaw!L298=\"\",\"\",offeringsRaw!L298)","v":""},{"$f":"IF(offeringsRaw!M298=\"\",\"\",offeringsRaw!M298)","v":""},{"$f":"IF(offeringsRaw!Q298=\"\",\"\",offeringsRaw!Q298)","v":""}," - "]
["",{"$f":"IF(offeringsRaw!B299=\"\",\"\",offeringsRaw!B299)","v":""},{"$f":"IF(offeringsRaw!C299=\"\",\"\",offeringsRaw!C299)","v":""},{"$f":"IF(offeringsRaw!D299=\"\",\"\",offeringsRaw!D299)","v":""},{"$f":"IF(offeringsRaw!E299=\"\",\"\",offeringsRaw!E299)","v":""},{"$f":"IF(offeringsRaw!F299=\"\",\"\",offeringsRaw!F299)","v":""},{"$f":"IF(offeringsRaw!G299=\"\",\"\",offeringsRaw!G299)","v":""},{"$f":"IF(offeringsRaw!I299=\"\",\"\",offeringsRaw!I299)","v":""},{"$f":"IF(offeringsRaw!J299=\"\",\"\",offeringsRaw!J299)","v":""},{"$f":"IF(offeringsRaw!K299=\"\",\"\",offeringsRaw!K299)","v":""},{"$f":"IF(offeringsRaw!L299=\"\",\"\",offeringsRaw!L299)","v":""},{"$f":"IF(offeringsRaw!M299=\"\",\"\",offeringsRaw!M299)","v":""},{"$f":"IF(offeringsRaw!Q299=\"\",\"\",offeringsRaw!Q299)","v":""}," - "]
["",{"$f":"IF(offeringsRaw!B300=\"\",\"\",offeringsRaw!B300)","v":""},{"$f":"IF(offeringsRaw!C300=\"\",\"\",offeringsRaw!C300)","v":""},{"$f":"IF(offeringsRaw!D300=\"\",\"\",offeringsRaw!D300)","v":""},{"$f":"IF(offeringsRaw!E300=\"\",\"\",offeringsRaw!E300)","v":""},{"$f":"IF(offeringsRaw!F300=\"\",\"\",offeringsRaw!F300)","v":""},{"$f":"IF(offeringsRaw!G300=\"\",\"\",offeringsRaw!G300)","v":""},{"$f":"IF(offeringsRaw!I300=\"\",\"\",offeringsRaw!I300)","v":""},{"$f":"IF(offeringsRaw!J300=\"\",\"\",offeringsRaw!J300)","v":""},{"$f":"IF(offeringsRaw!K300=\"\",\"\",offeringsRaw!K300)","v":""},{"$f":"IF(offeringsRaw!L300=\"\",\"\",offeringsRaw!L300)","v":""},{"$f":"IF(offeringsRaw!M300=\"\",\"\",offeringsRaw!M300)","v":""},{"$f":"IF(offeringsRaw!Q300=\"\",\"\",offeringsRaw!Q300)","v":""}," - "]

{"sheet":"Selected","index":5,"n_rows":2,"n_cols":11,"rows_kept":2,"cut":false,"hidden":true,"merged":[]}
[2859006035,20105,"A HTG",2859006,35,"Fall 2010","A HTG - American Heritage","100 - American Heritage","DAY",3]
[8961000002,20105,"ACC",8961000,2,"Fall 2010","ACC - Accounting","200 - Principles of Accounting","DAY",3,"Fall 2010 - ACC 200 - 2"]

{"sheet":"Home","index":6,"n_rows":0,"n_cols":0,"rows_kept":0,"cut":false,"hidden":false,"merged":[]}

{"sheet":"DONT CLOSE","index":7,"n_rows":1,"n_cols":1,"rows_kept":1,"cut":false,"hidden":true,"merged":[]}
["Don't close until your classes are added."]