{"text_format":"1","workbook":"xlsx","n_sheets":17,"sheets":["Home","Current Prices","Current Menu","Week 1","Week 2","Week 3","Week 4","Week 5","Week 6","Week 7","Week 8","Week 9","Reports","Data","ReportData","Instructions","Ideas"],"not_rendered":{"charts":1,"images":220,"macros":1,"external_links":0,"defined_names":5,"comments":0,"pivot_tables":0},"unopened":[],"bounds":{"document_bytes":16777216,"sheet_cells":100000,"rows_first":2000,"rows_last":500,"rows_between":2000,"halvings":0,"cell_chars":16384,"cell_head_chars":4096},"cells_cut":0,"cells_raw":0,"read":"whole","date_system":"1900"}

{"sheet":"Home","index":0,"n_rows":7,"n_cols":8,"rows_kept":7,"cut":false,"hidden":false,"merged":[[4,7,4,13],[6,7,6,13]]}
[]
[]
[]
[]
[null,null,null,null,null,null,null,"Welcome to the Pendulum Court!"]
[]
{"$rows_left_out":2}
{"sheet":"Current Prices","index":1,"n_rows":26,"n_cols":10,"rows_kept":26,"cut":false,"hidden":false,"merged":[]}
[]
[]
[]
[]
[null,null,null,null,null,"Menu","Price"]
[null,null,null,null,null,"Feature",5.35,null,"Other Fixed Data"]
{"$rows_left_out":21}
{"sheet":"Current Menu","index":2,"n_rows":38,"n_cols":15,"rows_kept":38,"cut":false,"hidden":false,"merged":[[2,4,2,8],[2,10,2,14],[27,4,27,11]]}
[]
[]
[null,null,null,null,"Pendulum Court Menu",null,null,null,null,null,"Backwards Menu for Weeks 4-6"]
[null,null,null,null,null,"Monday","Tuesday","Wednesday","Thursday",null,null,"Monday","Tuesday","Wednesday","Thursday"]
[null,null,null,null,null,1,2,3,4,null,null,1,2,3,4]
[null,null,null,null,"Feature","Chicken Puff Pastry","Beef & Broccoli Stir Fry","Macadamia Chicken","Mediterranean Chicken Pasta",null,"Feature",{"$f":"I6","v":"Mediterranean Chicken Pasta"},{"$f":"H6","v":"Macadamia Chicken"},{"$f":"G6","v":"Beef & Broccoli Stir Fry"},{"$f":"F6","v":"Chicken Puff Pastry"}]
{"$rows_left_out":33}
{"sheet":"Week 1","index":3,"n_rows":70,"n_cols":25,"rows_kept":70,"cut":false,"hidden":false,"merged":[[5,28,6,28],[17,23,20,23],[1,24,2,25],[51,6,51,9],[51,10,51,13],[51,14,51,17],[51,18,51,21]]}
[null,null,null,null,null,"ü"]
[null,null,null,null,null,null,null,null,null,null,null,null,null,null,null,null,null,null,null,null,null,null,null,null,"Instructions"]
[null,null,null,null,null,"ü"]
[null,null,null,null,null,"ü",null,"Monday",null,null,null,"Tuesday",null,null,null,"Wednesday",null,null,null,"Thursday"]
[null,null,null,null,null,null,null,1,null,null,null,2,null,null,null,3,null,null,null,4]
[null,null,null,null,null,"ü",null,"Daily Production",null,null,null,"Daily Production",null,null,null,"Daily Production",null,null,null,"Daily Production"]
{"$rows_left_out":65}
{"sheet":"Week 2","index":4,"n_rows":70,"n_cols":25,"rows_kept":70,"cut":false,"hidden":false,"merged":[[1,24,2,25],[5,28,6,28],[17,23,20,23],[51,6,51,9],[51,10,51,13],[51,14,51,17],[51,18,51,21]]}
[null,null,null,null,null,"ü"]
[null,null,null,null,null,null,null,null,null,null,null,null,null,null,null,null,null,null,null,null,null,null,null,null,"Instructions"]
[null,null,null,null,null,"ü"]
[null,null,null,null,null,"ü",null,"Monday",null,null,null,"Tuesday",null,null,null,"Wednesday",null,null,null,"Thursday"]
[null,null,null,null,null,null,null,1,null,null,null,2,null,null,null,3,null,null,null,4]
[null,null,null,null,null,"ü",null,"Daily Production",null,null,null,"Daily Production",null,null,null,"Daily Production",null,null,null,"Daily Production"]
{"$rows_left_out":65}
{"sheet":"Week 3","index":5,"n_rows":70,"n_cols":25,"rows_kept":70,"cut":false,"hidden":false,"merged":[[1,24,2,25],[5,28,6,28],[17,23,20,23],[51,6,51,9],[51,10,51,13],[51,14,51,17],[51,18,51,21]]}
[null,null,null,null,null,"ü"]
[null,null,null,null,null,null,null,null,null,null,null,null,null,null,null,null,null,null,null,null,null,null,null,null,"Instructions"]
[null,null,null,null,null,"ü"]
[null,null,null,null,null,"ü",null,"Monday",null,null,null,"Tuesday",null,null,null,"Wednesday",null,null,null,"Thursday"]
[null,null,null,null,null,null,null,1,null,null,null,2,null,null,null,3,null,null,null,4]
[null,null,null,null,null,"ü",null,"Daily Production",null,null,null,"Daily Production",null,null,null,"Daily Production",null,null,null,"Daily Production"]
{"$rows_left_out":65}
{"sheet":"Week 4","index":6,"n_rows":70,"n_cols":25,"rows_kept":70,"cut":false,"hidden":false,"merged":[[1,24,2,25],[5,28,6,28],[17,23,20,23],[51,6,51,9],[51,10,51,13],[51,14,51,17],[51,18,51,21]]}
[null,null,null,null,null,"ü"]
[null,null,null,null,null,null,null,null,null,null,null,null,null,null,null,null,null,null,null,null,null,null,null,null,"Instructions"]
[null,null,null,null,null,"ü"]
[null,null,null,null,null,"ü",null,"Monday",null,null,null,"Tuesday",null,null,null,"Wednesday",null,null,null,"Thursday"]
[null,null,null,null,null,null,null,1,null,null,null,2,null,null,null,3,null,null,null,4]
[null,null,null,null,null,"ü",null,"Daily Production",null,null,null,"Daily Production",null,null,null,"Daily Production",null,null,null,"Daily Production"]
{"$rows_left_out":65}
{"sheet":"Week 5","index":7,"n_rows":70,"n_cols":25,"rows_kept":70,"cut":false,"hidden":false,"merged":[[1,24,2,25],[5,28,6,28],[17,23,20,23],[51,6,51,9],[51,10,51,13],[51,14,51,17],[51,18,51,21]]}
[null,null,null,null,null,"ü"]
[null,null,null,null,null,null,null,null,null,null,null,null,null,null,null,null,null,null,null,null,null,null,null,null,"Instructions"]
[null,null,null,null,null,"ü"]
[null,null,null,null,null,"ü",null,"Monday",null,null,null,"Tuesday",null,null,null,"Wednesday",null,null,null,"Thursday"]
[null,null,null,null,null,null,null,1,null,null,null,2,null,null,null,3,null,null,null,4]
[null,null,null,null,null,"ü",null,"Daily Production",null,null,null,"Daily Production",null,null,null,"Daily Production",null,null,null,"Daily Production"]
{"$rows_left_out":65}
{"sheet":"Week 6","index":8,"n_rows":70,"n_cols":25,"rows_kept":70,"cut":false,"hidden":false,"merged":[[1,24,2,25],[5,28,6,28],[17,23,20,23],[51,6,51,9],[51,10,51,13],[51,14,51,17],[51,18,51,21]]}
[null,null,null,null,null,"ü"]
[null,null,null,null,null,null,null,null,null,null,null,null,null,null,null,null,null,null,null,null,null,null,null,null,"Instructions"]
[null,null,null,null,null,"ü"]
[null,null,null,null,null,"ü",null,"Monday",null,null,null,"Tuesday",null,null,null,"Wednesday",null,null,null,"Thursday"]
[null,null,null,null,null,null,null,1,null,null,null,2,null,null,null,3,null,null,null,4]
[null,null,null,null,null,"ü",null,"Daily Production",null,null,null,"Daily Production",null,null,null,"Daily Production",null,null,null,"Daily Production"]
{"$rows_left_out":65}
{"sheet":"Week 7","index":9,"n_rows":70,"n_cols":25,"rows_kept":70,"cut":false,"hidden":false,"merged":[[1,24,2,25],[5,28,6,28],[17,23,20,23],[51,6,51,9],[51,10,51,13],[51,14,51,17],[51,18,51,21]]}
[null,null,null,null,null,"ü"]
[null,null,null,null,null,null,null,null,null,null,null,null,null,null,null,null,null,null,null,null,null,null,null,null,"Instructions"]
[null,null,null,null,null,"ü"]
[null,null,null,null,null,"ü",null,"Monday",null,null,null,"Tuesday",null,null,null,"Wednesday",null,null,null,"Thursday"]
[null,null,null,null,null,null,null,1,null,null,null,2,null,null,null,3,null,null,null,4]
[null,null,null,null,null,"ü",null,"Daily Production",null,null,null,"Daily Production",null,null,null,"Daily Production",null,null,null,"Daily Production"]
{"$rows_left_out":65}
{"sheet":"Week 8","index":10,"n_rows":70,"n_cols":25,"rows_kept":70,"cut":false,"hidden":false,"merged":[[1,24,2,25],[5,28,6,28],[17,23,20,23],[51,6,51,9],[51,10,51,13],[51,14,51,17],[51,18,51,21]]}
[null,null,null,null,null,"ü"]
[null,null,null,null,null,null,null,null,null,null,null,null,null,null,null,null,null,null,null,null,null,null,null,null,"Instructions"]
[null,null,null,null,null,"ü"]
[null,null,null,null,null,"ü",null,"Monday",null,null,null,"Tuesday",null,null,null,"Wednesday",null,null,null,"Thursday"]
[null,null,null,null,null,null,null,1,null,null,null,2,null,null,null,3,null,null,null,4]
[null,null,null,null,null,"ü",null,"Daily Production",null,null,null,"Daily Production",null,null,null,"Daily Production",null,null,null,"Daily Production"]
{"$rows_left_out":65}
{"sheet":"Week 9","index":11,"n_rows":70,"n_cols":25,"rows_kept":70,"cut":false,"hidden":false,"merged":[[1,24,2,25],[5,28,6,28],[17,23,20,23],[51,6,51,9],[51,10,51,13],[51,14,51,17],[51,18,51,21]]}
[null,null,null,null,null,"ü"]
[null,null,null,null,null,null,null,null,null,null,null,null,null,null,null,null,null,null,null,null,null,null,null,null,"Instructions"]
[null,null,null,null,null,"ü"]
[null,null,null,null,null,"ü",null,"Monday",null,null,null,"Tuesday",null,null,null,"Wednesday",null,null,null,"Thursday"]
[null,null,null,null,null,null,null,1,null,null,null,2,null,null,null,3,null,null,null,4]
[null,null,null,null,null,"ü",null,"Daily Production",null,null,null,"Daily Production",null,null,null,"Daily Production",null,null,null,"Daily Production"]
{"$rows_left_out":65}
{"sheet":"Reports","index":12,"n_rows":0,"n_cols":0,"rows_kept":0,"cut":false,"hidden":false,"merged":[]}

{"sheet":"Data","index":13,"n_rows":37,"n_cols":27,"rows_kept":37,"cut":false,"hidden":false,"merged":[]}
["Week","Day","FeatureSales","ColdPlateSales","TacoSaladSales","SoupSales","DessertSales","MuffinSales","CookieSales","ALaCarteSales","MiscItemSales","TotalSales","TotalDiscounts","TotalNetSales","FeatureSold","ColdPlateSold","TacoSaladSold","SoupSold","DessertSold","MuffinSold","CookieSold","ALaCarteSold","MiscItemSold","TotalItemsSold","EquivalentMeals","AverageCheck","NumberofGuests"]
[1,"Monday",235.4,125,211.5,82.5,107.5,81.25,33,52.8,106.8,1035.75,35,1000.75,44,25,47,33,43,65,44,26,128,455,118.4319526627219,8.7799999999999994,114]
[1,"Tuesday",235.4,125,211.5,82.5,107.5,81.25,33,52.8,106.8,680,35,450,44,25,47,33,43,65,44,26,128,455,119.431952662722,8.7799999999999994,114]
[1,"Wednesday",235.4,125,211.5,82.5,107.5,81.25,33,52.8,106.8,1035.75,35,1000.75,44,25,47,33,43,65,44,26,128,455,120.431952662722,8.7799999999999994,114]
[1,"Thursday",235.4,125,211.5,82.5,107.5,81.25,33,52.8,106.8,1035.75,35,1000.75,44,25,47,33,43,65,44,26,128,455,121.431952662722,8.7799999999999994,114]
[2,"Monday",235.4,125,211.5,82.5,107.5,81.25,33,52.8,106.8,1035.75,35,1000.75,44,25,47,33,43,65,44,26,128,455,122.431952662722,8.7799999999999994,114]
{"$rows_left_out":32}
{"sheet":"ReportData","index":14,"n_rows":10,"n_cols":7,"rows_kept":10,"cut":false,"hidden":false,"merged":[]}
["Week","Weekly Net Sales","Weekly Item Sales Count","Weekly Equivalent Meals Served","Sales Discounts","Weekly # of Guests","Weekly Gross Sales"]
["Week 1",{"$f":"SUMIF(Data!$A$2:$A$37,1,Data!$N$2:$N$37)","v":3452.25},{"$f":"SUMIF(Data!$A$2:$A$37,1,Data!$X$2:$X$37)","v":1820},{"$f":"SUMIF(Data!$A$2:$A$37,1,Data!$Y$2:$Y$37)","v":479.72781065088787},{"$f":"SUMIF(Data!$A$2:$A$37,1,Data!$M$2:$M$37)","v":140},{"$f":"SUMIF(Data!$A$2:$A$37,1,Data!$AA$2:$AA$37)","v":456},{"$f":"SUMIF(Data!$A$2:$A$37,1,Data!$L$2:$L$37)","v":3787.25}]
["Week 2",{"$f":"SUMIF(Data!$A$2:$A$37,2,Data!$N$2:$N$37)","v":3782.25},{"$f":"SUMIF(Data!$A$2:$A$37,2,Data!$X$2:$X$37)","v":1820},{"$f":"SUMIF(Data!$A$2:$A$37,2,Data!$Y$2:$Y$37)","v":495.72781065088799},{"$f":"SUMIF(Data!$A$2:$A$37,2,Data!$M$2:$M$37)","v":140},{"$f":"SUMIF(Data!$A$2:$A$37,2,Data!$AA$2:$AA$37)","v":456},{"$f":"SUMIF(Data!$A$2:$A$37,2,Data!$L$2:$L$37)","v":4007.25}]
["Week 3",{"$f":"SUMIF(Data!$A$2:$A$37,3,Data!$N$2:$N$37)","v":3902.25},{"$f":"SUMIF(Data!$A$2:$A$37,3,Data!$X$2:$X$37)","v":1820},{"$f":"SUMIF(Data!$A$2:$A$37,3,Data!$Y$2:$Y$37)","v":511.72781065088805},{"$f":"SUMIF(Data!$A$2:$A$37,3,Data!$M$2:$M$37)","v":140},{"$f":"SUMIF(Data!$A$2:$A$37,3,Data!$AA$2:$AA$37)","v":456},{"$f":"SUMIF(Data!$A$2:$A$37,3,Data!$L$2:$L$37)","v":4307.25}]
["Week 4",{"$f":"SUMIF(Data!$A$2:$A$37,4,Data!$N$2:$N$37)","v":3602.25},{"$f":"SUMIF(Data!$A$2:$A$37,4,Data!$X$2:$X$37)","v":1820},{"$f":"SUMIF(Data!$A$2:$A$37,4,Data!$Y$2:$Y$37)","v":527.72781065088805},{"$f":"SUMIF(Data!$A$2:$A$37,4,Data!$M$2:$M$37)","v":140},{"$f":"SUMIF(Data!$A$2:$A$37,4,Data!$AA$2:$AA$37)","v":456},{"$f":"SUMIF(Data!$A$2:$A$37,4,Data!$L$2:$L$37)","v":3857.25}]
["Week 5",{"$f":"SUMIF(Data!$A$2:$A$37,5,Data!$N$2:$N$37)","v":4202.25},{"$f":"SUMIF(Data!$A$2:$A$37,5,Data!$X$2:$X$37)","v":1820},{"$f":"SUMIF(Data!$A$2:$A$37,5,Data!$Y$2:$Y$37)","v":543.72781065088805},{"$f":"SUMIF(Data!$A$2:$A$37,5,Data!$M$2:$M$37)","v":140},{"$f":"SUMIF(Data!$A$2:$A$37,5,Data!$AA$2:$AA$37)","v":456},{"$f":"SUMIF(Data!$A$2:$A$37,5,Data!$L$2:$L$37)","v":4507.25}]
{"$rows_left_out":5}
{"sheet":"Instructions","index":15,"n_rows":21,"n_cols":18,"rows_kept":21,"cut":false,"hidden":false,"merged":[]}
[]
[null,"If you can't see everything. You can click the + or - button in the bottom right to zoom in or out.",null,null,null,null,null,null,null,null,null,null,null,null,"TYPES OF REPORTS!"]
[null,null,null,null,null,null,null,null,null,null,null,null,null,null,null,null,"*Have \"Normalized\" be a TOGGLE or CHECK box"]
[null,null,null,null,null,null,null,null,null,null,null,null,null,null,null,"Weekly Sales",null,"*this disables the normalized check box"]
[]
[null,null,null,null,null,"*BEFORE COPYING",null,null,null,null,null,null,null,null,null,"FIGURE OUT R ON UPDATING DATA"]
{"$rows_left_out":16}
{"sheet":"Ideas","index":16,"n_rows":40,"n_cols":13,"rows_kept":40,"cut":false,"hidden":false,"merged":[]}
[]
[null,"Questions",null,null,null,null,null,null,"**Don't forget the discrepancy"]
[null,"-Do you have the new menu",null,null,null,null,null,null,"Use data validation to give instructions for the entry of all data"]
[null,"-Need to prepare the spreadsheets for entry by week 1"]
[null,null,null,null,null,null,null,null,"Get the worksheets in…"]
[null,null,null,null,null,null,null,null,null,"Have a button to update the data?"]
{"$rows_left_out":34}