{"text_format":"1","workbook":"xlsx","n_sheets":3,"sheets":["Main","Normal Loss Table","Normal Loss Table (Inverse)"],"not_rendered":{"charts":0,"images":0,"macros":1,"external_links":0,"defined_names":68,"comments":0,"pivot_tables":0},"unopened":[],"bounds":{"document_bytes":16777216,"sheet_cells":100000,"rows_first":2000,"rows_last":500,"rows_between":2000,"halvings":0,"cell_chars":16384,"cell_head_chars":4096},"cells_cut":0,"cells_raw":0,"read":"whole","date_system":"1900"}

{"sheet":"Main","index":0,"n_rows":384,"n_cols":27,"rows_kept":384,"cut":false,"hidden":false,"merged":[]}
[]
[]
["PRODUCT","Weekly DEMAND","Cost","Inventory","Sales ","LT STD DEV","MARGIN OVER COST","Cycle Time (weeks)","ORDER QTY","SS","Column1","Column2","Column3","CURRENT SERVICE LEVEL","SERVICED DEMAND","Serviced (per week)","CURRENT INVENTORY","f(k) @ new","SS@new","Inventory at NEW","Sales at Current level","Sales at new","INCREMENTAL MARGIN","Inventory Carrying Cost increase","CONTRIBUTION MARGIN","DESIRED NEW SERVICE LEVEL","NEW MARGIN"]
["P 001",210.1,423.76140800000002,763.51800000000003,182.69928787173399,1,0.25,2,{"$f":"IF(A4=\"\",\"\",H4*B4)","v":420.2},{"$f":"IF(A4=\"\",\"\",IF(D4-(I4/2) > 0, D4-(I4/2), 0))","v":553.41800000000001},{"$f":"IF(A4=\"\",\"\",SQRT(($H4*POWER(E4,2)) + ((B4^2)*POWER(F4,2))))","v":333.01662057272375},{"$f":"IF(A4=\"\",\"\",J4/K4)","v":1.66183297112387},{"$f":"IF(A4=\"\",\"\",IF(L4 >3,3,L4))","v":1.66183297112387},{"$f":"IF(A4=\"\",\"\",1 - (VLOOKUP(M4,'Normal Loss Table (Inverse)'!$A$4:$B$33,2)*K4/I4))","v":0.98161355164853115},{"$f":"IF(A4=\"\",\"\",B4*N4)","v":206.23700720135639},{"$f":"IF(A4=\"\",\"\",O4*$C4)","v":87395.284553352933},{"$f":"IF(A4=\"\",\"\",C4*D4)","v":323549.46271334402},{"$f":"IF(A4=\"\",\"\",ROUND((1-$Z4)*(I4/K4),4))","v":1.2618},{"$f":"IF(A4=\"\",\"\",VLOOKUP(R4,'Normal Loss Table'!$A$3:$B$32,2)*K4)","v":0},{"$f":"IF(A4=\"\",\"\",I4/2+S4)","v":210.1},{"$f":"IF(A4=\"\",\"\",B4*C4*52*N4)","v":4544554.796774352},{"$f":"B4*C4*52*Z4","v":0},{"$f":"IF(A4=\"\",\"\",(V4-U4)*G4)","v":-1136138.699193588},{"$f":"IF(A4=\"\",\"\",(T4*C4-Q4)*0.2)","v":-46903.438178508804},{"$f":"IF(A4=\"\",\"\",W4-X4)","v":-1089235.2610150792},{"$f":"IF(A4=\"\",\"\",0)","v":0}]
["P 002",797.03846153846155,43.818332000000005,3945.1859999999992,408.04026913627337,1,0.25,2,1594.0769230769231,3148.1475384615378,{"$f":"IF(A5=\"\",\"\",SQRT(($H5*POWER(E5,2)) + ((B5^2)*POWER(1,2))))","v":984.0040811120665},3.1993236602267716,3,{"$f":"IF(A5=\"\",\"\",1 - (VLOOKUP(M5,'Normal Loss Table (Inverse)'!$A$4:$B$33,2)*K5/I5))","v":1},797.03846153846155,34924.89592446154,172871.46994975198,1.62,{"$f":"IF(A5=\"\",\"\",VLOOKUP(R5,'Normal Loss Table'!$A$3:$B$32,2)*K5)","v":0},797.03846153846155,1816094.5880720001,0,-454023.64701800002,-27589.314805058089,-426434.33221294195,0]
["P 003",29.076923076923077,80.927080000000004,1716.3719999999998,52.53377854662773,1,0.25,2,58.153846153846153,1687.2950769230767,79.781346393712539,21.148992254360479,3,{"$f":"IF(A6=\"\",\"\",1 - (VLOOKUP(M6,'Normal Loss Table (Inverse)'!$A$4:$B$33,2)*K6/I6))","v":1},29.076923076923077,2353.1104800000003,138900.97415376001,0.72889999999999999,{"$f":"IF(A6=\"\",\"\",VLOOKUP(R6,'Normal Loss Table'!$A$3:$B$32,2)*K6)","v":0},29.076923076923077,122361.74496000001,0,-30590.436240000003,-27309.572734752001,-3280.8635052480022,0]
["P 004",659.88461538461536,47.489283999999998,2941.5679999999998,279.61280328102413,1,0.25,2,1319.7692307692307,2281.6833846153845,769.29470629833861,2.9659418762860037,2.9659418762860037,{"$f":"IF(A7=\"\",\"\",1 - (VLOOKUP(M7,'Normal Loss Table (Inverse)'!$A$4:$B$33,2)*K7/I7))","v":0.99959196935202455},659.61536223741098,31324.661268055283,139692.95815731198,1.7156,{"$f":"IF(A7=\"\",\"\",VLOOKUP(R7,'Normal Loss Table'!$A$3:$B$32,2)*K7)","v":0},659.88461538461536,1628882.3859388747,0,-407220.59648471867,-21671.102050016245,-385549.49443470244,0]
["P 005",1234.1538461538462,8.1646800000000006,13018.907999999998,1082.8603441288622,1,0.25,2,2468.3076923076924,11784.754153846152,1966.8016589758324,5.9918365942312644,3,{"$f":"IF(A8=\"\",\"\",1 - (VLOOKUP(M8,'Normal Loss Table (Inverse)'!$A$4:$B$33,2)*K8/I8))","v":1},1234.1538461538462,10076.471224615385,106295.21776943999,1.2549999999999999,{"$f":"IF(A8=\"\",\"\",VLOOKUP(R8,'Normal Loss Table'!$A$3:$B$32,2)*K8)","v":0},1234.1538461538462,523976.50368000002,0,-130994.12592000001,-19243.749308964922,-111750.37661103508,0]
["P 006",719.57692307692309,35.221592000000001,3416.28,289.45779916289916,1,0.25,2,1439.1538461538462,2696.7030769230769,827.86628341617495,3.2574138250868021,3,{"$f":"IF(A9=\"\",\"\",1 - (VLOOKUP(M9,'Normal Loss Table (Inverse)'!$A$4:$B$33,2)*K9/I9))","v":1},719.57692307692309,25344.644797230772,120326.82031776001,1.7383999999999999,{"$f":"IF(A9=\"\",\"\",VLOOKUP(R9,'Normal Loss Table'!$A$3:$B$32,2)*K9)","v":0},719.57692307692309,1317921.5294560001,0,-329480.38236400002,-18996.435104105851,-310483.94725989416,0]
["P 007",53.442307692307693,31.381920000000001,2391.739,126.078782320551,1,0.25,4,213.76923076923077,2284.8543846153848,257.75864225513533,8.8643172722557413,3,{"$f":"IF(A10=\"\",\"\",1 - (VLOOKUP(M10,'Normal Loss Table (Inverse)'!$A$4:$B$33,2)*K10/I10))","v":1},53.442307692307693,1677.1222246153848,75057.361958880007,0.82930000000000004,{"$f":"IF(A10=\"\",\"\",VLOOKUP(R10,'Normal Loss Table'!$A$3:$B$32,2)*K10)","v":0},106.88461538461539,87210.355680000008,0,-21802.588920000002,-14340.623501929847,-7461.9654180701546,0]
["P 008",167.32692307692307,13.50482,6612.3539999999994,478.49726866898652,1,0.25,4,669.30769230769226,6277.7001538461536,971.51265749917616,6.4617790673010118,3,{"$f":"IF(A11=\"\",\"\",1 - (VLOOKUP(M11,'Normal Loss Table (Inverse)'!$A$4:$B$33,2)*K11/I11))","v":1},167.32692307692307,2259.7199773076923,89298.650546279998,0.68889999999999996,{"$f":"IF(A11=\"\",\"\",VLOOKUP(R11,'Normal Loss Table'!$A$3:$B$32,2)*K11)","v":0},334.65384615384613,117505.43882,0,-29376.359704999999,-16955.842118332923,-12420.517586667076,0]
["P 009",643.21153846153845,52.816808000000002,2769.7249999999999,589.17747040171116,1,0.25,2,1286.4230769230769,2126.5134615384613,1052.6068907564579,2.0202351706155359,2.0202351706155359,{"$f":"IF(A12=\"\",\"\",1 - (VLOOKUP(M12,'Normal Loss Table (Inverse)'!$A$4:$B$33,2)*K12/I12))","v":0.99394500057459434},639.3168929657395,33766.677586928017,146288.03353779999,1.2221,{"$f":"IF(A12=\"\",\"\",VLOOKUP(R12,'Normal Loss Table'!$A$3:$B$32,2)*K12)","v":0},643.21153846153845,1755867.2345202568,0,-438966.80863006419,-22463.130641498457,-416503.67798856576,0]
["P 010",504.59615384615387,14.44608,7925.701,447.19523567279481,1,0.25,2,1009.1923076923077,7421.1048461538458,809.06392583851152,9.1724579593171622,3,{"$f":"IF(A13=\"\",\"\",1 - (VLOOKUP(M13,'Normal Loss Table (Inverse)'!$A$4:$B$33,2)*K13/I13))","v":1},504.59615384615387,7289.4364061538463,114495.31070208001,1.2474000000000001,{"$f":"IF(A13=\"\",\"\",VLOOKUP(R13,'Normal Loss Table'!$A$3:$B$32,2)*K13)","v":0},504.59615384615387,379050.69312000001,0,-94762.673280000003,-21441.174859185234,-73321.498420814765,0]
["P 011",63.53846153846154,74.63724400000001,2145.4650000000001,101.35096496604021,1,0.25,2,127.07692307692308,2081.9265384615387,156.7838393896819,13.278961317479716,3,{"$f":"IF(A14=\"\",\"\",1 - (VLOOKUP(M14,'Normal Loss Table (Inverse)'!$A$4:$B$33,2)*K14/I14))","v":1},63.53846153846154,4742.3356572307703,160131.59469846005,0.8105,{"$f":"IF(A14=\"\",\"\",VLOOKUP(R14,'Normal Loss Table'!$A$3:$B$32,2)*K14)","v":0},63.53846153846154,246601.45417600006,0,-61650.363544000014,-31077.851808245854,-30572.51173575416,0]
["P 012",1314.1730769230769,8.60548,9837.24,755.1114375921635,1,0.25,2,2628.3461538461538,8523.0669230769236,1693.3509507702397,5.0332548720630594,3,{"$f":"IF(A15=\"\",\"\",1 - (VLOOKUP(M15,'Normal Loss Table (Inverse)'!$A$4:$B$33,2)*K15/I15))","v":1},1314.1730769230769,11309.09013,84654.172075199996,1.5522,{"$f":"IF(A15=\"\",\"\",VLOOKUP(R15,'Normal Loss Table'!$A$3:$B$32,2)*K15)","v":0},1314.1730769230769,588072.68676000007,0,-147018.17169000002,-14669.01638904,-132349.15530096,0]
["P 013",617,32.463932,3753.4489999999996,307.9302187311975,1,0.25,2,1234,3136.4489999999996,755.20264778116757,4.1531223562511101,3,{"$f":"IF(A16=\"\",\"\",1 - (VLOOKUP(M16,'Normal Loss Table (Inverse)'!$A$4:$B$33,2)*K16/I16))","v":1},617,20030.246044,121851.71310146799,1.6339999999999999,{"$f":"IF(A16=\"\",\"\",VLOOKUP(R16,'Normal Loss Table'!$A$3:$B$32,2)*K16)","v":0},617,1041572.794288,0,-260393.19857199999,-20364.2934114936,-240028.9051605064,0]
["P 014",61.57692307692308,35.020800000000001,2373.56,111.21474478239644,1,0.25,4,246.30769230769232,2250.4061538461538,230.79557032940559,9.750647079726166,3,{"$f":"IF(A17=\"\",\"\",1 - (VLOOKUP(M17,'Normal Loss Table (Inverse)'!$A$4:$B$33,2)*K17/I17))","v":1},61.57692307692308,2156.4731076923081,83123.970048000003,1.0671999999999999,{"$f":"IF(A17=\"\",\"\",VLOOKUP(R17,'Normal Loss Table'!$A$3:$B$32,2)*K17)","v":0},123.15384615384616,112136.60160000002,0,-28034.150400000006,-15762.204766523078,-12271.945633476927,0]
["P 015",186.84615384615384,34.406112,2773.8409999999999,92.788053789771425,1,0.25,2,373.69230769230768,2586.9948461538461,228.32155189400675,11.330489061123767,3,{"$f":"IF(A18=\"\",\"\",1 - (VLOOKUP(M18,'Normal Loss Table (Inverse)'!$A$4:$B$33,2)*K18/I18))","v":1},186.84615384615384,6428.6496959999995,95437.084116191996,1.6367,{"$f":"IF(A18=\"\",\"\",VLOOKUP(R18,'Normal Loss Table'!$A$3:$B$32,2)*K18)","v":0},186.84615384615384,334289.78419199999,0,-83572.446047999998,-17801.686884038401,-65770.7591639616,0]
["P 016",655.5,38.318744000000002,2910.3549999999996,276.69793114159569,1,0.25,2,1311,2254.8549999999996,763.41583700895183,2.953639275855839,2.953639275855839,{"$f":"IF(A19=\"\",\"\",1 - (VLOOKUP(M19,'Normal Loss Table (Inverse)'!$A$4:$B$33,2)*K19/I19))","v":0.99959237903439646},655.23280445704688,25107.698094391639,111521.14819411999,1.7173,{"$f":"IF(A19=\"\",\"\",VLOOKUP(R19,'Normal Loss Table'!$A$3:$B$32,2)*K19)","v":0},655.5,1305600.3009083655,0,-326400.07522709138,-17280.642300423999,-309119.43292666739,0]
["P 017",3120.3076923076924,7.6002279999999995,12895.770999999999,1173.2450814370111,1,0.25,2,6240.6153846153848,9775.4633076923055,3534.0243543171623,2.7660995872172203,2.7660995872172203,{"$f":"IF(A20=\"\",\"\",1 - (VLOOKUP(M20,'Normal Loss Table (Inverse)'!$A$4:$B$33,2)*K20/I20))","v":0.99943370579077351},3118.5406801305335,23701.620196267122,98010.799835787984,1.7659,{"$f":"IF(A20=\"\",\"\",VLOOKUP(R20,'Normal Loss Table'!$A$3:$B$32,2)*K20)","v":0},3120.3076923076924,1232484.2502058903,0,-308121.06255147257,-14859.149988819136,-293261.91256265342,0]
["P 018",405.57692307692309,43.114799999999995,983.38099999999986,160.54751250249583,1,0.25,2,811.15384615384619,577.80407692307676,464.80495702393551,1.2431108321706694,1.2431108321706694,{"$f":"IF(A21=\"\",\"\",1 - (VLOOKUP(M21,'Normal Loss Table (Inverse)'!$A$4:$B$33,2)*K21/I21))","v":0.96785374536201463},392.53914403240174,16924.246687128194,42398.275138799989,1.7451000000000001,{"$f":"IF(A21=\"\",\"\",VLOOKUP(R21,'Normal Loss Table'!$A$3:$B$32,2)*K21)","v":0},405.57692307692309,880060.82773066603,0,-220015.20693266651,-4982.3814431446135,-215032.8254895219,0]
["P 019",255.53846153846155,19.726559999999999,4474.7779999999993,263.32641799347249,1,0.25,2,511.07692307692309,4219.2395384615374,451.64312255584025,9.3419767239782985,3,{"$f":"IF(A22=\"\",\"\",1 - (VLOOKUP(M22,'Normal Loss Table (Inverse)'!$A$4:$B$33,2)*K22/I22))","v":1},255.53846153846155,5040.8947938461542,88271.976703679989,1.1315999999999999,{"$f":"IF(A22=\"\",\"\",VLOOKUP(R22,'Normal Loss Table'!$A$3:$B$32,2)*K22)","v":0},255.53846153846155,262126.52928000002,0,-65531.632320000004,-16646.216381966769,-48885.415938033235,0]
["P 020",85.192307692307693,144.07555600000001,477.113,61.255824360623436,1,0.25,2,170.38461538461539,391.92069230769232,121.50012891408768,3.2256812878348309,3,{"$f":"IF(A23=\"\",\"\",1 - (VLOOKUP(M23,'Normal Loss Table (Inverse)'!$A$4:$B$33,2)*K23/I23))","v":1},85.192307692307693,12274.129097692308,68740.32074982801,1.4023000000000001,{"$f":"IF(A23=\"\",\"\",VLOOKUP(R23,'Normal Loss Table'!$A$3:$B$32,2)*K23)","v":0},85.192307692307693,638254.71308000002,0,-159563.67827,-11293.238330427143,-148270.43993957285,0]
["P 021",487.05769230769232,23.741336,2615.7179999999998,206.70120648703909,1,0.25,2,974.11538461538464,2128.6603076923075,568.04574918089986,3.7473395598184722,3,{"$f":"IF(A24=\"\",\"\",1 - (VLOOKUP(M24,'Normal Loss Table (Inverse)'!$A$4:$B$33,2)*K24/I24))","v":1},487.05769230769232,11563.40032446154,62100.639919247995,1.7149000000000001,{"$f":"IF(A24=\"\",\"\",VLOOKUP(R24,'Normal Loss Table'!$A$3:$B$32,2)*K24)","v":0},487.05769230769232,601296.81687200011,0,-150324.20421800003,-10107.447918957292,-140216.75629904273,0]
["P 022",69.557692307692307,99.546624000000008,588.58799999999997,49.481790455954588,1,0.25,2,139.11538461538461,519.0303076923077,98.666953599599864,5.2604270098232018,3,{"$f":"IF(A25=\"\",\"\",1 - (VLOOKUP(M25,'Normal Loss Table (Inverse)'!$A$4:$B$33,2)*K25/I25))","v":1},69.557692307692307,6924.2334424615392,58591.948326912003,1.4098999999999999,{"$f":"IF(A25=\"\",\"\",VLOOKUP(R25,'Normal Loss Table'!$A$3:$B$32,2)*K25)","v":0},69.557692307692307,360060.13900800003,0,-90015.034752000007,-10333.542976890094,-79681.491775109913,0]
["P 023",349.82692307692309,76.075999999999993,1105.8319999999999,168.75562110072659,1,0.25,2,699.65384615384619,756.00507692307679,423.48057265434437,1.7852178488011714,1.7852178488011714,{"$f":"IF(A26=\"\",\"\",1 - (VLOOKUP(M26,'Normal Loss Table (Inverse)'!$A$4:$B$33,2)*K26/I26))","v":0.99140514389401435},346.82021101107722,26384.694372878708,84127.275231999985,1.6521999999999999,{"$f":"IF(A26=\"\",\"\",VLOOKUP(R26,'Normal Loss Table'!$A$3:$B$32,2)*K26)","v":0},349.82692307692309,1372004.1073896927,0,-343001.02684742317,-11502.768446399998,-331498.25840102317,0]
["P 024",2166.6730769230771,5.0540000000000003,12226.578,1018.0715087399283,1,0.25,2,4333.3461538461543,10059.904923076923,2601.4248818828696,3.8670749223386092,3,{"$f":"IF(A27=\"\",\"\",1 - (VLOOKUP(M27,'Normal Loss Table (Inverse)'!$A$4:$B$33,2)*K27/I27))","v":1},2166.6730769230771,10950.365730769232,61793.125211999999,1.6657999999999999,{"$f":"IF(A27=\"\",\"\",VLOOKUP(R27,'Normal Loss Table'!$A$3:$B$32,2)*K27)","v":0},2166.6730769230771,569419.01800000004,0,-142354.75450000001,-10168.551896246154,-132186.20260375386,0]
["P 025",1035.5192307692307,19.852948000000001,4306.0219999999999,377.27622846410901,1,0.25,2,2071.0384615384614,3270.5027692307694,1164.8926055311299,2.8075573264881286,2.8075573264881286,{"$f":"IF(A28=\"\",\"\",1 - (VLOOKUP(M28,'Normal Loss Table (Inverse)'!$A$4:$B$33,2)*K28/I28))","v":0.99960627248647715},1035.1115183572949,20550.015148148424,85487.23085285601,1.7779,{"$f":"IF(A28=\"\",\"\",VLOOKUP(R28,'Normal Loss Table'!$A$3:$B$32,2)*K28)","v":0},1035.5192307692307,1068600.7877037178,0,-267150.19692592946,-12985.824282278896,-254164.37264365057,0]
["P 026",627.98076923076928,28.826496000000002,3085.6279999999997,290.90645962298106,1,0.25,2,1255.9615384615386,2457.6472307692302,750.74162201414072,3.2736259169641975,3,{"$f":"IF(A29=\"\",\"\",1 - (VLOOKUP(M29,'Normal Loss Table (Inverse)'!$A$4:$B$33,2)*K29/I29))","v":1},627.98076923076928,18102.485132307695,88947.843199487994,1.673,{"$f":"IF(A29=\"\",\"\",VLOOKUP(R29,'Normal Loss Table'!$A$3:$B$32,2)*K29)","v":0},627.98076923076928,941329.22688000009,0,-235332.30672000002,-14169.071613436059,-221163.23510656395,0]
["P 027",818.65384615384619,13.218756000000001,3838.5129999999999,292.9490944613097,1,0.25,2,1637.3076923076924,3019.8591538461537,917.51428529145414,3.2913483770848067,3,{"$f":"IF(A30=\"\",\"\",1 - (VLOOKUP(M30,'Normal Loss Table (Inverse)'!$A$4:$B$33,2)*K30/I30))","v":1},818.65384615384619,10821.585440769231,50740.366749828005,1.7845,{"$f":"IF(A30=\"\",\"\",VLOOKUP(R30,'Normal Loss Table'!$A$3:$B$32,2)*K30)","v":0},818.65384615384619,562722.44292000006,0,-140680.61073000001,-7983.7562618117554,-132696.85446818825,0]
["P 028",160.32692307692307,48.02516,1834.7070000000001,91.48785865098705,1,0.25,2,320.65384615384613,1674.380076923077,206.02130672432784,8.127218021986069,3,{"$f":"IF(A31=\"\",\"\",1 - (VLOOKUP(M31,'Normal Loss Table (Inverse)'!$A$4:$B$33,2)*K31/I31))","v":1},160.32692307692307,7699.7261330769225,88112.097228120008,1.5564,{"$f":"IF(A31=\"\",\"\",VLOOKUP(R31,'Normal Loss Table'!$A$3:$B$32,2)*K31)","v":0},160.32692307692307,400385.75891999999,0,-100096.43973,-16082.474219008618,-84013.965510991373,0]
["P 029",1025.1923076923076,13.785639999999999,4628.442,424.7401530191454,1,0.25,2,2050.3846153846152,3603.2496923076924,1188.2035444000885,3.0325188889475458,3,{"$f":"IF(A32=\"\",\"\",1 - (VLOOKUP(M32,'Normal Loss Table (Inverse)'!$A$4:$B$33,2)*K32/I32))","v":1},1025.1923076923076,14132.932084615382,63806.035172879994,1.7256,{"$f":"IF(A32=\"\",\"\",VLOOKUP(R32,'Normal Loss Table'!$A$3:$B$32,2)*K32)","v":0},1025.1923076923076,734912.4683999999,0,-183728.11709999997,-9934.6206176529231,-173793.49648234705,0]
["P 030",292.38461538461536,19.726559999999999,3127.817,290.09945244293777,1,0.25,2,584.76923076923072,2835.4323846153848,503.78978545519766,5.6282053873987117,3,{"$f":"IF(A33=\"\",\"\",1 - (VLOOKUP(M33,'Normal Loss Table (Inverse)'!$A$4:$B$33,2)*K33/I33))","v":1},292.38461538461536,5767.7426584615378,61701.069719519997,1.1607000000000001,{"$f":"IF(A33=\"\",\"\",VLOOKUP(R33,'Normal Loss Table'!$A$3:$B$32,2)*K33)","v":0},292.38461538461536,299922.61823999998,0,-74980.654559999995,-11186.665412211692,-63793.989147788307,0]
["P 031",559.01923076923072,14.530136000000001,4994.4229999999998,245.75003164658722,1,0.25,2,1118.0384615384614,4435.4037692307693,658.24665322234614,6.7382093741273525,3,{"$f":"IF(A34=\"\",\"\",1 - (VLOOKUP(M34,'Normal Loss Table (Inverse)'!$A$4:$B$33,2)*K34/I34))","v":1},559.01923076923072,8122.6254496923075,72569.645431527999,1.6984999999999999,{"$f":"IF(A34=\"\",\"\",VLOOKUP(R34,'Normal Loss Table'!$A$3:$B$32,2)*K34)","v":0},559.01923076923072,422376.523384,0,-105594.130846,-12889.403996367138,-92704.726849632862,0]
["P 032",2439.1346153846152,8.7092960000000001,6778.0229999999992,1539.4141619185966,1,0.25,2,4878.2692307692305,4338.888384615384,3269.398965528454,1.3271211101377656,1.3271211101377656,{"$f":"IF(A35=\"\",\"\",1 - (VLOOKUP(M35,'Normal Loss Table (Inverse)'!$A$4:$B$33,2)*K35/I35))","v":0.96950605924058686},2364.7557889188429,20595.358133407724,59031.808601807992,1.4921,{"$f":"IF(A35=\"\",\"\",VLOOKUP(R35,'Normal Loss Table'!$A$3:$B$32,2)*K35)","v":0},2439.1346153846152,1070958.6229372015,0,-267739.65573430038,-7557.7326505154451,-260181.92308378493,0]
["P 033",525.53846153846155,14.17248,4023.7329999999993,538.58443587810427,1,0.25,2,1051.0769230769231,3498.1945384615378,925.38481924898929,3.7802592669507513,3,{"$f":"IF(A36=\"\",\"\",1 - (VLOOKUP(M36,'Normal Loss Table (Inverse)'!$A$4:$B$33,2)*K36/I36))","v":1},525.53846153846155,7448.1833353846159,57026.275467839987,1.1357999999999999,{"$f":"IF(A36=\"\",\"\",VLOOKUP(R36,'Normal Loss Table'!$A$3:$B$32,2)*K36)","v":0},525.53846153846155,387305.53344000003,{"$f":"B36*C36*52*Z36","v":0},-96826.383360000007,-9915.6184264910753,-86910.764933508937,0]
["P 034",146.48076923076923,35.105996000000005,1145.6199999999999,141.13357466398949,1,0.25,2,292.96153846153845,999.13923076923061,247.57622573524637,4.0356832640210474,3,{"$f":"IF(A37=\"\",\"\",1 - (VLOOKUP(M37,'Normal Loss Table (Inverse)'!$A$4:$B$33,2)*K37/I37))","v":1},146.48076923076923,5142.3532986923083,40218.131137520002,1.1833,{"$f":"IF(A37=\"\",\"\",VLOOKUP(R37,'Normal Loss Table'!$A$3:$B$32,2)*K37)","v":0},146.48076923076923,267402.37153200002,0,-66850.592883000005,-7015.1555677655388,-59835.437315234463,0]
["P 035",281.15384615384613,44.870399999999997,618.42899999999997,150.82328116633647,1,0.25,2,562.30769230769226,337.27515384615384,352.90623328394207,0.95570755638874838,0.95570755638874838,{"$f":"IF(A38=\"\",\"\",1 - (VLOOKUP(M38,'Normal Loss Table (Inverse)'!$A$4:$B$33,2)*K38/I38))","v":0.93698861618574536},263.43795324299225,11820.566337194359,27749.156601599996,1.5933999999999999,{"$f":"IF(A38=\"\",\"\",VLOOKUP(R38,'Normal Loss Table'!$A$3:$B$32,2)*K38)","v":0},281.15384615384613,614669.44953410665,0,-153667.36238352666,-3026.7342126276922,-150640.62817089897,0]
["P 036",415.59615384615387,22.062800000000003,1771.252,201.16662292983767,1,0.25,2,831.19230769230774,1355.6558461538461,503.64291264119561,2.6917004332385792,2.6917004332385792,{"$f":"IF(A39=\"\",\"\",1 - (VLOOKUP(M39,'Normal Loss Table (Inverse)'!$A$4:$B$33,2)*K39/I39))","v":0.99915170042940449},415.24360380730502,9161.4365820798103,39078.778625600004,1.6504000000000001,{"$f":"IF(A39=\"\",\"\",VLOOKUP(R39,'Normal Loss Table'!$A$3:$B$32,2)*K39)","v":0},415.59615384615387,476394.70226815023,0,-119098.67556703756,-5981.912760504616,-113116.76280653293,0]
["P 037",851.03846153846155,21.170636000000002,3325.3849999999998,302.07140835671004,1,0.25,2,1702.0769230769231,2474.3465384615383,952.23985135624525,2.5984488413684899,2.5984488413684899,{"$f":"IF(A40=\"\",\"\",1 - (VLOOKUP(M40,'Normal Loss Table (Inverse)'!$A$4:$B$33,2)*K40/I40))","v":0.99888108482237703},850.08622168710531,17996.865967953014,70400.515394860005,1.7874000000000001,{"$f":"IF(A40=\"\",\"\",VLOOKUP(R40,'Normal Loss Table'!$A$3:$B$32,2)*K40)","v":0},851.03846153846155,935837.0303335567,0,-233959.25758338918,-10476.697980725847,-223482.55960266333,0]
{"$rows_left_out":345}
{"sheet":"Normal Loss Table","index":1,"n_rows":32,"n_cols":2,"rows_kept":32,"cut":false,"hidden":false,"merged":[]}
["f(k)","k"]
[]
[0,3]
[6.9999999999999999E-4,2.8]
[1E-3,2.7]
[1.4E-3,2.6]
[2E-3,2.5]
[2.7000000000000001E-3,2.4]
[3.5999999999999999E-3,2.2999999999999998]
[4.7999999999999996E-3,2.2000000000000002]
[6.4000000000000003E-3,2.1]
[7.4000000000000003E-3,2]
[8.3999999999999995E-3,1.9]
[1.0999999999999999E-2,1.8]
[1.4200000000000001E-2,1.7]
[2.3199999999999998E-2,1.6]
[2.93E-2,1.5]
[3.6600000000000001E-2,1.4]
[4.5499999999999999E-2,1.3]
[5.6099999999999997E-2,1.2]
[6.8599999999999994E-2,1.1000000000000001]
[8.3299999999999999E-2,1]
[0.1004,0.9]
[0.1202,0.8]
[0.14280000000000001,0.7]
[0.1686,0.6]
[0.19769999999999999,0.5]
[0.23039999999999999,0.4]
[0.26669999999999999,0.3]
[0.30680000000000002,0.2]
[0.35089999999999999,0.1]
[0.39889999999999998,0]

{"sheet":"Normal Loss Table (Inverse)","index":2,"n_rows":33,"n_cols":2,"rows_kept":33,"cut":false,"hidden":false,"merged":[]}
["k","f(k)"]
[]
["Column1","Column2"]
[0,0.39889999999999998]
[0.1,0.35089999999999999]
[0.2,0.30680000000000002]
[0.3,0.26669999999999999]
[0.4,0.23039999999999999]
[0.5,0.19769999999999999]
[0.6,0.1686]
[0.7,0.14280000000000001]
[0.8,0.1202]
[0.9,0.1004]
[1,8.3299999999999999E-2]
[1.1000000000000001,6.8599999999999994E-2]
[1.2,5.6099999999999997E-2]
[1.3,4.5499999999999999E-2]
[1.4,3.6600000000000001E-2]
[1.5,2.93E-2]
[1.6,2.3199999999999998E-2]
[1.7,1.4200000000000001E-2]
[1.8,1.0999999999999999E-2]
[1.9,8.3999999999999995E-3]
[2,7.4000000000000003E-3]
[2.1,6.4000000000000003E-3]
[2.2000000000000002,4.7999999999999996E-3]
[2.2999999999999998,3.5999999999999999E-3]
[2.4,2.7000000000000001E-3]
[2.5,2E-3]
[2.6,1.4E-3]
[2.7,1E-3]
[2.8,6.9999999999999999E-4]
[3,0]